test packages.x86_64-linux.nix-ci-check-gammaloop-nextest-feynkit

Reproduce this run
Retry Run
  1. 0.00 s $ /nix/store/61685rbaxmpigwi3z23i33sv3jyfl70q-coreutils-9.11/bin/timeout --kill-after=15s 7200s /nix/store/wknkybkzrc16r11vk5vrykh4wmw7a353-nix-2.34.8/bin/nix --extra-experimental-features nix-command --extra-experimental-features flakes flake clone git+https://github.com/alphal00p/gammaloop --dest /tmp/nix-ci-worker/stable-pwd/repo/
  2. 0.07 s Cloning into '/tmp/nix-ci-worker/stable-pwd/repo'...
  3. 2.02 s remote: Enumerating objects: 93516 remote: Enumerating objects: 103068, done.
  4. 2.14 s remote: Counting objects: 0% (1/9552) remote: Counting objects: 1% (96/9552) remote: Counting objects: 2% (192/9552) remote: Counting objects: 3% (287/9552) remote: Counting objects: 4% (383/9552) remote: Counting objects: 5% (478/9552) remote: Counting objects: 6% (574/9552) remote: Counting objects: 7% (669/9552) remote: Counting objects: 8% (765/9552) remote: Counting objects: 9% (860/9552) remote: Counting objects: 10% (956/9552) remote: Counting objects: 11% (1051/9552) remote: Counting objects: 12% (1147/9552) remote: Counting objects: 13% (1242/9552) remote: Counting objects: 14% (1338/9552) remote: Counting objects: 15% (1433/9552) remote: Counting objects: 16% (1529/9552) remote: Counting objects: 17% (1624/9552) remote: Counting objects: 18% (1720/9552) remote: Counting objects: 19% (1815/9552) remote: Counting objects: 20% (1911/9552) remote: Counting objects: 21% (2006/9552) remote: Counting objects: 22% (2102/9552) remote: Counting objects: 23% (2197/9552) remote: Counting objects: 24% (2293/9552) remote: Counting objects: 25% (2388/9552) remote: Counting objects: 26% (2484/9552) remote: Counting objects: 27% (2580/9552) remote: Counting objects: 28% (2675/9552) remote: Counting objects: 29% (2771/9552) remote: Counting objects: 30% (2866/9552) remote: Counting objects: 31% (2962/9552) remote: Counting objects: 32% (3057/9552) remote: Counting objects: 33% (3153/9552) remote: Counting objects: 34% (3248/9552) remote: Counting objects: 35% (3344/9552) remote: Counting objects: 36% (3439/9552) remote: Counting objects: 37% (3535/9552) remote: Counting objects: 38% (3630/9552) remote: Counting objects: 39% (3726/9552) remote: Counting objects: 40% (3821/9552) remote: Counting objects: 41% (3917/9552) remote: Counting objects: 42% (4012/9552) remote: Counting objects: 43% (4108/9552) remote: Counting objects: 44% (4203/9552) remote: Counting objects: 45% (4299/9552) remote: Counting objects: 46% (4394/9552) remote: Counting objects: 47% (4490/9552) remote: Counting objects: 48% (4585/9552) remote: Counting objects: 49% (4681/9552) remote: Counting objects: 50% (4776/9552) remote: Counting objects: 51% (4872/9552) remote: Counting objects: 52% (4968/9552) remote: Counting objects: 53% (5063/9552) remote: Counting objects: 54% (5159/9552) remote: Counting objects: 55% (5254/9552) remote: Counting objects: 56% (5350/9552) remote: Counting objects: 57% (5445/9552) remote: Counting objects: 58% (5541/9552) remote: Counting objects: 59% (5636/9552) remote: Counting objects: 60% (5732/9552) remote: Counting objects: 61% (5827/9552) remote: Counting objects: 62% (5923/9552) remote: Counting objects: 63% (6018/9552) remote: Counting objects: 64% (6114/9552) remote: Counting objects: 65% (6209/9552) remote: Counting objects: 66% (6305/9552) remote: Counting objects: 67% (6400/9552) remote: Counting objects: 68% (6496/9552) remote: Counting objects: 69% (6591/9552) remote: Counting objects: 70% (6687/9552) remote: Counting objects: 71% (6782/9552) remote: Counting objects: 72% (6878/9552) remote: Counting objects: 73% (6973/9552) remote: Counting objects: 74% (7069/9552) remote: Counting objects: 75% (7164/9552) remote: Counting objects: 76% (7260/9552) remote: Counting objects: 77% (7356/9552) remote: Counting objects: 78% (7451/9552) remote: Counting objects: 79% (7547/9552) remote: Counting objects: 80% (7642/9552) remote: Counting objects: 81% (7738/9552) remote: Counting objects: 82% (7833/9552) remote: Counting objects: 83% (7929/9552) remote: Counting objects: 84% (8024/9552) remote: Counting objects: 85% (8120/9552) remote: Counting objects: 86% (8215/9552) remote: Counting objects: 87% (8311/9552) remote: Counting objects: 88% (8406/9552) remote: Counting objects: 89% (8502/9552) remote: Counting objects: 90% (8597/9552) remote: Counting objects: 91% (8693/9552) remote: Counting objects: 92% (8788/9552) remote: Counting objects: 93% (8884/9552) remote: Counting objects: 94% (8979/9552) remote: Counting objects: 95% (9075/9552) remote: Counting objects: 96% (9170/9552) remote: Counting objects: 97% (9266/9552) remote: Counting objects: 98% (9361/9552) remote: Counting objects: 99% (9457/9552) remote: Counting objects: 100% (9552/9552) remote: Counting objects: 100% (9552/9552), done.
  5. 4.44 s remote: Compressing objects: 0% (1/2090) remote: Compressing objects: 1% (21/2090) remote: Compressing objects: 2% (42/2090) remote: Compressing objects: 3% (63/2090) remote: Compressing objects: 4% (84/2090) remote: Compressing objects: 5% (105/2090) remote: Compressing objects: 6% (126/2090) remote: Compressing objects: 7% (147/2090) remote: Compressing objects: 8% (168/2090) remote: Compressing objects: 8% (175/2090) remote: Compressing objects: 9% (189/2090) remote: Compressing objects: 10% (209/2090) remote: Compressing objects: 11% (230/2090) remote: Compressing objects: 12% (251/2090) remote: Compressing objects: 13% (272/2090) remote: Compressing objects: 14% (293/2090) remote: Compressing objects: 15% (314/2090) remote: Compressing objects: 16% (335/2090) remote: Compressing objects: 17% (356/2090) remote: Compressing objects: 18% (377/2090) remote: Compressing objects: 19% (398/2090) remote: Compressing objects: 20% (418/2090) remote: Compressing objects: 20% (435/2090) remote: Compressing objects: 21% (439/2090) remote: Compressing objects: 22% (460/2090) remote: Compressing objects: 23% (481/2090) remote: Compressing objects: 24% (502/2090) remote: Compressing objects: 25% (523/2090) remote: Compressing objects: 26% (544/2090) remote: Compressing objects: 27% (565/2090) remote: Compressing objects: 28% (586/2090) remote: Compressing objects: 29% (607/2090) remote: Compressing objects: 30% (627/2090) remote: Compressing objects: 31% (648/2090) remote: Compressing objects: 32% (669/2090) remote: Compressing objects: 33% (690/2090) remote: Compressing objects: 34% (711/2090) remote: Compressing objects: 35% (732/2090) remote: Compressing objects: 36% (753/2090) remote: Compressing objects: 37% (774/2090) remote: Compressing objects: 38% (795/2090) remote: Compressing objects: 39% (816/2090) remote: Compressing objects: 40% (836/2090) remote: Compressing objects: 41% (857/2090) remote: Compressing objects: 42% (878/2090) remote: Compressing objects: 43% (899/2090) remote: Compressing objects: 44% (920/2090) remote: Compressing objects: 45% (941/2090) remote: Compressing objects: 46% (962/2090) remote: Compressing objects: 47% (983/2090) remote: Compressing objects: 48% (1004/2090) remote: Compressing objects: 49% (1025/2090) remote: Compressing objects: 50% (1045/2090) remote: Compressing objects: 51% (1066/2090) remote: Compressing objects: 52% (1087/2090) remote: Compressing objects: 53% (1108/2090) remote: Compressing objects: 54% (1129/2090) remote: Compressing objects: 55% (1150/2090) remote: Compressing objects: 56% (1171/2090) remote: Compressing objects: 57% (1192/2090) remote: Compressing objects: 58% (1213/2090) remote: Compressing objects: 59% (1234/2090) remote: Compressing objects: 60% (1254/2090) remote: Compressing objects: 61% (1275/2090) remote: Compressing objects: 62% (1296/2090) remote: Compressing objects: 63% (1317/2090) remote: Compressing objects: 64% (1338/2090) remote: Compressing objects: 65% (1359/2090) remote: Compressing objects: 66% (1380/2090) remote: Compressing objects: 67% (1401/2090) remote: Compressing objects: 68% (1422/2090) remote: Compressing objects: 69% (1443/2090) remote: Compressing objects: 70% (1463/2090) remote: Compressing objects: 71% (1484/2090) remote: Compressing objects: 72% (1505/2090) remote: Compressing objects: 73% (1526/2090) remote: Compressing objects: 74% (1547/2090) remote: Compressing objects: 75% (1568/2090) remote: Compressing objects: 76% (1589/2090) remote: Compressing objects: 77% (1610/2090) remote: Compressing objects: 78% (1631/2090) remote: Compressing objects: 79% (1652/2090) remote: Compressing objects: 80% (1672/2090) remote: Compressing objects: 81% (1693/2090) remote: Compressing objects: 82% (1714/2090) remote: Compressing objects: 83% (1735/2090) remote: Compressing objects: 84% (1756/2090) remote: Compressing objects: 85% (1777/2090) remote: Compressing objects: 86% (1798/2090) remote: Compressing objects: 87% (1819/2090) remote: Compressing objects: 88% (1840/2090) remote: Compressing objects: 89% (1861/2090) remote: Compressing objects: 90% (1881/2090) remote: Compressing objects: 91% (1902/2090) remote: Compressing objects: 92% (1923/2090) remote: Compressing objects: 93% (1944/2090) remote: Compressing objects: 94% (1965/2090) remote: Compressing objects: 95% (1986/2090) remote: Compressing objects: 96% (2007/2090) remote: Compressing objects: 97% (2028/2090) remote: Compressing objects: 98% (2049/2090) remote: Compressing objects: 99% (2070/2090) remote: Compressing objects: 100% (2090/2090) remote: Compressing objects: 100% (2090/2090), done.
  6. 17.40 s Receiving objects: 0% (1/103068) Receiving objects: 1% (1031/103068) Receiving objects: 2% (2062/103068) Receiving objects: 3% (3093/103068) Receiving objects: 4% (4123/103068) Receiving objects: 5% (5154/103068) Receiving objects: 6% (6185/103068) Receiving objects: 7% (7215/103068), 15.59 MiB | 31.17 MiB/s Receiving objects: 8% (8246/103068), 15.59 MiB | 31.17 MiB/s Receiving objects: 9% (9277/103068), 15.59 MiB | 31.17 MiB/s Receiving objects: 10% (10307/103068), 15.59 MiB | 31.17 MiB/s Receiving objects: 11% (11338/103068), 15.59 MiB | 31.17 MiB/s Receiving objects: 12% (12369/103068), 15.59 MiB | 31.17 MiB/s Receiving objects: 13% (13399/103068), 15.59 MiB | 31.17 MiB/s Receiving objects: 14% (14430/103068), 15.59 MiB | 31.17 MiB/s Receiving objects: 15% (15461/103068), 15.59 MiB | 31.17 MiB/s Receiving objects: 16% (16491/103068), 15.59 MiB | 31.17 MiB/s Receiving objects: 17% (17522/103068), 15.59 MiB | 31.17 MiB/s Receiving objects: 18% (18553/103068), 15.59 MiB | 31.17 MiB/s Receiving objects: 19% (19583/103068), 15.59 MiB | 31.17 MiB/s Receiving objects: 20% (20614/103068), 15.59 MiB | 31.17 MiB/s Receiving objects: 21% (21645/103068), 15.59 MiB | 31.17 MiB/s Receiving objects: 22% (22675/103068), 15.59 MiB | 31.17 MiB/s Receiving objects: 23% (23706/103068), 15.59 MiB | 31.17 MiB/s Receiving objects: 24% (24737/103068), 15.59 MiB | 31.17 MiB/s Receiving objects: 25% (25767/103068), 15.59 MiB | 31.17 MiB/s Receiving objects: 26% (26798/103068), 15.59 MiB | 31.17 MiB/s Receiving objects: 27% (27829/103068), 15.59 MiB | 31.17 MiB/s Receiving objects: 28% (28860/103068), 15.59 MiB | 31.17 MiB/s Receiving objects: 29% (29890/103068), 15.59 MiB | 31.17 MiB/s Receiving objects: 30% (30921/103068), 15.59 MiB | 31.17 MiB/s Receiving objects: 31% (31952/103068), 15.59 MiB | 31.17 MiB/s Receiving objects: 31% (32630/103068), 30.44 MiB | 30.43 MiB/s Receiving objects: 32% (32982/103068), 30.44 MiB | 30.43 MiB/s Receiving objects: 33% (34013/103068), 30.44 MiB | 30.43 MiB/s Receiving objects: 34% (35044/103068), 30.44 MiB | 30.43 MiB/s Receiving objects: 35% (36074/103068), 30.44 MiB | 30.43 MiB/s Receiving objects: 36% (37105/103068), 30.44 MiB | 30.43 MiB/s Receiving objects: 37% (38136/103068), 30.44 MiB | 30.43 MiB/s Receiving objects: 38% (39166/103068), 43.79 MiB | 29.19 MiB/s Receiving objects: 39% (40197/103068), 43.79 MiB | 29.19 MiB/s Receiving objects: 40% (41228/103068), 43.79 MiB | 29.19 MiB/s Receiving objects: 41% (42258/103068), 43.79 MiB | 29.19 MiB/s Receiving objects: 42% (43289/103068), 43.79 MiB | 29.19 MiB/s Receiving objects: 43% (44320/103068), 43.79 MiB | 29.19 MiB/s Receiving objects: 44% (45350/103068), 43.79 MiB | 29.19 MiB/s Receiving objects: 45% (46381/103068), 43.79 MiB | 29.19 MiB/s Receiving objects: 45% (46381/103068), 57.14 MiB | 28.56 MiB/s Receiving objects: 46% (47412/103068), 57.14 MiB | 28.56 MiB/s Receiving objects: 47% (48442/103068), 57.14 MiB | 28.56 MiB/s Receiving objects: 48% (49473/103068), 57.14 MiB | 28.56 MiB/s Receiving objects: 49% (50504/103068), 57.14 MiB | 28.56 MiB/s Receiving objects: 50% (51534/103068), 73.09 MiB | 29.24 MiB/s Receiving objects: 51% (52565/103068), 73.09 MiB | 29.24 MiB/s Receiving objects: 52% (53596/103068), 73.09 MiB | 29.24 MiB/s Receiving objects: 53% (54627/103068), 73.09 MiB | 29.24 MiB/s Receiving objects: 54% (55657/103068), 73.09 MiB | 29.24 MiB/s Receiving objects: 55% (56688/103068), 73.09 MiB | 29.24 MiB/s Receiving objects: 55% (57523/103068), 87.27 MiB | 28.87 MiB/s Receiving objects: 56% (57719/103068), 87.27 MiB | 28.87 MiB/s Receiving objects: 57% (58749/103068), 87.27 MiB | 28.87 MiB/s Receiving objects: 58% (59780/103068), 99.21 MiB | 28.16 MiB/s Receiving objects: 59% (60811/103068), 99.21 MiB | 28.16 MiB/s Receiving objects: 60% (61841/103068), 99.21 MiB | 28.16 MiB/s Receiving objects: 60% (62645/103068), 99.21 MiB | 28.16 MiB/s Receiving objects: 61% (62872/103068), 99.21 MiB | 28.16 MiB/s Receiving objects: 62% (63903/103068), 112.86 MiB | 28.06 MiB/s Receiving objects: 62% (64395/103068), 144.23 MiB | 28.44 MiB/s Receiving objects: 63% (64933/103068), 144.23 MiB | 28.44 MiB/s Receiving objects: 64% (65964/103068), 144.23 MiB | 28.44 MiB/s Receiving objects: 64% (66257/103068), 175.89 MiB | 29.20 MiB/s Receiving objects: 64% (66285/103068), 208.71 MiB | 29.97 MiB/s Receiving objects: 64% (66397/103068), 223.09 MiB | 30.17 MiB/s Receiving objects: 64% (66521/103068), 271.50 MiB | 31.68 MiB/s Receiving objects: 65% (66995/103068), 285.10 MiB | 31.30 MiB/s Receiving objects: 66% (68025/103068), 285.10 MiB | 31.30 MiB/s Receiving objects: 67% (69056/103068), 285.10 MiB | 31.30 MiB/s Receiving objects: 67% (69568/103068), 285.10 MiB | 31.30 MiB/s Receiving objects: 68% (70087/103068), 285.10 MiB | 31.30 MiB/s Receiving objects: 69% (71117/103068), 299.55 MiB | 31.03 MiB/s Receiving objects: 70% (72148/103068), 299.55 MiB | 31.03 MiB/s Receiving objects: 71% (73179/103068), 299.55 MiB | 31.03 MiB/s Receiving objects: 72% (74209/103068), 316.18 MiB | 31.17 MiB/s Receiving objects: 73% (75240/103068), 316.18 MiB | 31.17 MiB/s Receiving objects: 74% (76271/103068), 316.18 MiB | 31.17 MiB/s Receiving objects: 75% (77301/103068), 316.18 MiB | 31.17 MiB/s Receiving objects: 76% (78332/103068), 316.18 MiB | 31.17 MiB/s Receiving objects: 77% (79363/103068), 316.18 MiB | 31.17 MiB/s Receiving objects: 78% (80394/103068), 316.18 MiB | 31.17 MiB/s Receiving objects: 79% (81424/103068), 316.18 MiB | 31.17 MiB/s Receiving objects: 80% (82455/103068), 316.18 MiB | 31.17 MiB/s Receiving objects: 80% (83464/103068), 316.18 MiB | 31.17 MiB/s Receiving objects: 81% (83486/103068), 316.18 MiB | 31.17 MiB/s Receiving objects: 82% (84516/103068), 332.58 MiB | 31.26 MiB/s Receiving objects: 83% (85547/103068), 332.58 MiB | 31.26 MiB/s Receiving objects: 83% (86464/103068), 347.54 MiB | 30.86 MiB/s Receiving objects: 84% (86578/103068), 362.01 MiB | 30.88 MiB/s Receiving objects: 85% (87608/103068), 362.01 MiB | 30.88 MiB/s Receiving objects: 86% (88639/103068), 362.01 MiB | 30.88 MiB/s Receiving objects: 87% (89670/103068), 362.01 MiB | 30.88 MiB/s Receiving objects: 88% (90700/103068), 362.01 MiB | 30.88 MiB/s Receiving objects: 89% (91731/103068), 362.01 MiB | 30.88 MiB/s Receiving objects: 90% (92762/103068), 362.01 MiB | 30.88 MiB/s Receiving objects: 91% (93792/103068), 377.86 MiB | 30.72 MiB/s Receiving objects: 92% (94823/103068), 377.86 MiB | 30.72 MiB/s Receiving objects: 93% (95854/103068), 377.86 MiB | 30.72 MiB/s Receiving objects: 94% (96884/103068), 377.86 MiB | 30.72 MiB/s Receiving objects: 95% (97915/103068), 377.86 MiB | 30.72 MiB/s Receiving objects: 96% (98946/103068), 377.86 MiB | 30.72 MiB/s Receiving objects: 97% (99976/103068), 377.86 MiB | 30.72 MiB/s Receiving objects: 98% (101007/103068), 377.86 MiB | 30.72 MiB/s Receiving objects: 99% (102038/103068), 377.86 MiB | 30.72 MiB/s remote: Total 103068 (delta 8241), reused 7536 (delta 7453), pack-reused 93516 (from 4)
  7. 17.40 s Receiving objects: 100% (103068/103068), 377.86 MiB | 30.72 MiB/s Receiving objects: 100% (103068/103068), 391.59 MiB | 30.25 MiB/s, done.
  8. 18.63 s Resolving deltas: 0% (0/67510) Resolving deltas: 1% (676/67510) Resolving deltas: 2% (1351/67510) Resolving deltas: 3% (2026/67510) Resolving deltas: 4% (2702/67510) Resolving deltas: 5% (3376/67510) Resolving deltas: 6% (4051/67510) Resolving deltas: 7% (4726/67510) Resolving deltas: 8% (5402/67510) Resolving deltas: 9% (6077/67510) Resolving deltas: 10% (6751/67510) Resolving deltas: 11% (7427/67510) Resolving deltas: 12% (8102/67510) Resolving deltas: 13% (8778/67510) Resolving deltas: 14% (9452/67510) Resolving deltas: 15% (10127/67510) Resolving deltas: 16% (10803/67510) Resolving deltas: 17% (11477/67510) Resolving deltas: 18% (12152/67510) Resolving deltas: 19% (12827/67510) Resolving deltas: 20% (13502/67510) Resolving deltas: 21% (14178/67510) Resolving deltas: 22% (14853/67510) Resolving deltas: 23% (15529/67510) Resolving deltas: 24% (16203/67510) Resolving deltas: 25% (16878/67510) Resolving deltas: 26% (17553/67510) Resolving deltas: 27% (18228/67510) Resolving deltas: 28% (18903/67510) Resolving deltas: 29% (19578/67510) Resolving deltas: 30% (20253/67510) Resolving deltas: 31% (20930/67510) Resolving deltas: 32% (21606/67510) Resolving deltas: 33% (22279/67510) Resolving deltas: 34% (22954/67510) Resolving deltas: 35% (23631/67510) Resolving deltas: 36% (24304/67510) Resolving deltas: 37% (24981/67510) Resolving deltas: 38% (25654/67510) Resolving deltas: 39% (26331/67510) Resolving deltas: 40% (27004/67510) Resolving deltas: 41% (27681/67510) Resolving deltas: 42% (28355/67510) Resolving deltas: 43% (29030/67510) Resolving deltas: 44% (29705/67510) Resolving deltas: 45% (30380/67510) Resolving deltas: 46% (31055/67510) Resolving deltas: 47% (31730/67510) Resolving deltas: 48% (32405/67510) Resolving deltas: 49% (33083/67510) Resolving deltas: 50% (33755/67510) Resolving deltas: 51% (34431/67510) Resolving deltas: 52% (35106/67510) Resolving deltas: 53% (35781/67510) Resolving deltas: 54% (36456/67510) Resolving deltas: 55% (37132/67510) Resolving deltas: 56% (37808/67510) Resolving deltas: 57% (38481/67510) Resolving deltas: 58% (39156/67510) Resolving deltas: 59% (39831/67510) Resolving deltas: 60% (40506/67510) Resolving deltas: 61% (41182/67510) Resolving deltas: 62% (41857/67510) Resolving deltas: 63% (42532/67510) Resolving deltas: 64% (43209/67510) Resolving deltas: 65% (43882/67510) Resolving deltas: 66% (44557/67510) Resolving deltas: 67% (45232/67510) Resolving deltas: 68% (45907/67510) Resolving deltas: 69% (46582/67510) Resolving deltas: 70% (47257/67510) Resolving deltas: 71% (47934/67510) Resolving deltas: 72% (48608/67510) Resolving deltas: 73% (49283/67510) Resolving deltas: 74% (49958/67510) Resolving deltas: 75% (50634/67510) Resolving deltas: 76% (51308/67510) Resolving deltas: 77% (51983/67510) Resolving deltas: 78% (52658/67510) Resolving deltas: 79% (53333/67510) Resolving deltas: 80% (54008/67510) Resolving deltas: 80% (54683/67510) Resolving deltas: 81% (54684/67510) Resolving deltas: 82% (55359/67510) Resolving deltas: 83% (56034/67510) Resolving deltas: 84% (56709/67510) Resolving deltas: 85% (57385/67510) Resolving deltas: 86% (58059/67510) Resolving deltas: 87% (58735/67510) Resolving deltas: 88% (59409/67510) Resolving deltas: 89% (60084/67510) Resolving deltas: 90% (60759/67510) Resolving deltas: 91% (61435/67510) Resolving deltas: 92% (62110/67510) Resolving deltas: 93% (62785/67510) Resolving deltas: 94% (63460/67510) Resolving deltas: 95% (64135/67510) Resolving deltas: 96% (64812/67510) Resolving deltas: 97% (65485/67510) Resolving deltas: 98% (66160/67510) Resolving deltas: 99% (66836/67510) Resolving deltas: 100% (67510/67510) Resolving deltas: 100% (67510/67510), done.
  9. 19.21 s Fetching commit 318759b6ebbe3c9f174340a96740fa34c8812634 for feynkit ...
  10. 19.21 s $ /nix/store/5vpcfsdx1lcnlb2y4k7xyc74shp5qwbh-git-2.54.0/bin/git fetch origin 318759b6ebbe3c9f174340a96740fa34c8812634
  11. 19.82 s From https://github.com/alphal00p/gammaloop
  12. 19.82 s * branch 318759b6ebbe3c9f174340a96740fa34c8812634 -> FETCH_HEAD
  13. 19.83 s $ /nix/store/61685rbaxmpigwi3z23i33sv3jyfl70q-coreutils-9.11/bin/timeout --kill-after=15s 7200s /nix/store/5vpcfsdx1lcnlb2y4k7xyc74shp5qwbh-git-2.54.0/bin/git -c advice.detachedHead=false checkout 318759b6ebbe3c9f174340a96740fa34c8812634
  14. 20.02 s HEAD is now at 318759b6e expose diagram analysis and make Python generation interruptible
  15. 20.02 s $ /nix/store/61685rbaxmpigwi3z23i33sv3jyfl70q-coreutils-9.11/bin/timeout --kill-after=15s 7200s /nix/store/wknkybkzrc16r11vk5vrykh4wmw7a353-nix-2.34.8/bin/nix --extra-experimental-features nix-command --extra-experimental-features flakes --log-format internal-json run .#packages.x86_64-linux.nix-ci-check-gammaloop-nextest-feynkit --print-build-logs
  16. 20.15 s warning: ignoring untrusted flake configuration setting 'extra-substituters'.
  17. 20.15 s Pass '--accept-flake-config' to trust it
  18. 20.15 s warning: ignoring untrusted flake configuration setting 'extra-trusted-public-keys'.
  19. 20.15 s Pass '--accept-flake-config' to trust it
  20. 25.44 s
  21. 25.54 s Downloading cached nix-ci-check-gammaloop-nextest-feynkit from https://cache.nix-ci.com
  22. 25.55 s Downloaded cached nix-ci-check-gammaloop-nextest-feynkit (1128 B) in 3ms
  23. 25.55 s Progress: 0 of 1 built, 1 of 1 downloaded from cache
  24. 25.67 s evaluating derivation 'gdo you want to allow configuration setting 'extra-substituters' to be set to 'https://cache.nix-ci.com' (y/N)? do you want to permanently mark this value as untrusted (y/N)? warning: ignoring untrusted flake configuration setting 'extra-substituters'.
  25. 25.67 s Pass '--accept-flake-config' to trust it
  26. 25.67 s do you want to allow configuration setting 'extra-trusted-public-keys' to be set to 'nix-ci:g3xV5BDTLtIBZr/A00IU1x0EtKKlb7YLgBN2SgYgM6A=' (y/N)? do you want to permanently mark this value as untrusted (y/N)? warning: ignoring untrusted flake configuration setting 'extra-trusted-public-keys'.
  27. 25.67 s Pass '--accept-flake-config' to trust it
  28. 31.76 s copying '/nix/store/wv69 evaluating derivation 'g copying '/nix/store/wv69 evaluating derivation 'g copying '/nix/store/wv69 evaluating derivation 'g copying '/nix/store/wv69 evaluating derivation 'g copying '/nix/store/wv69 evaluating derivation 'g copying '/nix/store/wv69 evaluating derivation 'g copying '/nix/store/wv69 evaluating derivation 'g copying '/nix/store/wv69 evaluating derivation 'g querying gammaloop-nexte [0/11 built, 9/0/9 copie [0/9 built, 7/2/9 copied [0/8 built, 6/3/9 copied [0/6 built, 4/5/9 copied [0/5 built, 3/6/9 copied [0/4 built, 2/7/9 copied [0/3 built, 1/8/9 copied [0/2 built, 9 copied (20 [1/0/2 built, 9 copied (gammaloop-nextest-binaries-feynkit (post)> Uploading to the NixCI cache: /nix/store/j88my1yckdnz6nv32wimh15c20a95931-gammaloop-nextest-binaries-feynkit
  29. 31.79 s gammaloop-nextest-binaries-feynkit (post)> warning: 'warn-short-path-literals' is deprecated, use 'lint-short-path-literals = ignore' instead
  30. 31.82 s gammaloop-nextest-binaries-feynkit (post)> copying 0 paths...
  31. 31.86 s gammaloop-nextest-binaries-feynkit (post)> warning: 'warn-short-path-literals' is deprecated, use 'lint-short-path-literals = ignore' instead
  32. 32.03 s gammaloop-nextest-binaries-feynkit (post)> copying 0 paths...
  33. 32.33 s [1/3 built, 9 copied (20 [1/1/2 built, 9 copied (gammaloop-nextest-feynkit> Extracting 1 binary and 2 linked paths to /build/source
  34. 32.40 s gammaloop-nextest-feynkit> Extracted 15 files to /build/source in 0.07s
  35. 32.41 s gammaloop-nextest-feynkit> ------------
  36. 32.41 s gammaloop-nextest-feynkit> Nextest run ID fe42dab7-4bb7-4b65-9c42-32ad1180fd3a with nextest profile: ci_gammaloop
  37. 32.41 s gammaloop-nextest-feynkit> Starting 1 test across 1 binary
  38. 32.41 s gammaloop-nextest-feynkit> ------------
  39. 32.41 s gammaloop-nextest-feynkit> Summary [ 0.005s] 1 test run: 1 passed, 0 skipped
  40. 32.44 s gammaloop-nextest-feynkit>
  41. 32.44 s gammaloop-nextest-feynkit> ========== nextest test summary ==========
  42. 32.44 s gammaloop-nextest-feynkit> report: target/nextest/ci_gammaloop/junit.xml
  43. 32.44 s gammaloop-nextest-feynkit> tests: 1, failures: 0, errors: 0
  44. 32.44 s gammaloop-nextest-feynkit> No failing testcases found.
  45. 32.44 s gammaloop-nextest-feynkit> =========================================
  46. 32.45 s gammaloop-nextest-feynkit> Extracting 1 binary and 2 linked paths to /build/source
  47. 32.52 s gammaloop-nextest-feynkit> Extracted 15 files to /build/source in 0.08s
  48. 32.53 s gammaloop-nextest-feynkit> ------------
  49. 32.53 s gammaloop-nextest-feynkit> Nextest run ID 2166da0a-859f-40b0-816a-e39bf45975b1 with nextest profile: ci_gammaloop
  50. 32.53 s gammaloop-nextest-feynkit> Starting 33 tests across 1 binary
  51. 32.55 s gammaloop-nextest-feynkit> ------------
  52. 32.55 s gammaloop-nextest-feynkit> Summary [ 0.014s] 33 tests run: 33 passed, 0 skipped
  53. 32.57 s gammaloop-nextest-feynkit>
  54. 32.57 s gammaloop-nextest-feynkit> ========== nextest test summary ==========
  55. 32.57 s gammaloop-nextest-feynkit> report: target/nextest/ci_gammaloop/junit.xml
  56. 32.57 s gammaloop-nextest-feynkit> tests: 33, failures: 0, errors: 0
  57. 32.57 s gammaloop-nextest-feynkit> No failing testcases found.
  58. 32.57 s gammaloop-nextest-feynkit> =========================================
  59. 32.59 s gammaloop-nextest-feynkit> Extracting 2 binaries and 2 linked paths to /build/source
  60. 32.71 s gammaloop-nextest-feynkit> Extracted 16 files to /build/source in 0.13s
  61. 32.72 s gammaloop-nextest-feynkit> ------------
  62. 32.72 s gammaloop-nextest-feynkit> Nextest run ID b8a117e9-1821-44df-b7e4-288d5280edca with nextest profile: ci_gammaloop
  63. 32.72 s gammaloop-nextest-feynkit> Starting 58 tests across 2 binaries
  64. 32.76 s gammaloop-nextest-feynkit> ------------
  65. 32.76 s gammaloop-nextest-feynkit> Summary [ 0.037s] 58 tests run: 58 passed, 0 skipped
  66. 32.79 s gammaloop-nextest-feynkit>
  67. 32.79 s gammaloop-nextest-feynkit> ========== nextest test summary ==========
  68. 32.79 s gammaloop-nextest-feynkit> report: target/nextest/ci_gammaloop/junit.xml
  69. 32.79 s gammaloop-nextest-feynkit> tests: 58, failures: 0, errors: 0
  70. 32.79 s gammaloop-nextest-feynkit> No failing testcases found.
  71. 32.79 s gammaloop-nextest-feynkit> =========================================
  72. 32.80 s gammaloop-nextest-feynkit> Extracting 1 binary and 2 linked paths to /build/source
  73. 32.88 s gammaloop-nextest-feynkit> Extracted 15 files to /build/source in 0.07s
  74. 32.88 s gammaloop-nextest-feynkit> ------------
  75. 32.88 s gammaloop-nextest-feynkit> Nextest run ID 36606e61-ce9e-4427-b9e8-01f6d498936b with nextest profile: ci_gammaloop
  76. 32.88 s gammaloop-nextest-feynkit> Starting 27 tests across 1 binary
  77. 32.90 s gammaloop-nextest-feynkit> ------------
  78. 32.90 s gammaloop-nextest-feynkit> Summary [ 0.014s] 27 tests run: 27 passed, 0 skipped
  79. 32.93 s gammaloop-nextest-feynkit>
  80. 32.93 s gammaloop-nextest-feynkit> ========== nextest test summary ==========
  81. 32.93 s gammaloop-nextest-feynkit> report: target/nextest/ci_gammaloop/junit.xml
  82. 32.93 s gammaloop-nextest-feynkit> tests: 27, failures: 0, errors: 0
  83. 32.93 s gammaloop-nextest-feynkit> No failing testcases found.
  84. 32.93 s gammaloop-nextest-feynkit> =========================================
  85. 32.94 s gammaloop-nextest-feynkit> Extracting 1 binary and 1 linked path to /build/source
  86. 33.01 s gammaloop-nextest-feynkit> Extracted 7 files to /build/source in 0.07s
  87. 33.02 s gammaloop-nextest-feynkit> ------------
  88. 33.02 s gammaloop-nextest-feynkit> Nextest run ID 0f1fce81-5969-4b83-854d-fda4d37200fb with nextest profile: ci_gammaloop
  89. 33.02 s gammaloop-nextest-feynkit> Starting 21 tests across 1 binary
  90. 33.03 s gammaloop-nextest-feynkit> ------------
  91. 33.03 s gammaloop-nextest-feynkit> Summary [ 0.011s] 21 tests run: 21 passed, 0 skipped
  92. 33.05 s gammaloop-nextest-feynkit>
  93. 33.05 s gammaloop-nextest-feynkit> ========== nextest test summary ==========
  94. 33.05 s gammaloop-nextest-feynkit> report: target/nextest/ci_gammaloop/junit.xml
  95. 33.05 s gammaloop-nextest-feynkit> tests: 21, failures: 0, errors: 0
  96. 33.05 s gammaloop-nextest-feynkit> No failing testcases found.
  97. 33.05 s gammaloop-nextest-feynkit> =========================================
  98. 33.07 s gammaloop-nextest-feynkit> Extracting 2 binaries and 2 linked paths to /build/source
  99. 33.19 s gammaloop-nextest-feynkit> Extracted 16 files to /build/source in 0.12s
  100. 33.19 s gammaloop-nextest-feynkit> ------------
  101. 33.19 s gammaloop-nextest-feynkit> Nextest run ID 140a0c6b-81f4-4906-9e54-133b5112a08c with nextest profile: ci_gammaloop
  102. 33.19 s gammaloop-nextest-feynkit> Starting 14 tests across 2 binaries
  103. 33.20 s gammaloop-nextest-feynkit> ------------
  104. 33.20 s gammaloop-nextest-feynkit> Summary [ 0.011s] 14 tests run: 14 passed, 0 skipped
  105. 33.23 s gammaloop-nextest-feynkit>
  106. 33.23 s gammaloop-nextest-feynkit> ========== nextest test summary ==========
  107. 33.23 s gammaloop-nextest-feynkit> report: target/nextest/ci_gammaloop/junit.xml
  108. 33.23 s gammaloop-nextest-feynkit> tests: 14, failures: 0, errors: 0
  109. 33.23 s gammaloop-nextest-feynkit> No failing testcases found.
  110. 33.23 s gammaloop-nextest-feynkit> =========================================
  111. 33.25 s gammaloop-nextest-feynkit> Extracting 5 binaries (including 3 non-test binaries) and 2 linked paths to /build/source
  112. 33.94 s gammaloop-nextest-feynkit> Extracted 22 files to /build/source in 0.69s
  113. 33.95 s gammaloop-nextest-feynkit> ------------
  114. 33.95 s gammaloop-nextest-feynkit> Nextest run ID 7bb283b1-23c2-4b28-85d8-72a96fd0c856 with nextest profile: ci_gammaloop
  115. 33.95 s gammaloop-nextest-feynkit> Starting 13 tests across 2 binaries
  116. 34.02 s gammaloop-nextest-feynkit> FAIL [ 0.066s] (10/13) feynkit-py tests::standalone_python_pipeline_covers_generation_graphs_cff_and_kinematics
  117. 34.02 s gammaloop-nextest-feynkit> stdout ---
  118. 34.02 s gammaloop-nextest-feynkit>
  119. 34.02 s gammaloop-nextest-feynkit> running 1 test
  120. 34.02 s gammaloop-nextest-feynkit> test tests::standalone_python_pipeline_covers_generation_graphs_cff_and_kinematics ... FAILED
  121. 34.02 s gammaloop-nextest-feynkit>
  122. 34.02 s gammaloop-nextest-feynkit> failures:
  123. 34.02 s gammaloop-nextest-feynkit>
  124. 34.02 s gammaloop-nextest-feynkit> failures:
  125. 34.02 s gammaloop-nextest-feynkit> tests::standalone_python_pipeline_covers_generation_graphs_cff_and_kinematics
  126. 34.02 s gammaloop-nextest-feynkit>
  127. 34.02 s gammaloop-nextest-feynkit> test result: FAILED. 0 passed; 1 failed; 0 ignored; 0 measured; 11 filtered out; finished in 0.06s
  128. 34.02 s gammaloop-nextest-feynkit>
  129. 34.02 s gammaloop-nextest-feynkit> stderr ---
  130. 34.02 s gammaloop-nextest-feynkit>
  131. 34.02 s gammaloop-nextest-feynkit> thread 'tests::standalone_python_pipeline_covers_generation_graphs_cff_and_kinematics' (903) panicked at crates/feynkit-py/src/lib.rs:438:57:
  132. 34.02 s gammaloop-nextest-feynkit> called `Result::unwrap()` on an `Err` value: PyErr { type: <class 'AssertionError'>, value: AssertionError(), traceback: Some("Traceback (most recent call last):\n File \"<string>\", line 39, in <module>\n") }
  133. 34.02 s gammaloop-nextest-feynkit> stack backtrace:
  134. 34.02 s gammaloop-nextest-feynkit> 0: __rustc::rust_begin_unwind
  135. 34.02 s gammaloop-nextest-feynkit> 1: core::panicking::panic_fmt
  136. 34.02 s gammaloop-nextest-feynkit> 2: core::result::unwrap_failed
  137. 34.02 s gammaloop-nextest-feynkit> 3: feynkit_py::tests::standalone_python_pipeline_covers_generation_graphs_cff_and_kinematics
  138. 34.02 s gammaloop-nextest-feynkit> 4: <feynkit_py::tests::standalone_python_pipeline_covers_generation_graphs_cff_and_kinematics::{closure#0} as core::ops::function::FnOnce<()>>::call_once
  139. 34.02 s gammaloop-nextest-feynkit> note: Some details are omitted, run with `RUST_BACKTRACE=full` for a verbose backtrace.
  140. 34.02 s gammaloop-nextest-feynkit>
  141. 35.00 s gammaloop-nextest-feynkit> ------------
  142. 35.00 s gammaloop-nextest-feynkit> Summary [ 1.053s] 13 tests run: 12 passed, 1 failed, 0 skipped
  143. 35.00 s gammaloop-nextest-feynkit> FAIL [ 0.066s] (10/13) feynkit-py tests::standalone_python_pipeline_covers_generation_graphs_cff_and_kinematics
  144. 35.00 s gammaloop-nextest-feynkit> stdout ---
  145. 35.00 s gammaloop-nextest-feynkit>
  146. 35.00 s gammaloop-nextest-feynkit> running 1 test
  147. 35.00 s gammaloop-nextest-feynkit> test tests::standalone_python_pipeline_covers_generation_graphs_cff_and_kinematics ... FAILED
  148. 35.00 s gammaloop-nextest-feynkit>
  149. 35.00 s gammaloop-nextest-feynkit> failures:
  150. 35.00 s gammaloop-nextest-feynkit>
  151. 35.00 s gammaloop-nextest-feynkit> failures:
  152. 35.00 s gammaloop-nextest-feynkit> tests::standalone_python_pipeline_covers_generation_graphs_cff_and_kinematics
  153. 35.00 s gammaloop-nextest-feynkit>
  154. 35.00 s gammaloop-nextest-feynkit> test result: FAILED. 0 passed; 1 failed; 0 ignored; 0 measured; 11 filtered out; finished in 0.06s
  155. 35.00 s gammaloop-nextest-feynkit>
  156. 35.00 s gammaloop-nextest-feynkit> stderr ---
  157. 35.00 s gammaloop-nextest-feynkit>
  158. 35.00 s gammaloop-nextest-feynkit> thread 'tests::standalone_python_pipeline_covers_generation_graphs_cff_and_kinematics' (903) panicked at crates/feynkit-py/src/lib.rs:438:57:
  159. 35.00 s gammaloop-nextest-feynkit> called `Result::unwrap()` on an `Err` value: PyErr { type: <class 'AssertionError'>, value: AssertionError(), traceback: Some("Traceback (most recent call last):\n File \"<string>\", line 39, in <module>\n") }
  160. 35.00 s gammaloop-nextest-feynkit> stack backtrace:
  161. 35.00 s gammaloop-nextest-feynkit> 0: __rustc::rust_begin_unwind
  162. 35.00 s gammaloop-nextest-feynkit> 1: core::panicking::panic_fmt
  163. 35.00 s gammaloop-nextest-feynkit> 2: core::result::unwrap_failed
  164. 35.00 s gammaloop-nextest-feynkit> 3: feynkit_py::tests::standalone_python_pipeline_covers_generation_graphs_cff_and_kinematics
  165. 35.00 s gammaloop-nextest-feynkit> 4: <feynkit_py::tests::standalone_python_pipeline_covers_generation_graphs_cff_and_kinematics::{closure#0} as core::ops::function::FnOnce<()>>::call_once
  166. 35.00 s gammaloop-nextest-feynkit> note: Some details are omitted, run with `RUST_BACKTRACE=full` for a verbose backtrace.
  167. 35.00 s gammaloop-nextest-feynkit>
  168. 35.01 s gammaloop-nextest-feynkit> error: test run failed
  169. 35.03 s gammaloop-nextest-feynkit>
  170. 35.03 s gammaloop-nextest-feynkit> ========== nextest test summary ==========
  171. 35.03 s gammaloop-nextest-feynkit> report: target/nextest/ci_gammaloop/junit.xml
  172. 35.03 s gammaloop-nextest-feynkit> tests: 13, failures: 1, errors: 0
  173. 35.03 s gammaloop-nextest-feynkit>
  174. 35.03 s gammaloop-nextest-feynkit> 1. feynkit-py::tests::standalone_python_pipeline_covers_generation_graphs_cff_and_kinematics
  175. 35.03 s gammaloop-nextest-feynkit> failure: test failure with exit code 101
  176. 35.03 s gammaloop-nextest-feynkit> thread 'tests::standalone_python_pipeline_covers_generation_graphs_cff_and_kinematics' (903) panicked at crates/feynkit-py/src/lib.rs:438:57:
  177. 35.03 s gammaloop-nextest-feynkit> called `Result::unwrap()` on an `Err` value: PyErr { type: <class 'AssertionError'>, value: AssertionError(), traceback: Some("Traceback (most recent call last):\n File \"<string>\", line 39, in <module>\n") }
  178. 35.03 s gammaloop-nextest-feynkit> stack backtrace:
  179. 35.03 s gammaloop-nextest-feynkit> 0: __rustc::rust_begin_unwind
  180. 35.03 s gammaloop-nextest-feynkit> 1: core::panicking::panic_fmt
  181. 35.03 s gammaloop-nextest-feynkit> 2: core::result::unwrap_failed
  182. 35.03 s gammaloop-nextest-feynkit> 3: feynkit_py::tests::standalone_python_pipeline_covers_generation_graphs_cff_and_kinematics
  183. 35.03 s gammaloop-nextest-feynkit> 4: <feynkit_py::tests::standalone_python_pipeline_covers_generation_graphs_cff_and_kinematics::{closure#0} as core::ops::function::FnOnce<()>>::call_once
  184. 35.03 s gammaloop-nextest-feynkit> note: Some details are omitted, run with `RUST_BACKTRACE=full` for a verbose backtrace.
  185. 35.03 s gammaloop-nextest-feynkit> system-out
  186. 35.03 s gammaloop-nextest-feynkit> running 1 test
  187. 35.03 s gammaloop-nextest-feynkit> test tests::standalone_python_pipeline_covers_generation_graphs_cff_and_kinematics ... FAILED
  188. 35.03 s gammaloop-nextest-feynkit>
  189. 35.03 s gammaloop-nextest-feynkit> failures:
  190. 35.03 s gammaloop-nextest-feynkit>
  191. 35.03 s gammaloop-nextest-feynkit> failures:
  192. 35.03 s gammaloop-nextest-feynkit> tests::standalone_python_pipeline_covers_generation_graphs_cff_and_kinematics
  193. 35.03 s gammaloop-nextest-feynkit>
  194. 35.03 s gammaloop-nextest-feynkit> test result: FAILED. 0 passed; 1 failed; 0 ignored; 0 measured; 11 filtered out; finished in 0.06s
  195. 35.03 s gammaloop-nextest-feynkit> system-err
  196. 35.03 s gammaloop-nextest-feynkit> thread 'tests::standalone_python_pipeline_covers_generation_graphs_cff_and_kinematics' (903) panicked at crates/feynkit-py/src/lib.rs:438:57:
  197. 35.03 s gammaloop-nextest-feynkit> called `Result::unwrap()` on an `Err` value: PyErr { type: <class 'AssertionError'>, value: AssertionError(), traceback: Some("Traceback (most recent call last):\n File \"<string>\", line 39, in <module>\n") }
  198. 35.03 s gammaloop-nextest-feynkit> stack backtrace:
  199. 35.03 s gammaloop-nextest-feynkit> 0: __rustc::rust_begin_unwind
  200. 35.03 s gammaloop-nextest-feynkit> 1: core::panicking::panic_fmt
  201. 35.03 s gammaloop-nextest-feynkit> 2: core::result::unwrap_failed
  202. 35.03 s gammaloop-nextest-feynkit> 3: feynkit_py::tests::standalone_python_pipeline_covers_generation_graphs_cff_and_kinematics
  203. 35.03 s gammaloop-nextest-feynkit> 4: <feynkit_py::tests::standalone_python_pipeline_covers_generation_graphs_cff_and_kinematics::{closure#0} as core::ops::function::FnOnce<()>>::call_once
  204. 35.03 s gammaloop-nextest-feynkit> note: Some details are omitted, run with `RUST_BACKTRACE=full` for a verbose backtrace.
  205. 35.03 s gammaloop-nextest-feynkit> =========================================
  206. 35.04 s gammaloop-nextest-feynkit> Extracting 1 binary and 2 linked paths to /build/source
  207. 35.15 s gammaloop-nextest-feynkit> Extracted 15 files to /build/source in 0.10s
  208. 35.15 s gammaloop-nextest-feynkit> ------------
  209. 35.15 s gammaloop-nextest-feynkit> Nextest run ID a250d689-6b8d-4888-b974-f9278ee64499 with nextest profile: ci_gammaloop
  210. 35.15 s gammaloop-nextest-feynkit> Starting 45 tests across 1 binary (1 test skipped)
  211. 35.25 s gammaloop-nextest-feynkit> ------------
  212. 35.25 s gammaloop-nextest-feynkit> Summary [ 0.094s] 45 tests run: 45 passed, 1 skipped
  213. 35.28 s gammaloop-nextest-feynkit>
  214. 35.28 s gammaloop-nextest-feynkit> ========== nextest test summary ==========
  215. 35.28 s gammaloop-nextest-feynkit> report: target/nextest/ci_gammaloop/junit.xml
  216. 35.28 s gammaloop-nextest-feynkit> tests: 45, failures: 0, errors: 0
  217. 35.28 s gammaloop-nextest-feynkit> No failing testcases found.
  218. 35.28 s gammaloop-nextest-feynkit> =========================================
  219. 35.29 s gammaloop-nextest-feynkit> Extracting 1 binary and 2 linked paths to /build/source
  220. 35.36 s gammaloop-nextest-feynkit> Extracted 15 files to /build/source in 0.08s
  221. 35.37 s gammaloop-nextest-feynkit> ------------
  222. 35.37 s gammaloop-nextest-feynkit> Nextest run ID 5d03711a-9a52-4219-beaf-73f5c7c2ad7b with nextest profile: ci_gammaloop
  223. 35.37 s gammaloop-nextest-feynkit> Starting 2 tests across 1 binary
  224. 35.39 s gammaloop-nextest-feynkit> ------------
  225. 35.39 s gammaloop-nextest-feynkit> Summary [ 0.015s] 2 tests run: 2 passed, 0 skipped
  226. 35.42 s gammaloop-nextest-feynkit>
  227. 35.42 s gammaloop-nextest-feynkit> ========== nextest test summary ==========
  228. 35.42 s gammaloop-nextest-feynkit> report: target/nextest/ci_gammaloop/junit.xml
  229. 35.42 s gammaloop-nextest-feynkit> tests: 2, failures: 0, errors: 0
  230. 35.42 s gammaloop-nextest-feynkit> No failing testcases found.
  231. 35.42 s gammaloop-nextest-feynkit> =========================================
  232. 35.56 s error: Cannot build '/nix/store/zh4pw054f6hx097n2qj1gy61y2ksp3nz-gammaloop-nextest-feynkit.drv'.
  233. 35.56 s Reason: builder failed with exit code 100.
  234. 35.56 s Output paths:
  235. 35.56 s /nix/store/x47xvchzdig7wfp2l11w8ppylahhi2kx-gammaloop-nextest-feynkit
  236. 35.56 s Last 199 log lines:
  237. 35.56 s > Extracting 1 binary and 2 linked paths to /build/source
  238. 35.56 s > Extracted 15 files to /build/source in 0.07s
  239. 35.56 s > ------------
  240. 35.56 s > Nextest run ID fe42dab7-4bb7-4b65-9c42-32ad1180fd3a with nextest profile: ci_gammaloop
  241. 35.56 s > Starting 1 test across 1 binary
  242. 35.56 s > ------------
  243. 35.56 s > Summary [ 0.005s] 1 test run: 1 passed, 0 skipped
  244. 35.56 s >
  245. 35.56 s > ========== nextest test summary ==========
  246. 35.56 s > report: target/nextest/ci_gammaloop/junit.xml
  247. 35.56 s > tests: 1, failures: 0, errors: 0
  248. 35.56 s > No failing testcases found.
  249. 35.56 s > =========================================
  250. 35.56 s > Extracting 1 binary and 2 linked paths to /build/source
  251. 35.56 s > Extracted 15 files to /build/source in 0.08s
  252. 35.56 s > ------------
  253. 35.56 s > Nextest run ID 2166da0a-859f-40b0-816a-e39bf45975b1 with nextest profile: ci_gammaloop
  254. 35.56 s > Starting 33 tests across 1 binary
  255. 35.56 s > ------------
  256. 35.56 s > Summary [ 0.014s] 33 tests run: 33 passed, 0 skipped
  257. 35.56 s >
  258. 35.56 s > ========== nextest test summary ==========
  259. 35.56 s > report: target/nextest/ci_gammaloop/junit.xml
  260. 35.56 s > tests: 33, failures: 0, errors: 0
  261. 35.56 s > No failing testcases found.
  262. 35.56 s > =========================================
  263. 35.56 s > Extracting 2 binaries and 2 linked paths to /build/source
  264. 35.56 s > Extracted 16 files to /build/source in 0.13s
  265. 35.56 s > ------------
  266. 35.56 s > Nextest run ID b8a117e9-1821-44df-b7e4-288d5280edca with nextest profile: ci_gammaloop
  267. 35.56 s > Starting 58 tests across 2 binaries
  268. 35.56 s > ------------
  269. 35.56 s > Summary [ 0.037s] 58 tests run: 58 passed, 0 skipped
  270. 35.56 s >
  271. 35.56 s > ========== nextest test summary ==========
  272. 35.56 s > report: target/nextest/ci_gammaloop/junit.xml
  273. 35.56 s > tests: 58, failures: 0, errors: 0
  274. 35.56 s > No failing testcases found.
  275. 35.56 s > =========================================
  276. 35.56 s > Extracting 1 binary and 2 linked paths to /build/source
  277. 35.56 s > Extracted 15 files to /build/source in 0.07s
  278. 35.56 s > ------------
  279. 35.56 s > Nextest run ID 36606e61-ce9e-4427-b9e8-01f6d498936b with nextest profile: ci_gammaloop
  280. 35.56 s > Starting 27 tests across 1 binary
  281. 35.56 s > ------------
  282. 35.56 s > Summary [ 0.014s] 27 tests run: 27 passed, 0 skipped
  283. 35.56 s >
  284. 35.56 s > ========== nextest test summary ==========
  285. 35.56 s > report: target/nextest/ci_gammaloop/junit.xml
  286. 35.56 s > tests: 27, failures: 0, errors: 0
  287. 35.56 s > No failing testcases found.
  288. 35.56 s > =========================================
  289. 35.56 s > Extracting 1 binary and 1 linked path to /build/source
  290. 35.56 s > Extracted 7 files to /build/source in 0.07s
  291. 35.56 s > ------------
  292. 35.56 s > Nextest run ID 0f1fce81-5969-4b83-854d-fda4d37200fb with nextest profile: ci_gammaloop
  293. 35.56 s > Starting 21 tests across 1 binary
  294. 35.56 s > ------------
  295. 35.56 s > Summary [ 0.011s] 21 tests run: 21 passed, 0 skipped
  296. 35.56 s >
  297. 35.56 s > ========== nextest test summary ==========
  298. 35.56 s > report: target/nextest/ci_gammaloop/junit.xml
  299. 35.56 s > tests: 21, failures: 0, errors: 0
  300. 35.56 s > No failing testcases found.
  301. 35.56 s > =========================================
  302. 35.56 s > Extracting 2 binaries and 2 linked paths to /build/source
  303. 35.56 s > Extracted 16 files to /build/source in 0.12s
  304. 35.56 s > ------------
  305. 35.56 s > Nextest run ID 140a0c6b-81f4-4906-9e54-133b5112a08c with nextest profile: ci_gammaloop
  306. 35.56 s > Starting 14 tests across 2 binaries
  307. 35.56 s > ------------
  308. 35.56 s > Summary [ 0.011s] 14 tests run: 14 passed, 0 skipped
  309. 35.56 s >
  310. 35.56 s > ========== nextest test summary ==========
  311. 35.56 s > report: target/nextest/ci_gammaloop/junit.xml
  312. 35.56 s > tests: 14, failures: 0, errors: 0
  313. 35.56 s > No failing testcases found.
  314. 35.56 s > =========================================
  315. 35.56 s > Extracting 5 binaries (including 3 non-test binaries) and 2 linked paths to /build/source
  316. 35.56 s > Extracted 22 files to /build/source in 0.69s
  317. 35.56 s > ------------
  318. 35.56 s > Nextest run ID 7bb283b1-23c2-4b28-85d8-72a96fd0c856 with nextest profile: ci_gammaloop
  319. 35.56 s > Starting 13 tests across 2 binaries
  320. 35.56 s > FAIL [ 0.066s] (10/13) feynkit-py tests::standalone_python_pipeline_covers_generation_graphs_cff_and_kinematics
  321. 35.56 s > stdout ---
  322. 35.56 s >
  323. 35.56 s > running 1 test
  324. 35.56 s > test tests::standalone_python_pipeline_covers_generation_graphs_cff_and_kinematics ... FAILED
  325. 35.56 s >
  326. 35.56 s > failures:
  327. 35.56 s >
  328. 35.56 s > failures:
  329. 35.56 s > tests::standalone_python_pipeline_covers_generation_graphs_cff_and_kinematics
  330. 35.56 s >
  331. 35.56 s > test result: FAILED. 0 passed; 1 failed; 0 ignored; 0 measured; 11 filtered out; finished in 0.06s
  332. 35.56 s >
  333. 35.56 s > stderr ---
  334. 35.56 s >
  335. 35.56 s > thread 'tests::standalone_python_pipeline_covers_generation_graphs_cff_and_kinematics' (903) panicked at crates/feynkit-py/src/lib.rs:438:57:
  336. 35.56 s > called `Result::unwrap()` on an `Err` value: PyErr { type: <class 'AssertionError'>, value: AssertionError(), traceback: Some("Traceback (most recent call last):\n File \"<string>\", line 39, in <module>\n") }
  337. 35.56 s > stack backtrace:
  338. 35.56 s > 0: __rustc::rust_begin_unwind
  339. 35.56 s > 1: core::panicking::panic_fmt
  340. 35.56 s > 2: core::result::unwrap_failed
  341. 35.56 s > 3: feynkit_py::tests::standalone_python_pipeline_covers_generation_graphs_cff_and_kinematics
  342. 35.56 s > 4: <feynkit_py::tests::standalone_python_pipeline_covers_generation_graphs_cff_and_kinematics::{closure#0} as core::ops::function::FnOnce<()>>::call_once
  343. 35.56 s > note: Some details are omitted, run with `RUST_BACKTRACE=full` for a verbose backtrace.
  344. 35.56 s >
  345. 35.56 s > ------------
  346. 35.56 s > Summary [ 1.053s] 13 tests run: 12 passed, 1 failed, 0 skipped
  347. 35.56 s > FAIL [ 0.066s] (10/13) feynkit-py tests::standalone_python_pipeline_covers_generation_graphs_cff_and_kinematics
  348. 35.56 s > stdout ---
  349. 35.56 s >
  350. 35.56 s > running 1 test
  351. 35.56 s > test tests::standalone_python_pipeline_covers_generation_graphs_cff_and_kinematics ... FAILED
  352. 35.56 s >
  353. 35.56 s > failures:
  354. 35.56 s >
  355. 35.56 s > failures:
  356. 35.56 s > tests::standalone_python_pipeline_covers_generation_graphs_cff_and_kinematics
  357. 35.56 s >
  358. 35.56 s > test result: FAILED. 0 passed; 1 failed; 0 ignored; 0 measured; 11 filtered out; finished in 0.06s
  359. 35.56 s >
  360. 35.56 s > stderr ---
  361. 35.56 s >
  362. 35.56 s > thread 'tests::standalone_python_pipeline_covers_generation_graphs_cff_and_kinematics' (903) panicked at crates/feynkit-py/src/lib.rs:438:57:
  363. 35.56 s > called `Result::unwrap()` on an `Err` value: PyErr { type: <class 'AssertionError'>, value: AssertionError(), traceback: Some("Traceback (most recent call last):\n File \"<string>\", line 39, in <module>\n") }
  364. 35.56 s > stack backtrace:
  365. 35.56 s > 0: __rustc::rust_begin_unwind
  366. 35.56 s > 1: core::panicking::panic_fmt
  367. 35.56 s > 2: core::result::unwrap_failed
  368. 35.56 s > 3: feynkit_py::tests::standalone_python_pipeline_covers_generation_graphs_cff_and_kinematics
  369. 35.56 s > 4: <feynkit_py::tests::standalone_python_pipeline_covers_generation_graphs_cff_and_kinematics::{closure#0} as core::ops::function::FnOnce<()>>::call_once
  370. 35.56 s > note: Some details are omitted, run with `RUST_BACKTRACE=full` for a verbose backtrace.
  371. 35.56 s >
  372. 35.56 s > error: test run failed
  373. 35.56 s >
  374. 35.56 s > ========== nextest test summary ==========
  375. 35.56 s > report: target/nextest/ci_gammaloop/junit.xml
  376. 35.56 s > tests: 13, failures: 1, errors: 0
  377. 35.56 s >
  378. 35.56 s > 1. feynkit-py::tests::standalone_python_pipeline_covers_generation_graphs_cff_and_kinematics
  379. 35.56 s > failure: test failure with exit code 101
  380. 35.56 s > thread 'tests::standalone_python_pipeline_covers_generation_graphs_cff_and_kinematics' (903) panicked at crates/feynkit-py/src/lib.rs:438:57:
  381. 35.56 s > called `Result::unwrap()` on an `Err` value: PyErr { type: <class 'AssertionError'>, value: AssertionError(), traceback: Some("Traceback (most recent call last):\n File \"<string>\", line 39, in <module>\n") }
  382. 35.56 s > stack backtrace:
  383. 35.56 s > 0: __rustc::rust_begin_unwind
  384. 35.56 s > 1: core::panicking::panic_fmt
  385. 35.56 s > 2: core::result::unwrap_failed
  386. 35.56 s > 3: feynkit_py::tests::standalone_python_pipeline_covers_generation_graphs_cff_and_kinematics
  387. 35.56 s > 4: <feynkit_py::tests::standalone_python_pipeline_covers_generation_graphs_cff_and_kinematics::{closure#0} as core::ops::function::FnOnce<()>>::call_once
  388. 35.56 s > note: Some details are omitted, run with `RUST_BACKTRACE=full` for a verbose backtrace.
  389. 35.56 s > system-out
  390. 35.56 s > running 1 test
  391. 35.56 s > test tests::standalone_python_pipeline_covers_generation_graphs_cff_and_kinematics ... FAILED
  392. 35.56 s >
  393. 35.56 s > failures:
  394. 35.56 s >
  395. 35.56 s > failures:
  396. 35.56 s > tests::standalone_python_pipeline_covers_generation_graphs_cff_and_kinematics
  397. 35.56 s >
  398. 35.56 s > test result: FAILED. 0 passed; 1 failed; 0 ignored; 0 measured; 11 filtered out; finished in 0.06s
  399. 35.56 s > system-err
  400. 35.56 s > thread 'tests::standalone_python_pipeline_covers_generation_graphs_cff_and_kinematics' (903) panicked at crates/feynkit-py/src/lib.rs:438:57:
  401. 35.56 s > called `Result::unwrap()` on an `Err` value: PyErr { type: <class 'AssertionError'>, value: AssertionError(), traceback: Some("Traceback (most recent call last):\n File \"<string>\", line 39, in <module>\n") }
  402. 35.56 s > stack backtrace:
  403. 35.56 s > 0: __rustc::rust_begin_unwind
  404. 35.56 s > 1: core::panicking::panic_fmt
  405. 35.56 s > 2: core::result::unwrap_failed
  406. 35.56 s > 3: feynkit_py::tests::standalone_python_pipeline_covers_generation_graphs_cff_and_kinematics
  407. 35.56 s > 4: <feynkit_py::tests::standalone_python_pipeline_covers_generation_graphs_cff_and_kinematics::{closure#0} as core::ops::function::FnOnce<()>>::call_once
  408. 35.56 s > note: Some details are omitted, run with `RUST_BACKTRACE=full` for a verbose backtrace.
  409. 35.56 s > =========================================
  410. 35.56 s > Extracting 1 binary and 2 linked paths to /build/source
  411. 35.56 s > Extracted 15 files to /build/source in 0.10s
  412. 35.56 s > ------------
  413. 35.56 s > Nextest run ID a250d689-6b8d-4888-b974-f9278ee64499 with nextest profile: ci_gammaloop
  414. 35.56 s > Starting 45 tests across 1 binary (1 test skipped)
  415. 35.56 s > ------------
  416. 35.56 s > Summary [ 0.094s] 45 tests run: 45 passed, 1 skipped
  417. 35.56 s >
  418. 35.56 s > ========== nextest test summary ==========
  419. 35.56 s > report: target/nextest/ci_gammaloop/junit.xml
  420. 35.56 s > tests: 45, failures: 0, errors: 0
  421. 35.56 s > No failing testcases found.
  422. 35.56 s > =========================================
  423. 35.56 s > Extracting 1 binary and 2 linked paths to /build/source
  424. 35.56 s > Extracted 15 files to /build/source in 0.08s
  425. 35.56 s > ------------
  426. 35.56 s > Nextest run ID 5d03711a-9a52-4219-beaf-73f5c7c2ad7b with nextest profile: ci_gammaloop
  427. 35.56 s > Starting 2 tests across 1 binary
  428. 35.56 s > ------------
  429. 35.56 s > Summary [ 0.015s] 2 tests run: 2 passed, 0 skipped
  430. 35.56 s >
  431. 35.56 s > ========== nextest test summary ==========
  432. 35.56 s > report: target/nextest/ci_gammaloop/junit.xml
  433. 35.56 s > tests: 2, failures: 0, errors: 0
  434. 35.56 s > No failing testcases found.
  435. 35.56 s > =========================================
  436. 35.56 s For full logs, run:
  437. 35.56 s nix log /nix/store/zh4pw054f6hx097n2qj1gy61y2ksp3nz-gammaloop-nextest-feynkit.drv
  438. 35.70 s [1 built (1 failed), 9 cRun failed.