0.01 s
$ /nix/store/61685rbaxmpigwi3z23i33sv3jyfl70q-coreutils-9.11/bin/timeout --kill-after=15s 7200s /nix/store/wknkybkzrc16r11vk5vrykh4wmw7a353-nix-2.34.8/bin/nix --extra-experimental-features nix-command --extra-experimental-features flakes flake clone git+https://github.com/alphal00p/gammaloop --dest /tmp/nix-ci-worker/stable-pwd/repo/
0.07 s
Cloning into '/tmp/nix-ci-worker/stable-pwd/repo'...
0.81 s
remote: Enumerating objects: 103784, done.
0.93 s
remote: Counting objects: 0% (1/9421)
remote: Counting objects: 1% (95/9421)
remote: Counting objects: 2% (189/9421)
remote: Counting objects: 3% (283/9421)
remote: Counting objects: 4% (377/9421)
remote: Counting objects: 5% (472/9421)
remote: Counting objects: 6% (566/9421)
remote: Counting objects: 7% (660/9421)
remote: Counting objects: 8% (754/9421)
remote: Counting objects: 9% (848/9421)
remote: Counting objects: 10% (943/9421)
remote: Counting objects: 11% (1037/9421)
remote: Counting objects: 12% (1131/9421)
remote: Counting objects: 13% (1225/9421)
remote: Counting objects: 14% (1319/9421)
remote: Counting objects: 15% (1414/9421)
remote: Counting objects: 16% (1508/9421)
remote: Counting objects: 17% (1602/9421)
remote: Counting objects: 18% (1696/9421)
remote: Counting objects: 19% (1790/9421)
remote: Counting objects: 20% (1885/9421)
remote: Counting objects: 21% (1979/9421)
remote: Counting objects: 22% (2073/9421)
remote: Counting objects: 23% (2167/9421)
remote: Counting objects: 24% (2262/9421)
remote: Counting objects: 25% (2356/9421)
remote: Counting objects: 26% (2450/9421)
remote: Counting objects: 27% (2544/9421)
remote: Counting objects: 28% (2638/9421)
remote: Counting objects: 29% (2733/9421)
remote: Counting objects: 30% (2827/9421)
remote: Counting objects: 31% (2921/9421)
remote: Counting objects: 32% (3015/9421)
remote: Counting objects: 33% (3109/9421)
remote: Counting objects: 34% (3204/9421)
remote: Counting objects: 35% (3298/9421)
remote: Counting objects: 36% (3392/9421)
remote: Counting objects: 37% (3486/9421)
remote: Counting objects: 38% (3580/9421)
remote: Counting objects: 39% (3675/9421)
remote: Counting objects: 40% (3769/9421)
remote: Counting objects: 41% (3863/9421)
remote: Counting objects: 42% (3957/9421)
remote: Counting objects: 43% (4052/9421)
remote: Counting objects: 44% (4146/9421)
remote: Counting objects: 45% (4240/9421)
remote: Counting objects: 46% (4334/9421)
remote: Counting objects: 47% (4428/9421)
remote: Counting objects: 48% (4523/9421)
remote: Counting objects: 49% (4617/9421)
remote: Counting objects: 50% (4711/9421)
remote: Counting objects: 51% (4805/9421)
remote: Counting objects: 52% (4899/9421)
remote: Counting objects: 53% (4994/9421)
remote: Counting objects: 54% (5088/9421)
remote: Counting objects: 55% (5182/9421)
remote: Counting objects: 56% (5276/9421)
remote: Counting objects: 57% (5370/9421)
remote: Counting objects: 58% (5465/9421)
remote: Counting objects: 59% (5559/9421)
remote: Counting objects: 60% (5653/9421)
remote: Counting objects: 61% (5747/9421)
remote: Counting objects: 62% (5842/9421)
remote: Counting objects: 63% (5936/9421)
remote: Counting objects: 64% (6030/9421)
remote: Counting objects: 65% (6124/9421)
remote: Counting objects: 66% (6218/9421)
remote: Counting objects: 67% (6313/9421)
remote: Counting objects: 68% (6407/9421)
remote: Counting objects: 69% (6501/9421)
remote: Counting objects: 70% (6595/9421)
remote: Counting objects: 71% (6689/9421)
remote: Counting objects: 72% (6784/9421)
remote: Counting objects: 73% (6878/9421)
remote: Counting objects: 74% (6972/9421)
remote: Counting objects: 75% (7066/9421)
remote: Counting objects: 76% (7160/9421)
remote: Counting objects: 77% (7255/9421)
remote: Counting objects: 78% (7349/9421)
remote: Counting objects: 79% (7443/9421)
remote: Counting objects: 80% (7537/9421)
remote: Counting objects: 81% (7632/9421)
remote: Counting objects: 82% (7726/9421)
remote: Counting objects: 83% (7820/9421)
remote: Counting objects: 84% (7914/9421)
remote: Counting objects: 85% (8008/9421)
remote: Counting objects: 86% (8103/9421)
remote: Counting objects: 87% (8197/9421)
remote: Counting objects: 88% (8291/9421)
remote: Counting objects: 89% (8385/9421)
remote: Counting objects: 90% (8479/9421)
remote: Counting objects: 91% (8574/9421)
remote: Counting objects: 92% (8668/9421)
remote: Counting objects: 93% (8762/9421)
remote: Counting objects: 94% (8856/9421)
remote: Counting objects: 95% (8950/9421)
remote: Counting objects: 96% (9045/9421)
remote: Counting objects: 97% (9139/9421)
remote: Counting objects: 98% (9233/9421)
remote: Counting objects: 99% (9327/9421)
remote: Counting objects: 100% (9421/9421)
remote: Counting objects: 100% (9421/9421), done.
2.90 s
remote: Compressing objects: 0% (1/2027)
remote: Compressing objects: 1% (21/2027)
remote: Compressing objects: 2% (41/2027)
remote: Compressing objects: 3% (61/2027)
remote: Compressing objects: 4% (82/2027)
remote: Compressing objects: 5% (102/2027)
remote: Compressing objects: 6% (122/2027)
remote: Compressing objects: 7% (142/2027)
remote: Compressing objects: 8% (163/2027)
remote: Compressing objects: 9% (183/2027)
remote: Compressing objects: 10% (203/2027)
remote: Compressing objects: 10% (218/2027)
remote: Compressing objects: 11% (223/2027)
remote: Compressing objects: 12% (244/2027)
remote: Compressing objects: 13% (264/2027)
remote: Compressing objects: 14% (284/2027)
remote: Compressing objects: 15% (305/2027)
remote: Compressing objects: 16% (325/2027)
remote: Compressing objects: 17% (345/2027)
remote: Compressing objects: 18% (365/2027)
remote: Compressing objects: 19% (386/2027)
remote: Compressing objects: 20% (406/2027)
remote: Compressing objects: 21% (426/2027)
remote: Compressing objects: 22% (446/2027)
remote: Compressing objects: 23% (467/2027)
remote: Compressing objects: 24% (487/2027)
remote: Compressing objects: 25% (507/2027)
remote: Compressing objects: 26% (528/2027)
remote: Compressing objects: 27% (548/2027)
remote: Compressing objects: 28% (568/2027)
remote: Compressing objects: 29% (588/2027)
remote: Compressing objects: 30% (609/2027)
remote: Compressing objects: 31% (629/2027)
remote: Compressing objects: 32% (649/2027)
remote: Compressing objects: 33% (669/2027)
remote: Compressing objects: 34% (690/2027)
remote: Compressing objects: 35% (710/2027)
remote: Compressing objects: 36% (730/2027)
remote: Compressing objects: 37% (750/2027)
remote: Compressing objects: 38% (771/2027)
remote: Compressing objects: 39% (791/2027)
remote: Compressing objects: 40% (811/2027)
remote: Compressing objects: 41% (832/2027)
remote: Compressing objects: 42% (852/2027)
remote: Compressing objects: 43% (872/2027)
remote: Compressing objects: 44% (892/2027)
remote: Compressing objects: 45% (913/2027)
remote: Compressing objects: 46% (933/2027)
remote: Compressing objects: 47% (953/2027)
remote: Compressing objects: 48% (973/2027)
remote: Compressing objects: 49% (994/2027)
remote: Compressing objects: 50% (1014/2027)
remote: Compressing objects: 51% (1034/2027)
remote: Compressing objects: 52% (1055/2027)
remote: Compressing objects: 53% (1075/2027)
remote: Compressing objects: 54% (1095/2027)
remote: Compressing objects: 55% (1115/2027)
remote: Compressing objects: 56% (1136/2027)
remote: Compressing objects: 57% (1156/2027)
remote: Compressing objects: 58% (1176/2027)
remote: Compressing objects: 59% (1196/2027)
remote: Compressing objects: 60% (1217/2027)
remote: Compressing objects: 61% (1237/2027)
remote: Compressing objects: 62% (1257/2027)
remote: Compressing objects: 63% (1278/2027)
remote: Compressing objects: 64% (1298/2027)
remote: Compressing objects: 65% (1318/2027)
remote: Compressing objects: 66% (1338/2027)
remote: Compressing objects: 67% (1359/2027)
remote: Compressing objects: 68% (1379/2027)
remote: Compressing objects: 69% (1399/2027)
remote: Compressing objects: 70% (1419/2027)
remote: Compressing objects: 71% (1440/2027)
remote: Compressing objects: 72% (1460/2027)
remote: Compressing objects: 73% (1480/2027)
remote: Compressing objects: 74% (1500/2027)
remote: Compressing objects: 75% (1521/2027)
remote: Compressing objects: 76% (1541/2027)
remote: Compressing objects: 77% (1561/2027)
remote: Compressing objects: 78% (1582/2027)
remote: Compressing objects: 79% (1602/2027)
remote: Compressing objects: 80% (1622/2027)
remote: Compressing objects: 81% (1642/2027)
remote: Compressing objects: 82% (1663/2027)
remote: Compressing objects: 83% (1683/2027)
remote: Compressing objects: 84% (1703/2027)
remote: Compressing objects: 85% (1723/2027)
remote: Compressing objects: 86% (1744/2027)
remote: Compressing objects: 87% (1764/2027)
remote: Compressing objects: 88% (1784/2027)
remote: Compressing objects: 89% (1805/2027)
remote: Compressing objects: 90% (1825/2027)
remote: Compressing objects: 91% (1845/2027)
remote: Compressing objects: 92% (1865/2027)
remote: Compressing objects: 93% (1886/2027)
remote: Compressing objects: 94% (1906/2027)
remote: Compressing objects: 95% (1926/2027)
remote: Compressing objects: 96% (1946/2027)
remote: Compressing objects: 97% (1967/2027)
remote: Compressing objects: 98% (1987/2027)
remote: Compressing objects: 99% (2007/2027)
remote: Compressing objects: 100% (2027/2027)
remote: Compressing objects: 100% (2027/2027), done.
16.44 s
Receiving objects: 0% (1/103784)
Receiving objects: 1% (1038/103784)
Receiving objects: 2% (2076/103784)
Receiving objects: 3% (3114/103784)
Receiving objects: 4% (4152/103784)
Receiving objects: 5% (5190/103784)
Receiving objects: 6% (6228/103784)
Receiving objects: 7% (7265/103784), 11.29 MiB | 22.55 MiB/s
Receiving objects: 8% (8303/103784), 11.29 MiB | 22.55 MiB/s
Receiving objects: 9% (9341/103784), 11.29 MiB | 22.55 MiB/s
Receiving objects: 10% (10379/103784), 11.29 MiB | 22.55 MiB/s
Receiving objects: 11% (11417/103784), 11.29 MiB | 22.55 MiB/s
Receiving objects: 12% (12455/103784), 11.29 MiB | 22.55 MiB/s
Receiving objects: 13% (13492/103784), 11.29 MiB | 22.55 MiB/s
Receiving objects: 14% (14530/103784), 11.29 MiB | 22.55 MiB/s
Receiving objects: 15% (15568/103784), 11.29 MiB | 22.55 MiB/s
Receiving objects: 16% (16606/103784), 11.29 MiB | 22.55 MiB/s
Receiving objects: 17% (17644/103784), 11.29 MiB | 22.55 MiB/s
Receiving objects: 18% (18682/103784), 11.29 MiB | 22.55 MiB/s
Receiving objects: 19% (19719/103784), 11.29 MiB | 22.55 MiB/s
Receiving objects: 20% (20757/103784), 11.29 MiB | 22.55 MiB/s
Receiving objects: 21% (21795/103784), 11.29 MiB | 22.55 MiB/s
Receiving objects: 22% (22833/103784), 11.29 MiB | 22.55 MiB/s
Receiving objects: 23% (23871/103784), 11.29 MiB | 22.55 MiB/s
Receiving objects: 24% (24909/103784), 11.29 MiB | 22.55 MiB/s
Receiving objects: 25% (25946/103784), 11.29 MiB | 22.55 MiB/s
Receiving objects: 26% (26984/103784), 11.29 MiB | 22.55 MiB/s
Receiving objects: 27% (28022/103784), 11.29 MiB | 22.55 MiB/s
Receiving objects: 28% (29060/103784), 11.29 MiB | 22.55 MiB/s
Receiving objects: 29% (30098/103784), 11.29 MiB | 22.55 MiB/s
Receiving objects: 30% (31136/103784), 11.29 MiB | 22.55 MiB/s
Receiving objects: 30% (31510/103784), 11.29 MiB | 22.55 MiB/s
Receiving objects: 31% (32174/103784), 29.48 MiB | 29.47 MiB/s
Receiving objects: 32% (33211/103784), 29.48 MiB | 29.47 MiB/s
Receiving objects: 33% (34249/103784), 29.48 MiB | 29.47 MiB/s
Receiving objects: 34% (35287/103784), 29.48 MiB | 29.47 MiB/s
Receiving objects: 35% (36325/103784), 29.48 MiB | 29.47 MiB/s
Receiving objects: 36% (37363/103784), 29.48 MiB | 29.47 MiB/s
Receiving objects: 37% (38401/103784), 29.48 MiB | 29.47 MiB/s
Receiving objects: 38% (39438/103784), 44.61 MiB | 29.67 MiB/s
Receiving objects: 39% (40476/103784), 44.61 MiB | 29.67 MiB/s
Receiving objects: 40% (41514/103784), 44.61 MiB | 29.67 MiB/s
Receiving objects: 41% (42552/103784), 44.61 MiB | 29.67 MiB/s
Receiving objects: 42% (43590/103784), 44.61 MiB | 29.67 MiB/s
Receiving objects: 43% (44628/103784), 44.61 MiB | 29.67 MiB/s
Receiving objects: 44% (45665/103784), 44.61 MiB | 29.67 MiB/s
Receiving objects: 45% (46703/103784), 44.61 MiB | 29.67 MiB/s
Receiving objects: 46% (47741/103784), 44.61 MiB | 29.67 MiB/s
Receiving objects: 46% (48736/103784), 61.99 MiB | 30.42 MiB/s
Receiving objects: 47% (48779/103784), 61.99 MiB | 30.42 MiB/s
Receiving objects: 48% (49817/103784), 61.99 MiB | 30.42 MiB/s
Receiving objects: 49% (50855/103784), 61.99 MiB | 30.42 MiB/s
Receiving objects: 50% (51892/103784), 61.99 MiB | 30.42 MiB/s
Receiving objects: 51% (52930/103784), 61.99 MiB | 30.42 MiB/s
Receiving objects: 52% (53968/103784), 61.99 MiB | 30.42 MiB/s
Receiving objects: 53% (55006/103784), 78.88 MiB | 30.98 MiB/s
Receiving objects: 54% (56044/103784), 78.88 MiB | 30.98 MiB/s
Receiving objects: 54% (57017/103784), 95.77 MiB | 31.06 MiB/s
Receiving objects: 54% (57059/103784), 112.76 MiB | 31.42 MiB/s
Receiving objects: 55% (57082/103784), 112.76 MiB | 31.42 MiB/s
Receiving objects: 55% (58083/103784), 146.75 MiB | 31.68 MiB/s
Receiving objects: 56% (58120/103784), 164.09 MiB | 32.73 MiB/s
Receiving objects: 56% (58208/103784), 180.52 MiB | 32.31 MiB/s
Receiving objects: 56% (58605/103784), 215.21 MiB | 32.73 MiB/s
Receiving objects: 57% (59157/103784), 215.21 MiB | 32.73 MiB/s
Receiving objects: 58% (60195/103784), 230.90 MiB | 32.54 MiB/s
Receiving objects: 59% (61233/103784), 230.90 MiB | 32.54 MiB/s
Receiving objects: 60% (62271/103784), 230.90 MiB | 32.54 MiB/s
Receiving objects: 61% (63309/103784), 230.90 MiB | 32.54 MiB/s
Receiving objects: 62% (64347/103784), 230.90 MiB | 32.54 MiB/s
Receiving objects: 63% (65384/103784), 246.43 MiB | 32.50 MiB/s
Receiving objects: 63% (65781/103784), 246.43 MiB | 32.50 MiB/s
Receiving objects: 64% (66422/103784), 246.43 MiB | 32.50 MiB/s
Receiving objects: 65% (67460/103784), 246.43 MiB | 32.50 MiB/s
Receiving objects: 66% (68498/103784), 246.43 MiB | 32.50 MiB/s
Receiving objects: 67% (69536/103784), 246.43 MiB | 32.50 MiB/s
Receiving objects: 68% (70574/103784), 246.43 MiB | 32.50 MiB/s
Receiving objects: 69% (71611/103784), 246.43 MiB | 32.50 MiB/s
Receiving objects: 70% (72649/103784), 246.43 MiB | 32.50 MiB/s
Receiving objects: 71% (73687/103784), 246.43 MiB | 32.50 MiB/s
Receiving objects: 72% (74725/103784), 264.17 MiB | 32.65 MiB/s
Receiving objects: 73% (75763/103784), 264.17 MiB | 32.65 MiB/s
Receiving objects: 74% (76801/103784), 264.17 MiB | 32.65 MiB/s
Receiving objects: 74% (77738/103784), 280.83 MiB | 32.71 MiB/s
Receiving objects: 75% (77838/103784), 280.83 MiB | 32.71 MiB/s
Receiving objects: 76% (78876/103784), 297.92 MiB | 32.65 MiB/s
Receiving objects: 77% (79914/103784), 297.92 MiB | 32.65 MiB/s
Receiving objects: 78% (80952/103784), 297.92 MiB | 32.65 MiB/s
Receiving objects: 79% (81990/103784), 297.92 MiB | 32.65 MiB/s
Receiving objects: 80% (83028/103784), 297.92 MiB | 32.65 MiB/s
Receiving objects: 81% (84066/103784), 297.92 MiB | 32.65 MiB/s
Receiving objects: 82% (85103/103784), 315.74 MiB | 33.02 MiB/s
Receiving objects: 82% (85349/103784), 315.74 MiB | 33.02 MiB/s
Receiving objects: 82% (85502/103784), 348.88 MiB | 32.99 MiB/s
Receiving objects: 83% (86141/103784), 366.06 MiB | 32.84 MiB/s
Receiving objects: 84% (87179/103784), 366.06 MiB | 32.84 MiB/s
Receiving objects: 85% (88217/103784), 366.06 MiB | 32.84 MiB/s
Receiving objects: 86% (89255/103784), 383.33 MiB | 33.12 MiB/s
Receiving objects: 87% (90293/103784), 383.33 MiB | 33.12 MiB/s
Receiving objects: 88% (91330/103784), 383.33 MiB | 33.12 MiB/s
Receiving objects: 88% (91946/103784), 383.33 MiB | 33.12 MiB/s
Receiving objects: 89% (92368/103784), 383.33 MiB | 33.12 MiB/s
Receiving objects: 89% (92662/103784), 418.14 MiB | 33.27 MiB/s
Receiving objects: 90% (93406/103784), 418.14 MiB | 33.27 MiB/s
Receiving objects: 91% (94444/103784), 418.14 MiB | 33.27 MiB/s
Receiving objects: 92% (95482/103784), 418.14 MiB | 33.27 MiB/s
Receiving objects: 93% (96520/103784), 418.14 MiB | 33.27 MiB/s
Receiving objects: 94% (97557/103784), 418.14 MiB | 33.27 MiB/s
Receiving objects: 95% (98595/103784), 418.14 MiB | 33.27 MiB/s
Receiving objects: 96% (99633/103784), 418.14 MiB | 33.27 MiB/s
Receiving objects: 97% (100671/103784), 434.87 MiB | 33.55 MiB/s
Receiving objects: 98% (101709/103784), 434.87 MiB | 33.55 MiB/s
Receiving objects: 99% (102747/103784), 434.87 MiB | 33.55 MiB/s
remote: Total 103784 (delta 8150), reused 7457 (delta 7388), pack-reused 94363 (from 4)
16.44 s
Receiving objects: 100% (103784/103784), 434.87 MiB | 33.55 MiB/s
Receiving objects: 100% (103784/103784), 439.18 MiB | 32.45 MiB/s, done.
17.60 s
Resolving deltas: 0% (0/67929)
Resolving deltas: 1% (680/67929)
Resolving deltas: 2% (1364/67929)
Resolving deltas: 3% (2038/67929)
Resolving deltas: 4% (2718/67929)
Resolving deltas: 5% (3397/67929)
Resolving deltas: 6% (4076/67929)
Resolving deltas: 7% (4756/67929)
Resolving deltas: 8% (5435/67929)
Resolving deltas: 9% (6114/67929)
Resolving deltas: 10% (6794/67929)
Resolving deltas: 11% (7473/67929)
Resolving deltas: 12% (8152/67929)
Resolving deltas: 13% (8831/67929)
Resolving deltas: 14% (9511/67929)
Resolving deltas: 15% (10190/67929)
Resolving deltas: 16% (10870/67929)
Resolving deltas: 17% (11550/67929)
Resolving deltas: 18% (12229/67929)
Resolving deltas: 19% (12907/67929)
Resolving deltas: 20% (13587/67929)
Resolving deltas: 21% (14267/67929)
Resolving deltas: 22% (14946/67929)
Resolving deltas: 23% (15627/67929)
Resolving deltas: 24% (16304/67929)
Resolving deltas: 25% (16987/67929)
Resolving deltas: 26% (17662/67929)
Resolving deltas: 27% (18341/67929)
Resolving deltas: 28% (19021/67929)
Resolving deltas: 29% (19700/67929)
Resolving deltas: 30% (20379/67929)
Resolving deltas: 31% (21058/67929)
Resolving deltas: 32% (21738/67929)
Resolving deltas: 33% (22417/67929)
Resolving deltas: 34% (23096/67929)
Resolving deltas: 35% (23776/67929)
Resolving deltas: 36% (24456/67929)
Resolving deltas: 37% (25134/67929)
Resolving deltas: 38% (25816/67929)
Resolving deltas: 39% (26493/67929)
Resolving deltas: 40% (27172/67929)
Resolving deltas: 41% (27851/67929)
Resolving deltas: 42% (28531/67929)
Resolving deltas: 43% (29210/67929)
Resolving deltas: 44% (29889/67929)
Resolving deltas: 45% (30569/67929)
Resolving deltas: 46% (31249/67929)
Resolving deltas: 47% (31927/67929)
Resolving deltas: 48% (32606/67929)
Resolving deltas: 49% (33286/67929)
Resolving deltas: 50% (33966/67929)
Resolving deltas: 51% (34644/67929)
Resolving deltas: 52% (35324/67929)
Resolving deltas: 53% (36003/67929)
Resolving deltas: 54% (36682/67929)
Resolving deltas: 55% (37361/67929)
Resolving deltas: 56% (38041/67929)
Resolving deltas: 57% (38720/67929)
Resolving deltas: 58% (39400/67929)
Resolving deltas: 59% (40080/67929)
Resolving deltas: 60% (40758/67929)
Resolving deltas: 61% (41438/67929)
Resolving deltas: 62% (42116/67929)
Resolving deltas: 63% (42796/67929)
Resolving deltas: 64% (43475/67929)
Resolving deltas: 65% (44155/67929)
Resolving deltas: 66% (44837/67929)
Resolving deltas: 67% (45513/67929)
Resolving deltas: 68% (46192/67929)
Resolving deltas: 69% (46872/67929)
Resolving deltas: 70% (47551/67929)
Resolving deltas: 71% (48230/67929)
Resolving deltas: 72% (48909/67929)
Resolving deltas: 73% (49590/67929)
Resolving deltas: 74% (50268/67929)
Resolving deltas: 75% (50947/67929)
Resolving deltas: 76% (51627/67929)
Resolving deltas: 77% (52306/67929)
Resolving deltas: 78% (52985/67929)
Resolving deltas: 79% (53664/67929)
Resolving deltas: 80% (54345/67929)
Resolving deltas: 81% (55023/67929)
Resolving deltas: 82% (55702/67929)
Resolving deltas: 83% (56382/67929)
Resolving deltas: 84% (57063/67929)
Resolving deltas: 85% (57740/67929)
Resolving deltas: 85% (57766/67929)
Resolving deltas: 86% (58419/67929)
Resolving deltas: 87% (59099/67929)
Resolving deltas: 88% (59780/67929)
Resolving deltas: 89% (60457/67929)
Resolving deltas: 90% (61137/67929)
Resolving deltas: 91% (61816/67929)
Resolving deltas: 92% (62495/67929)
Resolving deltas: 93% (63174/67929)
Resolving deltas: 94% (63854/67929)
Resolving deltas: 95% (64534/67929)
Resolving deltas: 96% (65212/67929)
Resolving deltas: 97% (65892/67929)
Resolving deltas: 98% (66571/67929)
Resolving deltas: 99% (67250/67929)
Resolving deltas: 100% (67929/67929)
Resolving deltas: 100% (67929/67929), done.
18.22 s
Fetching commit 58aaf5380023d118a91aa4083c01395586246f14 for feynkit ...
18.22 s
$ /nix/store/5vpcfsdx1lcnlb2y4k7xyc74shp5qwbh-git-2.54.0/bin/git fetch origin 58aaf5380023d118a91aa4083c01395586246f14
18.63 s
From https://github.com/alphal00p/gammaloop
18.63 s
* branch 58aaf5380023d118a91aa4083c01395586246f14 -> FETCH_HEAD
18.64 s
$ /nix/store/61685rbaxmpigwi3z23i33sv3jyfl70q-coreutils-9.11/bin/timeout --kill-after=15s 7200s /nix/store/5vpcfsdx1lcnlb2y4k7xyc74shp5qwbh-git-2.54.0/bin/git -c advice.detachedHead=false checkout 58aaf5380023d118a91aa4083c01395586246f14
18.87 s
HEAD is now at 58aaf5380 share physics layout across graph renderers
18.88 s
$ /nix/store/61685rbaxmpigwi3z23i33sv3jyfl70q-coreutils-9.11/bin/timeout --kill-after=15s 7200s /nix/store/wknkybkzrc16r11vk5vrykh4wmw7a353-nix-2.34.8/bin/nix --extra-experimental-features nix-command --extra-experimental-features flakes --log-format internal-json run .#packages.x86_64-linux.nix-ci-check-gammaloop-nextest-docs --print-build-logs
19.02 s
warning: ignoring untrusted flake configuration setting 'extra-substituters'.
19.02 s
Pass '--accept-flake-config' to trust it
19.02 s
warning: ignoring untrusted flake configuration setting 'extra-trusted-public-keys'.
19.02 s
Pass '--accept-flake-config' to trust it
24.17 s
24.41 s
evaluating derivation 'gdo you want to allow configuration setting 'extra-substituters' to be set to 'https://cache.nix-ci.com ' (y/N)? do you want to permanently mark this value as untrusted (y/N)? warning: ignoring untrusted flake configuration setting 'extra-substituters'.
24.41 s
Pass '--accept-flake-config' to trust it
24.41 s
do you want to allow configuration setting 'extra-trusted-public-keys' to be set to 'nix-ci:g3xV5BDTLtIBZr/A00IU1x0EtKKlb7YLgBN2SgYgM6A= ' (y/N)? do you want to permanently mark this value as untrusted (y/N)? warning: ignoring untrusted flake configuration setting 'extra-trusted-public-keys'.
24.41 s
Pass '--accept-flake-config' to trust it
41.35 s
copying '/nix/store/566x
evaluating derivation 'g
copying '/nix/store/566x
evaluating derivation 'g
copying '/nix/store/566x
evaluating derivation 'g
copying '/nix/store/566x
evaluating derivation 'g
copying '/nix/store/566x
evaluating derivation 'g
copying '/nix/store/566x
evaluating derivation 'g
querying source on https
[1 /0 /1 copied (256.0 KiB
[1 /0 /1 copied (6.7 /201.4
[1 /0 /1 copied (11.8 /201.
[1 /0 /1 copied (17.5 /201.
[1 /0 /1 copied (22.0 /201.
[1 /0 /1 copied (25.2 /201.
[1 /0 /1 copied (33.3 /201.
[1 /0 /1 copied (36.1 /201.
[1 /0 /1 copied (38.8 /201.
[1 /0 /1 copied (41.1 /201.
[1 /0 /1 copied (43.5 /201.
[1 /0 /1 copied (46.9 /201.
[1 /0 /1 copied (49.4 /201.
[1 /0 /1 copied (51.4 /201.
[1 /0 /1 copied (53.8 /201.
[1 /0 /1 copied (56.2 /201.
[1 /0 /1 copied (58.6 /201.
[1 /0 /1 copied (60.6 /201.
[1 /0 /1 copied (62.7 /201.
[1 /0 /1 copied (64.5 /201.
[1 /0 /1 copied (66.6 /201.
[1 /0 /1 copied (69.3 /201.
[1 /0 /1 copied (71.8 /201.
[1 /0 /1 copied (73.6 /201.
[1 /0 /1 copied (75.0 /201.
[1 /0 /1 copied (76.7 /201.
[1 /0 /1 copied (79.4 /201.
[1 /0 /1 copied (81.4 /201.
[1 /0 /1 copied (84.7 /201.
[1 /0 /1 copied (87.2 /201.
[1 /0 /1 copied (89.2 /201.
[1 /0 /1 copied (91.4 /201.
[1 /0 /1 copied (94.4 /201.
[1 /0 /1 copied (97.0 /201.
[1 /0 /1 copied (99.6 /201.
[1 /0 /1 copied (102.0 /201
[1 /0 /1 copied (104.2 /201
[1 /0 /1 copied (107.0 /201
[1 /0 /1 copied (108.7 /201
[1 /0 /1 copied (112.4 /201
[1 /0 /1 copied (115.0 /201
[1 /0 /1 copied (116.9 /201
[1 /0 /1 copied (118.6 /201
[1 /0 /1 copied (131.1 /201
[1 /0 /1 copied (142.6 /201
[1 /0 /1 copied (152.9 /201
[1 /0 /1 copied (158.6 /201
[1 /0 /1 copied (160.1 /201
[1 /0 /1 copied (161.2 /201
[1 /0 /1 copied (162.4 /201
[1 /0 /1 copied (163.9 /201
[1 /0 /1 copied (165.0 /201
[1 /0 /1 copied (166.2 /201
[1 /0 /1 copied (167.4 /201
[1 /0 /1 copied (168.6 /201
[1 /0 /1 copied (170.0 /201
[1 /0 /1 copied (171.1 /201
[1 /0 /1 copied (172.2 /201
[1 /0 /1 copied (173.7 /201
[1 /0 /1 copied (174.9 /201
[1 /0 /1 copied (176.3 /201
[1 /0 /1 copied (179.0 /201
[1 /0 /1 copied (187.8 /201
[1 /0 /1 copied (189.7 /201
[1 /0 /1 copied (192.7 /201
[1 /0 /1 copied (201.4 MiB
[1 copied (201.4 MiB), 4
[0 /14 built, 16 /5 /103 co
[0 /14 built, 16 /18 /103 c
[0 /11 built, 16 /33 /103 c
[0 /10 built, 7 /46 /103 co
[0 /10 built, 7 /50 /103 co
[0 /10 built, 5 /54 /103 co
[0 /10 built, 4 /56 /103 co
[0 /10 built, 3 /57 /103 co
[0 /10 built, 16 /58 /103 c
[0 /10 built, 16 /64 /103 c
[0 /9 built, 15 /68 /103 co
[0 /9 built, 12 /77 /103 co
[0 /9 built, 7 /82 /103 cop
[0 /9 built, 7 /87 /103 cop
[0 /9 built, 6 /89 /103 cop
[0 /8 built, 5 /90 /103 cop
[0 /8 built, 7 /91 /103 cop
[0 /8 built, 6 /93 /103 cop
[0 /7 built, 5 /94 /103 cop
[1 /0 /7 built, 5 /94 /103 cbuilder.pl> Running phase: patchPhase
41.35 s
builder.pl> Running phase: updateAutotoolsGnuConfigScriptsPhase
41.36 s
builder.pl> Running phase: configurePhase
41.37 s
builder.pl> no configure script, doing nothing
41.37 s
builder.pl> Running phase: buildPhase
41.38 s
builder.pl> Running phase: checkPhase
41.38 s
[1 /0 /7 built, 5 /95 /103 cbuilder.pl> Running phase: installPhase
41.38 s
builder.pl> no Makefile or custom installPhase, doing nothing
41.39 s
builder.pl> Running phase: fixupPhase
41.40 s
builder.pl> shrinking RPATHs of ELF executables and libraries in /nix/store/zzmspl8wdn2a3ancrz8dg3kci887nw6d-builder.pl
41.40 s
builder.pl> checking for references to /build/ in /nix/store/zzmspl8wdn2a3ancrz8dg3kci887nw6d-builder.pl...
41.41 s
builder.pl> patching script interpreter paths in /nix/store/zzmspl8wdn2a3ancrz8dg3kci887nw6d-builder.pl
41.43 s
builder.pl (post)> Uploading to the NixCI cache: /nix/store/zzmspl8wdn2a3ancrz8dg3kci887nw6d-builder.pl
41.48 s
builder.pl (post)> warning: 'warn-short-path-literals' is deprecated, use 'lint-short-path-literals = ignore' instead
41.51 s
builder.pl (post)> copying 0 paths...
41.56 s
builder.pl (post)> warning: 'warn-short-path-literals' is deprecated, use 'lint-short-path-literals = ignore' instead
42.00 s
builder.pl (post)> copying 0 paths...
42.70 s
[1 /6 built, 3 /98 /103 cop
[1 /5 built, 2 /99 /103 cop
[1 /4 built, 1 /100 /103 co
[1 /4 built, 1 /101 /103 co
[1 /3 built, 103 copied (typst> structuredAttrs is enabled
42.76 s
[1 /1 /3 built, 103 copiedtypst> created 4 symlinks in user environment
42.84 s
typst (post)> Uploading to the NixCI cache: /nix/store/yc93gbspdkf53nwjsf1mbydbsaq9snxl-typst-0.15.1-env
42.88 s
typst (post)> warning: 'warn-short-path-literals' is deprecated, use 'lint-short-path-literals = ignore' instead
42.90 s
typst (post)> copying 0 paths...
42.94 s
typst (post)> warning: 'warn-short-path-literals' is deprecated, use 'lint-short-path-literals = ignore' instead
43.42 s
typst (post)> copying 0 paths...
43.84 s
[2 /4 built, 103 copied (
[1 /2 /3 built, 103 copiedgammaloop-nextest-docs> Extracting 2 binaries to /build/source
43.88 s
gammaloop-nextest-docs> Extracted 5 files to /build/source in 0.04s
43.89 s
gammaloop-nextest-docs> ------------
43.89 s
gammaloop-nextest-docs> Nextest run ID 084cddad-40b2-4805-90a7-48ad0373b0fe with nextest profile: ci_gammaloop
43.89 s
gammaloop-nextest-docs> Starting 129 tests across 2 binaries
43.91 s
gammaloop-nextest-docs> FAIL [ 0.009s] ( 23/129) alphal00p-docs-builder tests :: developer_architecture_is_classified_searchable_and_source_backed
43.91 s
gammaloop-nextest-docs> stdout ---
43.91 s
gammaloop-nextest-docs>
43.91 s
gammaloop-nextest-docs> running 1 test
43.91 s
gammaloop-nextest-docs> test tests::developer_architecture_is_classified_searchable_and_source_backed ... FAILED
43.91 s
gammaloop-nextest-docs>
43.91 s
gammaloop-nextest-docs> failures:
43.91 s
gammaloop-nextest-docs>
43.91 s
gammaloop-nextest-docs> failures:
43.91 s
gammaloop-nextest-docs> tests::developer_architecture_is_classified_searchable_and_source_backed
43.91 s
gammaloop-nextest-docs>
43.91 s
gammaloop-nextest-docs> test result: FAILED. 0 passed; 1 failed; 0 ignored; 0 measured; 128 filtered out; finished in 0.01s
43.91 s
gammaloop-nextest-docs>
43.91 s
gammaloop-nextest-docs> stderr ---
43.91 s
gammaloop-nextest-docs>
43.91 s
gammaloop-nextest-docs> thread 'tests::developer_architecture_is_classified_searchable_and_source_backed' (276) panicked at crates/alphal00p-docs-builder/src/lib.rs:12751:14:
43.91 s
gammaloop-nextest-docs> called `Result::unwrap()` on an `Err` value: failed to copy documentation asset crates/spynso3/typst/STIXTwoMath-Regular.woff2
43.91 s
gammaloop-nextest-docs>
43.91 s
gammaloop-nextest-docs> Caused by:
43.91 s
gammaloop-nextest-docs> No such file or directory (os error 2)
43.91 s
gammaloop-nextest-docs>
43.91 s
gammaloop-nextest-docs> Location:
43.91 s
gammaloop-nextest-docs> crates/alphal00p-docs-builder/src/lib.rs:2276:18
43.91 s
gammaloop-nextest-docs> stack backtrace:
43.91 s
gammaloop-nextest-docs> 0: __rustc::rust_begin_unwind
43.91 s
gammaloop-nextest-docs> 1: core::panicking::panic_fmt
43.91 s
gammaloop-nextest-docs> 2: core::result::unwrap_failed
43.91 s
gammaloop-nextest-docs> 3: alphal00p_docs_builder::tests::developer_architecture_is_classified_searchable_and_source_backed
43.91 s
gammaloop-nextest-docs> 4: <alphal00p_docs_builder::tests::developer_architecture_is_classified_searchable_and_source_backed::{closure#0} as core::ops::function::FnOnce<()>>::call_once
43.91 s
gammaloop-nextest-docs> note: Some details are omitted, run with `RUST_BACKTRACE=full` for a verbose backtrace.
43.91 s
gammaloop-nextest-docs>
43.92 s
gammaloop-nextest-docs> FAIL [ 0.011s] ( 30/129) alphal00p-docs-builder tests :: every_product_orients_rust_to_native_rustdoc_and_keeps_legacy_redirects
43.92 s
gammaloop-nextest-docs> stdout ---
43.92 s
gammaloop-nextest-docs>
43.92 s
gammaloop-nextest-docs> running 1 test
43.92 s
gammaloop-nextest-docs> test tests::every_product_orients_rust_to_native_rustdoc_and_keeps_legacy_redirects ... FAILED
43.92 s
gammaloop-nextest-docs>
43.92 s
gammaloop-nextest-docs> failures:
43.92 s
gammaloop-nextest-docs>
43.92 s
gammaloop-nextest-docs> failures:
43.92 s
gammaloop-nextest-docs> tests::every_product_orients_rust_to_native_rustdoc_and_keeps_legacy_redirects
43.92 s
gammaloop-nextest-docs>
43.92 s
gammaloop-nextest-docs> test result: FAILED. 0 passed; 1 failed; 0 ignored; 0 measured; 128 filtered out; finished in 0.01s
43.92 s
gammaloop-nextest-docs>
43.92 s
gammaloop-nextest-docs> stderr ---
43.92 s
gammaloop-nextest-docs>
43.92 s
gammaloop-nextest-docs> thread 'tests::every_product_orients_rust_to_native_rustdoc_and_keeps_legacy_redirects' (302) panicked at crates/alphal00p-docs-builder/src/lib.rs:12555:46:
43.92 s
gammaloop-nextest-docs> called `Result::unwrap()` on an `Err` value: failed to copy documentation asset crates/spynso3/typst/STIXTwoMath-Regular.woff2
43.92 s
gammaloop-nextest-docs>
43.92 s
gammaloop-nextest-docs> Caused by:
43.92 s
gammaloop-nextest-docs> No such file or directory (os error 2)
43.92 s
gammaloop-nextest-docs>
43.92 s
gammaloop-nextest-docs> Location:
43.92 s
gammaloop-nextest-docs> crates/alphal00p-docs-builder/src/lib.rs:2276:18
43.92 s
gammaloop-nextest-docs> stack backtrace:
43.92 s
gammaloop-nextest-docs> 0: __rustc::rust_begin_unwind
43.92 s
gammaloop-nextest-docs> 1: core::panicking::panic_fmt
43.92 s
gammaloop-nextest-docs> 2: core::result::unwrap_failed
43.92 s
gammaloop-nextest-docs> 3: alphal00p_docs_builder::tests::every_product_orients_rust_to_native_rustdoc_and_keeps_legacy_redirects
43.92 s
gammaloop-nextest-docs> 4: <alphal00p_docs_builder::tests::every_product_orients_rust_to_native_rustdoc_and_keeps_legacy_redirects::{closure#0} as core::ops::function::FnOnce<()>>::call_once
43.92 s
gammaloop-nextest-docs> note: Some details are omitted, run with `RUST_BACKTRACE=full` for a verbose backtrace.
43.92 s
gammaloop-nextest-docs>
43.95 s
gammaloop-nextest-docs> FAIL [ 0.009s] ( 54/129) alphal00p-docs-builder tests :: portal_and_developer_pages_use_federated_search_and_feedback
43.95 s
gammaloop-nextest-docs> stdout ---
43.95 s
gammaloop-nextest-docs>
43.95 s
gammaloop-nextest-docs> running 1 test
43.95 s
gammaloop-nextest-docs> test tests::portal_and_developer_pages_use_federated_search_and_feedback ... FAILED
43.95 s
gammaloop-nextest-docs>
43.95 s
gammaloop-nextest-docs> failures:
43.95 s
gammaloop-nextest-docs>
43.95 s
gammaloop-nextest-docs> failures:
43.95 s
gammaloop-nextest-docs> tests::portal_and_developer_pages_use_federated_search_and_feedback
43.95 s
gammaloop-nextest-docs>
43.95 s
gammaloop-nextest-docs> test result: FAILED. 0 passed; 1 failed; 0 ignored; 0 measured; 128 filtered out; finished in 0.01s
43.95 s
gammaloop-nextest-docs>
43.95 s
gammaloop-nextest-docs> stderr ---
43.95 s
gammaloop-nextest-docs>
43.95 s
gammaloop-nextest-docs> thread 'tests::portal_and_developer_pages_use_federated_search_and_feedback' (416) panicked at crates/alphal00p-docs-builder/src/lib.rs:9684:14:
43.95 s
gammaloop-nextest-docs> called `Result::unwrap()` on an `Err` value: failed to copy documentation asset crates/spynso3/typst/STIXTwoMath-Regular.woff2
43.95 s
gammaloop-nextest-docs>
43.95 s
gammaloop-nextest-docs> Caused by:
43.95 s
gammaloop-nextest-docs> No such file or directory (os error 2)
43.95 s
gammaloop-nextest-docs>
43.95 s
gammaloop-nextest-docs> Location:
43.95 s
gammaloop-nextest-docs> crates/alphal00p-docs-builder/src/lib.rs:2276:18
43.95 s
gammaloop-nextest-docs> stack backtrace:
43.95 s
gammaloop-nextest-docs> 0: __rustc::rust_begin_unwind
43.95 s
gammaloop-nextest-docs> 1: core::panicking::panic_fmt
43.95 s
gammaloop-nextest-docs> 2: core::result::unwrap_failed
43.95 s
gammaloop-nextest-docs> 3: alphal00p_docs_builder::tests::write_test_portal
43.95 s
gammaloop-nextest-docs> 4: alphal00p_docs_builder::tests::portal_and_developer_pages_use_federated_search_and_feedback
43.95 s
gammaloop-nextest-docs> 5: <alphal00p_docs_builder::tests::portal_and_developer_pages_use_federated_search_and_feedback::{closure#0} as core::ops::function::FnOnce<()>>::call_once
43.95 s
gammaloop-nextest-docs> note: Some details are omitted, run with `RUST_BACKTRACE=full` for a verbose backtrace.
43.95 s
gammaloop-nextest-docs>
43.95 s
gammaloop-nextest-docs> FAIL [ 0.008s] ( 55/129) alphal00p-docs-builder tests :: portal_emits_routes_and_valid_assets
43.95 s
gammaloop-nextest-docs> stdout ---
43.95 s
gammaloop-nextest-docs>
43.95 s
gammaloop-nextest-docs> running 1 test
43.95 s
gammaloop-nextest-docs> test tests::portal_emits_routes_and_valid_assets ... FAILED
43.95 s
gammaloop-nextest-docs>
43.95 s
gammaloop-nextest-docs> failures:
43.95 s
gammaloop-nextest-docs>
43.95 s
gammaloop-nextest-docs> failures:
43.95 s
gammaloop-nextest-docs> tests::portal_emits_routes_and_valid_assets
43.95 s
gammaloop-nextest-docs>
43.95 s
gammaloop-nextest-docs> test result: FAILED. 0 passed; 1 failed; 0 ignored; 0 measured; 128 filtered out; finished in 0.00s
43.95 s
gammaloop-nextest-docs>
43.95 s
gammaloop-nextest-docs> stderr ---
43.95 s
gammaloop-nextest-docs>
43.95 s
gammaloop-nextest-docs> thread 'tests::portal_emits_routes_and_valid_assets' (422) panicked at crates/alphal00p-docs-builder/src/lib.rs:9684:14:
43.95 s
gammaloop-nextest-docs> called `Result::unwrap()` on an `Err` value: failed to copy documentation asset crates/spynso3/typst/STIXTwoMath-Regular.woff2
43.95 s
gammaloop-nextest-docs>
43.95 s
gammaloop-nextest-docs> Caused by:
43.95 s
gammaloop-nextest-docs> No such file or directory (os error 2)
43.95 s
gammaloop-nextest-docs>
43.95 s
gammaloop-nextest-docs> Location:
43.95 s
gammaloop-nextest-docs> crates/alphal00p-docs-builder/src/lib.rs:2276:18
43.95 s
gammaloop-nextest-docs> stack backtrace:
43.95 s
gammaloop-nextest-docs> 0: __rustc::rust_begin_unwind
43.95 s
gammaloop-nextest-docs> 1: core::panicking::panic_fmt
43.95 s
gammaloop-nextest-docs> 2: core::result::unwrap_failed
43.95 s
gammaloop-nextest-docs> 3: alphal00p_docs_builder::tests::write_test_portal
43.95 s
gammaloop-nextest-docs> 4: alphal00p_docs_builder::tests::portal_emits_routes_and_valid_assets
43.95 s
gammaloop-nextest-docs> 5: <alphal00p_docs_builder::tests::portal_emits_routes_and_valid_assets::{closure#0} as core::ops::function::FnOnce<()>>::call_once
43.95 s
gammaloop-nextest-docs> note: Some details are omitted, run with `RUST_BACKTRACE=full` for a verbose backtrace.
43.95 s
gammaloop-nextest-docs>
43.95 s
gammaloop-nextest-docs> FAIL [ 0.010s] ( 56/129) alphal00p-docs-builder tests :: portal_task_chooser_routes_each_goal_to_the_registered_quickstart
43.95 s
gammaloop-nextest-docs> stdout ---
43.95 s
gammaloop-nextest-docs>
43.95 s
gammaloop-nextest-docs> running 1 test
43.95 s
gammaloop-nextest-docs> test tests::portal_task_chooser_routes_each_goal_to_the_registered_quickstart ... FAILED
43.95 s
gammaloop-nextest-docs>
43.95 s
gammaloop-nextest-docs> failures:
43.95 s
gammaloop-nextest-docs>
43.95 s
gammaloop-nextest-docs> failures:
43.95 s
gammaloop-nextest-docs> tests::portal_task_chooser_routes_each_goal_to_the_registered_quickstart
43.95 s
gammaloop-nextest-docs>
43.95 s
gammaloop-nextest-docs> test result: FAILED. 0 passed; 1 failed; 0 ignored; 0 measured; 128 filtered out; finished in 0.01s
43.95 s
gammaloop-nextest-docs>
43.95 s
gammaloop-nextest-docs> stderr ---
43.95 s
gammaloop-nextest-docs>
43.95 s
gammaloop-nextest-docs> thread 'tests::portal_task_chooser_routes_each_goal_to_the_registered_quickstart' (427) panicked at crates/alphal00p-docs-builder/src/lib.rs:9684:14:
43.95 s
gammaloop-nextest-docs> called `Result::unwrap()` on an `Err` value: failed to copy documentation asset crates/spynso3/typst/STIXTwoMath-Regular.woff2
43.95 s
gammaloop-nextest-docs>
43.95 s
gammaloop-nextest-docs> Caused by:
43.95 s
gammaloop-nextest-docs> No such file or directory (os error 2)
43.95 s
gammaloop-nextest-docs>
43.95 s
gammaloop-nextest-docs> Location:
43.95 s
gammaloop-nextest-docs> crates/alphal00p-docs-builder/src/lib.rs:2276:18
43.95 s
gammaloop-nextest-docs> stack backtrace:
43.95 s
gammaloop-nextest-docs> 0: __rustc::rust_begin_unwind
43.95 s
gammaloop-nextest-docs> 1: core::panicking::panic_fmt
43.95 s
gammaloop-nextest-docs> 2: core::result::unwrap_failed
43.95 s
gammaloop-nextest-docs> 3: alphal00p_docs_builder::tests::write_test_portal
43.95 s
gammaloop-nextest-docs> 4: alphal00p_docs_builder::tests::portal_task_chooser_routes_each_goal_to_the_registered_quickstart
43.95 s
gammaloop-nextest-docs> 5: <alphal00p_docs_builder::tests::portal_task_chooser_routes_each_goal_to_the_registered_quickstart::{closure#0} as core::ops::function::FnOnce<()>>::call_once
43.95 s
gammaloop-nextest-docs> note: Some details are omitted, run with `RUST_BACKTRACE=full` for a verbose backtrace.
43.95 s
gammaloop-nextest-docs>
44.00 s
gammaloop-nextest-docs> FAIL [ 0.009s] ( 86/129) alphal00p-docs-builder tests :: site_assets_replace_read_only_generated_files
44.00 s
gammaloop-nextest-docs> stdout ---
44.00 s
gammaloop-nextest-docs>
44.00 s
gammaloop-nextest-docs> running 1 test
44.00 s
gammaloop-nextest-docs> test tests::site_assets_replace_read_only_generated_files ... FAILED
44.00 s
gammaloop-nextest-docs>
44.00 s
gammaloop-nextest-docs> failures:
44.00 s
gammaloop-nextest-docs>
44.00 s
gammaloop-nextest-docs> failures:
44.00 s
gammaloop-nextest-docs> tests::site_assets_replace_read_only_generated_files
44.00 s
gammaloop-nextest-docs>
44.00 s
gammaloop-nextest-docs> test result: FAILED. 0 passed; 1 failed; 0 ignored; 0 measured; 128 filtered out; finished in 0.00s
44.00 s
gammaloop-nextest-docs>
44.00 s
gammaloop-nextest-docs> stderr ---
44.00 s
gammaloop-nextest-docs>
44.00 s
gammaloop-nextest-docs> thread 'tests::site_assets_replace_read_only_generated_files' (648) panicked at crates/alphal00p-docs-builder/src/lib.rs:12305:50:
44.00 s
gammaloop-nextest-docs> called `Result::unwrap()` on an `Err` value: failed to copy documentation asset crates/spynso3/typst/STIXTwoMath-Regular.woff2
44.00 s
gammaloop-nextest-docs>
44.00 s
gammaloop-nextest-docs> Caused by:
44.00 s
gammaloop-nextest-docs> No such file or directory (os error 2)
44.00 s
gammaloop-nextest-docs>
44.00 s
gammaloop-nextest-docs> Location:
44.00 s
gammaloop-nextest-docs> crates/alphal00p-docs-builder/src/lib.rs:2276:18
44.00 s
gammaloop-nextest-docs> stack backtrace:
44.00 s
gammaloop-nextest-docs> 0: __rustc::rust_begin_unwind
44.00 s
gammaloop-nextest-docs> 1: core::panicking::panic_fmt
44.00 s
gammaloop-nextest-docs> 2: core::result::unwrap_failed
44.00 s
gammaloop-nextest-docs> 3: alphal00p_docs_builder::tests::site_assets_replace_read_only_generated_files
44.00 s
gammaloop-nextest-docs> 4: <alphal00p_docs_builder::tests::site_assets_replace_read_only_generated_files::{closure#0} as core::ops::function::FnOnce<()>>::call_once
44.00 s
gammaloop-nextest-docs> note: Some details are omitted, run with `RUST_BACKTRACE=full` for a verbose backtrace.
44.00 s
gammaloop-nextest-docs>
44.01 s
gammaloop-nextest-docs> FAIL [ 0.122s] ( 91/129) alphal00p-docs-builder tests :: checked_in_registry_is_valid
44.01 s
gammaloop-nextest-docs> stdout ---
44.01 s
gammaloop-nextest-docs>
44.01 s
gammaloop-nextest-docs> running 1 test
44.01 s
gammaloop-nextest-docs> test tests::checked_in_registry_is_valid ... FAILED
44.01 s
gammaloop-nextest-docs>
44.01 s
gammaloop-nextest-docs> failures:
44.01 s
gammaloop-nextest-docs>
44.01 s
gammaloop-nextest-docs> failures:
44.01 s
gammaloop-nextest-docs> tests::checked_in_registry_is_valid
44.01 s
gammaloop-nextest-docs>
44.01 s
gammaloop-nextest-docs> test result: FAILED. 0 passed; 1 failed; 0 ignored; 0 measured; 128 filtered out; finished in 0.11s
44.01 s
gammaloop-nextest-docs>
44.01 s
gammaloop-nextest-docs> stderr ---
44.01 s
gammaloop-nextest-docs>
44.01 s
gammaloop-nextest-docs> thread 'tests::checked_in_registry_is_valid' (241) panicked at crates/alphal00p-docs-builder/src/lib.rs:12260:50:
44.01 s
gammaloop-nextest-docs> called `Result::unwrap()` on an `Err` value: required documentation source is missing: /build/source/crates/spynso3/typst/STIXTwoMath-Regular.woff2
44.01 s
gammaloop-nextest-docs>
44.01 s
gammaloop-nextest-docs> Location:
44.01 s
gammaloop-nextest-docs> crates/alphal00p-docs-builder/src/lib.rs:5103:9
44.01 s
gammaloop-nextest-docs> stack backtrace:
44.01 s
gammaloop-nextest-docs> 0: __rustc::rust_begin_unwind
44.01 s
gammaloop-nextest-docs> 1: core::panicking::panic_fmt
44.01 s
gammaloop-nextest-docs> 2: core::result::unwrap_failed
44.01 s
gammaloop-nextest-docs> 3: alphal00p_docs_builder::tests::checked_in_registry_is_valid
44.01 s
gammaloop-nextest-docs> 4: <alphal00p_docs_builder::tests::checked_in_registry_is_valid::{closure#0} as core::ops::function::FnOnce<()>>::call_once
44.01 s
gammaloop-nextest-docs> note: Some details are omitted, run with `RUST_BACKTRACE=full` for a verbose backtrace.
44.01 s
gammaloop-nextest-docs>
44.02 s
gammaloop-nextest-docs> FAIL [ 0.130s] ( 97/129) alphal00p-docs-builder provenance_tests :: each_build_captures_one_revision_before_rendering
44.02 s
gammaloop-nextest-docs> stdout ---
44.02 s
gammaloop-nextest-docs>
44.02 s
gammaloop-nextest-docs> running 1 test
44.02 s
gammaloop-nextest-docs>
44.02 s
gammaloop-nextest-docs> running 1 test
44.02 s
gammaloop-nextest-docs> test provenance_tests::each_build_captures_one_revision_before_rendering ... FAILED
44.02 s
gammaloop-nextest-docs>
44.02 s
gammaloop-nextest-docs> failures:
44.02 s
gammaloop-nextest-docs>
44.02 s
gammaloop-nextest-docs> failures:
44.02 s
gammaloop-nextest-docs> provenance_tests::each_build_captures_one_revision_before_rendering
44.02 s
gammaloop-nextest-docs>
44.02 s
gammaloop-nextest-docs> test result: FAILED. 0 passed; 1 failed; 0 ignored; 0 measured; 128 filtered out; finished in 0.11s
44.02 s
gammaloop-nextest-docs>
44.02 s
gammaloop-nextest-docs> test provenance_tests::each_build_captures_one_revision_before_rendering ... FAILED
44.02 s
gammaloop-nextest-docs>
44.02 s
gammaloop-nextest-docs> failures:
44.02 s
gammaloop-nextest-docs>
44.02 s
gammaloop-nextest-docs> failures:
44.02 s
gammaloop-nextest-docs> provenance_tests::each_build_captures_one_revision_before_rendering
44.02 s
gammaloop-nextest-docs>
44.02 s
gammaloop-nextest-docs> test result: FAILED. 0 passed; 1 failed; 0 ignored; 0 measured; 128 filtered out; finished in 0.12s
44.02 s
gammaloop-nextest-docs>
44.02 s
gammaloop-nextest-docs> stderr ---
44.02 s
gammaloop-nextest-docs>
44.02 s
gammaloop-nextest-docs> thread 'provenance_tests::each_build_captures_one_revision_before_rendering' (260) panicked at crates/alphal00p-docs-builder/src/provenance_tests.rs:297:14:
44.02 s
gammaloop-nextest-docs> called `Result::unwrap()` on an `Err` value: required documentation source is missing: /build/source/target/nix-ci-tmp/.tmp3od26f/checkout/crates/spynso3/typst/STIXTwoMath-Regular.woff2
44.02 s
gammaloop-nextest-docs>
44.02 s
gammaloop-nextest-docs> Location:
44.02 s
gammaloop-nextest-docs> crates/alphal00p-docs-builder/src/lib.rs:5103:9
44.02 s
gammaloop-nextest-docs> stack backtrace:
44.02 s
gammaloop-nextest-docs> 0: __rustc::rust_begin_unwind
44.02 s
gammaloop-nextest-docs> 1: core::panicking::panic_fmt
44.02 s
gammaloop-nextest-docs> 2: core::result::unwrap_failed
44.02 s
gammaloop-nextest-docs> 3: alphal00p_docs_builder::provenance_tests::each_build_captures_one_revision_before_rendering
44.02 s
gammaloop-nextest-docs> 4: <alphal00p_docs_builder::provenance_tests::each_build_captures_one_revision_before_rendering::{closure#0} as core::ops::function::FnOnce<()>>::call_once
44.02 s
gammaloop-nextest-docs> note: Some details are omitted, run with `RUST_BACKTRACE=full` for a verbose backtrace.
44.02 s
gammaloop-nextest-docs>
44.02 s
gammaloop-nextest-docs> thread 'provenance_tests::each_build_captures_one_revision_before_rendering' (226) panicked at crates/alphal00p-docs-builder/src/provenance_tests.rs:274:9:
44.02 s
gammaloop-nextest-docs> assertion failed: command.status().unwrap().success()
44.02 s
gammaloop-nextest-docs> stack backtrace:
44.02 s
gammaloop-nextest-docs> 0: __rustc::rust_begin_unwind
44.02 s
gammaloop-nextest-docs> 1: core::panicking::panic_fmt
44.02 s
gammaloop-nextest-docs> 2: core::panicking::panic
44.02 s
gammaloop-nextest-docs> 3: alphal00p_docs_builder::provenance_tests::each_build_captures_one_revision_before_rendering
44.02 s
gammaloop-nextest-docs> 4: <alphal00p_docs_builder::provenance_tests::each_build_captures_one_revision_before_rendering::{closure#0} as core::ops::function::FnOnce<()>>::call_once
44.02 s
gammaloop-nextest-docs> note: Some details are omitted, run with `RUST_BACKTRACE=full` for a verbose backtrace.
44.02 s
gammaloop-nextest-docs>
44.02 s
gammaloop-nextest-docs> FAIL [ 0.116s] (100/129) alphal00p-docs-builder tests :: developer_scope_ranges_ignore_unrelated_edits_and_warn_only_while_watching
44.02 s
gammaloop-nextest-docs> stdout ---
44.02 s
gammaloop-nextest-docs>
44.02 s
gammaloop-nextest-docs> running 1 test
44.02 s
gammaloop-nextest-docs> test tests::developer_scope_ranges_ignore_unrelated_edits_and_warn_only_while_watching ... FAILED
44.02 s
gammaloop-nextest-docs>
44.02 s
gammaloop-nextest-docs> failures:
44.02 s
gammaloop-nextest-docs>
44.02 s
gammaloop-nextest-docs> failures:
44.02 s
gammaloop-nextest-docs> tests::developer_scope_ranges_ignore_unrelated_edits_and_warn_only_while_watching
44.02 s
gammaloop-nextest-docs>
44.02 s
gammaloop-nextest-docs> test result: FAILED. 0 passed; 1 failed; 0 ignored; 0 measured; 128 filtered out; finished in 0.11s
44.02 s
gammaloop-nextest-docs>
44.02 s
gammaloop-nextest-docs> stderr ---
44.02 s
gammaloop-nextest-docs>
44.02 s
gammaloop-nextest-docs> thread 'tests::developer_scope_ranges_ignore_unrelated_edits_and_warn_only_while_watching' (284) panicked at crates/alphal00p-docs-builder/src/lib.rs:12350:29:
44.02 s
gammaloop-nextest-docs> called `Result::unwrap()` on an `Err` value: required documentation source is missing: /build/source/crates/spynso3/typst/STIXTwoMath-Regular.woff2
44.02 s
gammaloop-nextest-docs>
44.02 s
gammaloop-nextest-docs> Location:
44.02 s
gammaloop-nextest-docs> crates/alphal00p-docs-builder/src/lib.rs:5103:9
44.02 s
gammaloop-nextest-docs> stack backtrace:
44.02 s
gammaloop-nextest-docs> 0: __rustc::rust_begin_unwind
44.02 s
gammaloop-nextest-docs> 1: core::panicking::panic_fmt
44.02 s
gammaloop-nextest-docs> 2: core::result::unwrap_failed
44.02 s
gammaloop-nextest-docs> 3: alphal00p_docs_builder::tests::developer_scope_ranges_ignore_unrelated_edits_and_warn_only_while_watching
44.02 s
gammaloop-nextest-docs> 4: <alphal00p_docs_builder::tests::developer_scope_ranges_ignore_unrelated_edits_and_warn_only_while_watching::{closure#0} as core::ops::function::FnOnce<()>>::call_once
44.02 s
gammaloop-nextest-docs> note: Some details are omitted, run with `RUST_BACKTRACE=full` for a verbose backtrace.
44.02 s
gammaloop-nextest-docs>
44.03 s
gammaloop-nextest-docs> FAIL [ 0.120s] (111/129) alphal00p-docs-builder tests :: every_product_requires_a_task_chooser_and_each_supported_interface
44.03 s
gammaloop-nextest-docs> stdout ---
44.03 s
gammaloop-nextest-docs>
44.03 s
gammaloop-nextest-docs> running 1 test
44.03 s
gammaloop-nextest-docs> test tests::every_product_requires_a_task_chooser_and_each_supported_interface ... FAILED
44.03 s
gammaloop-nextest-docs>
44.03 s
gammaloop-nextest-docs> failures:
44.03 s
gammaloop-nextest-docs>
44.03 s
gammaloop-nextest-docs> failures:
44.03 s
gammaloop-nextest-docs> tests::every_product_requires_a_task_chooser_and_each_supported_interface
44.03 s
gammaloop-nextest-docs>
44.03 s
gammaloop-nextest-docs> test result: FAILED. 0 passed; 1 failed; 0 ignored; 0 measured; 128 filtered out; finished in 0.12s
44.03 s
gammaloop-nextest-docs>
44.03 s
gammaloop-nextest-docs> stderr ---
44.03 s
gammaloop-nextest-docs>
44.03 s
gammaloop-nextest-docs> thread 'tests::every_product_requires_a_task_chooser_and_each_supported_interface' (309) panicked at crates/alphal00p-docs-builder/src/lib.rs:12274:9:
44.03 s
gammaloop-nextest-docs> assertion failed: format!("{error:#}").contains("has no quickstart page")
44.03 s
gammaloop-nextest-docs> stack backtrace:
44.03 s
gammaloop-nextest-docs> 0: __rustc::rust_begin_unwind
44.03 s
gammaloop-nextest-docs> 1: core::panicking::panic_fmt
44.03 s
gammaloop-nextest-docs> 2: core::panicking::panic
44.03 s
gammaloop-nextest-docs> 3: alphal00p_docs_builder::tests::every_product_requires_a_task_chooser_and_each_supported_interface
44.03 s
gammaloop-nextest-docs> 4: <alphal00p_docs_builder::tests::every_product_requires_a_task_chooser_and_each_supported_interface::{closure#0} as core::ops::function::FnOnce<()>>::call_once
44.03 s
gammaloop-nextest-docs> note: Some details are omitted, run with `RUST_BACKTRACE=full` for a verbose backtrace.
44.03 s
gammaloop-nextest-docs>
44.05 s
gammaloop-nextest-docs> FAIL [ 0.112s] (122/129) alphal00p-docs-builder tests :: pdf_manual_chapter_order_must_match_the_page_registry
44.05 s
gammaloop-nextest-docs> stdout ---
44.05 s
gammaloop-nextest-docs>
44.05 s
gammaloop-nextest-docs> running 1 test
44.05 s
gammaloop-nextest-docs> test tests::pdf_manual_chapter_order_must_match_the_page_registry ... FAILED
44.05 s
gammaloop-nextest-docs>
44.05 s
gammaloop-nextest-docs> failures:
44.05 s
gammaloop-nextest-docs>
44.05 s
gammaloop-nextest-docs> failures:
44.05 s
gammaloop-nextest-docs> tests::pdf_manual_chapter_order_must_match_the_page_registry
44.05 s
gammaloop-nextest-docs>
44.05 s
gammaloop-nextest-docs> test result: FAILED. 0 passed; 1 failed; 0 ignored; 0 measured; 128 filtered out; finished in 0.11s
44.05 s
gammaloop-nextest-docs>
44.05 s
gammaloop-nextest-docs> stderr ---
44.05 s
gammaloop-nextest-docs>
44.05 s
gammaloop-nextest-docs> thread 'tests::pdf_manual_chapter_order_must_match_the_page_registry' (402) panicked at crates/alphal00p-docs-builder/src/lib.rs:12330:9:
44.05 s
gammaloop-nextest-docs> assertion failed: format!("{error:#}").contains("PDF manual chapter order differs")
44.05 s
gammaloop-nextest-docs> stack backtrace:
44.05 s
gammaloop-nextest-docs> 0: __rustc::rust_begin_unwind
44.05 s
gammaloop-nextest-docs> 1: core::panicking::panic_fmt
44.05 s
gammaloop-nextest-docs> 2: core::panicking::panic
44.05 s
gammaloop-nextest-docs> 3: alphal00p_docs_builder::tests::pdf_manual_chapter_order_must_match_the_page_registry
44.05 s
gammaloop-nextest-docs> 4: <alphal00p_docs_builder::tests::pdf_manual_chapter_order_must_match_the_page_registry::{closure#0} as core::ops::function::FnOnce<()>>::call_once
44.05 s
gammaloop-nextest-docs> note: Some details are omitted, run with `RUST_BACKTRACE=full` for a verbose backtrace.
44.05 s
gammaloop-nextest-docs>
54.95 s
gammaloop-nextest-docs> ------------
54.95 s
gammaloop-nextest-docs> Summary [ 11.064s] 129 tests run: 118 passed , 11 failed , 0 skipped
54.95 s
gammaloop-nextest-docs> FAIL [ 0.009s] ( 23/129) alphal00p-docs-builder tests :: developer_architecture_is_classified_searchable_and_source_backed
54.95 s
gammaloop-nextest-docs> stdout ---
54.95 s
gammaloop-nextest-docs>
54.95 s
gammaloop-nextest-docs> running 1 test
54.95 s
gammaloop-nextest-docs> test tests::developer_architecture_is_classified_searchable_and_source_backed ... FAILED
54.95 s
gammaloop-nextest-docs>
54.95 s
gammaloop-nextest-docs> failures:
54.95 s
gammaloop-nextest-docs>
54.95 s
gammaloop-nextest-docs> failures:
54.95 s
gammaloop-nextest-docs> tests::developer_architecture_is_classified_searchable_and_source_backed
54.95 s
gammaloop-nextest-docs>
54.95 s
gammaloop-nextest-docs> test result: FAILED. 0 passed; 1 failed; 0 ignored; 0 measured; 128 filtered out; finished in 0.01s
54.95 s
gammaloop-nextest-docs>
54.95 s
gammaloop-nextest-docs> stderr ---
54.95 s
gammaloop-nextest-docs>
54.95 s
gammaloop-nextest-docs> thread 'tests::developer_architecture_is_classified_searchable_and_source_backed' (276) panicked at crates/alphal00p-docs-builder/src/lib.rs:12751:14:
54.95 s
gammaloop-nextest-docs> called `Result::unwrap()` on an `Err` value: failed to copy documentation asset crates/spynso3/typst/STIXTwoMath-Regular.woff2
54.95 s
gammaloop-nextest-docs>
54.95 s
gammaloop-nextest-docs> Caused by:
54.95 s
gammaloop-nextest-docs> No such file or directory (os error 2)
54.95 s
gammaloop-nextest-docs>
54.95 s
gammaloop-nextest-docs> Location:
54.95 s
gammaloop-nextest-docs> crates/alphal00p-docs-builder/src/lib.rs:2276:18
54.95 s
gammaloop-nextest-docs> stack backtrace:
54.95 s
gammaloop-nextest-docs> 0: __rustc::rust_begin_unwind
54.95 s
gammaloop-nextest-docs> 1: core::panicking::panic_fmt
54.95 s
gammaloop-nextest-docs> 2: core::result::unwrap_failed
54.95 s
gammaloop-nextest-docs> 3: alphal00p_docs_builder::tests::developer_architecture_is_classified_searchable_and_source_backed
54.95 s
gammaloop-nextest-docs> 4: <alphal00p_docs_builder::tests::developer_architecture_is_classified_searchable_and_source_backed::{closure#0} as core::ops::function::FnOnce<()>>::call_once
54.95 s
gammaloop-nextest-docs> note: Some details are omitted, run with `RUST_BACKTRACE=full` for a verbose backtrace.
54.95 s
gammaloop-nextest-docs>
54.95 s
gammaloop-nextest-docs> FAIL [ 0.011s] ( 30/129) alphal00p-docs-builder tests :: every_product_orients_rust_to_native_rustdoc_and_keeps_legacy_redirects
54.95 s
gammaloop-nextest-docs> stdout ---
54.95 s
gammaloop-nextest-docs>
54.95 s
gammaloop-nextest-docs> running 1 test
54.95 s
gammaloop-nextest-docs> test tests::every_product_orients_rust_to_native_rustdoc_and_keeps_legacy_redirects ... FAILED
54.95 s
gammaloop-nextest-docs>
54.95 s
gammaloop-nextest-docs> failures:
54.95 s
gammaloop-nextest-docs>
54.95 s
gammaloop-nextest-docs> failures:
54.95 s
gammaloop-nextest-docs> tests::every_product_orients_rust_to_native_rustdoc_and_keeps_legacy_redirects
54.95 s
gammaloop-nextest-docs>
54.95 s
gammaloop-nextest-docs> test result: FAILED. 0 passed; 1 failed; 0 ignored; 0 measured; 128 filtered out; finished in 0.01s
54.95 s
gammaloop-nextest-docs>
54.95 s
gammaloop-nextest-docs> stderr ---
54.95 s
gammaloop-nextest-docs>
54.95 s
gammaloop-nextest-docs> thread 'tests::every_product_orients_rust_to_native_rustdoc_and_keeps_legacy_redirects' (302) panicked at crates/alphal00p-docs-builder/src/lib.rs:12555:46:
54.95 s
gammaloop-nextest-docs> called `Result::unwrap()` on an `Err` value: failed to copy documentation asset crates/spynso3/typst/STIXTwoMath-Regular.woff2
54.95 s
gammaloop-nextest-docs>
54.95 s
gammaloop-nextest-docs> Caused by:
54.95 s
gammaloop-nextest-docs> No such file or directory (os error 2)
54.95 s
gammaloop-nextest-docs>
54.95 s
gammaloop-nextest-docs> Location:
54.95 s
gammaloop-nextest-docs> crates/alphal00p-docs-builder/src/lib.rs:2276:18
54.95 s
gammaloop-nextest-docs> stack backtrace:
54.95 s
gammaloop-nextest-docs> 0: __rustc::rust_begin_unwind
54.95 s
gammaloop-nextest-docs> 1: core::panicking::panic_fmt
54.95 s
gammaloop-nextest-docs> 2: core::result::unwrap_failed
54.95 s
gammaloop-nextest-docs> 3: alphal00p_docs_builder::tests::every_product_orients_rust_to_native_rustdoc_and_keeps_legacy_redirects
54.95 s
gammaloop-nextest-docs> 4: <alphal00p_docs_builder::tests::every_product_orients_rust_to_native_rustdoc_and_keeps_legacy_redirects::{closure#0} as core::ops::function::FnOnce<()>>::call_once
54.95 s
gammaloop-nextest-docs> note: Some details are omitted, run with `RUST_BACKTRACE=full` for a verbose backtrace.
54.95 s
gammaloop-nextest-docs>
54.95 s
gammaloop-nextest-docs> FAIL [ 0.009s] ( 54/129) alphal00p-docs-builder tests :: portal_and_developer_pages_use_federated_search_and_feedback
54.95 s
gammaloop-nextest-docs> stdout ---
54.95 s
gammaloop-nextest-docs>
54.95 s
gammaloop-nextest-docs> running 1 test
54.95 s
gammaloop-nextest-docs> test tests::portal_and_developer_pages_use_federated_search_and_feedback ... FAILED
54.95 s
gammaloop-nextest-docs>
54.95 s
gammaloop-nextest-docs> failures:
54.95 s
gammaloop-nextest-docs>
54.95 s
gammaloop-nextest-docs> failures:
54.95 s
gammaloop-nextest-docs> tests::portal_and_developer_pages_use_federated_search_and_feedback
54.95 s
gammaloop-nextest-docs>
54.95 s
gammaloop-nextest-docs> test result: FAILED. 0 passed; 1 failed; 0 ignored; 0 measured; 128 filtered out; finished in 0.01s
54.95 s
gammaloop-nextest-docs>
54.95 s
gammaloop-nextest-docs> stderr ---
54.95 s
gammaloop-nextest-docs>
54.95 s
gammaloop-nextest-docs> thread 'tests::portal_and_developer_pages_use_federated_search_and_feedback' (416) panicked at crates/alphal00p-docs-builder/src/lib.rs:9684:14:
54.95 s
gammaloop-nextest-docs> called `Result::unwrap()` on an `Err` value: failed to copy documentation asset crates/spynso3/typst/STIXTwoMath-Regular.woff2
54.95 s
gammaloop-nextest-docs>
54.95 s
gammaloop-nextest-docs> Caused by:
54.95 s
gammaloop-nextest-docs> No such file or directory (os error 2)
54.95 s
gammaloop-nextest-docs>
54.95 s
gammaloop-nextest-docs> Location:
54.95 s
gammaloop-nextest-docs> crates/alphal00p-docs-builder/src/lib.rs:2276:18
54.95 s
gammaloop-nextest-docs> stack backtrace:
54.95 s
gammaloop-nextest-docs> 0: __rustc::rust_begin_unwind
54.95 s
gammaloop-nextest-docs> 1: core::panicking::panic_fmt
54.95 s
gammaloop-nextest-docs> 2: core::result::unwrap_failed
54.95 s
gammaloop-nextest-docs> 3: alphal00p_docs_builder::tests::write_test_portal
54.95 s
gammaloop-nextest-docs> 4: alphal00p_docs_builder::tests::portal_and_developer_pages_use_federated_search_and_feedback
54.95 s
gammaloop-nextest-docs> 5: <alphal00p_docs_builder::tests::portal_and_developer_pages_use_federated_search_and_feedback::{closure#0} as core::ops::function::FnOnce<()>>::call_once
54.95 s
gammaloop-nextest-docs> note: Some details are omitted, run with `RUST_BACKTRACE=full` for a verbose backtrace.
54.95 s
gammaloop-nextest-docs>
54.95 s
gammaloop-nextest-docs> FAIL [ 0.008s] ( 55/129) alphal00p-docs-builder tests :: portal_emits_routes_and_valid_assets
54.95 s
gammaloop-nextest-docs> stdout ---
54.95 s
gammaloop-nextest-docs>
54.95 s
gammaloop-nextest-docs> running 1 test
54.95 s
gammaloop-nextest-docs> test tests::portal_emits_routes_and_valid_assets ... FAILED
54.95 s
gammaloop-nextest-docs>
54.95 s
gammaloop-nextest-docs> failures:
54.95 s
gammaloop-nextest-docs>
54.95 s
gammaloop-nextest-docs> failures:
54.95 s
gammaloop-nextest-docs> tests::portal_emits_routes_and_valid_assets
54.95 s
gammaloop-nextest-docs>
54.95 s
gammaloop-nextest-docs> test result: FAILED. 0 passed; 1 failed; 0 ignored; 0 measured; 128 filtered out; finished in 0.00s
54.95 s
gammaloop-nextest-docs>
54.95 s
gammaloop-nextest-docs> stderr ---
54.95 s
gammaloop-nextest-docs>
54.95 s
gammaloop-nextest-docs> thread 'tests::portal_emits_routes_and_valid_assets' (422) panicked at crates/alphal00p-docs-builder/src/lib.rs:9684:14:
54.95 s
gammaloop-nextest-docs> called `Result::unwrap()` on an `Err` value: failed to copy documentation asset crates/spynso3/typst/STIXTwoMath-Regular.woff2
54.95 s
gammaloop-nextest-docs>
54.95 s
gammaloop-nextest-docs> Caused by:
54.95 s
gammaloop-nextest-docs> No such file or directory (os error 2)
54.95 s
gammaloop-nextest-docs>
54.95 s
gammaloop-nextest-docs> Location:
54.95 s
gammaloop-nextest-docs> crates/alphal00p-docs-builder/src/lib.rs:2276:18
54.95 s
gammaloop-nextest-docs> stack backtrace:
54.95 s
gammaloop-nextest-docs> 0: __rustc::rust_begin_unwind
54.95 s
gammaloop-nextest-docs> 1: core::panicking::panic_fmt
54.95 s
gammaloop-nextest-docs> 2: core::result::unwrap_failed
54.95 s
gammaloop-nextest-docs> 3: alphal00p_docs_builder::tests::write_test_portal
54.95 s
gammaloop-nextest-docs> 4: alphal00p_docs_builder::tests::portal_emits_routes_and_valid_assets
54.95 s
gammaloop-nextest-docs> 5: <alphal00p_docs_builder::tests::portal_emits_routes_and_valid_assets::{closure#0} as core::ops::function::FnOnce<()>>::call_once
54.95 s
gammaloop-nextest-docs> note: Some details are omitted, run with `RUST_BACKTRACE=full` for a verbose backtrace.
54.95 s
gammaloop-nextest-docs>
54.95 s
gammaloop-nextest-docs> FAIL [ 0.010s] ( 56/129) alphal00p-docs-builder tests :: portal_task_chooser_routes_each_goal_to_the_registered_quickstart
54.95 s
gammaloop-nextest-docs> stdout ---
54.95 s
gammaloop-nextest-docs>
54.95 s
gammaloop-nextest-docs> running 1 test
54.95 s
gammaloop-nextest-docs> test tests::portal_task_chooser_routes_each_goal_to_the_registered_quickstart ... FAILED
54.95 s
gammaloop-nextest-docs>
54.95 s
gammaloop-nextest-docs> failures:
54.95 s
gammaloop-nextest-docs>
54.95 s
gammaloop-nextest-docs> failures:
54.95 s
gammaloop-nextest-docs> tests::portal_task_chooser_routes_each_goal_to_the_registered_quickstart
54.95 s
gammaloop-nextest-docs>
54.95 s
gammaloop-nextest-docs> test result: FAILED. 0 passed; 1 failed; 0 ignored; 0 measured; 128 filtered out; finished in 0.01s
54.95 s
gammaloop-nextest-docs>
54.95 s
gammaloop-nextest-docs> stderr ---
54.95 s
gammaloop-nextest-docs>
54.95 s
gammaloop-nextest-docs> thread 'tests::portal_task_chooser_routes_each_goal_to_the_registered_quickstart' (427) panicked at crates/alphal00p-docs-builder/src/lib.rs:9684:14:
54.95 s
gammaloop-nextest-docs> called `Result::unwrap()` on an `Err` value: failed to copy documentation asset crates/spynso3/typst/STIXTwoMath-Regular.woff2
54.95 s
gammaloop-nextest-docs>
54.95 s
gammaloop-nextest-docs> Caused by:
54.95 s
gammaloop-nextest-docs> No such file or directory (os error 2)
54.95 s
gammaloop-nextest-docs>
54.95 s
gammaloop-nextest-docs> Location:
54.95 s
gammaloop-nextest-docs> crates/alphal00p-docs-builder/src/lib.rs:2276:18
54.95 s
gammaloop-nextest-docs> stack backtrace:
54.95 s
gammaloop-nextest-docs> 0: __rustc::rust_begin_unwind
54.95 s
gammaloop-nextest-docs> 1: core::panicking::panic_fmt
54.95 s
gammaloop-nextest-docs> 2: core::result::unwrap_failed
54.95 s
gammaloop-nextest-docs> 3: alphal00p_docs_builder::tests::write_test_portal
54.95 s
gammaloop-nextest-docs> 4: alphal00p_docs_builder::tests::portal_task_chooser_routes_each_goal_to_the_registered_quickstart
54.95 s
gammaloop-nextest-docs> 5: <alphal00p_docs_builder::tests::portal_task_chooser_routes_each_goal_to_the_registered_quickstart::{closure#0} as core::ops::function::FnOnce<()>>::call_once
54.95 s
gammaloop-nextest-docs> note: Some details are omitted, run with `RUST_BACKTRACE=full` for a verbose backtrace.
54.95 s
gammaloop-nextest-docs>
54.95 s
gammaloop-nextest-docs> FAIL [ 0.009s] ( 86/129) alphal00p-docs-builder tests :: site_assets_replace_read_only_generated_files
54.95 s
gammaloop-nextest-docs> stdout ---
54.95 s
gammaloop-nextest-docs>
54.95 s
gammaloop-nextest-docs> running 1 test
54.95 s
gammaloop-nextest-docs> test tests::site_assets_replace_read_only_generated_files ... FAILED
54.95 s
gammaloop-nextest-docs>
54.95 s
gammaloop-nextest-docs> failures:
54.95 s
gammaloop-nextest-docs>
54.95 s
gammaloop-nextest-docs> failures:
54.95 s
gammaloop-nextest-docs> tests::site_assets_replace_read_only_generated_files
54.95 s
gammaloop-nextest-docs>
54.95 s
gammaloop-nextest-docs> test result: FAILED. 0 passed; 1 failed; 0 ignored; 0 measured; 128 filtered out; finished in 0.00s
54.95 s
gammaloop-nextest-docs>
54.95 s
gammaloop-nextest-docs> stderr ---
54.95 s
gammaloop-nextest-docs>
54.95 s
gammaloop-nextest-docs> thread 'tests::site_assets_replace_read_only_generated_files' (648) panicked at crates/alphal00p-docs-builder/src/lib.rs:12305:50:
54.95 s
gammaloop-nextest-docs> called `Result::unwrap()` on an `Err` value: failed to copy documentation asset crates/spynso3/typst/STIXTwoMath-Regular.woff2
54.95 s
gammaloop-nextest-docs>
54.95 s
gammaloop-nextest-docs> Caused by:
54.95 s
gammaloop-nextest-docs> No such file or directory (os error 2)
54.95 s
gammaloop-nextest-docs>
54.95 s
gammaloop-nextest-docs> Location:
54.95 s
gammaloop-nextest-docs> crates/alphal00p-docs-builder/src/lib.rs:2276:18
54.95 s
gammaloop-nextest-docs> stack backtrace:
54.95 s
gammaloop-nextest-docs> 0: __rustc::rust_begin_unwind
54.95 s
gammaloop-nextest-docs> 1: core::panicking::panic_fmt
54.95 s
gammaloop-nextest-docs> 2: core::result::unwrap_failed
54.95 s
gammaloop-nextest-docs> 3: alphal00p_docs_builder::tests::site_assets_replace_read_only_generated_files
54.95 s
gammaloop-nextest-docs> 4: <alphal00p_docs_builder::tests::site_assets_replace_read_only_generated_files::{closure#0} as core::ops::function::FnOnce<()>>::call_once
54.95 s
gammaloop-nextest-docs> note: Some details are omitted, run with `RUST_BACKTRACE=full` for a verbose backtrace.
54.95 s
gammaloop-nextest-docs>
54.95 s
gammaloop-nextest-docs> FAIL [ 0.122s] ( 91/129) alphal00p-docs-builder tests :: checked_in_registry_is_valid
54.95 s
gammaloop-nextest-docs> stdout ---
54.95 s
gammaloop-nextest-docs>
54.95 s
gammaloop-nextest-docs> running 1 test
54.95 s
gammaloop-nextest-docs> test tests::checked_in_registry_is_valid ... FAILED
54.95 s
gammaloop-nextest-docs>
54.95 s
gammaloop-nextest-docs> failures:
54.95 s
gammaloop-nextest-docs>
54.95 s
gammaloop-nextest-docs> failures:
54.95 s
gammaloop-nextest-docs> tests::checked_in_registry_is_valid
54.95 s
gammaloop-nextest-docs>
54.95 s
gammaloop-nextest-docs> test result: FAILED. 0 passed; 1 failed; 0 ignored; 0 measured; 128 filtered out; finished in 0.11s
54.95 s
gammaloop-nextest-docs>
54.95 s
gammaloop-nextest-docs> stderr ---
54.95 s
gammaloop-nextest-docs>
54.95 s
gammaloop-nextest-docs> thread 'tests::checked_in_registry_is_valid' (241) panicked at crates/alphal00p-docs-builder/src/lib.rs:12260:50:
54.95 s
gammaloop-nextest-docs> called `Result::unwrap()` on an `Err` value: required documentation source is missing: /build/source/crates/spynso3/typst/STIXTwoMath-Regular.woff2
54.95 s
gammaloop-nextest-docs>
54.95 s
gammaloop-nextest-docs> Location:
54.95 s
gammaloop-nextest-docs> crates/alphal00p-docs-builder/src/lib.rs:5103:9
54.95 s
gammaloop-nextest-docs> stack backtrace:
54.95 s
gammaloop-nextest-docs> 0: __rustc::rust_begin_unwind
54.95 s
gammaloop-nextest-docs> 1: core::panicking::panic_fmt
54.95 s
gammaloop-nextest-docs> 2: core::result::unwrap_failed
54.95 s
gammaloop-nextest-docs> 3: alphal00p_docs_builder::tests::checked_in_registry_is_valid
54.95 s
gammaloop-nextest-docs> 4: <alphal00p_docs_builder::tests::checked_in_registry_is_valid::{closure#0} as core::ops::function::FnOnce<()>>::call_once
54.95 s
gammaloop-nextest-docs> note: Some details are omitted, run with `RUST_BACKTRACE=full` for a verbose backtrace.
54.95 s
gammaloop-nextest-docs>
54.95 s
gammaloop-nextest-docs> FAIL [ 0.130s] ( 97/129) alphal00p-docs-builder provenance_tests :: each_build_captures_one_revision_before_rendering
54.95 s
gammaloop-nextest-docs> stdout ---
54.95 s
gammaloop-nextest-docs>
54.95 s
gammaloop-nextest-docs> running 1 test
54.95 s
gammaloop-nextest-docs>
54.95 s
gammaloop-nextest-docs> running 1 test
54.95 s
gammaloop-nextest-docs> test provenance_tests::each_build_captures_one_revision_before_rendering ... FAILED
54.95 s
gammaloop-nextest-docs>
54.95 s
gammaloop-nextest-docs> failures:
54.95 s
gammaloop-nextest-docs>
54.95 s
gammaloop-nextest-docs> failures:
54.95 s
gammaloop-nextest-docs> provenance_tests::each_build_captures_one_revision_before_rendering
54.95 s
gammaloop-nextest-docs>
54.95 s
gammaloop-nextest-docs> test result: FAILED. 0 passed; 1 failed; 0 ignored; 0 measured; 128 filtered out; finished in 0.11s
54.95 s
gammaloop-nextest-docs>
54.95 s
gammaloop-nextest-docs> test provenance_tests::each_build_captures_one_revision_before_rendering ... FAILED
54.95 s
gammaloop-nextest-docs>
54.95 s
gammaloop-nextest-docs> failures:
54.95 s
gammaloop-nextest-docs>
54.95 s
gammaloop-nextest-docs> failures:
54.95 s
gammaloop-nextest-docs> provenance_tests::each_build_captures_one_revision_before_rendering
54.95 s
gammaloop-nextest-docs>
54.95 s
gammaloop-nextest-docs> test result: FAILED. 0 passed; 1 failed; 0 ignored; 0 measured; 128 filtered out; finished in 0.12s
54.95 s
gammaloop-nextest-docs>
54.95 s
gammaloop-nextest-docs> stderr ---
54.95 s
gammaloop-nextest-docs>
54.95 s
gammaloop-nextest-docs> thread 'provenance_tests::each_build_captures_one_revision_before_rendering' (260) panicked at crates/alphal00p-docs-builder/src/provenance_tests.rs:297:14:
54.95 s
gammaloop-nextest-docs> called `Result::unwrap()` on an `Err` value: required documentation source is missing: /build/source/target/nix-ci-tmp/.tmp3od26f/checkout/crates/spynso3/typst/STIXTwoMath-Regular.woff2
54.95 s
gammaloop-nextest-docs>
54.95 s
gammaloop-nextest-docs> Location:
54.95 s
gammaloop-nextest-docs> crates/alphal00p-docs-builder/src/lib.rs:5103:9
54.95 s
gammaloop-nextest-docs> stack backtrace:
54.95 s
gammaloop-nextest-docs> 0: __rustc::rust_begin_unwind
54.95 s
gammaloop-nextest-docs> 1: core::panicking::panic_fmt
54.95 s
gammaloop-nextest-docs> 2: core::result::unwrap_failed
54.95 s
gammaloop-nextest-docs> 3: alphal00p_docs_builder::provenance_tests::each_build_captures_one_revision_before_rendering
54.95 s
gammaloop-nextest-docs> 4: <alphal00p_docs_builder::provenance_tests::each_build_captures_one_revision_before_rendering::{closure#0} as core::ops::function::FnOnce<()>>::call_once
54.95 s
gammaloop-nextest-docs> note: Some details are omitted, run with `RUST_BACKTRACE=full` for a verbose backtrace.
54.95 s
gammaloop-nextest-docs>
54.95 s
gammaloop-nextest-docs> thread 'provenance_tests::each_build_captures_one_revision_before_rendering' (226) panicked at crates/alphal00p-docs-builder/src/provenance_tests.rs:274:9:
54.95 s
gammaloop-nextest-docs> assertion failed: command.status().unwrap().success()
54.95 s
gammaloop-nextest-docs> stack backtrace:
54.95 s
gammaloop-nextest-docs> 0: __rustc::rust_begin_unwind
54.95 s
gammaloop-nextest-docs> 1: core::panicking::panic_fmt
54.95 s
gammaloop-nextest-docs> 2: core::panicking::panic
54.95 s
gammaloop-nextest-docs> 3: alphal00p_docs_builder::provenance_tests::each_build_captures_one_revision_before_rendering
54.95 s
gammaloop-nextest-docs> 4: <alphal00p_docs_builder::provenance_tests::each_build_captures_one_revision_before_rendering::{closure#0} as core::ops::function::FnOnce<()>>::call_once
54.95 s
gammaloop-nextest-docs> note: Some details are omitted, run with `RUST_BACKTRACE=full` for a verbose backtrace.
54.95 s
gammaloop-nextest-docs>
54.95 s
gammaloop-nextest-docs> FAIL [ 0.116s] (100/129) alphal00p-docs-builder tests :: developer_scope_ranges_ignore_unrelated_edits_and_warn_only_while_watching
54.95 s
gammaloop-nextest-docs> stdout ---
54.95 s
gammaloop-nextest-docs>
54.95 s
gammaloop-nextest-docs> running 1 test
54.95 s
gammaloop-nextest-docs> test tests::developer_scope_ranges_ignore_unrelated_edits_and_warn_only_while_watching ... FAILED
54.95 s
gammaloop-nextest-docs>
54.95 s
gammaloop-nextest-docs> failures:
54.95 s
gammaloop-nextest-docs>
54.95 s
gammaloop-nextest-docs> failures:
54.95 s
gammaloop-nextest-docs> tests::developer_scope_ranges_ignore_unrelated_edits_and_warn_only_while_watching
54.95 s
gammaloop-nextest-docs>
54.95 s
gammaloop-nextest-docs> test result: FAILED. 0 passed; 1 failed; 0 ignored; 0 measured; 128 filtered out; finished in 0.11s
54.95 s
gammaloop-nextest-docs>
54.95 s
gammaloop-nextest-docs> stderr ---
54.95 s
gammaloop-nextest-docs>
54.95 s
gammaloop-nextest-docs> thread 'tests::developer_scope_ranges_ignore_unrelated_edits_and_warn_only_while_watching' (284) panicked at crates/alphal00p-docs-builder/src/lib.rs:12350:29:
54.95 s
gammaloop-nextest-docs> called `Result::unwrap()` on an `Err` value: required documentation source is missing: /build/source/crates/spynso3/typst/STIXTwoMath-Regular.woff2
54.95 s
gammaloop-nextest-docs>
54.95 s
gammaloop-nextest-docs> Location:
54.95 s
gammaloop-nextest-docs> crates/alphal00p-docs-builder/src/lib.rs:5103:9
54.95 s
gammaloop-nextest-docs> stack backtrace:
54.95 s
gammaloop-nextest-docs> 0: __rustc::rust_begin_unwind
54.95 s
gammaloop-nextest-docs> 1: core::panicking::panic_fmt
54.95 s
gammaloop-nextest-docs> 2: core::result::unwrap_failed
54.95 s
gammaloop-nextest-docs> 3: alphal00p_docs_builder::tests::developer_scope_ranges_ignore_unrelated_edits_and_warn_only_while_watching
54.95 s
gammaloop-nextest-docs> 4: <alphal00p_docs_builder::tests::developer_scope_ranges_ignore_unrelated_edits_and_warn_only_while_watching::{closure#0} as core::ops::function::FnOnce<()>>::call_once
54.95 s
gammaloop-nextest-docs> note: Some details are omitted, run with `RUST_BACKTRACE=full` for a verbose backtrace.
54.95 s
gammaloop-nextest-docs>
54.95 s
gammaloop-nextest-docs> FAIL [ 0.120s] (111/129) alphal00p-docs-builder tests :: every_product_requires_a_task_chooser_and_each_supported_interface
54.95 s
gammaloop-nextest-docs> stdout ---
54.95 s
gammaloop-nextest-docs>
54.95 s
gammaloop-nextest-docs> running 1 test
54.95 s
gammaloop-nextest-docs> test tests::every_product_requires_a_task_chooser_and_each_supported_interface ... FAILED
54.95 s
gammaloop-nextest-docs>
54.95 s
gammaloop-nextest-docs> failures:
54.95 s
gammaloop-nextest-docs>
54.95 s
gammaloop-nextest-docs> failures:
54.95 s
gammaloop-nextest-docs> tests::every_product_requires_a_task_chooser_and_each_supported_interface
54.95 s
gammaloop-nextest-docs>
54.95 s
gammaloop-nextest-docs> test result: FAILED. 0 passed; 1 failed; 0 ignored; 0 measured; 128 filtered out; finished in 0.12s
54.95 s
gammaloop-nextest-docs>
54.95 s
gammaloop-nextest-docs> stderr ---
54.95 s
gammaloop-nextest-docs>
54.95 s
gammaloop-nextest-docs> thread 'tests::every_product_requires_a_task_chooser_and_each_supported_interface' (309) panicked at crates/alphal00p-docs-builder/src/lib.rs:12274:9:
54.95 s
gammaloop-nextest-docs> assertion failed: format!("{error:#}").contains("has no quickstart page")
54.95 s
gammaloop-nextest-docs> stack backtrace:
54.95 s
gammaloop-nextest-docs> 0: __rustc::rust_begin_unwind
54.95 s
gammaloop-nextest-docs> 1: core::panicking::panic_fmt
54.95 s
gammaloop-nextest-docs> 2: core::panicking::panic
54.95 s
gammaloop-nextest-docs> 3: alphal00p_docs_builder::tests::every_product_requires_a_task_chooser_and_each_supported_interface
54.95 s
gammaloop-nextest-docs> 4: <alphal00p_docs_builder::tests::every_product_requires_a_task_chooser_and_each_supported_interface::{closure#0} as core::ops::function::FnOnce<()>>::call_once
54.95 s
gammaloop-nextest-docs> note: Some details are omitted, run with `RUST_BACKTRACE=full` for a verbose backtrace.
54.95 s
gammaloop-nextest-docs>
54.95 s
gammaloop-nextest-docs> FAIL [ 0.112s] (122/129) alphal00p-docs-builder tests :: pdf_manual_chapter_order_must_match_the_page_registry
54.95 s
gammaloop-nextest-docs> stdout ---
54.95 s
gammaloop-nextest-docs>
54.95 s
gammaloop-nextest-docs> running 1 test
54.95 s
gammaloop-nextest-docs> test tests::pdf_manual_chapter_order_must_match_the_page_registry ... FAILED
54.95 s
gammaloop-nextest-docs>
54.95 s
gammaloop-nextest-docs> failures:
54.95 s
gammaloop-nextest-docs>
54.95 s
gammaloop-nextest-docs> failures:
54.95 s
gammaloop-nextest-docs> tests::pdf_manual_chapter_order_must_match_the_page_registry
54.95 s
gammaloop-nextest-docs>
54.95 s
gammaloop-nextest-docs> test result: FAILED. 0 passed; 1 failed; 0 ignored; 0 measured; 128 filtered out; finished in 0.11s
54.95 s
gammaloop-nextest-docs>
54.95 s
gammaloop-nextest-docs> stderr ---
54.95 s
gammaloop-nextest-docs>
54.95 s
gammaloop-nextest-docs> thread 'tests::pdf_manual_chapter_order_must_match_the_page_registry' (402) panicked at crates/alphal00p-docs-builder/src/lib.rs:12330:9:
54.95 s
gammaloop-nextest-docs> assertion failed: format!("{error:#}").contains("PDF manual chapter order differs")
54.95 s
gammaloop-nextest-docs> stack backtrace:
54.95 s
gammaloop-nextest-docs> 0: __rustc::rust_begin_unwind
54.95 s
gammaloop-nextest-docs> 1: core::panicking::panic_fmt
54.95 s
gammaloop-nextest-docs> 2: core::panicking::panic
54.95 s
gammaloop-nextest-docs> 3: alphal00p_docs_builder::tests::pdf_manual_chapter_order_must_match_the_page_registry
54.95 s
gammaloop-nextest-docs> 4: <alphal00p_docs_builder::tests::pdf_manual_chapter_order_must_match_the_page_registry::{closure#0} as core::ops::function::FnOnce<()>>::call_once
54.95 s
gammaloop-nextest-docs> note: Some details are omitted, run with `RUST_BACKTRACE=full` for a verbose backtrace.
54.95 s
gammaloop-nextest-docs>
54.96 s
gammaloop-nextest-docs> error : test run failed
54.98 s
gammaloop-nextest-docs>
54.98 s
gammaloop-nextest-docs> ========== nextest test summary ==========
54.98 s
gammaloop-nextest-docs> report: target/nextest/ci_gammaloop/junit.xml
54.98 s
gammaloop-nextest-docs> tests: 129, failures: 11, errors: 0
54.98 s
gammaloop-nextest-docs>
54.98 s
gammaloop-nextest-docs> 1. alphal00p-docs-builder::tests::developer_architecture_is_classified_searchable_and_source_backed
54.98 s
gammaloop-nextest-docs> failure: test failure with exit code 101
54.98 s
gammaloop-nextest-docs> thread 'tests::developer_architecture_is_classified_searchable_and_source_backed' (276) panicked at crates/alphal00p-docs-builder/src/lib.rs:12751:14:
54.98 s
gammaloop-nextest-docs> called `Result::unwrap()` on an `Err` value: failed to copy documentation asset crates/spynso3/typst/STIXTwoMath-Regular.woff2
54.98 s
gammaloop-nextest-docs>
54.98 s
gammaloop-nextest-docs> Caused by:
54.98 s
gammaloop-nextest-docs> No such file or directory (os error 2)
54.98 s
gammaloop-nextest-docs>
54.98 s
gammaloop-nextest-docs> Location:
54.98 s
gammaloop-nextest-docs> crates/alphal00p-docs-builder/src/lib.rs:2276:18
54.98 s
gammaloop-nextest-docs> stack backtrace:
54.98 s
gammaloop-nextest-docs> 0: __rustc::rust_begin_unwind
54.98 s
gammaloop-nextest-docs> 1: core::panicking::panic_fmt
54.98 s
gammaloop-nextest-docs> 2: core::result::unwrap_failed
54.98 s
gammaloop-nextest-docs> 3: alphal00p_docs_builder::tests::developer_architecture_is_classified_searchable_and_source_backed
54.98 s
gammaloop-nextest-docs> 4: <alphal00p_docs_builder::tests::developer_architecture_is_classified_searchable_and_source_backed::{closure#0} as core::ops::function::FnOnce<()>>::call_once
54.98 s
gammaloop-nextest-docs> note: Some details are omitted, run with `RUST_BACKTRACE=full` for a verbose backtrace.
54.98 s
gammaloop-nextest-docs> system-out
54.98 s
gammaloop-nextest-docs> running 1 test
54.98 s
gammaloop-nextest-docs> test tests::developer_architecture_is_classified_searchable_and_source_backed ... FAILED
54.98 s
gammaloop-nextest-docs>
54.98 s
gammaloop-nextest-docs> failures:
54.98 s
gammaloop-nextest-docs>
54.98 s
gammaloop-nextest-docs> failures:
54.98 s
gammaloop-nextest-docs> tests::developer_architecture_is_classified_searchable_and_source_backed
54.98 s
gammaloop-nextest-docs>
54.98 s
gammaloop-nextest-docs> test result: FAILED. 0 passed; 1 failed; 0 ignored; 0 measured; 128 filtered out; finished in 0.01s
54.98 s
gammaloop-nextest-docs> system-err
54.98 s
gammaloop-nextest-docs> thread 'tests::developer_architecture_is_classified_searchable_and_source_backed' (276) panicked at crates/alphal00p-docs-builder/src/lib.rs:12751:14:
54.98 s
gammaloop-nextest-docs> called `Result::unwrap()` on an `Err` value: failed to copy documentation asset crates/spynso3/typst/STIXTwoMath-Regular.woff2
54.98 s
gammaloop-nextest-docs>
54.98 s
gammaloop-nextest-docs> Caused by:
54.98 s
gammaloop-nextest-docs> No such file or directory (os error 2)
54.98 s
gammaloop-nextest-docs>
54.98 s
gammaloop-nextest-docs> Location:
54.98 s
gammaloop-nextest-docs> crates/alphal00p-docs-builder/src/lib.rs:2276:18
54.98 s
gammaloop-nextest-docs> stack backtrace:
54.98 s
gammaloop-nextest-docs> 0: __rustc::rust_begin_unwind
54.98 s
gammaloop-nextest-docs> 1: core::panicking::panic_fmt
54.98 s
gammaloop-nextest-docs> 2: core::result::unwrap_failed
54.98 s
gammaloop-nextest-docs> 3: alphal00p_docs_builder::tests::developer_architecture_is_classified_searchable_and_source_backed
54.98 s
gammaloop-nextest-docs> 4: <alphal00p_docs_builder::tests::developer_architecture_is_classified_searchable_and_source_backed::{closure#0} as core::ops::function::FnOnce<()>>::call_once
54.98 s
gammaloop-nextest-docs> note: Some details are omitted, run with `RUST_BACKTRACE=full` for a verbose backtrace.
54.98 s
gammaloop-nextest-docs>
54.98 s
gammaloop-nextest-docs> 2. alphal00p-docs-builder::tests::every_product_orients_rust_to_native_rustdoc_and_keeps_legacy_redirects
54.98 s
gammaloop-nextest-docs> failure: test failure with exit code 101
54.98 s
gammaloop-nextest-docs> thread 'tests::every_product_orients_rust_to_native_rustdoc_and_keeps_legacy_redirects' (302) panicked at crates/alphal00p-docs-builder/src/lib.rs:12555:46:
54.98 s
gammaloop-nextest-docs> called `Result::unwrap()` on an `Err` value: failed to copy documentation asset crates/spynso3/typst/STIXTwoMath-Regular.woff2
54.98 s
gammaloop-nextest-docs>
54.98 s
gammaloop-nextest-docs> Caused by:
54.98 s
gammaloop-nextest-docs> No such file or directory (os error 2)
54.98 s
gammaloop-nextest-docs>
54.98 s
gammaloop-nextest-docs> Location:
54.98 s
gammaloop-nextest-docs> crates/alphal00p-docs-builder/src/lib.rs:2276:18
54.98 s
gammaloop-nextest-docs> stack backtrace:
54.98 s
gammaloop-nextest-docs> 0: __rustc::rust_begin_unwind
54.98 s
gammaloop-nextest-docs> 1: core::panicking::panic_fmt
54.98 s
gammaloop-nextest-docs> 2: core::result::unwrap_failed
54.98 s
gammaloop-nextest-docs> 3: alphal00p_docs_builder::tests::every_product_orients_rust_to_native_rustdoc_and_keeps_legacy_redirects
54.98 s
gammaloop-nextest-docs> 4: <alphal00p_docs_builder::tests::every_product_orients_rust_to_native_rustdoc_and_keeps_legacy_redirects::{closure#0} as core::ops::function::FnOnce<()>>::call_once
54.98 s
gammaloop-nextest-docs> note: Some details are omitted, run with `RUST_BACKTRACE=full` for a verbose backtrace.
54.98 s
gammaloop-nextest-docs> system-out
54.98 s
gammaloop-nextest-docs> running 1 test
54.98 s
gammaloop-nextest-docs> test tests::every_product_orients_rust_to_native_rustdoc_and_keeps_legacy_redirects ... FAILED
54.98 s
gammaloop-nextest-docs>
54.98 s
gammaloop-nextest-docs> failures:
54.98 s
gammaloop-nextest-docs>
54.98 s
gammaloop-nextest-docs> failures:
54.98 s
gammaloop-nextest-docs> tests::every_product_orients_rust_to_native_rustdoc_and_keeps_legacy_redirects
54.98 s
gammaloop-nextest-docs>
54.98 s
gammaloop-nextest-docs> test result: FAILED. 0 passed; 1 failed; 0 ignored; 0 measured; 128 filtered out; finished in 0.01s
54.98 s
gammaloop-nextest-docs> system-err
54.98 s
gammaloop-nextest-docs> thread 'tests::every_product_orients_rust_to_native_rustdoc_and_keeps_legacy_redirects' (302) panicked at crates/alphal00p-docs-builder/src/lib.rs:12555:46:
54.98 s
gammaloop-nextest-docs> called `Result::unwrap()` on an `Err` value: failed to copy documentation asset crates/spynso3/typst/STIXTwoMath-Regular.woff2
54.98 s
gammaloop-nextest-docs>
54.98 s
gammaloop-nextest-docs> Caused by:
54.98 s
gammaloop-nextest-docs> No such file or directory (os error 2)
54.98 s
gammaloop-nextest-docs>
54.98 s
gammaloop-nextest-docs> Location:
54.98 s
gammaloop-nextest-docs> crates/alphal00p-docs-builder/src/lib.rs:2276:18
54.98 s
gammaloop-nextest-docs> stack backtrace:
54.98 s
gammaloop-nextest-docs> 0: __rustc::rust_begin_unwind
54.98 s
gammaloop-nextest-docs> 1: core::panicking::panic_fmt
54.98 s
gammaloop-nextest-docs> 2: core::result::unwrap_failed
54.98 s
gammaloop-nextest-docs> 3: alphal00p_docs_builder::tests::every_product_orients_rust_to_native_rustdoc_and_keeps_legacy_redirects
54.98 s
gammaloop-nextest-docs> 4: <alphal00p_docs_builder::tests::every_product_orients_rust_to_native_rustdoc_and_keeps_legacy_redirects::{closure#0} as core::ops::function::FnOnce<()>>::call_once
54.98 s
gammaloop-nextest-docs> note: Some details are omitted, run with `RUST_BACKTRACE=full` for a verbose backtrace.
54.98 s
gammaloop-nextest-docs>
54.98 s
gammaloop-nextest-docs> 3. alphal00p-docs-builder::tests::portal_and_developer_pages_use_federated_search_and_feedback
54.98 s
gammaloop-nextest-docs> failure: test failure with exit code 101
54.98 s
gammaloop-nextest-docs> thread 'tests::portal_and_developer_pages_use_federated_search_and_feedback' (416) panicked at crates/alphal00p-docs-builder/src/lib.rs:9684:14:
54.98 s
gammaloop-nextest-docs> called `Result::unwrap()` on an `Err` value: failed to copy documentation asset crates/spynso3/typst/STIXTwoMath-Regular.woff2
54.98 s
gammaloop-nextest-docs>
54.98 s
gammaloop-nextest-docs> Caused by:
54.98 s
gammaloop-nextest-docs> No such file or directory (os error 2)
54.98 s
gammaloop-nextest-docs>
54.98 s
gammaloop-nextest-docs> Location:
54.98 s
gammaloop-nextest-docs> crates/alphal00p-docs-builder/src/lib.rs:2276:18
54.98 s
gammaloop-nextest-docs> stack backtrace:
54.98 s
gammaloop-nextest-docs> 0: __rustc::rust_begin_unwind
54.98 s
gammaloop-nextest-docs> 1: core::panicking::panic_fmt
54.98 s
gammaloop-nextest-docs> 2: core::result::unwrap_failed
54.98 s
gammaloop-nextest-docs> 3: alphal00p_docs_builder::tests::write_test_portal
54.98 s
gammaloop-nextest-docs> 4: alphal00p_docs_builder::tests::portal_and_developer_pages_use_federated_search_and_feedback
54.98 s
gammaloop-nextest-docs> 5: <alphal00p_docs_builder::tests::portal_and_developer_pages_use_federated_search_and_feedback::{closure#0} as core::ops::function::FnOnce<()>>::call_once
54.98 s
gammaloop-nextest-docs> note: Some details are omitted, run with `RUST_BACKTRACE=full` for a verbose backtrace.
54.98 s
gammaloop-nextest-docs> system-out
54.98 s
gammaloop-nextest-docs> running 1 test
54.98 s
gammaloop-nextest-docs> test tests::portal_and_developer_pages_use_federated_search_and_feedback ... FAILED
54.98 s
gammaloop-nextest-docs>
54.98 s
gammaloop-nextest-docs> failures:
54.98 s
gammaloop-nextest-docs>
54.98 s
gammaloop-nextest-docs> failures:
54.98 s
gammaloop-nextest-docs> tests::portal_and_developer_pages_use_federated_search_and_feedback
54.98 s
gammaloop-nextest-docs>
54.98 s
gammaloop-nextest-docs> test result: FAILED. 0 passed; 1 failed; 0 ignored; 0 measured; 128 filtered out; finished in 0.01s
54.98 s
gammaloop-nextest-docs> system-err
54.98 s
gammaloop-nextest-docs> thread 'tests::portal_and_developer_pages_use_federated_search_and_feedback' (416) panicked at crates/alphal00p-docs-builder/src/lib.rs:9684:14:
54.98 s
gammaloop-nextest-docs> called `Result::unwrap()` on an `Err` value: failed to copy documentation asset crates/spynso3/typst/STIXTwoMath-Regular.woff2
54.98 s
gammaloop-nextest-docs>
54.98 s
gammaloop-nextest-docs> Caused by:
54.98 s
gammaloop-nextest-docs> No such file or directory (os error 2)
54.98 s
gammaloop-nextest-docs>
54.98 s
gammaloop-nextest-docs> Location:
54.98 s
gammaloop-nextest-docs> crates/alphal00p-docs-builder/src/lib.rs:2276:18
54.99 s
gammaloop-nextest-docs> stack backtrace:
54.99 s
gammaloop-nextest-docs> 0: __rustc::rust_begin_unwind
54.99 s
gammaloop-nextest-docs> 1: core::panicking::panic_fmt
54.99 s
gammaloop-nextest-docs> 2: core::result::unwrap_failed
54.99 s
gammaloop-nextest-docs> 3: alphal00p_docs_builder::tests::write_test_portal
54.99 s
gammaloop-nextest-docs> 4: alphal00p_docs_builder::tests::portal_and_developer_pages_use_federated_search_and_feedback
54.99 s
gammaloop-nextest-docs> 5: <alphal00p_docs_builder::tests::portal_and_developer_pages_use_federated_search_and_feedback::{closure#0} as core::ops::function::FnOnce<()>>::call_once
54.99 s
gammaloop-nextest-docs> note: Some details are omitted, run with `RUST_BACKTRACE=full` for a verbose backtrace.
54.99 s
gammaloop-nextest-docs>
54.99 s
gammaloop-nextest-docs> 4. alphal00p-docs-builder::tests::portal_emits_routes_and_valid_assets
54.99 s
gammaloop-nextest-docs> failure: test failure with exit code 101
54.99 s
gammaloop-nextest-docs> thread 'tests::portal_emits_routes_and_valid_assets' (422) panicked at crates/alphal00p-docs-builder/src/lib.rs:9684:14:
54.99 s
gammaloop-nextest-docs> called `Result::unwrap()` on an `Err` value: failed to copy documentation asset crates/spynso3/typst/STIXTwoMath-Regular.woff2
54.99 s
gammaloop-nextest-docs>
54.99 s
gammaloop-nextest-docs> Caused by:
54.99 s
gammaloop-nextest-docs> No such file or directory (os error 2)
54.99 s
gammaloop-nextest-docs>
54.99 s
gammaloop-nextest-docs> Location:
54.99 s
gammaloop-nextest-docs> crates/alphal00p-docs-builder/src/lib.rs:2276:18
54.99 s
gammaloop-nextest-docs> stack backtrace:
54.99 s
gammaloop-nextest-docs> 0: __rustc::rust_begin_unwind
54.99 s
gammaloop-nextest-docs> 1: core::panicking::panic_fmt
54.99 s
gammaloop-nextest-docs> 2: core::result::unwrap_failed
54.99 s
gammaloop-nextest-docs> 3: alphal00p_docs_builder::tests::write_test_portal
54.99 s
gammaloop-nextest-docs> 4: alphal00p_docs_builder::tests::portal_emits_routes_and_valid_assets
54.99 s
gammaloop-nextest-docs> 5: <alphal00p_docs_builder::tests::portal_emits_routes_and_valid_assets::{closure#0} as core::ops::function::FnOnce<()>>::call_once
54.99 s
gammaloop-nextest-docs> note: Some details are omitted, run with `RUST_BACKTRACE=full` for a verbose backtrace.
54.99 s
gammaloop-nextest-docs> system-out
54.99 s
gammaloop-nextest-docs> running 1 test
54.99 s
gammaloop-nextest-docs> test tests::portal_emits_routes_and_valid_assets ... FAILED
54.99 s
gammaloop-nextest-docs>
54.99 s
gammaloop-nextest-docs> failures:
54.99 s
gammaloop-nextest-docs>
54.99 s
gammaloop-nextest-docs> failures:
54.99 s
gammaloop-nextest-docs> tests::portal_emits_routes_and_valid_assets
54.99 s
gammaloop-nextest-docs>
54.99 s
gammaloop-nextest-docs> test result: FAILED. 0 passed; 1 failed; 0 ignored; 0 measured; 128 filtered out; finished in 0.00s
54.99 s
gammaloop-nextest-docs> system-err
54.99 s
gammaloop-nextest-docs> thread 'tests::portal_emits_routes_and_valid_assets' (422) panicked at crates/alphal00p-docs-builder/src/lib.rs:9684:14:
54.99 s
gammaloop-nextest-docs> called `Result::unwrap()` on an `Err` value: failed to copy documentation asset crates/spynso3/typst/STIXTwoMath-Regular.woff2
54.99 s
gammaloop-nextest-docs>
54.99 s
gammaloop-nextest-docs> Caused by:
54.99 s
gammaloop-nextest-docs> No such file or directory (os error 2)
54.99 s
gammaloop-nextest-docs>
54.99 s
gammaloop-nextest-docs> Location:
54.99 s
gammaloop-nextest-docs> crates/alphal00p-docs-builder/src/lib.rs:2276:18
54.99 s
gammaloop-nextest-docs> stack backtrace:
54.99 s
gammaloop-nextest-docs> 0: __rustc::rust_begin_unwind
54.99 s
gammaloop-nextest-docs> 1: core::panicking::panic_fmt
54.99 s
gammaloop-nextest-docs> 2: core::result::unwrap_failed
54.99 s
gammaloop-nextest-docs> 3: alphal00p_docs_builder::tests::write_test_portal
54.99 s
gammaloop-nextest-docs> 4: alphal00p_docs_builder::tests::portal_emits_routes_and_valid_assets
54.99 s
gammaloop-nextest-docs> 5: <alphal00p_docs_builder::tests::portal_emits_routes_and_valid_assets::{closure#0} as core::ops::function::FnOnce<()>>::call_once
54.99 s
gammaloop-nextest-docs> note: Some details are omitted, run with `RUST_BACKTRACE=full` for a verbose backtrace.
54.99 s
gammaloop-nextest-docs>
54.99 s
gammaloop-nextest-docs> 5. alphal00p-docs-builder::tests::portal_task_chooser_routes_each_goal_to_the_registered_quickstart
54.99 s
gammaloop-nextest-docs> failure: test failure with exit code 101
54.99 s
gammaloop-nextest-docs> thread 'tests::portal_task_chooser_routes_each_goal_to_the_registered_quickstart' (427) panicked at crates/alphal00p-docs-builder/src/lib.rs:9684:14:
54.99 s
gammaloop-nextest-docs> called `Result::unwrap()` on an `Err` value: failed to copy documentation asset crates/spynso3/typst/STIXTwoMath-Regular.woff2
54.99 s
gammaloop-nextest-docs>
54.99 s
gammaloop-nextest-docs> Caused by:
54.99 s
gammaloop-nextest-docs> No such file or directory (os error 2)
54.99 s
gammaloop-nextest-docs>
54.99 s
gammaloop-nextest-docs> Location:
54.99 s
gammaloop-nextest-docs> crates/alphal00p-docs-builder/src/lib.rs:2276:18
54.99 s
gammaloop-nextest-docs> stack backtrace:
54.99 s
gammaloop-nextest-docs> 0: __rustc::rust_begin_unwind
54.99 s
gammaloop-nextest-docs> 1: core::panicking::panic_fmt
54.99 s
gammaloop-nextest-docs> 2: core::result::unwrap_failed
54.99 s
gammaloop-nextest-docs> 3: alphal00p_docs_builder::tests::write_test_portal
54.99 s
gammaloop-nextest-docs> 4: alphal00p_docs_builder::tests::portal_task_chooser_routes_each_goal_to_the_registered_quickstart
54.99 s
gammaloop-nextest-docs> 5: <alphal00p_docs_builder::tests::portal_task_chooser_routes_each_goal_to_the_registered_quickstart::{closure#0} as core::ops::function::FnOnce<()>>::call_once
54.99 s
gammaloop-nextest-docs> note: Some details are omitted, run with `RUST_BACKTRACE=full` for a verbose backtrace.
54.99 s
gammaloop-nextest-docs> system-out
54.99 s
gammaloop-nextest-docs> running 1 test
54.99 s
gammaloop-nextest-docs> test tests::portal_task_chooser_routes_each_goal_to_the_registered_quickstart ... FAILED
54.99 s
gammaloop-nextest-docs>
54.99 s
gammaloop-nextest-docs> failures:
54.99 s
gammaloop-nextest-docs>
54.99 s
gammaloop-nextest-docs> failures:
54.99 s
gammaloop-nextest-docs> tests::portal_task_chooser_routes_each_goal_to_the_registered_quickstart
54.99 s
gammaloop-nextest-docs>
54.99 s
gammaloop-nextest-docs> test result: FAILED. 0 passed; 1 failed; 0 ignored; 0 measured; 128 filtered out; finished in 0.01s
54.99 s
gammaloop-nextest-docs> system-err
54.99 s
gammaloop-nextest-docs> thread 'tests::portal_task_chooser_routes_each_goal_to_the_registered_quickstart' (427) panicked at crates/alphal00p-docs-builder/src/lib.rs:9684:14:
54.99 s
gammaloop-nextest-docs> called `Result::unwrap()` on an `Err` value: failed to copy documentation asset crates/spynso3/typst/STIXTwoMath-Regular.woff2
54.99 s
gammaloop-nextest-docs>
54.99 s
gammaloop-nextest-docs> Caused by:
54.99 s
gammaloop-nextest-docs> No such file or directory (os error 2)
54.99 s
gammaloop-nextest-docs>
54.99 s
gammaloop-nextest-docs> Location:
54.99 s
gammaloop-nextest-docs> crates/alphal00p-docs-builder/src/lib.rs:2276:18
54.99 s
gammaloop-nextest-docs> stack backtrace:
54.99 s
gammaloop-nextest-docs> 0: __rustc::rust_begin_unwind
54.99 s
gammaloop-nextest-docs> 1: core::panicking::panic_fmt
54.99 s
gammaloop-nextest-docs> 2: core::result::unwrap_failed
54.99 s
gammaloop-nextest-docs> 3: alphal00p_docs_builder::tests::write_test_portal
54.99 s
gammaloop-nextest-docs> 4: alphal00p_docs_builder::tests::portal_task_chooser_routes_each_goal_to_the_registered_quickstart
54.99 s
gammaloop-nextest-docs> 5: <alphal00p_docs_builder::tests::portal_task_chooser_routes_each_goal_to_the_registered_quickstart::{closure#0} as core::ops::function::FnOnce<()>>::call_once
54.99 s
gammaloop-nextest-docs> note: Some details are omitted, run with `RUST_BACKTRACE=full` for a verbose backtrace.
54.99 s
gammaloop-nextest-docs>
54.99 s
gammaloop-nextest-docs> 6. alphal00p-docs-builder::tests::site_assets_replace_read_only_generated_files
54.99 s
gammaloop-nextest-docs> failure: test failure with exit code 101
54.99 s
gammaloop-nextest-docs> thread 'tests::site_assets_replace_read_only_generated_files' (648) panicked at crates/alphal00p-docs-builder/src/lib.rs:12305:50:
54.99 s
gammaloop-nextest-docs> called `Result::unwrap()` on an `Err` value: failed to copy documentation asset crates/spynso3/typst/STIXTwoMath-Regular.woff2
54.99 s
gammaloop-nextest-docs>
54.99 s
gammaloop-nextest-docs> Caused by:
54.99 s
gammaloop-nextest-docs> No such file or directory (os error 2)
54.99 s
gammaloop-nextest-docs>
54.99 s
gammaloop-nextest-docs> Location:
54.99 s
gammaloop-nextest-docs> crates/alphal00p-docs-builder/src/lib.rs:2276:18
54.99 s
gammaloop-nextest-docs> stack backtrace:
54.99 s
gammaloop-nextest-docs> 0: __rustc::rust_begin_unwind
54.99 s
gammaloop-nextest-docs> 1: core::panicking::panic_fmt
54.99 s
gammaloop-nextest-docs> 2: core::result::unwrap_failed
54.99 s
gammaloop-nextest-docs> 3: alphal00p_docs_builder::tests::site_assets_replace_read_only_generated_files
54.99 s
gammaloop-nextest-docs> 4: <alphal00p_docs_builder::tests::site_assets_replace_read_only_generated_files::{closure#0} as core::ops::function::FnOnce<()>>::call_once
54.99 s
gammaloop-nextest-docs> note: Some details are omitted, run with `RUST_BACKTRACE=full` for a verbose backtrace.
54.99 s
gammaloop-nextest-docs> system-out
54.99 s
gammaloop-nextest-docs> running 1 test
54.99 s
gammaloop-nextest-docs> test tests::site_assets_replace_read_only_generated_files ... FAILED
54.99 s
gammaloop-nextest-docs>
54.99 s
gammaloop-nextest-docs> failures:
54.99 s
gammaloop-nextest-docs>
54.99 s
gammaloop-nextest-docs> failures:
54.99 s
gammaloop-nextest-docs> tests::site_assets_replace_read_only_generated_files
54.99 s
gammaloop-nextest-docs>
54.99 s
gammaloop-nextest-docs> test result: FAILED. 0 passed; 1 failed; 0 ignored; 0 measured; 128 filtered out; finished in 0.00s
54.99 s
gammaloop-nextest-docs> system-err
54.99 s
gammaloop-nextest-docs> thread 'tests::site_assets_replace_read_only_generated_files' (648) panicked at crates/alphal00p-docs-builder/src/lib.rs:12305:50:
54.99 s
gammaloop-nextest-docs> called `Result::unwrap()` on an `Err` value: failed to copy documentation asset crates/spynso3/typst/STIXTwoMath-Regular.woff2
54.99 s
gammaloop-nextest-docs>
54.99 s
gammaloop-nextest-docs> Caused by:
54.99 s
gammaloop-nextest-docs> No such file or directory (os error 2)
54.99 s
gammaloop-nextest-docs>
54.99 s
gammaloop-nextest-docs> Location:
54.99 s
gammaloop-nextest-docs> crates/alphal00p-docs-builder/src/lib.rs:2276:18
54.99 s
gammaloop-nextest-docs> stack backtrace:
54.99 s
gammaloop-nextest-docs> 0: __rustc::rust_begin_unwind
54.99 s
gammaloop-nextest-docs> 1: core::panicking::panic_fmt
54.99 s
gammaloop-nextest-docs> 2: core::result::unwrap_failed
54.99 s
gammaloop-nextest-docs> 3: alphal00p_docs_builder::tests::site_assets_replace_read_only_generated_files
54.99 s
gammaloop-nextest-docs> 4: <alphal00p_docs_builder::tests::site_assets_replace_read_only_generated_files::{closure#0} as core::ops::function::FnOnce<()>>::call_once
54.99 s
gammaloop-nextest-docs> note: Some details are omitted, run with `RUST_BACKTRACE=full` for a verbose backtrace.
54.99 s
gammaloop-nextest-docs>
54.99 s
gammaloop-nextest-docs> 7. alphal00p-docs-builder::tests::checked_in_registry_is_valid
54.99 s
gammaloop-nextest-docs> failure: test failure with exit code 101
54.99 s
gammaloop-nextest-docs> thread 'tests::checked_in_registry_is_valid' (241) panicked at crates/alphal00p-docs-builder/src/lib.rs:12260:50:
54.99 s
gammaloop-nextest-docs> called `Result::unwrap()` on an `Err` value: required documentation source is missing: /build/source/crates/spynso3/typst/STIXTwoMath-Regular.woff2
54.99 s
gammaloop-nextest-docs>
54.99 s
gammaloop-nextest-docs> Location:
54.99 s
gammaloop-nextest-docs> crates/alphal00p-docs-builder/src/lib.rs:5103:9
54.99 s
gammaloop-nextest-docs> stack backtrace:
54.99 s
gammaloop-nextest-docs> 0: __rustc::rust_begin_unwind
54.99 s
gammaloop-nextest-docs> 1: core::panicking::panic_fmt
54.99 s
gammaloop-nextest-docs> 2: core::result::unwrap_failed
54.99 s
gammaloop-nextest-docs> 3: alphal00p_docs_builder::tests::checked_in_registry_is_valid
54.99 s
gammaloop-nextest-docs> 4: <alphal00p_docs_builder::tests::checked_in_registry_is_valid::{closure#0} as core::ops::function::FnOnce<()>>::call_once
54.99 s
gammaloop-nextest-docs> note: Some details are omitted, run with `RUST_BACKTRACE=full` for a verbose backtrace.
54.99 s
gammaloop-nextest-docs> system-out
54.99 s
gammaloop-nextest-docs> running 1 test
54.99 s
gammaloop-nextest-docs> test tests::checked_in_registry_is_valid ... FAILED
54.99 s
gammaloop-nextest-docs>
54.99 s
gammaloop-nextest-docs> failures:
54.99 s
gammaloop-nextest-docs>
54.99 s
gammaloop-nextest-docs> failures:
54.99 s
gammaloop-nextest-docs> tests::checked_in_registry_is_valid
54.99 s
gammaloop-nextest-docs>
54.99 s
gammaloop-nextest-docs> test result: FAILED. 0 passed; 1 failed; 0 ignored; 0 measured; 128 filtered out; finished in 0.11s
54.99 s
gammaloop-nextest-docs> system-err
54.99 s
gammaloop-nextest-docs> thread 'tests::checked_in_registry_is_valid' (241) panicked at crates/alphal00p-docs-builder/src/lib.rs:12260:50:
54.99 s
gammaloop-nextest-docs> called `Result::unwrap()` on an `Err` value: required documentation source is missing: /build/source/crates/spynso3/typst/STIXTwoMath-Regular.woff2
54.99 s
gammaloop-nextest-docs>
54.99 s
gammaloop-nextest-docs> Location:
54.99 s
gammaloop-nextest-docs> crates/alphal00p-docs-builder/src/lib.rs:5103:9
54.99 s
gammaloop-nextest-docs> stack backtrace:
54.99 s
gammaloop-nextest-docs> 0: __rustc::rust_begin_unwind
54.99 s
gammaloop-nextest-docs> 1: core::panicking::panic_fmt
54.99 s
gammaloop-nextest-docs> 2: core::result::unwrap_failed
54.99 s
gammaloop-nextest-docs> 3: alphal00p_docs_builder::tests::checked_in_registry_is_valid
54.99 s
gammaloop-nextest-docs> 4: <alphal00p_docs_builder::tests::checked_in_registry_is_valid::{closure#0} as core::ops::function::FnOnce<()>>::call_once
54.99 s
gammaloop-nextest-docs> note: Some details are omitted, run with `RUST_BACKTRACE=full` for a verbose backtrace.
54.99 s
gammaloop-nextest-docs>
54.99 s
gammaloop-nextest-docs> 8. alphal00p-docs-builder::provenance_tests::each_build_captures_one_revision_before_rendering
54.99 s
gammaloop-nextest-docs> failure: test failure with exit code 101
54.99 s
gammaloop-nextest-docs> thread 'provenance_tests::each_build_captures_one_revision_before_rendering' (226) panicked at crates/alphal00p-docs-builder/src/provenance_tests.rs:274:9:
54.99 s
gammaloop-nextest-docs> assertion failed: command.status().unwrap().success()
54.99 s
gammaloop-nextest-docs> stack backtrace:
54.99 s
gammaloop-nextest-docs> 0: __rustc::rust_begin_unwind
54.99 s
gammaloop-nextest-docs> 1: core::panicking::panic_fmt
54.99 s
gammaloop-nextest-docs> 2: core::panicking::panic
54.99 s
gammaloop-nextest-docs> 3: alphal00p_docs_builder::provenance_tests::each_build_captures_one_revision_before_rendering
54.99 s
gammaloop-nextest-docs> 4: <alphal00p_docs_builder::provenance_tests::each_build_captures_one_revision_before_rendering::{closure#0} as core::ops::function::FnOnce<()>>::call_once
54.99 s
gammaloop-nextest-docs> note: Some details are omitted, run with `RUST_BACKTRACE=full` for a verbose backtrace.
54.99 s
gammaloop-nextest-docs> system-out
54.99 s
gammaloop-nextest-docs> running 1 test
54.99 s
gammaloop-nextest-docs>
54.99 s
gammaloop-nextest-docs> running 1 test
54.99 s
gammaloop-nextest-docs> test provenance_tests::each_build_captures_one_revision_before_rendering ... FAILED
54.99 s
gammaloop-nextest-docs>
54.99 s
gammaloop-nextest-docs> failures:
54.99 s
gammaloop-nextest-docs>
54.99 s
gammaloop-nextest-docs> failures:
54.99 s
gammaloop-nextest-docs> provenance_tests::each_build_captures_one_revision_before_rendering
54.99 s
gammaloop-nextest-docs>
54.99 s
gammaloop-nextest-docs> test result: FAILED. 0 passed; 1 failed; 0 ignored; 0 measured; 128 filtered out; finished in 0.11s
54.99 s
gammaloop-nextest-docs>
54.99 s
gammaloop-nextest-docs> test provenance_tests::each_build_captures_one_revision_before_rendering ... FAILED
54.99 s
gammaloop-nextest-docs>
54.99 s
gammaloop-nextest-docs> failures:
54.99 s
gammaloop-nextest-docs>
54.99 s
gammaloop-nextest-docs> failures:
54.99 s
gammaloop-nextest-docs> provenance_tests::each_build_captures_one_revision_before_rendering
54.99 s
gammaloop-nextest-docs>
54.99 s
gammaloop-nextest-docs> test result: FAILED. 0 passed; 1 failed; 0 ignored; 0 measured; 128 filtered out; finished in 0.12s
54.99 s
gammaloop-nextest-docs> system-err
54.99 s
gammaloop-nextest-docs> thread 'provenance_tests::each_build_captures_one_revision_before_rendering' (260) panicked at crates/alphal00p-docs-builder/src/provenance_tests.rs:297:14:
54.99 s
gammaloop-nextest-docs> called `Result::unwrap()` on an `Err` value: required documentation source is missing: /build/source/target/nix-ci-tmp/.tmp3od26f/checkout/crates/spynso3/typst/STIXTwoMath-Regular.woff2
54.99 s
gammaloop-nextest-docs>
54.99 s
gammaloop-nextest-docs> Location:
54.99 s
gammaloop-nextest-docs> crates/alphal00p-docs-builder/src/lib.rs:5103:9
54.99 s
gammaloop-nextest-docs> stack backtrace:
54.99 s
gammaloop-nextest-docs> 0: __rustc::rust_begin_unwind
54.99 s
gammaloop-nextest-docs> 1: core::panicking::panic_fmt
54.99 s
gammaloop-nextest-docs> 2: core::result::unwrap_failed
54.99 s
gammaloop-nextest-docs> 3: alphal00p_docs_builder::provenance_tests::each_build_captures_one_revision_before_rendering
54.99 s
gammaloop-nextest-docs> 4: <alphal00p_docs_builder::provenance_tests::each_build_captures_one_revision_before_rendering::{closure#0} as core::ops::function::FnOnce<()>>::call_once
54.99 s
gammaloop-nextest-docs> note: Some details are omitted, run with `RUST_BACKTRACE=full` for a verbose backtrace.
54.99 s
gammaloop-nextest-docs>
54.99 s
gammaloop-nextest-docs> thread 'provenance_tests::each_build_captures_one_revision_before_rendering' (226) panicked at crates/alphal00p-docs-builder/src/provenance_tests.rs:274:9:
54.99 s
gammaloop-nextest-docs> assertion failed: command.status().unwrap().success()
54.99 s
gammaloop-nextest-docs> stack backtrace:
54.99 s
gammaloop-nextest-docs> 0: __rustc::rust_begin_unwind
54.99 s
gammaloop-nextest-docs> 1: core::panicking::panic_fmt
54.99 s
gammaloop-nextest-docs> 2: core::panicking::panic
54.99 s
gammaloop-nextest-docs> 3: alphal00p_docs_builder::provenance_tests::each_build_captures_one_revision_before_rendering
54.99 s
gammaloop-nextest-docs> 4: <alphal00p_docs_builder::provenance_tests::each_build_captures_one_revision_before_rendering::{closure#0} as core::ops::function::FnOnce<()>>::call_once
54.99 s
gammaloop-nextest-docs> note: Some details are omitted, run with `RUST_BACKTRACE=full` for a verbose backtrace.
54.99 s
gammaloop-nextest-docs>
54.99 s
gammaloop-nextest-docs> 9. alphal00p-docs-builder::tests::developer_scope_ranges_ignore_unrelated_edits_and_warn_only_while_watching
54.99 s
gammaloop-nextest-docs> failure: test failure with exit code 101
54.99 s
gammaloop-nextest-docs> thread 'tests::developer_scope_ranges_ignore_unrelated_edits_and_warn_only_while_watching' (284) panicked at crates/alphal00p-docs-builder/src/lib.rs:12350:29:
54.99 s
gammaloop-nextest-docs> called `Result::unwrap()` on an `Err` value: required documentation source is missing: /build/source/crates/spynso3/typst/STIXTwoMath-Regular.woff2
54.99 s
gammaloop-nextest-docs>
54.99 s
gammaloop-nextest-docs> Location:
54.99 s
gammaloop-nextest-docs> crates/alphal00p-docs-builder/src/lib.rs:5103:9
54.99 s
gammaloop-nextest-docs> stack backtrace:
54.99 s
gammaloop-nextest-docs> 0: __rustc::rust_begin_unwind
54.99 s
gammaloop-nextest-docs> 1: core::panicking::panic_fmt
54.99 s
gammaloop-nextest-docs> 2: core::result::unwrap_failed
54.99 s
gammaloop-nextest-docs> 3: alphal00p_docs_builder::tests::developer_scope_ranges_ignore_unrelated_edits_and_warn_only_while_watching
54.99 s
gammaloop-nextest-docs> 4: <alphal00p_docs_builder::tests::developer_scope_ranges_ignore_unrelated_edits_and_warn_only_while_watching::{closure#0} as core::ops::function::FnOnce<()>>::call_once
54.99 s
gammaloop-nextest-docs> note: Some details are omitted, run with `RUST_BACKTRACE=full` for a verbose backtrace.
54.99 s
gammaloop-nextest-docs> system-out
54.99 s
gammaloop-nextest-docs> running 1 test
54.99 s
gammaloop-nextest-docs> test tests::developer_scope_ranges_ignore_unrelated_edits_and_warn_only_while_watching ... FAILED
54.99 s
gammaloop-nextest-docs>
54.99 s
gammaloop-nextest-docs> failures:
54.99 s
gammaloop-nextest-docs>
54.99 s
gammaloop-nextest-docs> failures:
54.99 s
gammaloop-nextest-docs> tests::developer_scope_ranges_ignore_unrelated_edits_and_warn_only_while_watching
54.99 s
gammaloop-nextest-docs>
54.99 s
gammaloop-nextest-docs> test result: FAILED. 0 passed; 1 failed; 0 ignored; 0 measured; 128 filtered out; finished in 0.11s
54.99 s
gammaloop-nextest-docs> system-err
54.99 s
gammaloop-nextest-docs> thread 'tests::developer_scope_ranges_ignore_unrelated_edits_and_warn_only_while_watching' (284) panicked at crates/alphal00p-docs-builder/src/lib.rs:12350:29:
54.99 s
gammaloop-nextest-docs> called `Result::unwrap()` on an `Err` value: required documentation source is missing: /build/source/crates/spynso3/typst/STIXTwoMath-Regular.woff2
54.99 s
gammaloop-nextest-docs>
54.99 s
gammaloop-nextest-docs> Location:
54.99 s
gammaloop-nextest-docs> crates/alphal00p-docs-builder/src/lib.rs:5103:9
54.99 s
gammaloop-nextest-docs> stack backtrace:
54.99 s
gammaloop-nextest-docs> 0: __rustc::rust_begin_unwind
54.99 s
gammaloop-nextest-docs> 1: core::panicking::panic_fmt
54.99 s
gammaloop-nextest-docs> 2: core::result::unwrap_failed
54.99 s
gammaloop-nextest-docs> 3: alphal00p_docs_builder::tests::developer_scope_ranges_ignore_unrelated_edits_and_warn_only_while_watching
54.99 s
gammaloop-nextest-docs> 4: <alphal00p_docs_builder::tests::developer_scope_ranges_ignore_unrelated_edits_and_warn_only_while_watching::{closure#0} as core::ops::function::FnOnce<()>>::call_once
54.99 s
gammaloop-nextest-docs> note: Some details are omitted, run with `RUST_BACKTRACE=full` for a verbose backtrace.
54.99 s
gammaloop-nextest-docs>
54.99 s
gammaloop-nextest-docs> 10. alphal00p-docs-builder::tests::every_product_requires_a_task_chooser_and_each_supported_interface
54.99 s
gammaloop-nextest-docs> failure: test failure with exit code 101
54.99 s
gammaloop-nextest-docs> thread 'tests::every_product_requires_a_task_chooser_and_each_supported_interface' (309) panicked at crates/alphal00p-docs-builder/src/lib.rs:12274:9:
54.99 s
gammaloop-nextest-docs> assertion failed: format!("{error:#}").contains("has no quickstart page")
54.99 s
gammaloop-nextest-docs> stack backtrace:
54.99 s
gammaloop-nextest-docs> 0: __rustc::rust_begin_unwind
54.99 s
gammaloop-nextest-docs> 1: core::panicking::panic_fmt
54.99 s
gammaloop-nextest-docs> 2: core::panicking::panic
54.99 s
gammaloop-nextest-docs> 3: alphal00p_docs_builder::tests::every_product_requires_a_task_chooser_and_each_supported_interface
54.99 s
gammaloop-nextest-docs> 4: <alphal00p_docs_builder::tests::every_product_requires_a_task_chooser_and_each_supported_interface::{closure#0} as core::ops::function::FnOnce<()>>::call_once
54.99 s
gammaloop-nextest-docs> note: Some details are omitted, run with `RUST_BACKTRACE=full` for a verbose backtrace.
54.99 s
gammaloop-nextest-docs> system-out
54.99 s
gammaloop-nextest-docs> running 1 test
54.99 s
gammaloop-nextest-docs> test tests::every_product_requires_a_task_chooser_and_each_supported_interface ... FAILED
54.99 s
gammaloop-nextest-docs>
54.99 s
gammaloop-nextest-docs> failures:
54.99 s
gammaloop-nextest-docs>
54.99 s
gammaloop-nextest-docs> failures:
54.99 s
gammaloop-nextest-docs> tests::every_product_requires_a_task_chooser_and_each_supported_interface
54.99 s
gammaloop-nextest-docs>
54.99 s
gammaloop-nextest-docs> test result: FAILED. 0 passed; 1 failed; 0 ignored; 0 measured; 128 filtered out; finished in 0.12s
54.99 s
gammaloop-nextest-docs> system-err
54.99 s
gammaloop-nextest-docs> thread 'tests::every_product_requires_a_task_chooser_and_each_supported_interface' (309) panicked at crates/alphal00p-docs-builder/src/lib.rs:12274:9:
54.99 s
gammaloop-nextest-docs> assertion failed: format!("{error:#}").contains("has no quickstart page")
54.99 s
gammaloop-nextest-docs> stack backtrace:
54.99 s
gammaloop-nextest-docs> 0: __rustc::rust_begin_unwind
54.99 s
gammaloop-nextest-docs> 1: core::panicking::panic_fmt
54.99 s
gammaloop-nextest-docs> 2: core::panicking::panic
54.99 s
gammaloop-nextest-docs> 3: alphal00p_docs_builder::tests::every_product_requires_a_task_chooser_and_each_supported_interface
54.99 s
gammaloop-nextest-docs> 4: <alphal00p_docs_builder::tests::every_product_requires_a_task_chooser_and_each_supported_interface::{closure#0} as core::ops::function::FnOnce<()>>::call_once
54.99 s
gammaloop-nextest-docs> note: Some details are omitted, run with `RUST_BACKTRACE=full` for a verbose backtrace.
54.99 s
gammaloop-nextest-docs>
54.99 s
gammaloop-nextest-docs> 11. alphal00p-docs-builder::tests::pdf_manual_chapter_order_must_match_the_page_registry
54.99 s
gammaloop-nextest-docs> failure: test failure with exit code 101
54.99 s
gammaloop-nextest-docs> thread 'tests::pdf_manual_chapter_order_must_match_the_page_registry' (402) panicked at crates/alphal00p-docs-builder/src/lib.rs:12330:9:
54.99 s
gammaloop-nextest-docs> assertion failed: format!("{error:#}").contains("PDF manual chapter order differs")
54.99 s
gammaloop-nextest-docs> stack backtrace:
54.99 s
gammaloop-nextest-docs> 0: __rustc::rust_begin_unwind
54.99 s
gammaloop-nextest-docs> 1: core::panicking::panic_fmt
54.99 s
gammaloop-nextest-docs> 2: core::panicking::panic
54.99 s
gammaloop-nextest-docs> 3: alphal00p_docs_builder::tests::pdf_manual_chapter_order_must_match_the_page_registry
54.99 s
gammaloop-nextest-docs> 4: <alphal00p_docs_builder::tests::pdf_manual_chapter_order_must_match_the_page_registry::{closure#0} as core::ops::function::FnOnce<()>>::call_once
54.99 s
gammaloop-nextest-docs> note: Some details are omitted, run with `RUST_BACKTRACE=full` for a verbose backtrace.
54.99 s
gammaloop-nextest-docs> system-out
54.99 s
gammaloop-nextest-docs> running 1 test
54.99 s
gammaloop-nextest-docs> test tests::pdf_manual_chapter_order_must_match_the_page_registry ... FAILED
54.99 s
gammaloop-nextest-docs>
54.99 s
gammaloop-nextest-docs> failures:
54.99 s
gammaloop-nextest-docs>
54.99 s
gammaloop-nextest-docs> failures:
54.99 s
gammaloop-nextest-docs> tests::pdf_manual_chapter_order_must_match_the_page_registry
54.99 s
gammaloop-nextest-docs>
54.99 s
gammaloop-nextest-docs> test result: FAILED. 0 passed; 1 failed; 0 ignored; 0 measured; 128 filtered out; finished in 0.11s
54.99 s
gammaloop-nextest-docs> system-err
54.99 s
gammaloop-nextest-docs> thread 'tests::pdf_manual_chapter_order_must_match_the_page_registry' (402) panicked at crates/alphal00p-docs-builder/src/lib.rs:12330:9:
54.99 s
gammaloop-nextest-docs> assertion failed: format!("{error:#}").contains("PDF manual chapter order differs")
54.99 s
gammaloop-nextest-docs> stack backtrace:
54.99 s
gammaloop-nextest-docs> 0: __rustc::rust_begin_unwind
54.99 s
gammaloop-nextest-docs> 1: core::panicking::panic_fmt
54.99 s
gammaloop-nextest-docs> 2: core::panicking::panic
54.99 s
gammaloop-nextest-docs> 3: alphal00p_docs_builder::tests::pdf_manual_chapter_order_must_match_the_page_registry
54.99 s
gammaloop-nextest-docs> 4: <alphal00p_docs_builder::tests::pdf_manual_chapter_order_must_match_the_page_registry::{closure#0} as core::ops::function::FnOnce<()>>::call_once
54.99 s
gammaloop-nextest-docs> note: Some details are omitted, run with `RUST_BACKTRACE=full` for a verbose backtrace.
54.99 s
gammaloop-nextest-docs> =========================================
55.00 s
gammaloop-nextest-docs> Extracting 2 binaries to /build/source
55.03 s
gammaloop-nextest-docs> Extracted 5 files to /build/source in 0.03s
55.04 s
gammaloop-nextest-docs> ------------
55.04 s
gammaloop-nextest-docs> Nextest run ID ab300ae5-3f22-4230-b31a-4f7de1fb8f7c with nextest profile: ci_gammaloop
55.04 s
gammaloop-nextest-docs> Starting 22 tests across 2 binaries
55.06 s
gammaloop-nextest-docs> ------------
55.06 s
gammaloop-nextest-docs> Summary [ 0.018s] 22 tests run: 22 passed , 0 skipped
55.09 s
gammaloop-nextest-docs>
55.09 s
gammaloop-nextest-docs> ========== nextest test summary ==========
55.09 s
gammaloop-nextest-docs> report: target/nextest/ci_gammaloop/junit.xml
55.09 s
gammaloop-nextest-docs> tests: 22, failures: 0, errors: 0
55.09 s
gammaloop-nextest-docs> No failing testcases found.
55.09 s
gammaloop-nextest-docs> =========================================
55.10 s
gammaloop-nextest-docs> Extracting 3 binaries (including 2 non-test binaries), 1 build script output directory, and 2 linked paths to /build/source
55.37 s
gammaloop-nextest-docs> Extracted 22 files to /build/source in 0.27s
55.38 s
gammaloop-nextest-docs> ------------
55.38 s
gammaloop-nextest-docs> Nextest run ID df153d31-f0fb-4864-ab82-c414d8ea411a with nextest profile: ci_gammaloop
55.38 s
gammaloop-nextest-docs> Starting 89 tests across 1 binary
55.42 s
gammaloop-nextest-docs> ------------
55.42 s
gammaloop-nextest-docs> Summary [ 0.037s] 89 tests run: 89 passed , 0 skipped
55.44 s
gammaloop-nextest-docs>
55.44 s
gammaloop-nextest-docs> ========== nextest test summary ==========
55.44 s
gammaloop-nextest-docs> report: target/nextest/ci_gammaloop/junit.xml
55.44 s
gammaloop-nextest-docs> tests: 89, failures: 0, errors: 0
55.44 s
gammaloop-nextest-docs> No failing testcases found.
55.44 s
gammaloop-nextest-docs> =========================================
55.45 s
gammaloop-nextest-docs> Extracting 2 binaries to /build/source
55.49 s
gammaloop-nextest-docs> Extracted 5 files to /build/source in 0.04s
55.50 s
gammaloop-nextest-docs> ------------
55.50 s
gammaloop-nextest-docs> Nextest run ID aafb35f4-0aa3-479d-a18a-042b5fce0863 with nextest profile: ci_gammaloop
55.50 s
gammaloop-nextest-docs> Starting 10 tests across 2 binaries
67.58 s
gammaloop-nextest-docs> ------------
67.58 s
gammaloop-nextest-docs> Summary [ 12.075s] 10 tests run: 10 passed , 0 skipped
67.60 s
gammaloop-nextest-docs>
67.60 s
gammaloop-nextest-docs> ========== nextest test summary ==========
67.60 s
gammaloop-nextest-docs> report: target/nextest/ci_gammaloop/junit.xml
67.60 s
gammaloop-nextest-docs> tests: 10, failures: 0, errors: 0
67.60 s
gammaloop-nextest-docs> No failing testcases found.
67.60 s
gammaloop-nextest-docs> =========================================
67.61 s
gammaloop-nextest-docs> Extracting 1 binary to /build/source
67.65 s
gammaloop-nextest-docs> Extracted 4 files to /build/source in 0.03s
67.65 s
gammaloop-nextest-docs> ------------
67.65 s
gammaloop-nextest-docs> Nextest run ID b18503e4-e052-423a-ad8b-5d5cb1010cae with nextest profile: ci_gammaloop
67.65 s
gammaloop-nextest-docs> Starting 0 tests across 1 binary
67.65 s
gammaloop-nextest-docs> ------------
67.65 s
gammaloop-nextest-docs> Summary [ 0.000s] 0 tests run: 0 passed , 0 skipped
67.68 s
gammaloop-nextest-docs>
67.68 s
gammaloop-nextest-docs> ========== nextest test summary ==========
67.68 s
gammaloop-nextest-docs> report: target/nextest/ci_gammaloop/junit.xml
67.68 s
gammaloop-nextest-docs> tests: 0, failures: 0, errors: 0
67.68 s
gammaloop-nextest-docs> No failing testcases found.
67.68 s
gammaloop-nextest-docs> =========================================
67.69 s
gammaloop-nextest-docs> Extracting 1 binary to /build/source
67.72 s
gammaloop-nextest-docs> Extracted 4 files to /build/source in 0.03s
67.73 s
gammaloop-nextest-docs> ------------
67.73 s
gammaloop-nextest-docs> Nextest run ID 32218442-73be-48a1-95ce-22bbd599d23b with nextest profile: ci_gammaloop
67.73 s
gammaloop-nextest-docs> Starting 5 tests across 1 binary
67.74 s
gammaloop-nextest-docs> ------------
67.74 s
gammaloop-nextest-docs> Summary [ 0.005s] 5 tests run: 5 passed , 0 skipped
67.77 s
gammaloop-nextest-docs>
67.77 s
gammaloop-nextest-docs> ========== nextest test summary ==========
67.77 s
gammaloop-nextest-docs> report: target/nextest/ci_gammaloop/junit.xml
67.77 s
gammaloop-nextest-docs> tests: 5, failures: 0, errors: 0
67.77 s
gammaloop-nextest-docs> No failing testcases found.
67.77 s
gammaloop-nextest-docs> =========================================
67.96 s
error: Cannot build '/nix/store/yhcpczfzd32fj8slcs1lsa10nlfs6yzl-gammaloop-nextest-docs.drv '.
67.96 s
Reason: builder failed with exit code 100 .
67.96 s
Output paths:
67.96 s
/nix/store/j1nkfs263f0lyg41i99f3f56r6b8p9mh-gammaloop-nextest-docs
67.96 s
Last 1232 log lines:
67.96 s
> Extracting 2 binaries to /build/source
67.96 s
> Extracted 5 files to /build/source in 0.04s
67.96 s
> ------------
67.96 s
> Nextest run ID 084cddad-40b2-4805-90a7-48ad0373b0fe with nextest profile: ci_gammaloop
67.96 s
> Starting 129 tests across 2 binaries
67.96 s
> FAIL [ 0.009s] ( 23/129) alphal00p-docs-builder tests :: developer_architecture_is_classified_searchable_and_source_backed
67.96 s
> stdout ---
67.96 s
>
67.96 s
> running 1 test
67.96 s
> test tests::developer_architecture_is_classified_searchable_and_source_backed ... FAILED
67.96 s
>
67.96 s
> failures:
67.96 s
>
67.96 s
> failures:
67.96 s
> tests::developer_architecture_is_classified_searchable_and_source_backed
67.96 s
>
67.96 s
> test result: FAILED. 0 passed; 1 failed; 0 ignored; 0 measured; 128 filtered out; finished in 0.01s
67.96 s
>
67.96 s
> stderr ---
67.96 s
>
67.96 s
> thread 'tests::developer_architecture_is_classified_searchable_and_source_backed' (276) panicked at crates/alphal00p-docs-builder/src/lib.rs:12751:14:
67.96 s
> called `Result::unwrap()` on an `Err` value: failed to copy documentation asset crates/spynso3/typst/STIXTwoMath-Regular.woff2
67.96 s
>
67.96 s
> Caused by:
67.96 s
> No such file or directory (os error 2)
67.96 s
>
67.96 s
> Location:
67.96 s
> crates/alphal00p-docs-builder/src/lib.rs:2276:18
67.96 s
> stack backtrace:
67.96 s
> 0: __rustc::rust_begin_unwind
67.96 s
> 1: core::panicking::panic_fmt
67.96 s
> 2: core::result::unwrap_failed
67.96 s
> 3: alphal00p_docs_builder::tests::developer_architecture_is_classified_searchable_and_source_backed
67.96 s
> 4: <alphal00p_docs_builder::tests::developer_architecture_is_classified_searchable_and_source_backed::{closure#0} as core::ops::function::FnOnce<()>>::call_once
67.96 s
> note: Some details are omitted, run with `RUST_BACKTRACE=full` for a verbose backtrace.
67.96 s
>
67.96 s
> FAIL [ 0.011s] ( 30/129) alphal00p-docs-builder tests :: every_product_orients_rust_to_native_rustdoc_and_keeps_legacy_redirects
67.96 s
> stdout ---
67.96 s
>
67.96 s
> running 1 test
67.96 s
> test tests::every_product_orients_rust_to_native_rustdoc_and_keeps_legacy_redirects ... FAILED
67.96 s
>
67.96 s
> failures:
67.96 s
>
67.96 s
> failures:
67.96 s
> tests::every_product_orients_rust_to_native_rustdoc_and_keeps_legacy_redirects
67.96 s
>
67.96 s
> test result: FAILED. 0 passed; 1 failed; 0 ignored; 0 measured; 128 filtered out; finished in 0.01s
67.96 s
>
67.96 s
> stderr ---
67.96 s
>
67.96 s
> thread 'tests::every_product_orients_rust_to_native_rustdoc_and_keeps_legacy_redirects' (302) panicked at crates/alphal00p-docs-builder/src/lib.rs:12555:46:
67.96 s
> called `Result::unwrap()` on an `Err` value: failed to copy documentation asset crates/spynso3/typst/STIXTwoMath-Regular.woff2
67.96 s
>
67.96 s
> Caused by:
67.96 s
> No such file or directory (os error 2)
67.96 s
>
67.96 s
> Location:
67.96 s
> crates/alphal00p-docs-builder/src/lib.rs:2276:18
67.96 s
> stack backtrace:
67.96 s
> 0: __rustc::rust_begin_unwind
67.96 s
> 1: core::panicking::panic_fmt
67.96 s
> 2: core::result::unwrap_failed
67.96 s
> 3: alphal00p_docs_builder::tests::every_product_orients_rust_to_native_rustdoc_and_keeps_legacy_redirects
67.96 s
> 4: <alphal00p_docs_builder::tests::every_product_orients_rust_to_native_rustdoc_and_keeps_legacy_redirects::{closure#0} as core::ops::function::FnOnce<()>>::call_once
67.96 s
> note: Some details are omitted, run with `RUST_BACKTRACE=full` for a verbose backtrace.
67.96 s
>
67.96 s
> FAIL [ 0.009s] ( 54/129) alphal00p-docs-builder tests :: portal_and_developer_pages_use_federated_search_and_feedback
67.96 s
> stdout ---
67.96 s
>
67.96 s
> running 1 test
67.96 s
> test tests::portal_and_developer_pages_use_federated_search_and_feedback ... FAILED
67.96 s
>
67.96 s
> failures:
67.96 s
>
67.96 s
> failures:
67.96 s
> tests::portal_and_developer_pages_use_federated_search_and_feedback
67.96 s
>
67.96 s
> test result: FAILED. 0 passed; 1 failed; 0 ignored; 0 measured; 128 filtered out; finished in 0.01s
67.96 s
>
67.96 s
> stderr ---
67.96 s
>
67.96 s
> thread 'tests::portal_and_developer_pages_use_federated_search_and_feedback' (416) panicked at crates/alphal00p-docs-builder/src/lib.rs:9684:14:
67.96 s
> called `Result::unwrap()` on an `Err` value: failed to copy documentation asset crates/spynso3/typst/STIXTwoMath-Regular.woff2
67.96 s
>
67.96 s
> Caused by:
67.96 s
> No such file or directory (os error 2)
67.96 s
>
67.96 s
> Location:
67.96 s
> crates/alphal00p-docs-builder/src/lib.rs:2276:18
67.96 s
> stack backtrace:
67.96 s
> 0: __rustc::rust_begin_unwind
67.96 s
> 1: core::panicking::panic_fmt
67.96 s
> 2: core::result::unwrap_failed
67.96 s
> 3: alphal00p_docs_builder::tests::write_test_portal
67.96 s
> 4: alphal00p_docs_builder::tests::portal_and_developer_pages_use_federated_search_and_feedback
67.96 s
> 5: <alphal00p_docs_builder::tests::portal_and_developer_pages_use_federated_search_and_feedback::{closure#0} as core::ops::function::FnOnce<()>>::call_once
67.96 s
> note: Some details are omitted, run with `RUST_BACKTRACE=full` for a verbose backtrace.
67.96 s
>
67.96 s
> FAIL [ 0.008s] ( 55/129) alphal00p-docs-builder tests :: portal_emits_routes_and_valid_assets
67.96 s
> stdout ---
67.96 s
>
67.96 s
> running 1 test
67.96 s
> test tests::portal_emits_routes_and_valid_assets ... FAILED
67.96 s
>
67.96 s
> failures:
67.96 s
>
67.96 s
> failures:
67.96 s
> tests::portal_emits_routes_and_valid_assets
67.96 s
>
67.96 s
> test result: FAILED. 0 passed; 1 failed; 0 ignored; 0 measured; 128 filtered out; finished in 0.00s
67.96 s
>
67.96 s
> stderr ---
67.96 s
>
67.96 s
> thread 'tests::portal_emits_routes_and_valid_assets' (422) panicked at crates/alphal00p-docs-builder/src/lib.rs:9684:14:
67.96 s
> called `Result::unwrap()` on an `Err` value: failed to copy documentation asset crates/spynso3/typst/STIXTwoMath-Regular.woff2
67.96 s
>
67.96 s
> Caused by:
67.96 s
> No such file or directory (os error 2)
67.96 s
>
67.96 s
> Location:
67.96 s
> crates/alphal00p-docs-builder/src/lib.rs:2276:18
67.96 s
> stack backtrace:
67.96 s
> 0: __rustc::rust_begin_unwind
67.96 s
> 1: core::panicking::panic_fmt
67.96 s
> 2: core::result::unwrap_failed
67.96 s
> 3: alphal00p_docs_builder::tests::write_test_portal
67.96 s
> 4: alphal00p_docs_builder::tests::portal_emits_routes_and_valid_assets
67.96 s
> 5: <alphal00p_docs_builder::tests::portal_emits_routes_and_valid_assets::{closure#0} as core::ops::function::FnOnce<()>>::call_once
67.96 s
> note: Some details are omitted, run with `RUST_BACKTRACE=full` for a verbose backtrace.
67.96 s
>
67.96 s
> FAIL [ 0.010s] ( 56/129) alphal00p-docs-builder tests :: portal_task_chooser_routes_each_goal_to_the_registered_quickstart
67.96 s
> stdout ---
67.96 s
>
67.96 s
> running 1 test
67.96 s
> test tests::portal_task_chooser_routes_each_goal_to_the_registered_quickstart ... FAILED
67.96 s
>
67.96 s
> failures:
67.96 s
>
67.96 s
> failures:
67.96 s
> tests::portal_task_chooser_routes_each_goal_to_the_registered_quickstart
67.96 s
>
67.96 s
> test result: FAILED. 0 passed; 1 failed; 0 ignored; 0 measured; 128 filtered out; finished in 0.01s
67.96 s
>
67.96 s
> stderr ---
67.96 s
>
67.96 s
> thread 'tests::portal_task_chooser_routes_each_goal_to_the_registered_quickstart' (427) panicked at crates/alphal00p-docs-builder/src/lib.rs:9684:14:
67.96 s
> called `Result::unwrap()` on an `Err` value: failed to copy documentation asset crates/spynso3/typst/STIXTwoMath-Regular.woff2
67.96 s
>
67.96 s
> Caused by:
67.96 s
> No such file or directory (os error 2)
67.96 s
>
67.96 s
> Location:
67.96 s
> crates/alphal00p-docs-builder/src/lib.rs:2276:18
67.96 s
> stack backtrace:
67.96 s
> 0: __rustc::rust_begin_unwind
67.96 s
> 1: core::panicking::panic_fmt
67.96 s
> 2: core::result::unwrap_failed
67.96 s
> 3: alphal00p_docs_builder::tests::write_test_portal
67.96 s
> 4: alphal00p_docs_builder::tests::portal_task_chooser_routes_each_goal_to_the_registered_quickstart
67.96 s
> 5: <alphal00p_docs_builder::tests::portal_task_chooser_routes_each_goal_to_the_registered_quickstart::{closure#0} as core::ops::function::FnOnce<()>>::call_once
67.96 s
> note: Some details are omitted, run with `RUST_BACKTRACE=full` for a verbose backtrace.
67.96 s
>
67.96 s
> FAIL [ 0.009s] ( 86/129) alphal00p-docs-builder tests :: site_assets_replace_read_only_generated_files
67.96 s
> stdout ---
67.96 s
>
67.96 s
> running 1 test
67.96 s
> test tests::site_assets_replace_read_only_generated_files ... FAILED
67.96 s
>
67.96 s
> failures:
67.96 s
>
67.96 s
> failures:
67.96 s
> tests::site_assets_replace_read_only_generated_files
67.96 s
>
67.96 s
> test result: FAILED. 0 passed; 1 failed; 0 ignored; 0 measured; 128 filtered out; finished in 0.00s
67.96 s
>
67.96 s
> stderr ---
67.96 s
>
67.96 s
> thread 'tests::site_assets_replace_read_only_generated_files' (648) panicked at crates/alphal00p-docs-builder/src/lib.rs:12305:50:
67.96 s
> called `Result::unwrap()` on an `Err` value: failed to copy documentation asset crates/spynso3/typst/STIXTwoMath-Regular.woff2
67.96 s
>
67.96 s
> Caused by:
67.96 s
> No such file or directory (os error 2)
67.96 s
>
67.96 s
> Location:
67.96 s
> crates/alphal00p-docs-builder/src/lib.rs:2276:18
67.96 s
> stack backtrace:
67.96 s
> 0: __rustc::rust_begin_unwind
67.96 s
> 1: core::panicking::panic_fmt
67.96 s
> 2: core::result::unwrap_failed
67.96 s
> 3: alphal00p_docs_builder::tests::site_assets_replace_read_only_generated_files
67.96 s
> 4: <alphal00p_docs_builder::tests::site_assets_replace_read_only_generated_files::{closure#0} as core::ops::function::FnOnce<()>>::call_once
67.96 s
> note: Some details are omitted, run with `RUST_BACKTRACE=full` for a verbose backtrace.
67.96 s
>
67.96 s
> FAIL [ 0.122s] ( 91/129) alphal00p-docs-builder tests :: checked_in_registry_is_valid
67.96 s
> stdout ---
67.96 s
>
67.96 s
> running 1 test
67.96 s
> test tests::checked_in_registry_is_valid ... FAILED
67.96 s
>
67.96 s
> failures:
67.96 s
>
67.96 s
> failures:
67.96 s
> tests::checked_in_registry_is_valid
67.96 s
>
67.96 s
> test result: FAILED. 0 passed; 1 failed; 0 ignored; 0 measured; 128 filtered out; finished in 0.11s
67.96 s
>
67.96 s
> stderr ---
67.96 s
>
67.96 s
> thread 'tests::checked_in_registry_is_valid' (241) panicked at crates/alphal00p-docs-builder/src/lib.rs:12260:50:
67.96 s
> called `Result::unwrap()` on an `Err` value: required documentation source is missing: /build/source/crates/spynso3/typst/STIXTwoMath-Regular.woff2
67.96 s
>
67.96 s
> Location:
67.96 s
> crates/alphal00p-docs-builder/src/lib.rs:5103:9
67.96 s
> stack backtrace:
67.96 s
> 0: __rustc::rust_begin_unwind
67.96 s
> 1: core::panicking::panic_fmt
67.96 s
> 2: core::result::unwrap_failed
67.96 s
> 3: alphal00p_docs_builder::tests::checked_in_registry_is_valid
67.96 s
> 4: <alphal00p_docs_builder::tests::checked_in_registry_is_valid::{closure#0} as core::ops::function::FnOnce<()>>::call_once
67.96 s
> note: Some details are omitted, run with `RUST_BACKTRACE=full` for a verbose backtrace.
67.96 s
>
67.96 s
> FAIL [ 0.130s] ( 97/129) alphal00p-docs-builder provenance_tests :: each_build_captures_one_revision_before_rendering
67.96 s
> stdout ---
67.96 s
>
67.96 s
> running 1 test
67.96 s
>
67.96 s
> running 1 test
67.96 s
> test provenance_tests::each_build_captures_one_revision_before_rendering ... FAILED
67.96 s
>
67.96 s
> failures:
67.96 s
>
67.96 s
> failures:
67.96 s
> provenance_tests::each_build_captures_one_revision_before_rendering
67.96 s
>
67.96 s
> test result: FAILED. 0 passed; 1 failed; 0 ignored; 0 measured; 128 filtered out; finished in 0.11s
67.96 s
>
67.96 s
> test provenance_tests::each_build_captures_one_revision_before_rendering ... FAILED
67.96 s
>
67.96 s
> failures:
67.96 s
>
67.96 s
> failures:
67.96 s
> provenance_tests::each_build_captures_one_revision_before_rendering
67.96 s
>
67.96 s
> test result: FAILED. 0 passed; 1 failed; 0 ignored; 0 measured; 128 filtered out; finished in 0.12s
67.96 s
>
67.96 s
> stderr ---
67.96 s
>
67.96 s
> thread 'provenance_tests::each_build_captures_one_revision_before_rendering' (260) panicked at crates/alphal00p-docs-builder/src/provenance_tests.rs:297:14:
67.96 s
> called `Result::unwrap()` on an `Err` value: required documentation source is missing: /build/source/target/nix-ci-tmp/.tmp3od26f/checkout/crates/spynso3/typst/STIXTwoMath-Regular.woff2
67.96 s
>
67.96 s
> Location:
67.96 s
> crates/alphal00p-docs-builder/src/lib.rs:5103:9
67.96 s
> stack backtrace:
67.96 s
> 0: __rustc::rust_begin_unwind
67.96 s
> 1: core::panicking::panic_fmt
67.96 s
> 2: core::result::unwrap_failed
67.96 s
> 3: alphal00p_docs_builder::provenance_tests::each_build_captures_one_revision_before_rendering
67.96 s
> 4: <alphal00p_docs_builder::provenance_tests::each_build_captures_one_revision_before_rendering::{closure#0} as core::ops::function::FnOnce<()>>::call_once
67.96 s
> note: Some details are omitted, run with `RUST_BACKTRACE=full` for a verbose backtrace.
67.96 s
>
67.96 s
> thread 'provenance_tests::each_build_captures_one_revision_before_rendering' (226) panicked at crates/alphal00p-docs-builder/src/provenance_tests.rs:274:9:
67.96 s
> assertion failed: command.status().unwrap().success()
67.96 s
> stack backtrace:
67.96 s
> 0: __rustc::rust_begin_unwind
67.96 s
> 1: core::panicking::panic_fmt
67.96 s
> 2: core::panicking::panic
67.96 s
> 3: alphal00p_docs_builder::provenance_tests::each_build_captures_one_revision_before_rendering
67.96 s
> 4: <alphal00p_docs_builder::provenance_tests::each_build_captures_one_revision_before_rendering::{closure#0} as core::ops::function::FnOnce<()>>::call_once
67.96 s
> note: Some details are omitted, run with `RUST_BACKTRACE=full` for a verbose backtrace.
67.96 s
>
67.96 s
> FAIL [ 0.116s] (100/129) alphal00p-docs-builder tests :: developer_scope_ranges_ignore_unrelated_edits_and_warn_only_while_watching
67.96 s
> stdout ---
67.96 s
>
67.96 s
> running 1 test
67.96 s
> test tests::developer_scope_ranges_ignore_unrelated_edits_and_warn_only_while_watching ... FAILED
67.96 s
>
67.96 s
> failures:
67.96 s
>
67.96 s
> failures:
67.96 s
> tests::developer_scope_ranges_ignore_unrelated_edits_and_warn_only_while_watching
67.96 s
>
67.96 s
> test result: FAILED. 0 passed; 1 failed; 0 ignored; 0 measured; 128 filtered out; finished in 0.11s
67.96 s
>
67.96 s
> stderr ---
67.96 s
>
67.96 s
> thread 'tests::developer_scope_ranges_ignore_unrelated_edits_and_warn_only_while_watching' (284) panicked at crates/alphal00p-docs-builder/src/lib.rs:12350:29:
67.96 s
> called `Result::unwrap()` on an `Err` value: required documentation source is missing: /build/source/crates/spynso3/typst/STIXTwoMath-Regular.woff2
67.96 s
>
67.96 s
> Location:
67.96 s
> crates/alphal00p-docs-builder/src/lib.rs:5103:9
67.96 s
> stack backtrace:
67.96 s
> 0: __rustc::rust_begin_unwind
67.96 s
> 1: core::panicking::panic_fmt
67.96 s
> 2: core::result::unwrap_failed
67.96 s
> 3: alphal00p_docs_builder::tests::developer_scope_ranges_ignore_unrelated_edits_and_warn_only_while_watching
67.96 s
> 4: <alphal00p_docs_builder::tests::developer_scope_ranges_ignore_unrelated_edits_and_warn_only_while_watching::{closure#0} as core::ops::function::FnOnce<()>>::call_once
67.96 s
> note: Some details are omitted, run with `RUST_BACKTRACE=full` for a verbose backtrace.
67.96 s
>
67.96 s
> FAIL [ 0.120s] (111/129) alphal00p-docs-builder tests :: every_product_requires_a_task_chooser_and_each_supported_interface
67.96 s
> stdout ---
67.96 s
>
67.96 s
> running 1 test
67.96 s
> test tests::every_product_requires_a_task_chooser_and_each_supported_interface ... FAILED
67.96 s
>
67.96 s
> failures:
67.96 s
>
67.96 s
> failures:
67.96 s
> tests::every_product_requires_a_task_chooser_and_each_supported_interface
67.96 s
>
67.96 s
> test result: FAILED. 0 passed; 1 failed; 0 ignored; 0 measured; 128 filtered out; finished in 0.12s
67.96 s
>
67.96 s
> stderr ---
67.96 s
>
67.96 s
> thread 'tests::every_product_requires_a_task_chooser_and_each_supported_interface' (309) panicked at crates/alphal00p-docs-builder/src/lib.rs:12274:9:
67.96 s
> assertion failed: format!("{error:#}").contains("has no quickstart page")
67.96 s
> stack backtrace:
67.96 s
> 0: __rustc::rust_begin_unwind
67.96 s
> 1: core::panicking::panic_fmt
67.96 s
> 2: core::panicking::panic
67.96 s
> 3: alphal00p_docs_builder::tests::every_product_requires_a_task_chooser_and_each_supported_interface
67.96 s
> 4: <alphal00p_docs_builder::tests::every_product_requires_a_task_chooser_and_each_supported_interface::{closure#0} as core::ops::function::FnOnce<()>>::call_once
67.96 s
> note: Some details are omitted, run with `RUST_BACKTRACE=full` for a verbose backtrace.
67.96 s
>
67.96 s
> FAIL [ 0.112s] (122/129) alphal00p-docs-builder tests :: pdf_manual_chapter_order_must_match_the_page_registry
67.96 s
> stdout ---
67.96 s
>
67.96 s
> running 1 test
67.96 s
> test tests::pdf_manual_chapter_order_must_match_the_page_registry ... FAILED
67.96 s
>
67.96 s
> failures:
67.96 s
>
67.96 s
> failures:
67.96 s
> tests::pdf_manual_chapter_order_must_match_the_page_registry
67.96 s
>
67.96 s
> test result: FAILED. 0 passed; 1 failed; 0 ignored; 0 measured; 128 filtered out; finished in 0.11s
67.96 s
>
67.96 s
> stderr ---
67.96 s
>
67.96 s
> thread 'tests::pdf_manual_chapter_order_must_match_the_page_registry' (402) panicked at crates/alphal00p-docs-builder/src/lib.rs:12330:9:
67.96 s
> assertion failed: format!("{error:#}").contains("PDF manual chapter order differs")
67.96 s
> stack backtrace:
67.96 s
> 0: __rustc::rust_begin_unwind
67.96 s
> 1: core::panicking::panic_fmt
67.96 s
> 2: core::panicking::panic
67.96 s
> 3: alphal00p_docs_builder::tests::pdf_manual_chapter_order_must_match_the_page_registry
67.96 s
> 4: <alphal00p_docs_builder::tests::pdf_manual_chapter_order_must_match_the_page_registry::{closure#0} as core::ops::function::FnOnce<()>>::call_once
67.96 s
> note: Some details are omitted, run with `RUST_BACKTRACE=full` for a verbose backtrace.
67.96 s
>
67.96 s
> ------------
67.96 s
> Summary [ 11.064s] 129 tests run: 118 passed , 11 failed , 0 skipped
67.96 s
> FAIL [ 0.009s] ( 23/129) alphal00p-docs-builder tests :: developer_architecture_is_classified_searchable_and_source_backed
67.96 s
> stdout ---
67.96 s
>
67.96 s
> running 1 test
67.96 s
> test tests::developer_architecture_is_classified_searchable_and_source_backed ... FAILED
67.96 s
>
67.96 s
> failures:
67.96 s
>
67.96 s
> failures:
67.96 s
> tests::developer_architecture_is_classified_searchable_and_source_backed
67.96 s
>
67.96 s
> test result: FAILED. 0 passed; 1 failed; 0 ignored; 0 measured; 128 filtered out; finished in 0.01s
67.96 s
>
67.96 s
> stderr ---
67.96 s
>
67.96 s
> thread 'tests::developer_architecture_is_classified_searchable_and_source_backed' (276) panicked at crates/alphal00p-docs-builder/src/lib.rs:12751:14:
67.96 s
> called `Result::unwrap()` on an `Err` value: failed to copy documentation asset crates/spynso3/typst/STIXTwoMath-Regular.woff2
67.96 s
>
67.96 s
> Caused by:
67.96 s
> No such file or directory (os error 2)
67.96 s
>
67.96 s
> Location:
67.96 s
> crates/alphal00p-docs-builder/src/lib.rs:2276:18
67.96 s
> stack backtrace:
67.96 s
> 0: __rustc::rust_begin_unwind
67.96 s
> 1: core::panicking::panic_fmt
67.96 s
> 2: core::result::unwrap_failed
67.96 s
> 3: alphal00p_docs_builder::tests::developer_architecture_is_classified_searchable_and_source_backed
67.96 s
> 4: <alphal00p_docs_builder::tests::developer_architecture_is_classified_searchable_and_source_backed::{closure#0} as core::ops::function::FnOnce<()>>::call_once
67.96 s
> note: Some details are omitted, run with `RUST_BACKTRACE=full` for a verbose backtrace.
67.96 s
>
67.96 s
> FAIL [ 0.011s] ( 30/129) alphal00p-docs-builder tests :: every_product_orients_rust_to_native_rustdoc_and_keeps_legacy_redirects
67.96 s
> stdout ---
67.96 s
>
67.96 s
> running 1 test
67.96 s
> test tests::every_product_orients_rust_to_native_rustdoc_and_keeps_legacy_redirects ... FAILED
67.96 s
>
67.96 s
> failures:
67.96 s
>
67.96 s
> failures:
67.96 s
> tests::every_product_orients_rust_to_native_rustdoc_and_keeps_legacy_redirects
67.96 s
>
67.96 s
> test result: FAILED. 0 passed; 1 failed; 0 ignored; 0 measured; 128 filtered out; finished in 0.01s
67.96 s
>
67.96 s
> stderr ---
67.96 s
>
67.96 s
> thread 'tests::every_product_orients_rust_to_native_rustdoc_and_keeps_legacy_redirects' (302) panicked at crates/alphal00p-docs-builder/src/lib.rs:12555:46:
67.96 s
> called `Result::unwrap()` on an `Err` value: failed to copy documentation asset crates/spynso3/typst/STIXTwoMath-Regular.woff2
67.96 s
>
67.96 s
> Caused by:
67.96 s
> No such file or directory (os error 2)
67.96 s
>
67.96 s
> Location:
67.96 s
> crates/alphal00p-docs-builder/src/lib.rs:2276:18
67.96 s
> stack backtrace:
67.96 s
> 0: __rustc::rust_begin_unwind
67.96 s
> 1: core::panicking::panic_fmt
67.96 s
> 2: core::result::unwrap_failed
67.96 s
> 3: alphal00p_docs_builder::tests::every_product_orients_rust_to_native_rustdoc_and_keeps_legacy_redirects
67.96 s
> 4: <alphal00p_docs_builder::tests::every_product_orients_rust_to_native_rustdoc_and_keeps_legacy_redirects::{closure#0} as core::ops::function::FnOnce<()>>::call_once
67.96 s
> note: Some details are omitted, run with `RUST_BACKTRACE=full` for a verbose backtrace.
67.96 s
>
67.96 s
> FAIL [ 0.009s] ( 54/129) alphal00p-docs-builder tests :: portal_and_developer_pages_use_federated_search_and_feedback
67.96 s
> stdout ---
67.96 s
>
67.96 s
> running 1 test
67.96 s
> test tests::portal_and_developer_pages_use_federated_search_and_feedback ... FAILED
67.96 s
>
67.96 s
> failures:
67.96 s
>
67.96 s
> failures:
67.96 s
> tests::portal_and_developer_pages_use_federated_search_and_feedback
67.96 s
>
67.96 s
> test result: FAILED. 0 passed; 1 failed; 0 ignored; 0 measured; 128 filtered out; finished in 0.01s
67.96 s
>
67.96 s
> stderr ---
67.96 s
>
67.96 s
> thread 'tests::portal_and_developer_pages_use_federated_search_and_feedback' (416) panicked at crates/alphal00p-docs-builder/src/lib.rs:9684:14:
67.96 s
> called `Result::unwrap()` on an `Err` value: failed to copy documentation asset crates/spynso3/typst/STIXTwoMath-Regular.woff2
67.96 s
>
67.96 s
> Caused by:
67.96 s
> No such file or directory (os error 2)
67.96 s
>
67.96 s
> Location:
67.96 s
> crates/alphal00p-docs-builder/src/lib.rs:2276:18
67.96 s
> stack backtrace:
67.96 s
> 0: __rustc::rust_begin_unwind
67.96 s
> 1: core::panicking::panic_fmt
67.96 s
> 2: core::result::unwrap_failed
67.96 s
> 3: alphal00p_docs_builder::tests::write_test_portal
67.96 s
> 4: alphal00p_docs_builder::tests::portal_and_developer_pages_use_federated_search_and_feedback
67.96 s
> 5: <alphal00p_docs_builder::tests::portal_and_developer_pages_use_federated_search_and_feedback::{closure#0} as core::ops::function::FnOnce<()>>::call_once
67.96 s
> note: Some details are omitted, run with `RUST_BACKTRACE=full` for a verbose backtrace.
67.96 s
>
67.96 s
> FAIL [ 0.008s] ( 55/129) alphal00p-docs-builder tests :: portal_emits_routes_and_valid_assets
67.96 s
> stdout ---
67.96 s
>
67.96 s
> running 1 test
67.96 s
> test tests::portal_emits_routes_and_valid_assets ... FAILED
67.96 s
>
67.96 s
> failures:
67.96 s
>
67.96 s
> failures:
67.96 s
> tests::portal_emits_routes_and_valid_assets
67.96 s
>
67.96 s
> test result: FAILED. 0 passed; 1 failed; 0 ignored; 0 measured; 128 filtered out; finished in 0.00s
67.96 s
>
67.96 s
> stderr ---
67.96 s
>
67.96 s
> thread 'tests::portal_emits_routes_and_valid_assets' (422) panicked at crates/alphal00p-docs-builder/src/lib.rs:9684:14:
67.96 s
> called `Result::unwrap()` on an `Err` value: failed to copy documentation asset crates/spynso3/typst/STIXTwoMath-Regular.woff2
67.96 s
>
67.96 s
> Caused by:
67.96 s
> No such file or directory (os error 2)
67.96 s
>
67.96 s
> Location:
67.96 s
> crates/alphal00p-docs-builder/src/lib.rs:2276:18
67.96 s
> stack backtrace:
67.96 s
> 0: __rustc::rust_begin_unwind
67.96 s
> 1: core::panicking::panic_fmt
67.96 s
> 2: core::result::unwrap_failed
67.96 s
> 3: alphal00p_docs_builder::tests::write_test_portal
67.96 s
> 4: alphal00p_docs_builder::tests::portal_emits_routes_and_valid_assets
67.96 s
> 5: <alphal00p_docs_builder::tests::portal_emits_routes_and_valid_assets::{closure#0} as core::ops::function::FnOnce<()>>::call_once
67.96 s
> note: Some details are omitted, run with `RUST_BACKTRACE=full` for a verbose backtrace.
67.96 s
>
67.96 s
> FAIL [ 0.010s] ( 56/129) alphal00p-docs-builder tests :: portal_task_chooser_routes_each_goal_to_the_registered_quickstart
67.96 s
> stdout ---
67.96 s
>
67.96 s
> running 1 test
67.96 s
> test tests::portal_task_chooser_routes_each_goal_to_the_registered_quickstart ... FAILED
67.96 s
>
67.96 s
> failures:
67.96 s
>
67.96 s
> failures:
67.96 s
> tests::portal_task_chooser_routes_each_goal_to_the_registered_quickstart
67.96 s
>
67.96 s
> test result: FAILED. 0 passed; 1 failed; 0 ignored; 0 measured; 128 filtered out; finished in 0.01s
67.96 s
>
67.96 s
> stderr ---
67.96 s
>
67.96 s
> thread 'tests::portal_task_chooser_routes_each_goal_to_the_registered_quickstart' (427) panicked at crates/alphal00p-docs-builder/src/lib.rs:9684:14:
67.96 s
> called `Result::unwrap()` on an `Err` value: failed to copy documentation asset crates/spynso3/typst/STIXTwoMath-Regular.woff2
67.96 s
>
67.96 s
> Caused by:
67.96 s
> No such file or directory (os error 2)
67.96 s
>
67.96 s
> Location:
67.96 s
> crates/alphal00p-docs-builder/src/lib.rs:2276:18
67.96 s
> stack backtrace:
67.96 s
> 0: __rustc::rust_begin_unwind
67.96 s
> 1: core::panicking::panic_fmt
67.96 s
> 2: core::result::unwrap_failed
67.96 s
> 3: alphal00p_docs_builder::tests::write_test_portal
67.96 s
> 4: alphal00p_docs_builder::tests::portal_task_chooser_routes_each_goal_to_the_registered_quickstart
67.96 s
> 5: <alphal00p_docs_builder::tests::portal_task_chooser_routes_each_goal_to_the_registered_quickstart::{closure#0} as core::ops::function::FnOnce<()>>::call_once
67.96 s
> note: Some details are omitted, run with `RUST_BACKTRACE=full` for a verbose backtrace.
67.96 s
>
67.96 s
> FAIL [ 0.009s] ( 86/129) alphal00p-docs-builder tests :: site_assets_replace_read_only_generated_files
67.96 s
> stdout ---
67.96 s
>
67.96 s
> running 1 test
67.96 s
> test tests::site_assets_replace_read_only_generated_files ... FAILED
67.96 s
>
67.96 s
> failures:
67.96 s
>
67.96 s
> failures:
67.96 s
> tests::site_assets_replace_read_only_generated_files
67.96 s
>
67.96 s
> test result: FAILED. 0 passed; 1 failed; 0 ignored; 0 measured; 128 filtered out; finished in 0.00s
67.96 s
>
67.96 s
> stderr ---
67.96 s
>
67.96 s
> thread 'tests::site_assets_replace_read_only_generated_files' (648) panicked at crates/alphal00p-docs-builder/src/lib.rs:12305:50:
67.96 s
> called `Result::unwrap()` on an `Err` value: failed to copy documentation asset crates/spynso3/typst/STIXTwoMath-Regular.woff2
67.96 s
>
67.96 s
> Caused by:
67.96 s
> No such file or directory (os error 2)
67.96 s
>
67.96 s
> Location:
67.96 s
> crates/alphal00p-docs-builder/src/lib.rs:2276:18
67.96 s
> stack backtrace:
67.96 s
> 0: __rustc::rust_begin_unwind
67.96 s
> 1: core::panicking::panic_fmt
67.96 s
> 2: core::result::unwrap_failed
67.96 s
> 3: alphal00p_docs_builder::tests::site_assets_replace_read_only_generated_files
67.96 s
> 4: <alphal00p_docs_builder::tests::site_assets_replace_read_only_generated_files::{closure#0} as core::ops::function::FnOnce<()>>::call_once
67.96 s
> note: Some details are omitted, run with `RUST_BACKTRACE=full` for a verbose backtrace.
67.96 s
>
67.96 s
> FAIL [ 0.122s] ( 91/129) alphal00p-docs-builder tests :: checked_in_registry_is_valid
67.96 s
> stdout ---
67.96 s
>
67.96 s
> running 1 test
67.96 s
> test tests::checked_in_registry_is_valid ... FAILED
67.96 s
>
67.96 s
> failures:
67.96 s
>
67.96 s
> failures:
67.96 s
> tests::checked_in_registry_is_valid
67.96 s
>
67.96 s
> test result: FAILED. 0 passed; 1 failed; 0 ignored; 0 measured; 128 filtered out; finished in 0.11s
67.96 s
>
67.96 s
> stderr ---
67.96 s
>
67.96 s
> thread 'tests::checked_in_registry_is_valid' (241) panicked at crates/alphal00p-docs-builder/src/lib.rs:12260:50:
67.96 s
> called `Result::unwrap()` on an `Err` value: required documentation source is missing: /build/source/crates/spynso3/typst/STIXTwoMath-Regular.woff2
67.96 s
>
67.96 s
> Location:
67.96 s
> crates/alphal00p-docs-builder/src/lib.rs:5103:9
67.96 s
> stack backtrace:
67.96 s
> 0: __rustc::rust_begin_unwind
67.96 s
> 1: core::panicking::panic_fmt
67.96 s
> 2: core::result::unwrap_failed
67.96 s
> 3: alphal00p_docs_builder::tests::checked_in_registry_is_valid
67.96 s
> 4: <alphal00p_docs_builder::tests::checked_in_registry_is_valid::{closure#0} as core::ops::function::FnOnce<()>>::call_once
67.96 s
> note: Some details are omitted, run with `RUST_BACKTRACE=full` for a verbose backtrace.
67.96 s
>
67.96 s
> FAIL [ 0.130s] ( 97/129) alphal00p-docs-builder provenance_tests :: each_build_captures_one_revision_before_rendering
67.96 s
> stdout ---
67.96 s
>
67.96 s
> running 1 test
67.96 s
>
67.96 s
> running 1 test
67.96 s
> test provenance_tests::each_build_captures_one_revision_before_rendering ... FAILED
67.96 s
>
67.96 s
> failures:
67.96 s
>
67.96 s
> failures:
67.96 s
> provenance_tests::each_build_captures_one_revision_before_rendering
67.96 s
>
67.96 s
> test result: FAILED. 0 passed; 1 failed; 0 ignored; 0 measured; 128 filtered out; finished in 0.11s
67.96 s
>
67.96 s
> test provenance_tests::each_build_captures_one_revision_before_rendering ... FAILED
67.96 s
>
67.96 s
> failures:
67.96 s
>
67.96 s
> failures:
67.96 s
> provenance_tests::each_build_captures_one_revision_before_rendering
67.96 s
>
67.96 s
> test result: FAILED. 0 passed; 1 failed; 0 ignored; 0 measured; 128 filtered out; finished in 0.12s
67.96 s
>
67.96 s
> stderr ---
67.96 s
>
67.96 s
> thread 'provenance_tests::each_build_captures_one_revision_before_rendering' (260) panicked at crates/alphal00p-docs-builder/src/provenance_tests.rs:297:14:
67.96 s
> called `Result::unwrap()` on an `Err` value: required documentation source is missing: /build/source/target/nix-ci-tmp/.tmp3od26f/checkout/crates/spynso3/typst/STIXTwoMath-Regular.woff2
67.96 s
>
67.96 s
> Location:
67.96 s
> crates/alphal00p-docs-builder/src/lib.rs:5103:9
67.96 s
> stack backtrace:
67.96 s
> 0: __rustc::rust_begin_unwind
67.96 s
> 1: core::panicking::panic_fmt
67.96 s
> 2: core::result::unwrap_failed
67.96 s
> 3: alphal00p_docs_builder::provenance_tests::each_build_captures_one_revision_before_rendering
67.96 s
> 4: <alphal00p_docs_builder::provenance_tests::each_build_captures_one_revision_before_rendering::{closure#0} as core::ops::function::FnOnce<()>>::call_once
67.96 s
> note: Some details are omitted, run with `RUST_BACKTRACE=full` for a verbose backtrace.
67.96 s
>
67.96 s
> thread 'provenance_tests::each_build_captures_one_revision_before_rendering' (226) panicked at crates/alphal00p-docs-builder/src/provenance_tests.rs:274:9:
67.96 s
> assertion failed: command.status().unwrap().success()
67.96 s
> stack backtrace:
67.96 s
> 0: __rustc::rust_begin_unwind
67.96 s
> 1: core::panicking::panic_fmt
67.96 s
> 2: core::panicking::panic
67.96 s
> 3: alphal00p_docs_builder::provenance_tests::each_build_captures_one_revision_before_rendering
67.96 s
> 4: <alphal00p_docs_builder::provenance_tests::each_build_captures_one_revision_before_rendering::{closure#0} as core::ops::function::FnOnce<()>>::call_once
67.96 s
> note: Some details are omitted, run with `RUST_BACKTRACE=full` for a verbose backtrace.
67.96 s
>
67.96 s
> FAIL [ 0.116s] (100/129) alphal00p-docs-builder tests :: developer_scope_ranges_ignore_unrelated_edits_and_warn_only_while_watching
67.96 s
> stdout ---
67.96 s
>
67.96 s
> running 1 test
67.96 s
> test tests::developer_scope_ranges_ignore_unrelated_edits_and_warn_only_while_watching ... FAILED
67.96 s
>
67.96 s
> failures:
67.96 s
>
67.96 s
> failures:
67.96 s
> tests::developer_scope_ranges_ignore_unrelated_edits_and_warn_only_while_watching
67.96 s
>
67.96 s
> test result: FAILED. 0 passed; 1 failed; 0 ignored; 0 measured; 128 filtered out; finished in 0.11s
67.96 s
>
67.96 s
> stderr ---
67.96 s
>
67.96 s
> thread 'tests::developer_scope_ranges_ignore_unrelated_edits_and_warn_only_while_watching' (284) panicked at crates/alphal00p-docs-builder/src/lib.rs:12350:29:
67.96 s
> called `Result::unwrap()` on an `Err` value: required documentation source is missing: /build/source/crates/spynso3/typst/STIXTwoMath-Regular.woff2
67.96 s
>
67.96 s
> Location:
67.96 s
> crates/alphal00p-docs-builder/src/lib.rs:5103:9
67.96 s
> stack backtrace:
67.96 s
> 0: __rustc::rust_begin_unwind
67.96 s
> 1: core::panicking::panic_fmt
67.96 s
> 2: core::result::unwrap_failed
67.96 s
> 3: alphal00p_docs_builder::tests::developer_scope_ranges_ignore_unrelated_edits_and_warn_only_while_watching
67.96 s
> 4: <alphal00p_docs_builder::tests::developer_scope_ranges_ignore_unrelated_edits_and_warn_only_while_watching::{closure#0} as core::ops::function::FnOnce<()>>::call_once
67.96 s
> note: Some details are omitted, run with `RUST_BACKTRACE=full` for a verbose backtrace.
67.96 s
>
67.96 s
> FAIL [ 0.120s] (111/129) alphal00p-docs-builder tests :: every_product_requires_a_task_chooser_and_each_supported_interface
67.96 s
> stdout ---
67.96 s
>
67.96 s
> running 1 test
67.96 s
> test tests::every_product_requires_a_task_chooser_and_each_supported_interface ... FAILED
67.96 s
>
67.96 s
> failures:
67.96 s
>
67.96 s
> failures:
67.96 s
> tests::every_product_requires_a_task_chooser_and_each_supported_interface
67.96 s
>
67.96 s
> test result: FAILED. 0 passed; 1 failed; 0 ignored; 0 measured; 128 filtered out; finished in 0.12s
67.96 s
>
67.96 s
> stderr ---
67.96 s
>
67.96 s
> thread 'tests::every_product_requires_a_task_chooser_and_each_supported_interface' (309) panicked at crates/alphal00p-docs-builder/src/lib.rs:12274:9:
67.96 s
> assertion failed: format!("{error:#}").contains("has no quickstart page")
67.96 s
> stack backtrace:
67.96 s
> 0: __rustc::rust_begin_unwind
67.96 s
> 1: core::panicking::panic_fmt
67.96 s
> 2: core::panicking::panic
67.96 s
> 3: alphal00p_docs_builder::tests::every_product_requires_a_task_chooser_and_each_supported_interface
67.96 s
> 4: <alphal00p_docs_builder::tests::every_product_requires_a_task_chooser_and_each_supported_interface::{closure#0} as core::ops::function::FnOnce<()>>::call_once
67.96 s
> note: Some details are omitted, run with `RUST_BACKTRACE=full` for a verbose backtrace.
67.96 s
>
67.96 s
> FAIL [ 0.112s] (122/129) alphal00p-docs-builder tests :: pdf_manual_chapter_order_must_match_the_page_registry
67.96 s
> stdout ---
67.96 s
>
67.96 s
> running 1 test
67.96 s
> test tests::pdf_manual_chapter_order_must_match_the_page_registry ... FAILED
67.96 s
>
67.96 s
> failures:
67.96 s
>
67.96 s
> failures:
67.96 s
> tests::pdf_manual_chapter_order_must_match_the_page_registry
67.96 s
>
67.96 s
> test result: FAILED. 0 passed; 1 failed; 0 ignored; 0 measured; 128 filtered out; finished in 0.11s
67.96 s
>
67.96 s
> stderr ---
67.96 s
>
67.96 s
> thread 'tests::pdf_manual_chapter_order_must_match_the_page_registry' (402) panicked at crates/alphal00p-docs-builder/src/lib.rs:12330:9:
67.96 s
> assertion failed: format!("{error:#}").contains("PDF manual chapter order differs")
67.96 s
> stack backtrace:
67.96 s
> 0: __rustc::rust_begin_unwind
67.96 s
> 1: core::panicking::panic_fmt
67.96 s
> 2: core::panicking::panic
67.96 s
> 3: alphal00p_docs_builder::tests::pdf_manual_chapter_order_must_match_the_page_registry
67.96 s
> 4: <alphal00p_docs_builder::tests::pdf_manual_chapter_order_must_match_the_page_registry::{closure#0} as core::ops::function::FnOnce<()>>::call_once
67.96 s
> note: Some details are omitted, run with `RUST_BACKTRACE=full` for a verbose backtrace.
67.96 s
>
67.96 s
> error : test run failed
67.96 s
>
67.96 s
> ========== nextest test summary ==========
67.96 s
> report: target/nextest/ci_gammaloop/junit.xml
67.96 s
> tests: 129, failures: 11, errors: 0
67.96 s
>
67.96 s
> 1. alphal00p-docs-builder::tests::developer_architecture_is_classified_searchable_and_source_backed
67.96 s
> failure: test failure with exit code 101
67.96 s
> thread 'tests::developer_architecture_is_classified_searchable_and_source_backed' (276) panicked at crates/alphal00p-docs-builder/src/lib.rs:12751:14:
67.96 s
> called `Result::unwrap()` on an `Err` value: failed to copy documentation asset crates/spynso3/typst/STIXTwoMath-Regular.woff2
67.96 s
>
67.96 s
> Caused by:
67.96 s
> No such file or directory (os error 2)
67.96 s
>
67.96 s
> Location:
67.96 s
> crates/alphal00p-docs-builder/src/lib.rs:2276:18
67.96 s
> stack backtrace:
67.96 s
> 0: __rustc::rust_begin_unwind
67.96 s
> 1: core::panicking::panic_fmt
67.96 s
> 2: core::result::unwrap_failed
67.96 s
> 3: alphal00p_docs_builder::tests::developer_architecture_is_classified_searchable_and_source_backed
67.96 s
> 4: <alphal00p_docs_builder::tests::developer_architecture_is_classified_searchable_and_source_backed::{closure#0} as core::ops::function::FnOnce<()>>::call_once
67.96 s
> note: Some details are omitted, run with `RUST_BACKTRACE=full` for a verbose backtrace.
67.96 s
> system-out
67.96 s
> running 1 test
67.96 s
> test tests::developer_architecture_is_classified_searchable_and_source_backed ... FAILED
67.96 s
>
67.96 s
> failures:
67.96 s
>
67.96 s
> failures:
67.96 s
> tests::developer_architecture_is_classified_searchable_and_source_backed
67.96 s
>
67.96 s
> test result: FAILED. 0 passed; 1 failed; 0 ignored; 0 measured; 128 filtered out; finished in 0.01s
67.96 s
> system-err
67.96 s
> thread 'tests::developer_architecture_is_classified_searchable_and_source_backed' (276) panicked at crates/alphal00p-docs-builder/src/lib.rs:12751:14:
67.96 s
> called `Result::unwrap()` on an `Err` value: failed to copy documentation asset crates/spynso3/typst/STIXTwoMath-Regular.woff2
67.96 s
>
67.96 s
> Caused by:
67.96 s
> No such file or directory (os error 2)
67.96 s
>
67.96 s
> Location:
67.96 s
> crates/alphal00p-docs-builder/src/lib.rs:2276:18
67.96 s
> stack backtrace:
67.96 s
> 0: __rustc::rust_begin_unwind
67.96 s
> 1: core::panicking::panic_fmt
67.96 s
> 2: core::result::unwrap_failed
67.96 s
> 3: alphal00p_docs_builder::tests::developer_architecture_is_classified_searchable_and_source_backed
67.96 s
> 4: <alphal00p_docs_builder::tests::developer_architecture_is_classified_searchable_and_source_backed::{closure#0} as core::ops::function::FnOnce<()>>::call_once
67.96 s
> note: Some details are omitted, run with `RUST_BACKTRACE=full` for a verbose backtrace.
67.96 s
>
67.96 s
> 2. alphal00p-docs-builder::tests::every_product_orients_rust_to_native_rustdoc_and_keeps_legacy_redirects
67.96 s
> failure: test failure with exit code 101
67.96 s
> thread 'tests::every_product_orients_rust_to_native_rustdoc_and_keeps_legacy_redirects' (302) panicked at crates/alphal00p-docs-builder/src/lib.rs:12555:46:
67.96 s
> called `Result::unwrap()` on an `Err` value: failed to copy documentation asset crates/spynso3/typst/STIXTwoMath-Regular.woff2
67.96 s
>
67.96 s
> Caused by:
67.96 s
> No such file or directory (os error 2)
67.96 s
>
67.96 s
> Location:
67.96 s
> crates/alphal00p-docs-builder/src/lib.rs:2276:18
67.96 s
> stack backtrace:
67.96 s
> 0: __rustc::rust_begin_unwind
67.96 s
> 1: core::panicking::panic_fmt
67.96 s
> 2: core::result::unwrap_failed
67.96 s
> 3: alphal00p_docs_builder::tests::every_product_orients_rust_to_native_rustdoc_and_keeps_legacy_redirects
67.96 s
> 4: <alphal00p_docs_builder::tests::every_product_orients_rust_to_native_rustdoc_and_keeps_legacy_redirects::{closure#0} as core::ops::function::FnOnce<()>>::call_once
67.96 s
> note: Some details are omitted, run with `RUST_BACKTRACE=full` for a verbose backtrace.
67.96 s
> system-out
67.96 s
> running 1 test
67.96 s
> test tests::every_product_orients_rust_to_native_rustdoc_and_keeps_legacy_redirects ... FAILED
67.96 s
>
67.96 s
> failures:
67.96 s
>
67.96 s
> failures:
67.96 s
> tests::every_product_orients_rust_to_native_rustdoc_and_keeps_legacy_redirects
67.96 s
>
67.96 s
> test result: FAILED. 0 passed; 1 failed; 0 ignored; 0 measured; 128 filtered out; finished in 0.01s
67.96 s
> system-err
67.96 s
> thread 'tests::every_product_orients_rust_to_native_rustdoc_and_keeps_legacy_redirects' (302) panicked at crates/alphal00p-docs-builder/src/lib.rs:12555:46:
67.96 s
> called `Result::unwrap()` on an `Err` value: failed to copy documentation asset crates/spynso3/typst/STIXTwoMath-Regular.woff2
67.96 s
>
67.96 s
> Caused by:
67.96 s
> No such file or directory (os error 2)
67.96 s
>
67.96 s
> Location:
67.96 s
> crates/alphal00p-docs-builder/src/lib.rs:2276:18
67.96 s
> stack backtrace:
67.96 s
> 0: __rustc::rust_begin_unwind
67.96 s
> 1: core::panicking::panic_fmt
67.96 s
> 2: core::result::unwrap_failed
67.96 s
> 3: alphal00p_docs_builder::tests::every_product_orients_rust_to_native_rustdoc_and_keeps_legacy_redirects
67.96 s
> 4: <alphal00p_docs_builder::tests::every_product_orients_rust_to_native_rustdoc_and_keeps_legacy_redirects::{closure#0} as core::ops::function::FnOnce<()>>::call_once
67.96 s
> note: Some details are omitted, run with `RUST_BACKTRACE=full` for a verbose backtrace.
67.96 s
>
67.96 s
> 3. alphal00p-docs-builder::tests::portal_and_developer_pages_use_federated_search_and_feedback
67.96 s
> failure: test failure with exit code 101
67.96 s
> thread 'tests::portal_and_developer_pages_use_federated_search_and_feedback' (416) panicked at crates/alphal00p-docs-builder/src/lib.rs:9684:14:
67.96 s
> called `Result::unwrap()` on an `Err` value: failed to copy documentation asset crates/spynso3/typst/STIXTwoMath-Regular.woff2
67.96 s
>
67.96 s
> Caused by:
67.96 s
> No such file or directory (os error 2)
67.96 s
>
67.96 s
> Location:
67.96 s
> crates/alphal00p-docs-builder/src/lib.rs:2276:18
67.96 s
> stack backtrace:
67.96 s
> 0: __rustc::rust_begin_unwind
67.96 s
> 1: core::panicking::panic_fmt
67.96 s
> 2: core::result::unwrap_failed
67.96 s
> 3: alphal00p_docs_builder::tests::write_test_portal
67.96 s
> 4: alphal00p_docs_builder::tests::portal_and_developer_pages_use_federated_search_and_feedback
67.96 s
> 5: <alphal00p_docs_builder::tests::portal_and_developer_pages_use_federated_search_and_feedback::{closure#0} as core::ops::function::FnOnce<()>>::call_once
67.96 s
> note: Some details are omitted, run with `RUST_BACKTRACE=full` for a verbose backtrace.
67.96 s
> system-out
67.96 s
> running 1 test
67.96 s
> test tests::portal_and_developer_pages_use_federated_search_and_feedback ... FAILED
67.96 s
>
67.96 s
> failures:
67.96 s
>
67.96 s
> failures:
67.96 s
> tests::portal_and_developer_pages_use_federated_search_and_feedback
67.96 s
>
67.96 s
> test result: FAILED. 0 passed; 1 failed; 0 ignored; 0 measured; 128 filtered out; finished in 0.01s
67.96 s
> system-err
67.96 s
> thread 'tests::portal_and_developer_pages_use_federated_search_and_feedback' (416) panicked at crates/alphal00p-docs-builder/src/lib.rs:9684:14:
67.96 s
> called `Result::unwrap()` on an `Err` value: failed to copy documentation asset crates/spynso3/typst/STIXTwoMath-Regular.woff2
67.96 s
>
67.96 s
> Caused by:
67.96 s
> No such file or directory (os error 2)
67.96 s
>
67.96 s
> Location:
67.96 s
> crates/alphal00p-docs-builder/src/lib.rs:2276:18
67.96 s
> stack backtrace:
67.96 s
> 0: __rustc::rust_begin_unwind
67.96 s
> 1: core::panicking::panic_fmt
67.96 s
> 2: core::result::unwrap_failed
67.96 s
> 3: alphal00p_docs_builder::tests::write_test_portal
67.96 s
> 4: alphal00p_docs_builder::tests::portal_and_developer_pages_use_federated_search_and_feedback
67.96 s
> 5: <alphal00p_docs_builder::tests::portal_and_developer_pages_use_federated_search_and_feedback::{closure#0} as core::ops::function::FnOnce<()>>::call_once
67.96 s
> note: Some details are omitted, run with `RUST_BACKTRACE=full` for a verbose backtrace.
67.96 s
>
67.96 s
> 4. alphal00p-docs-builder::tests::portal_emits_routes_and_valid_assets
67.96 s
> failure: test failure with exit code 101
67.96 s
> thread 'tests::portal_emits_routes_and_valid_assets' (422) panicked at crates/alphal00p-docs-builder/src/lib.rs:9684:14:
67.96 s
> called `Result::unwrap()` on an `Err` value: failed to copy documentation asset crates/spynso3/typst/STIXTwoMath-Regular.woff2
67.96 s
>
67.96 s
> Caused by:
67.96 s
> No such file or directory (os error 2)
67.96 s
>
67.96 s
> Location:
67.96 s
> crates/alphal00p-docs-builder/src/lib.rs:2276:18
67.96 s
> stack backtrace:
67.96 s
> 0: __rustc::rust_begin_unwind
67.96 s
> 1: core::panicking::panic_fmt
67.96 s
> 2: core::result::unwrap_failed
67.96 s
> 3: alphal00p_docs_builder::tests::write_test_portal
67.96 s
> 4: alphal00p_docs_builder::tests::portal_emits_routes_and_valid_assets
67.96 s
> 5: <alphal00p_docs_builder::tests::portal_emits_routes_and_valid_assets::{closure#0} as core::ops::function::FnOnce<()>>::call_once
67.96 s
> note: Some details are omitted, run with `RUST_BACKTRACE=full` for a verbose backtrace.
67.96 s
> system-out
67.96 s
> running 1 test
67.96 s
> test tests::portal_emits_routes_and_valid_assets ... FAILED
67.96 s
>
67.96 s
> failures:
67.96 s
>
67.96 s
> failures:
67.96 s
> tests::portal_emits_routes_and_valid_assets
67.96 s
>
67.96 s
> test result: FAILED. 0 passed; 1 failed; 0 ignored; 0 measured; 128 filtered out; finished in 0.00s
67.96 s
> system-err
67.96 s
> thread 'tests::portal_emits_routes_and_valid_assets' (422) panicked at crates/alphal00p-docs-builder/src/lib.rs:9684:14:
67.96 s
> called `Result::unwrap()` on an `Err` value: failed to copy documentation asset crates/spynso3/typst/STIXTwoMath-Regular.woff2
67.96 s
>
67.96 s
> Caused by:
67.96 s
> No such file or directory (os error 2)
67.96 s
>
67.96 s
> Location:
67.96 s
> crates/alphal00p-docs-builder/src/lib.rs:2276:18
67.96 s
> stack backtrace:
67.96 s
> 0: __rustc::rust_begin_unwind
67.96 s
> 1: core::panicking::panic_fmt
67.96 s
> 2: core::result::unwrap_failed
67.96 s
> 3: alphal00p_docs_builder::tests::write_test_portal
67.96 s
> 4: alphal00p_docs_builder::tests::portal_emits_routes_and_valid_assets
67.96 s
> 5: <alphal00p_docs_builder::tests::portal_emits_routes_and_valid_assets::{closure#0} as core::ops::function::FnOnce<()>>::call_once
67.96 s
> note: Some details are omitted, run with `RUST_BACKTRACE=full` for a verbose backtrace.
67.96 s
>
67.96 s
> 5. alphal00p-docs-builder::tests::portal_task_chooser_routes_each_goal_to_the_registered_quickstart
67.96 s
> failure: test failure with exit code 101
67.96 s
> thread 'tests::portal_task_chooser_routes_each_goal_to_the_registered_quickstart' (427) panicked at crates/alphal00p-docs-builder/src/lib.rs:9684:14:
67.96 s
> called `Result::unwrap()` on an `Err` value: failed to copy documentation asset crates/spynso3/typst/STIXTwoMath-Regular.woff2
67.96 s
>
67.96 s
> Caused by:
67.96 s
> No such file or directory (os error 2)
67.96 s
>
67.96 s
> Location:
67.96 s
> crates/alphal00p-docs-builder/src/lib.rs:2276:18
67.96 s
> stack backtrace:
67.96 s
> 0: __rustc::rust_begin_unwind
67.96 s
> 1: core::panicking::panic_fmt
67.96 s
> 2: core::result::unwrap_failed
67.96 s
> 3: alphal00p_docs_builder::tests::write_test_portal
67.96 s
> 4: alphal00p_docs_builder::tests::portal_task_chooser_routes_each_goal_to_the_registered_quickstart
67.96 s
> 5: <alphal00p_docs_builder::tests::portal_task_chooser_routes_each_goal_to_the_registered_quickstart::{closure#0} as core::ops::function::FnOnce<()>>::call_once
67.96 s
> note: Some details are omitted, run with `RUST_BACKTRACE=full` for a verbose backtrace.
67.96 s
> system-out
67.96 s
> running 1 test
67.96 s
> test tests::portal_task_chooser_routes_each_goal_to_the_registered_quickstart ... FAILED
67.96 s
>
67.96 s
> failures:
67.96 s
>
67.96 s
> failures:
67.96 s
> tests::portal_task_chooser_routes_each_goal_to_the_registered_quickstart
67.96 s
>
67.96 s
> test result: FAILED. 0 passed; 1 failed; 0 ignored; 0 measured; 128 filtered out; finished in 0.01s
67.96 s
> system-err
67.96 s
> thread 'tests::portal_task_chooser_routes_each_goal_to_the_registered_quickstart' (427) panicked at crates/alphal00p-docs-builder/src/lib.rs:9684:14:
67.96 s
> called `Result::unwrap()` on an `Err` value: failed to copy documentation asset crates/spynso3/typst/STIXTwoMath-Regular.woff2
67.96 s
>
67.96 s
> Caused by:
67.96 s
> No such file or directory (os error 2)
67.96 s
>
67.96 s
> Location:
67.96 s
> crates/alphal00p-docs-builder/src/lib.rs:2276:18
67.96 s
> stack backtrace:
67.96 s
> 0: __rustc::rust_begin_unwind
67.96 s
> 1: core::panicking::panic_fmt
67.96 s
> 2: core::result::unwrap_failed
67.96 s
> 3: alphal00p_docs_builder::tests::write_test_portal
67.96 s
> 4: alphal00p_docs_builder::tests::portal_task_chooser_routes_each_goal_to_the_registered_quickstart
67.96 s
> 5: <alphal00p_docs_builder::tests::portal_task_chooser_routes_each_goal_to_the_registered_quickstart::{closure#0} as core::ops::function::FnOnce<()>>::call_once
67.96 s
> note: Some details are omitted, run with `RUST_BACKTRACE=full` for a verbose backtrace.
67.96 s
>
67.96 s
> 6. alphal00p-docs-builder::tests::site_assets_replace_read_only_generated_files
67.96 s
> failure: test failure with exit code 101
67.96 s
> thread 'tests::site_assets_replace_read_only_generated_files' (648) panicked at crates/alphal00p-docs-builder/src/lib.rs:12305:50:
67.96 s
> called `Result::unwrap()` on an `Err` value: failed to copy documentation asset crates/spynso3/typst/STIXTwoMath-Regular.woff2
67.96 s
>
67.96 s
> Caused by:
67.96 s
> No such file or directory (os error 2)
67.96 s
>
67.96 s
> Location:
67.96 s
> crates/alphal00p-docs-builder/src/lib.rs:2276:18
67.96 s
> stack backtrace:
67.96 s
> 0: __rustc::rust_begin_unwind
67.96 s
> 1: core::panicking::panic_fmt
67.96 s
> 2: core::result::unwrap_failed
67.96 s
> 3: alphal00p_docs_builder::tests::site_assets_replace_read_only_generated_files
67.96 s
> 4: <alphal00p_docs_builder::tests::site_assets_replace_read_only_generated_files::{closure#0} as core::ops::function::FnOnce<()>>::call_once
67.96 s
> note: Some details are omitted, run with `RUST_BACKTRACE=full` for a verbose backtrace.
67.96 s
> system-out
67.96 s
> running 1 test
67.96 s
> test tests::site_assets_replace_read_only_generated_files ... FAILED
67.96 s
>
67.96 s
> failures:
67.96 s
>
67.96 s
> failures:
67.96 s
> tests::site_assets_replace_read_only_generated_files
67.96 s
>
67.96 s
> test result: FAILED. 0 passed; 1 failed; 0 ignored; 0 measured; 128 filtered out; finished in 0.00s
67.96 s
> system-err
67.96 s
> thread 'tests::site_assets_replace_read_only_generated_files' (648) panicked at crates/alphal00p-docs-builder/src/lib.rs:12305:50:
67.96 s
> called `Result::unwrap()` on an `Err` value: failed to copy documentation asset crates/spynso3/typst/STIXTwoMath-Regular.woff2
67.96 s
>
67.96 s
> Caused by:
67.96 s
> No such file or directory (os error 2)
67.96 s
>
67.96 s
> Location:
67.96 s
> crates/alphal00p-docs-builder/src/lib.rs:2276:18
67.96 s
> stack backtrace:
67.96 s
> 0: __rustc::rust_begin_unwind
67.96 s
> 1: core::panicking::panic_fmt
67.96 s
> 2: core::result::unwrap_failed
67.96 s
> 3: alphal00p_docs_builder::tests::site_assets_replace_read_only_generated_files
67.96 s
> 4: <alphal00p_docs_builder::tests::site_assets_replace_read_only_generated_files::{closure#0} as core::ops::function::FnOnce<()>>::call_once
67.96 s
> note: Some details are omitted, run with `RUST_BACKTRACE=full` for a verbose backtrace.
67.96 s
>
67.96 s
> 7. alphal00p-docs-builder::tests::checked_in_registry_is_valid
67.96 s
> failure: test failure with exit code 101
67.96 s
> thread 'tests::checked_in_registry_is_valid' (241) panicked at crates/alphal00p-docs-builder/src/lib.rs:12260:50:
67.96 s
> called `Result::unwrap()` on an `Err` value: required documentation source is missing: /build/source/crates/spynso3/typst/STIXTwoMath-Regular.woff2
67.96 s
>
67.96 s
> Location:
67.96 s
> crates/alphal00p-docs-builder/src/lib.rs:5103:9
67.96 s
> stack backtrace:
67.96 s
> 0: __rustc::rust_begin_unwind
67.96 s
> 1: core::panicking::panic_fmt
67.96 s
> 2: core::result::unwrap_failed
67.96 s
> 3: alphal00p_docs_builder::tests::checked_in_registry_is_valid
67.96 s
> 4: <alphal00p_docs_builder::tests::checked_in_registry_is_valid::{closure#0} as core::ops::function::FnOnce<()>>::call_once
67.96 s
> note: Some details are omitted, run with `RUST_BACKTRACE=full` for a verbose backtrace.
67.96 s
> system-out
67.96 s
> running 1 test
67.96 s
> test tests::checked_in_registry_is_valid ... FAILED
67.96 s
>
67.96 s
> failures:
67.96 s
>
67.96 s
> failures:
67.96 s
> tests::checked_in_registry_is_valid
67.96 s
>
67.96 s
> test result: FAILED. 0 passed; 1 failed; 0 ignored; 0 measured; 128 filtered out; finished in 0.11s
67.96 s
> system-err
67.96 s
> thread 'tests::checked_in_registry_is_valid' (241) panicked at crates/alphal00p-docs-builder/src/lib.rs:12260:50:
67.96 s
> called `Result::unwrap()` on an `Err` value: required documentation source is missing: /build/source/crates/spynso3/typst/STIXTwoMath-Regular.woff2
67.96 s
>
67.96 s
> Location:
67.96 s
> crates/alphal00p-docs-builder/src/lib.rs:5103:9
67.96 s
> stack backtrace:
67.96 s
> 0: __rustc::rust_begin_unwind
67.96 s
> 1: core::panicking::panic_fmt
67.96 s
> 2: core::result::unwrap_failed
67.96 s
> 3: alphal00p_docs_builder::tests::checked_in_registry_is_valid
67.96 s
> 4: <alphal00p_docs_builder::tests::checked_in_registry_is_valid::{closure#0} as core::ops::function::FnOnce<()>>::call_once
67.96 s
> note: Some details are omitted, run with `RUST_BACKTRACE=full` for a verbose backtrace.
67.96 s
>
67.96 s
> 8. alphal00p-docs-builder::provenance_tests::each_build_captures_one_revision_before_rendering
67.96 s
> failure: test failure with exit code 101
67.96 s
> thread 'provenance_tests::each_build_captures_one_revision_before_rendering' (226) panicked at crates/alphal00p-docs-builder/src/provenance_tests.rs:274:9:
67.96 s
> assertion failed: command.status().unwrap().success()
67.96 s
> stack backtrace:
67.96 s
> 0: __rustc::rust_begin_unwind
67.96 s
> 1: core::panicking::panic_fmt
67.96 s
> 2: core::panicking::panic
67.96 s
> 3: alphal00p_docs_builder::provenance_tests::each_build_captures_one_revision_before_rendering
67.96 s
> 4: <alphal00p_docs_builder::provenance_tests::each_build_captures_one_revision_before_rendering::{closure#0} as core::ops::function::FnOnce<()>>::call_once
67.96 s
> note: Some details are omitted, run with `RUST_BACKTRACE=full` for a verbose backtrace.
67.96 s
> system-out
67.96 s
> running 1 test
67.96 s
>
67.96 s
> running 1 test
67.96 s
> test provenance_tests::each_build_captures_one_revision_before_rendering ... FAILED
67.96 s
>
67.96 s
> failures:
67.96 s
>
67.96 s
> failures:
67.96 s
> provenance_tests::each_build_captures_one_revision_before_rendering
67.96 s
>
67.96 s
> test result: FAILED. 0 passed; 1 failed; 0 ignored; 0 measured; 128 filtered out; finished in 0.11s
67.96 s
>
67.96 s
> test provenance_tests::each_build_captures_one_revision_before_rendering ... FAILED
67.96 s
>
67.96 s
> failures:
67.96 s
>
67.96 s
> failures:
67.96 s
> provenance_tests::each_build_captures_one_revision_before_rendering
67.96 s
>
67.96 s
> test result: FAILED. 0 passed; 1 failed; 0 ignored; 0 measured; 128 filtered out; finished in 0.12s
67.96 s
> system-err
67.96 s
> thread 'provenance_tests::each_build_captures_one_revision_before_rendering' (260) panicked at crates/alphal00p-docs-builder/src/provenance_tests.rs:297:14:
67.96 s
> called `Result::unwrap()` on an `Err` value: required documentation source is missing: /build/source/target/nix-ci-tmp/.tmp3od26f/checkout/crates/spynso3/typst/STIXTwoMath-Regular.woff2
67.96 s
>
67.96 s
> Location:
67.96 s
> crates/alphal00p-docs-builder/src/lib.rs:5103:9
67.96 s
> stack backtrace:
67.96 s
> 0: __rustc::rust_begin_unwind
67.96 s
> 1: core::panicking::panic_fmt
67.96 s
> 2: core::result::unwrap_failed
67.96 s
> 3: alphal00p_docs_builder::provenance_tests::each_build_captures_one_revision_before_rendering
67.96 s
> 4: <alphal00p_docs_builder::provenance_tests::each_build_captures_one_revision_before_rendering::{closure#0} as core::ops::function::FnOnce<()>>::call_once
67.96 s
> note: Some details are omitted, run with `RUST_BACKTRACE=full` for a verbose backtrace.
67.96 s
>
67.96 s
> thread 'provenance_tests::each_build_captures_one_revision_before_rendering' (226) panicked at crates/alphal00p-docs-builder/src/provenance_tests.rs:274:9:
67.96 s
> assertion failed: command.status().unwrap().success()
67.96 s
> stack backtrace:
67.96 s
> 0: __rustc::rust_begin_unwind
67.96 s
> 1: core::panicking::panic_fmt
67.96 s
> 2: core::panicking::panic
67.96 s
> 3: alphal00p_docs_builder::provenance_tests::each_build_captures_one_revision_before_rendering
67.96 s
> 4: <alphal00p_docs_builder::provenance_tests::each_build_captures_one_revision_before_rendering::{closure#0} as core::ops::function::FnOnce<()>>::call_once
67.96 s
> note: Some details are omitted, run with `RUST_BACKTRACE=full` for a verbose backtrace.
67.96 s
>
67.96 s
> 9. alphal00p-docs-builder::tests::developer_scope_ranges_ignore_unrelated_edits_and_warn_only_while_watching
67.96 s
> failure: test failure with exit code 101
67.96 s
> thread 'tests::developer_scope_ranges_ignore_unrelated_edits_and_warn_only_while_watching' (284) panicked at crates/alphal00p-docs-builder/src/lib.rs:12350:29:
67.96 s
> called `Result::unwrap()` on an `Err` value: required documentation source is missing: /build/source/crates/spynso3/typst/STIXTwoMath-Regular.woff2
67.96 s
>
67.96 s
> Location:
67.96 s
> crates/alphal00p-docs-builder/src/lib.rs:5103:9
67.96 s
> stack backtrace:
67.96 s
> 0: __rustc::rust_begin_unwind
67.96 s
> 1: core::panicking::panic_fmt
67.96 s
> 2: core::result::unwrap_failed
67.96 s
> 3: alphal00p_docs_builder::tests::developer_scope_ranges_ignore_unrelated_edits_and_warn_only_while_watching
67.96 s
> 4: <alphal00p_docs_builder::tests::developer_scope_ranges_ignore_unrelated_edits_and_warn_only_while_watching::{closure#0} as core::ops::function::FnOnce<()>>::call_once
67.96 s
> note: Some details are omitted, run with `RUST_BACKTRACE=full` for a verbose backtrace.
67.96 s
> system-out
67.96 s
> running 1 test
67.96 s
> test tests::developer_scope_ranges_ignore_unrelated_edits_and_warn_only_while_watching ... FAILED
67.96 s
>
67.96 s
> failures:
67.96 s
>
67.96 s
> failures:
67.96 s
> tests::developer_scope_ranges_ignore_unrelated_edits_and_warn_only_while_watching
67.96 s
>
67.96 s
> test result: FAILED. 0 passed; 1 failed; 0 ignored; 0 measured; 128 filtered out; finished in 0.11s
67.96 s
> system-err
67.96 s
> thread 'tests::developer_scope_ranges_ignore_unrelated_edits_and_warn_only_while_watching' (284) panicked at crates/alphal00p-docs-builder/src/lib.rs:12350:29:
67.96 s
> called `Result::unwrap()` on an `Err` value: required documentation source is missing: /build/source/crates/spynso3/typst/STIXTwoMath-Regular.woff2
67.96 s
>
67.96 s
> Location:
67.96 s
> crates/alphal00p-docs-builder/src/lib.rs:5103:9
67.96 s
> stack backtrace:
67.96 s
> 0: __rustc::rust_begin_unwind
67.96 s
> 1: core::panicking::panic_fmt
67.96 s
> 2: core::result::unwrap_failed
67.96 s
> 3: alphal00p_docs_builder::tests::developer_scope_ranges_ignore_unrelated_edits_and_warn_only_while_watching
67.96 s
> 4: <alphal00p_docs_builder::tests::developer_scope_ranges_ignore_unrelated_edits_and_warn_only_while_watching::{closure#0} as core::ops::function::FnOnce<()>>::call_once
67.96 s
> note: Some details are omitted, run with `RUST_BACKTRACE=full` for a verbose backtrace.
67.96 s
>
67.96 s
> 10. alphal00p-docs-builder::tests::every_product_requires_a_task_chooser_and_each_supported_interface
67.96 s
> failure: test failure with exit code 101
67.96 s
> thread 'tests::every_product_requires_a_task_chooser_and_each_supported_interface' (309) panicked at crates/alphal00p-docs-builder/src/lib.rs:12274:9:
67.96 s
> assertion failed: format!("{error:#}").contains("has no quickstart page")
67.96 s
> stack backtrace:
67.96 s
> 0: __rustc::rust_begin_unwind
67.96 s
> 1: core::panicking::panic_fmt
67.96 s
> 2: core::panicking::panic
67.96 s
> 3: alphal00p_docs_builder::tests::every_product_requires_a_task_chooser_and_each_supported_interface
67.96 s
> 4: <alphal00p_docs_builder::tests::every_product_requires_a_task_chooser_and_each_supported_interface::{closure#0} as core::ops::function::FnOnce<()>>::call_once
67.96 s
> note: Some details are omitted, run with `RUST_BACKTRACE=full` for a verbose backtrace.
67.96 s
> system-out
67.96 s
> running 1 test
67.96 s
> test tests::every_product_requires_a_task_chooser_and_each_supported_interface ... FAILED
67.96 s
>
67.96 s
> failures:
67.96 s
>
67.96 s
> failures:
67.96 s
> tests::every_product_requires_a_task_chooser_and_each_supported_interface
67.96 s
>
67.96 s
> test result: FAILED. 0 passed; 1 failed; 0 ignored; 0 measured; 128 filtered out; finished in 0.12s
67.96 s
> system-err
67.96 s
> thread 'tests::every_product_requires_a_task_chooser_and_each_supported_interface' (309) panicked at crates/alphal00p-docs-builder/src/lib.rs:12274:9:
67.96 s
> assertion failed: format!("{error:#}").contains("has no quickstart page")
67.96 s
> stack backtrace:
67.96 s
> 0: __rustc::rust_begin_unwind
67.96 s
> 1: core::panicking::panic_fmt
67.96 s
> 2: core::panicking::panic
67.96 s
> 3: alphal00p_docs_builder::tests::every_product_requires_a_task_chooser_and_each_supported_interface
67.96 s
> 4: <alphal00p_docs_builder::tests::every_product_requires_a_task_chooser_and_each_supported_interface::{closure#0} as core::ops::function::FnOnce<()>>::call_once
67.96 s
> note: Some details are omitted, run with `RUST_BACKTRACE=full` for a verbose backtrace.
67.96 s
>
67.96 s
> 11. alphal00p-docs-builder::tests::pdf_manual_chapter_order_must_match_the_page_registry
67.96 s
> failure: test failure with exit code 101
67.96 s
> thread 'tests::pdf_manual_chapter_order_must_match_the_page_registry' (402) panicked at crates/alphal00p-docs-builder/src/lib.rs:12330:9:
67.96 s
> assertion failed: format!("{error:#}").contains("PDF manual chapter order differs")
67.96 s
> stack backtrace:
67.96 s
> 0: __rustc::rust_begin_unwind
67.96 s
> 1: core::panicking::panic_fmt
67.96 s
> 2: core::panicking::panic
67.96 s
> 3: alphal00p_docs_builder::tests::pdf_manual_chapter_order_must_match_the_page_registry
67.96 s
> 4: <alphal00p_docs_builder::tests::pdf_manual_chapter_order_must_match_the_page_registry::{closure#0} as core::ops::function::FnOnce<()>>::call_once
67.96 s
> note: Some details are omitted, run with `RUST_BACKTRACE=full` for a verbose backtrace.
67.96 s
> system-out
67.96 s
> running 1 test
67.96 s
> test tests::pdf_manual_chapter_order_must_match_the_page_registry ... FAILED
67.96 s
>
67.96 s
> failures:
67.96 s
>
67.96 s
> failures:
67.96 s
> tests::pdf_manual_chapter_order_must_match_the_page_registry
67.96 s
>
67.96 s
> test result: FAILED. 0 passed; 1 failed; 0 ignored; 0 measured; 128 filtered out; finished in 0.11s
67.96 s
> system-err
67.96 s
> thread 'tests::pdf_manual_chapter_order_must_match_the_page_registry' (402) panicked at crates/alphal00p-docs-builder/src/lib.rs:12330:9:
67.96 s
> assertion failed: format!("{error:#}").contains("PDF manual chapter order differs")
67.96 s
> stack backtrace:
67.96 s
> 0: __rustc::rust_begin_unwind
67.96 s
> 1: core::panicking::panic_fmt
67.96 s
> 2: core::panicking::panic
67.96 s
> 3: alphal00p_docs_builder::tests::pdf_manual_chapter_order_must_match_the_page_registry
67.96 s
> 4: <alphal00p_docs_builder::tests::pdf_manual_chapter_order_must_match_the_page_registry::{closure#0} as core::ops::function::FnOnce<()>>::call_once
67.96 s
> note: Some details are omitted, run with `RUST_BACKTRACE=full` for a verbose backtrace.
67.96 s
> =========================================
67.96 s
> Extracting 2 binaries to /build/source
67.96 s
> Extracted 5 files to /build/source in 0.03s
67.96 s
> ------------
67.96 s
> Nextest run ID ab300ae5-3f22-4230-b31a-4f7de1fb8f7c with nextest profile: ci_gammaloop
67.96 s
> Starting 22 tests across 2 binaries
67.96 s
> ------------
67.96 s
> Summary [ 0.018s] 22 tests run: 22 passed , 0 skipped
67.96 s
>
67.96 s
> ========== nextest test summary ==========
67.96 s
> report: target/nextest/ci_gammaloop/junit.xml
67.96 s
> tests: 22, failures: 0, errors: 0
67.96 s
> No failing testcases found.
67.96 s
> =========================================
67.96 s
> Extracting 3 binaries (including 2 non-test binaries), 1 build script output directory, and 2 linked paths to /build/source
67.96 s
> Extracted 22 files to /build/source in 0.27s
67.96 s
> ------------
67.96 s
> Nextest run ID df153d31-f0fb-4864-ab82-c414d8ea411a with nextest profile: ci_gammaloop
67.96 s
> Starting 89 tests across 1 binary
67.96 s
> ------------
67.96 s
> Summary [ 0.037s] 89 tests run: 89 passed , 0 skipped
67.96 s
>
67.96 s
> ========== nextest test summary ==========
67.96 s
> report: target/nextest/ci_gammaloop/junit.xml
67.96 s
> tests: 89, failures: 0, errors: 0
67.96 s
> No failing testcases found.
67.96 s
> =========================================
67.96 s
> Extracting 2 binaries to /build/source
67.96 s
> Extracted 5 files to /build/source in 0.04s
67.96 s
> ------------
67.96 s
> Nextest run ID aafb35f4-0aa3-479d-a18a-042b5fce0863 with nextest profile: ci_gammaloop
67.96 s
> Starting 10 tests across 2 binaries
67.96 s
> ------------
67.96 s
> Summary [ 12.075s] 10 tests run: 10 passed , 0 skipped
67.96 s
>
67.96 s
> ========== nextest test summary ==========
67.96 s
> report: target/nextest/ci_gammaloop/junit.xml
67.96 s
> tests: 10, failures: 0, errors: 0
67.96 s
> No failing testcases found.
67.96 s
> =========================================
67.96 s
> Extracting 1 binary to /build/source
67.96 s
> Extracted 4 files to /build/source in 0.03s
67.96 s
> ------------
67.96 s
> Nextest run ID b18503e4-e052-423a-ad8b-5d5cb1010cae with nextest profile: ci_gammaloop
67.96 s
> Starting 0 tests across 1 binary
67.96 s
> ------------
67.96 s
> Summary [ 0.000s] 0 tests run: 0 passed , 0 skipped
67.96 s
>
67.96 s
> ========== nextest test summary ==========
67.96 s
> report: target/nextest/ci_gammaloop/junit.xml
67.96 s
> tests: 0, failures: 0, errors: 0
67.96 s
> No failing testcases found.
67.96 s
> =========================================
67.96 s
> Extracting 1 binary to /build/source
67.96 s
> Extracted 4 files to /build/source in 0.03s
67.96 s
> ------------
67.96 s
> Nextest run ID 32218442-73be-48a1-95ce-22bbd599d23b with nextest profile: ci_gammaloop
67.96 s
> Starting 5 tests across 1 binary
67.96 s
> ------------
67.96 s
> Summary [ 0.005s] 5 tests run: 5 passed , 0 skipped
67.96 s
>
67.96 s
> ========== nextest test summary ==========
67.96 s
> report: target/nextest/ci_gammaloop/junit.xml
67.96 s
> tests: 5, failures: 0, errors: 0
67.96 s
> No failing testcases found.
67.96 s
> =========================================
67.96 s
For full logs, run:
67.96 s
nix log /nix/store/yhcpczfzd32fj8slcs1lsa10nlfs6yzl-gammaloop-nextest-docs.drv
68.13 s
[2 built (1 failed ), 103 Run failed.