test packages.x86_64-linux.nix-ci-check-gammaloop-nextest-docs

Reproduce this run
Retry Run
  1. 0.01 s $ /nix/store/61685rbaxmpigwi3z23i33sv3jyfl70q-coreutils-9.11/bin/timeout --kill-after=15s 7200s /nix/store/wknkybkzrc16r11vk5vrykh4wmw7a353-nix-2.34.8/bin/nix --extra-experimental-features nix-command --extra-experimental-features flakes flake clone git+https://github.com/alphal00p/gammaloop --dest /tmp/nix-ci-worker/stable-pwd/repo/
  2. 0.07 s Cloning into '/tmp/nix-ci-worker/stable-pwd/repo'...
  3. 0.81 s remote: Enumerating objects: 103784, done.
  4. 0.93 s remote: Counting objects: 0% (1/9421) remote: Counting objects: 1% (95/9421) remote: Counting objects: 2% (189/9421) remote: Counting objects: 3% (283/9421) remote: Counting objects: 4% (377/9421) remote: Counting objects: 5% (472/9421) remote: Counting objects: 6% (566/9421) remote: Counting objects: 7% (660/9421) remote: Counting objects: 8% (754/9421) remote: Counting objects: 9% (848/9421) remote: Counting objects: 10% (943/9421) remote: Counting objects: 11% (1037/9421) remote: Counting objects: 12% (1131/9421) remote: Counting objects: 13% (1225/9421) remote: Counting objects: 14% (1319/9421) remote: Counting objects: 15% (1414/9421) remote: Counting objects: 16% (1508/9421) remote: Counting objects: 17% (1602/9421) remote: Counting objects: 18% (1696/9421) remote: Counting objects: 19% (1790/9421) remote: Counting objects: 20% (1885/9421) remote: Counting objects: 21% (1979/9421) remote: Counting objects: 22% (2073/9421) remote: Counting objects: 23% (2167/9421) remote: Counting objects: 24% (2262/9421) remote: Counting objects: 25% (2356/9421) remote: Counting objects: 26% (2450/9421) remote: Counting objects: 27% (2544/9421) remote: Counting objects: 28% (2638/9421) remote: Counting objects: 29% (2733/9421) remote: Counting objects: 30% (2827/9421) remote: Counting objects: 31% (2921/9421) remote: Counting objects: 32% (3015/9421) remote: Counting objects: 33% (3109/9421) remote: Counting objects: 34% (3204/9421) remote: Counting objects: 35% (3298/9421) remote: Counting objects: 36% (3392/9421) remote: Counting objects: 37% (3486/9421) remote: Counting objects: 38% (3580/9421) remote: Counting objects: 39% (3675/9421) remote: Counting objects: 40% (3769/9421) remote: Counting objects: 41% (3863/9421) remote: Counting objects: 42% (3957/9421) remote: Counting objects: 43% (4052/9421) remote: Counting objects: 44% (4146/9421) remote: Counting objects: 45% (4240/9421) remote: Counting objects: 46% (4334/9421) remote: Counting objects: 47% (4428/9421) remote: Counting objects: 48% (4523/9421) remote: Counting objects: 49% (4617/9421) remote: Counting objects: 50% (4711/9421) remote: Counting objects: 51% (4805/9421) remote: Counting objects: 52% (4899/9421) remote: Counting objects: 53% (4994/9421) remote: Counting objects: 54% (5088/9421) remote: Counting objects: 55% (5182/9421) remote: Counting objects: 56% (5276/9421) remote: Counting objects: 57% (5370/9421) remote: Counting objects: 58% (5465/9421) remote: Counting objects: 59% (5559/9421) remote: Counting objects: 60% (5653/9421) remote: Counting objects: 61% (5747/9421) remote: Counting objects: 62% (5842/9421) remote: Counting objects: 63% (5936/9421) remote: Counting objects: 64% (6030/9421) remote: Counting objects: 65% (6124/9421) remote: Counting objects: 66% (6218/9421) remote: Counting objects: 67% (6313/9421) remote: Counting objects: 68% (6407/9421) remote: Counting objects: 69% (6501/9421) remote: Counting objects: 70% (6595/9421) remote: Counting objects: 71% (6689/9421) remote: Counting objects: 72% (6784/9421) remote: Counting objects: 73% (6878/9421) remote: Counting objects: 74% (6972/9421) remote: Counting objects: 75% (7066/9421) remote: Counting objects: 76% (7160/9421) remote: Counting objects: 77% (7255/9421) remote: Counting objects: 78% (7349/9421) remote: Counting objects: 79% (7443/9421) remote: Counting objects: 80% (7537/9421) remote: Counting objects: 81% (7632/9421) remote: Counting objects: 82% (7726/9421) remote: Counting objects: 83% (7820/9421) remote: Counting objects: 84% (7914/9421) remote: Counting objects: 85% (8008/9421) remote: Counting objects: 86% (8103/9421) remote: Counting objects: 87% (8197/9421) remote: Counting objects: 88% (8291/9421) remote: Counting objects: 89% (8385/9421) remote: Counting objects: 90% (8479/9421) remote: Counting objects: 91% (8574/9421) remote: Counting objects: 92% (8668/9421) remote: Counting objects: 93% (8762/9421) remote: Counting objects: 94% (8856/9421) remote: Counting objects: 95% (8950/9421) remote: Counting objects: 96% (9045/9421) remote: Counting objects: 97% (9139/9421) remote: Counting objects: 98% (9233/9421) remote: Counting objects: 99% (9327/9421) remote: Counting objects: 100% (9421/9421) remote: Counting objects: 100% (9421/9421), done.
  5. 2.90 s remote: Compressing objects: 0% (1/2027) remote: Compressing objects: 1% (21/2027) remote: Compressing objects: 2% (41/2027) remote: Compressing objects: 3% (61/2027) remote: Compressing objects: 4% (82/2027) remote: Compressing objects: 5% (102/2027) remote: Compressing objects: 6% (122/2027) remote: Compressing objects: 7% (142/2027) remote: Compressing objects: 8% (163/2027) remote: Compressing objects: 9% (183/2027) remote: Compressing objects: 10% (203/2027) remote: Compressing objects: 10% (218/2027) remote: Compressing objects: 11% (223/2027) remote: Compressing objects: 12% (244/2027) remote: Compressing objects: 13% (264/2027) remote: Compressing objects: 14% (284/2027) remote: Compressing objects: 15% (305/2027) remote: Compressing objects: 16% (325/2027) remote: Compressing objects: 17% (345/2027) remote: Compressing objects: 18% (365/2027) remote: Compressing objects: 19% (386/2027) remote: Compressing objects: 20% (406/2027) remote: Compressing objects: 21% (426/2027) remote: Compressing objects: 22% (446/2027) remote: Compressing objects: 23% (467/2027) remote: Compressing objects: 24% (487/2027) remote: Compressing objects: 25% (507/2027) remote: Compressing objects: 26% (528/2027) remote: Compressing objects: 27% (548/2027) remote: Compressing objects: 28% (568/2027) remote: Compressing objects: 29% (588/2027) remote: Compressing objects: 30% (609/2027) remote: Compressing objects: 31% (629/2027) remote: Compressing objects: 32% (649/2027) remote: Compressing objects: 33% (669/2027) remote: Compressing objects: 34% (690/2027) remote: Compressing objects: 35% (710/2027) remote: Compressing objects: 36% (730/2027) remote: Compressing objects: 37% (750/2027) remote: Compressing objects: 38% (771/2027) remote: Compressing objects: 39% (791/2027) remote: Compressing objects: 40% (811/2027) remote: Compressing objects: 41% (832/2027) remote: Compressing objects: 42% (852/2027) remote: Compressing objects: 43% (872/2027) remote: Compressing objects: 44% (892/2027) remote: Compressing objects: 45% (913/2027) remote: Compressing objects: 46% (933/2027) remote: Compressing objects: 47% (953/2027) remote: Compressing objects: 48% (973/2027) remote: Compressing objects: 49% (994/2027) remote: Compressing objects: 50% (1014/2027) remote: Compressing objects: 51% (1034/2027) remote: Compressing objects: 52% (1055/2027) remote: Compressing objects: 53% (1075/2027) remote: Compressing objects: 54% (1095/2027) remote: Compressing objects: 55% (1115/2027) remote: Compressing objects: 56% (1136/2027) remote: Compressing objects: 57% (1156/2027) remote: Compressing objects: 58% (1176/2027) remote: Compressing objects: 59% (1196/2027) remote: Compressing objects: 60% (1217/2027) remote: Compressing objects: 61% (1237/2027) remote: Compressing objects: 62% (1257/2027) remote: Compressing objects: 63% (1278/2027) remote: Compressing objects: 64% (1298/2027) remote: Compressing objects: 65% (1318/2027) remote: Compressing objects: 66% (1338/2027) remote: Compressing objects: 67% (1359/2027) remote: Compressing objects: 68% (1379/2027) remote: Compressing objects: 69% (1399/2027) remote: Compressing objects: 70% (1419/2027) remote: Compressing objects: 71% (1440/2027) remote: Compressing objects: 72% (1460/2027) remote: Compressing objects: 73% (1480/2027) remote: Compressing objects: 74% (1500/2027) remote: Compressing objects: 75% (1521/2027) remote: Compressing objects: 76% (1541/2027) remote: Compressing objects: 77% (1561/2027) remote: Compressing objects: 78% (1582/2027) remote: Compressing objects: 79% (1602/2027) remote: Compressing objects: 80% (1622/2027) remote: Compressing objects: 81% (1642/2027) remote: Compressing objects: 82% (1663/2027) remote: Compressing objects: 83% (1683/2027) remote: Compressing objects: 84% (1703/2027) remote: Compressing objects: 85% (1723/2027) remote: Compressing objects: 86% (1744/2027) remote: Compressing objects: 87% (1764/2027) remote: Compressing objects: 88% (1784/2027) remote: Compressing objects: 89% (1805/2027) remote: Compressing objects: 90% (1825/2027) remote: Compressing objects: 91% (1845/2027) remote: Compressing objects: 92% (1865/2027) remote: Compressing objects: 93% (1886/2027) remote: Compressing objects: 94% (1906/2027) remote: Compressing objects: 95% (1926/2027) remote: Compressing objects: 96% (1946/2027) remote: Compressing objects: 97% (1967/2027) remote: Compressing objects: 98% (1987/2027) remote: Compressing objects: 99% (2007/2027) remote: Compressing objects: 100% (2027/2027) remote: Compressing objects: 100% (2027/2027), done.
  6. 16.44 s Receiving objects: 0% (1/103784) Receiving objects: 1% (1038/103784) Receiving objects: 2% (2076/103784) Receiving objects: 3% (3114/103784) Receiving objects: 4% (4152/103784) Receiving objects: 5% (5190/103784) Receiving objects: 6% (6228/103784) Receiving objects: 7% (7265/103784), 11.29 MiB | 22.55 MiB/s Receiving objects: 8% (8303/103784), 11.29 MiB | 22.55 MiB/s Receiving objects: 9% (9341/103784), 11.29 MiB | 22.55 MiB/s Receiving objects: 10% (10379/103784), 11.29 MiB | 22.55 MiB/s Receiving objects: 11% (11417/103784), 11.29 MiB | 22.55 MiB/s Receiving objects: 12% (12455/103784), 11.29 MiB | 22.55 MiB/s Receiving objects: 13% (13492/103784), 11.29 MiB | 22.55 MiB/s Receiving objects: 14% (14530/103784), 11.29 MiB | 22.55 MiB/s Receiving objects: 15% (15568/103784), 11.29 MiB | 22.55 MiB/s Receiving objects: 16% (16606/103784), 11.29 MiB | 22.55 MiB/s Receiving objects: 17% (17644/103784), 11.29 MiB | 22.55 MiB/s Receiving objects: 18% (18682/103784), 11.29 MiB | 22.55 MiB/s Receiving objects: 19% (19719/103784), 11.29 MiB | 22.55 MiB/s Receiving objects: 20% (20757/103784), 11.29 MiB | 22.55 MiB/s Receiving objects: 21% (21795/103784), 11.29 MiB | 22.55 MiB/s Receiving objects: 22% (22833/103784), 11.29 MiB | 22.55 MiB/s Receiving objects: 23% (23871/103784), 11.29 MiB | 22.55 MiB/s Receiving objects: 24% (24909/103784), 11.29 MiB | 22.55 MiB/s Receiving objects: 25% (25946/103784), 11.29 MiB | 22.55 MiB/s Receiving objects: 26% (26984/103784), 11.29 MiB | 22.55 MiB/s Receiving objects: 27% (28022/103784), 11.29 MiB | 22.55 MiB/s Receiving objects: 28% (29060/103784), 11.29 MiB | 22.55 MiB/s Receiving objects: 29% (30098/103784), 11.29 MiB | 22.55 MiB/s Receiving objects: 30% (31136/103784), 11.29 MiB | 22.55 MiB/s Receiving objects: 30% (31510/103784), 11.29 MiB | 22.55 MiB/s Receiving objects: 31% (32174/103784), 29.48 MiB | 29.47 MiB/s Receiving objects: 32% (33211/103784), 29.48 MiB | 29.47 MiB/s Receiving objects: 33% (34249/103784), 29.48 MiB | 29.47 MiB/s Receiving objects: 34% (35287/103784), 29.48 MiB | 29.47 MiB/s Receiving objects: 35% (36325/103784), 29.48 MiB | 29.47 MiB/s Receiving objects: 36% (37363/103784), 29.48 MiB | 29.47 MiB/s Receiving objects: 37% (38401/103784), 29.48 MiB | 29.47 MiB/s Receiving objects: 38% (39438/103784), 44.61 MiB | 29.67 MiB/s Receiving objects: 39% (40476/103784), 44.61 MiB | 29.67 MiB/s Receiving objects: 40% (41514/103784), 44.61 MiB | 29.67 MiB/s Receiving objects: 41% (42552/103784), 44.61 MiB | 29.67 MiB/s Receiving objects: 42% (43590/103784), 44.61 MiB | 29.67 MiB/s Receiving objects: 43% (44628/103784), 44.61 MiB | 29.67 MiB/s Receiving objects: 44% (45665/103784), 44.61 MiB | 29.67 MiB/s Receiving objects: 45% (46703/103784), 44.61 MiB | 29.67 MiB/s Receiving objects: 46% (47741/103784), 44.61 MiB | 29.67 MiB/s Receiving objects: 46% (48736/103784), 61.99 MiB | 30.42 MiB/s Receiving objects: 47% (48779/103784), 61.99 MiB | 30.42 MiB/s Receiving objects: 48% (49817/103784), 61.99 MiB | 30.42 MiB/s Receiving objects: 49% (50855/103784), 61.99 MiB | 30.42 MiB/s Receiving objects: 50% (51892/103784), 61.99 MiB | 30.42 MiB/s Receiving objects: 51% (52930/103784), 61.99 MiB | 30.42 MiB/s Receiving objects: 52% (53968/103784), 61.99 MiB | 30.42 MiB/s Receiving objects: 53% (55006/103784), 78.88 MiB | 30.98 MiB/s Receiving objects: 54% (56044/103784), 78.88 MiB | 30.98 MiB/s Receiving objects: 54% (57017/103784), 95.77 MiB | 31.06 MiB/s Receiving objects: 54% (57059/103784), 112.76 MiB | 31.42 MiB/s Receiving objects: 55% (57082/103784), 112.76 MiB | 31.42 MiB/s Receiving objects: 55% (58083/103784), 146.75 MiB | 31.68 MiB/s Receiving objects: 56% (58120/103784), 164.09 MiB | 32.73 MiB/s Receiving objects: 56% (58208/103784), 180.52 MiB | 32.31 MiB/s Receiving objects: 56% (58605/103784), 215.21 MiB | 32.73 MiB/s Receiving objects: 57% (59157/103784), 215.21 MiB | 32.73 MiB/s Receiving objects: 58% (60195/103784), 230.90 MiB | 32.54 MiB/s Receiving objects: 59% (61233/103784), 230.90 MiB | 32.54 MiB/s Receiving objects: 60% (62271/103784), 230.90 MiB | 32.54 MiB/s Receiving objects: 61% (63309/103784), 230.90 MiB | 32.54 MiB/s Receiving objects: 62% (64347/103784), 230.90 MiB | 32.54 MiB/s Receiving objects: 63% (65384/103784), 246.43 MiB | 32.50 MiB/s Receiving objects: 63% (65781/103784), 246.43 MiB | 32.50 MiB/s Receiving objects: 64% (66422/103784), 246.43 MiB | 32.50 MiB/s Receiving objects: 65% (67460/103784), 246.43 MiB | 32.50 MiB/s Receiving objects: 66% (68498/103784), 246.43 MiB | 32.50 MiB/s Receiving objects: 67% (69536/103784), 246.43 MiB | 32.50 MiB/s Receiving objects: 68% (70574/103784), 246.43 MiB | 32.50 MiB/s Receiving objects: 69% (71611/103784), 246.43 MiB | 32.50 MiB/s Receiving objects: 70% (72649/103784), 246.43 MiB | 32.50 MiB/s Receiving objects: 71% (73687/103784), 246.43 MiB | 32.50 MiB/s Receiving objects: 72% (74725/103784), 264.17 MiB | 32.65 MiB/s Receiving objects: 73% (75763/103784), 264.17 MiB | 32.65 MiB/s Receiving objects: 74% (76801/103784), 264.17 MiB | 32.65 MiB/s Receiving objects: 74% (77738/103784), 280.83 MiB | 32.71 MiB/s Receiving objects: 75% (77838/103784), 280.83 MiB | 32.71 MiB/s Receiving objects: 76% (78876/103784), 297.92 MiB | 32.65 MiB/s Receiving objects: 77% (79914/103784), 297.92 MiB | 32.65 MiB/s Receiving objects: 78% (80952/103784), 297.92 MiB | 32.65 MiB/s Receiving objects: 79% (81990/103784), 297.92 MiB | 32.65 MiB/s Receiving objects: 80% (83028/103784), 297.92 MiB | 32.65 MiB/s Receiving objects: 81% (84066/103784), 297.92 MiB | 32.65 MiB/s Receiving objects: 82% (85103/103784), 315.74 MiB | 33.02 MiB/s Receiving objects: 82% (85349/103784), 315.74 MiB | 33.02 MiB/s Receiving objects: 82% (85502/103784), 348.88 MiB | 32.99 MiB/s Receiving objects: 83% (86141/103784), 366.06 MiB | 32.84 MiB/s Receiving objects: 84% (87179/103784), 366.06 MiB | 32.84 MiB/s Receiving objects: 85% (88217/103784), 366.06 MiB | 32.84 MiB/s Receiving objects: 86% (89255/103784), 383.33 MiB | 33.12 MiB/s Receiving objects: 87% (90293/103784), 383.33 MiB | 33.12 MiB/s Receiving objects: 88% (91330/103784), 383.33 MiB | 33.12 MiB/s Receiving objects: 88% (91946/103784), 383.33 MiB | 33.12 MiB/s Receiving objects: 89% (92368/103784), 383.33 MiB | 33.12 MiB/s Receiving objects: 89% (92662/103784), 418.14 MiB | 33.27 MiB/s Receiving objects: 90% (93406/103784), 418.14 MiB | 33.27 MiB/s Receiving objects: 91% (94444/103784), 418.14 MiB | 33.27 MiB/s Receiving objects: 92% (95482/103784), 418.14 MiB | 33.27 MiB/s Receiving objects: 93% (96520/103784), 418.14 MiB | 33.27 MiB/s Receiving objects: 94% (97557/103784), 418.14 MiB | 33.27 MiB/s Receiving objects: 95% (98595/103784), 418.14 MiB | 33.27 MiB/s Receiving objects: 96% (99633/103784), 418.14 MiB | 33.27 MiB/s Receiving objects: 97% (100671/103784), 434.87 MiB | 33.55 MiB/s Receiving objects: 98% (101709/103784), 434.87 MiB | 33.55 MiB/s Receiving objects: 99% (102747/103784), 434.87 MiB | 33.55 MiB/s remote: Total 103784 (delta 8150), reused 7457 (delta 7388), pack-reused 94363 (from 4)
  7. 16.44 s Receiving objects: 100% (103784/103784), 434.87 MiB | 33.55 MiB/s Receiving objects: 100% (103784/103784), 439.18 MiB | 32.45 MiB/s, done.
  8. 17.60 s Resolving deltas: 0% (0/67929) Resolving deltas: 1% (680/67929) Resolving deltas: 2% (1364/67929) Resolving deltas: 3% (2038/67929) Resolving deltas: 4% (2718/67929) Resolving deltas: 5% (3397/67929) Resolving deltas: 6% (4076/67929) Resolving deltas: 7% (4756/67929) Resolving deltas: 8% (5435/67929) Resolving deltas: 9% (6114/67929) Resolving deltas: 10% (6794/67929) Resolving deltas: 11% (7473/67929) Resolving deltas: 12% (8152/67929) Resolving deltas: 13% (8831/67929) Resolving deltas: 14% (9511/67929) Resolving deltas: 15% (10190/67929) Resolving deltas: 16% (10870/67929) Resolving deltas: 17% (11550/67929) Resolving deltas: 18% (12229/67929) Resolving deltas: 19% (12907/67929) Resolving deltas: 20% (13587/67929) Resolving deltas: 21% (14267/67929) Resolving deltas: 22% (14946/67929) Resolving deltas: 23% (15627/67929) Resolving deltas: 24% (16304/67929) Resolving deltas: 25% (16987/67929) Resolving deltas: 26% (17662/67929) Resolving deltas: 27% (18341/67929) Resolving deltas: 28% (19021/67929) Resolving deltas: 29% (19700/67929) Resolving deltas: 30% (20379/67929) Resolving deltas: 31% (21058/67929) Resolving deltas: 32% (21738/67929) Resolving deltas: 33% (22417/67929) Resolving deltas: 34% (23096/67929) Resolving deltas: 35% (23776/67929) Resolving deltas: 36% (24456/67929) Resolving deltas: 37% (25134/67929) Resolving deltas: 38% (25816/67929) Resolving deltas: 39% (26493/67929) Resolving deltas: 40% (27172/67929) Resolving deltas: 41% (27851/67929) Resolving deltas: 42% (28531/67929) Resolving deltas: 43% (29210/67929) Resolving deltas: 44% (29889/67929) Resolving deltas: 45% (30569/67929) Resolving deltas: 46% (31249/67929) Resolving deltas: 47% (31927/67929) Resolving deltas: 48% (32606/67929) Resolving deltas: 49% (33286/67929) Resolving deltas: 50% (33966/67929) Resolving deltas: 51% (34644/67929) Resolving deltas: 52% (35324/67929) Resolving deltas: 53% (36003/67929) Resolving deltas: 54% (36682/67929) Resolving deltas: 55% (37361/67929) Resolving deltas: 56% (38041/67929) Resolving deltas: 57% (38720/67929) Resolving deltas: 58% (39400/67929) Resolving deltas: 59% (40080/67929) Resolving deltas: 60% (40758/67929) Resolving deltas: 61% (41438/67929) Resolving deltas: 62% (42116/67929) Resolving deltas: 63% (42796/67929) Resolving deltas: 64% (43475/67929) Resolving deltas: 65% (44155/67929) Resolving deltas: 66% (44837/67929) Resolving deltas: 67% (45513/67929) Resolving deltas: 68% (46192/67929) Resolving deltas: 69% (46872/67929) Resolving deltas: 70% (47551/67929) Resolving deltas: 71% (48230/67929) Resolving deltas: 72% (48909/67929) Resolving deltas: 73% (49590/67929) Resolving deltas: 74% (50268/67929) Resolving deltas: 75% (50947/67929) Resolving deltas: 76% (51627/67929) Resolving deltas: 77% (52306/67929) Resolving deltas: 78% (52985/67929) Resolving deltas: 79% (53664/67929) Resolving deltas: 80% (54345/67929) Resolving deltas: 81% (55023/67929) Resolving deltas: 82% (55702/67929) Resolving deltas: 83% (56382/67929) Resolving deltas: 84% (57063/67929) Resolving deltas: 85% (57740/67929) Resolving deltas: 85% (57766/67929) Resolving deltas: 86% (58419/67929) Resolving deltas: 87% (59099/67929) Resolving deltas: 88% (59780/67929) Resolving deltas: 89% (60457/67929) Resolving deltas: 90% (61137/67929) Resolving deltas: 91% (61816/67929) Resolving deltas: 92% (62495/67929) Resolving deltas: 93% (63174/67929) Resolving deltas: 94% (63854/67929) Resolving deltas: 95% (64534/67929) Resolving deltas: 96% (65212/67929) Resolving deltas: 97% (65892/67929) Resolving deltas: 98% (66571/67929) Resolving deltas: 99% (67250/67929) Resolving deltas: 100% (67929/67929) Resolving deltas: 100% (67929/67929), done.
  9. 18.22 s Fetching commit 58aaf5380023d118a91aa4083c01395586246f14 for feynkit ...
  10. 18.22 s $ /nix/store/5vpcfsdx1lcnlb2y4k7xyc74shp5qwbh-git-2.54.0/bin/git fetch origin 58aaf5380023d118a91aa4083c01395586246f14
  11. 18.63 s From https://github.com/alphal00p/gammaloop
  12. 18.63 s * branch 58aaf5380023d118a91aa4083c01395586246f14 -> FETCH_HEAD
  13. 18.64 s $ /nix/store/61685rbaxmpigwi3z23i33sv3jyfl70q-coreutils-9.11/bin/timeout --kill-after=15s 7200s /nix/store/5vpcfsdx1lcnlb2y4k7xyc74shp5qwbh-git-2.54.0/bin/git -c advice.detachedHead=false checkout 58aaf5380023d118a91aa4083c01395586246f14
  14. 18.87 s HEAD is now at 58aaf5380 share physics layout across graph renderers
  15. 18.88 s $ /nix/store/61685rbaxmpigwi3z23i33sv3jyfl70q-coreutils-9.11/bin/timeout --kill-after=15s 7200s /nix/store/wknkybkzrc16r11vk5vrykh4wmw7a353-nix-2.34.8/bin/nix --extra-experimental-features nix-command --extra-experimental-features flakes --log-format internal-json run .#packages.x86_64-linux.nix-ci-check-gammaloop-nextest-docs --print-build-logs
  16. 19.02 s warning: ignoring untrusted flake configuration setting 'extra-substituters'.
  17. 19.02 s Pass '--accept-flake-config' to trust it
  18. 19.02 s warning: ignoring untrusted flake configuration setting 'extra-trusted-public-keys'.
  19. 19.02 s Pass '--accept-flake-config' to trust it
  20. 24.17 s
  21. 24.41 s evaluating derivation 'gdo you want to allow configuration setting 'extra-substituters' to be set to 'https://cache.nix-ci.com' (y/N)? do you want to permanently mark this value as untrusted (y/N)? warning: ignoring untrusted flake configuration setting 'extra-substituters'.
  22. 24.41 s Pass '--accept-flake-config' to trust it
  23. 24.41 s do you want to allow configuration setting 'extra-trusted-public-keys' to be set to 'nix-ci:g3xV5BDTLtIBZr/A00IU1x0EtKKlb7YLgBN2SgYgM6A=' (y/N)? do you want to permanently mark this value as untrusted (y/N)? warning: ignoring untrusted flake configuration setting 'extra-trusted-public-keys'.
  24. 24.41 s Pass '--accept-flake-config' to trust it
  25. 41.35 s copying '/nix/store/566x evaluating derivation 'g copying '/nix/store/566x evaluating derivation 'g copying '/nix/store/566x evaluating derivation 'g copying '/nix/store/566x evaluating derivation 'g copying '/nix/store/566x evaluating derivation 'g copying '/nix/store/566x evaluating derivation 'g querying source on https [1/0/1 copied (256.0 KiB [1/0/1 copied (6.7/201.4 [1/0/1 copied (11.8/201. [1/0/1 copied (17.5/201. [1/0/1 copied (22.0/201. [1/0/1 copied (25.2/201. [1/0/1 copied (33.3/201. [1/0/1 copied (36.1/201. [1/0/1 copied (38.8/201. [1/0/1 copied (41.1/201. [1/0/1 copied (43.5/201. [1/0/1 copied (46.9/201. [1/0/1 copied (49.4/201. [1/0/1 copied (51.4/201. [1/0/1 copied (53.8/201. [1/0/1 copied (56.2/201. [1/0/1 copied (58.6/201. [1/0/1 copied (60.6/201. [1/0/1 copied (62.7/201. [1/0/1 copied (64.5/201. [1/0/1 copied (66.6/201. [1/0/1 copied (69.3/201. [1/0/1 copied (71.8/201. [1/0/1 copied (73.6/201. [1/0/1 copied (75.0/201. [1/0/1 copied (76.7/201. [1/0/1 copied (79.4/201. [1/0/1 copied (81.4/201. [1/0/1 copied (84.7/201. [1/0/1 copied (87.2/201. [1/0/1 copied (89.2/201. [1/0/1 copied (91.4/201. [1/0/1 copied (94.4/201. [1/0/1 copied (97.0/201. [1/0/1 copied (99.6/201. [1/0/1 copied (102.0/201 [1/0/1 copied (104.2/201 [1/0/1 copied (107.0/201 [1/0/1 copied (108.7/201 [1/0/1 copied (112.4/201 [1/0/1 copied (115.0/201 [1/0/1 copied (116.9/201 [1/0/1 copied (118.6/201 [1/0/1 copied (131.1/201 [1/0/1 copied (142.6/201 [1/0/1 copied (152.9/201 [1/0/1 copied (158.6/201 [1/0/1 copied (160.1/201 [1/0/1 copied (161.2/201 [1/0/1 copied (162.4/201 [1/0/1 copied (163.9/201 [1/0/1 copied (165.0/201 [1/0/1 copied (166.2/201 [1/0/1 copied (167.4/201 [1/0/1 copied (168.6/201 [1/0/1 copied (170.0/201 [1/0/1 copied (171.1/201 [1/0/1 copied (172.2/201 [1/0/1 copied (173.7/201 [1/0/1 copied (174.9/201 [1/0/1 copied (176.3/201 [1/0/1 copied (179.0/201 [1/0/1 copied (187.8/201 [1/0/1 copied (189.7/201 [1/0/1 copied (192.7/201 [1/0/1 copied (201.4 MiB [1 copied (201.4 MiB), 4 [0/14 built, 16/5/103 co [0/14 built, 16/18/103 c [0/11 built, 16/33/103 c [0/10 built, 7/46/103 co [0/10 built, 7/50/103 co [0/10 built, 5/54/103 co [0/10 built, 4/56/103 co [0/10 built, 3/57/103 co [0/10 built, 16/58/103 c [0/10 built, 16/64/103 c [0/9 built, 15/68/103 co [0/9 built, 12/77/103 co [0/9 built, 7/82/103 cop [0/9 built, 7/87/103 cop [0/9 built, 6/89/103 cop [0/8 built, 5/90/103 cop [0/8 built, 7/91/103 cop [0/8 built, 6/93/103 cop [0/7 built, 5/94/103 cop [1/0/7 built, 5/94/103 cbuilder.pl> Running phase: patchPhase
  26. 41.35 s builder.pl> Running phase: updateAutotoolsGnuConfigScriptsPhase
  27. 41.36 s builder.pl> Running phase: configurePhase
  28. 41.37 s builder.pl> no configure script, doing nothing
  29. 41.37 s builder.pl> Running phase: buildPhase
  30. 41.38 s builder.pl> Running phase: checkPhase
  31. 41.38 s [1/0/7 built, 5/95/103 cbuilder.pl> Running phase: installPhase
  32. 41.38 s builder.pl> no Makefile or custom installPhase, doing nothing
  33. 41.39 s builder.pl> Running phase: fixupPhase
  34. 41.40 s builder.pl> shrinking RPATHs of ELF executables and libraries in /nix/store/zzmspl8wdn2a3ancrz8dg3kci887nw6d-builder.pl
  35. 41.40 s builder.pl> checking for references to /build/ in /nix/store/zzmspl8wdn2a3ancrz8dg3kci887nw6d-builder.pl...
  36. 41.41 s builder.pl> patching script interpreter paths in /nix/store/zzmspl8wdn2a3ancrz8dg3kci887nw6d-builder.pl
  37. 41.43 s builder.pl (post)> Uploading to the NixCI cache: /nix/store/zzmspl8wdn2a3ancrz8dg3kci887nw6d-builder.pl
  38. 41.48 s builder.pl (post)> warning: 'warn-short-path-literals' is deprecated, use 'lint-short-path-literals = ignore' instead
  39. 41.51 s builder.pl (post)> copying 0 paths...
  40. 41.56 s builder.pl (post)> warning: 'warn-short-path-literals' is deprecated, use 'lint-short-path-literals = ignore' instead
  41. 42.00 s builder.pl (post)> copying 0 paths...
  42. 42.70 s [1/6 built, 3/98/103 cop [1/5 built, 2/99/103 cop [1/4 built, 1/100/103 co [1/4 built, 1/101/103 co [1/3 built, 103 copied (typst> structuredAttrs is enabled
  43. 42.76 s [1/1/3 built, 103 copiedtypst> created 4 symlinks in user environment
  44. 42.84 s typst (post)> Uploading to the NixCI cache: /nix/store/yc93gbspdkf53nwjsf1mbydbsaq9snxl-typst-0.15.1-env
  45. 42.88 s typst (post)> warning: 'warn-short-path-literals' is deprecated, use 'lint-short-path-literals = ignore' instead
  46. 42.90 s typst (post)> copying 0 paths...
  47. 42.94 s typst (post)> warning: 'warn-short-path-literals' is deprecated, use 'lint-short-path-literals = ignore' instead
  48. 43.42 s typst (post)> copying 0 paths...
  49. 43.84 s [2/4 built, 103 copied ( [1/2/3 built, 103 copiedgammaloop-nextest-docs> Extracting 2 binaries to /build/source
  50. 43.88 s gammaloop-nextest-docs> Extracted 5 files to /build/source in 0.04s
  51. 43.89 s gammaloop-nextest-docs> ------------
  52. 43.89 s gammaloop-nextest-docs> Nextest run ID 084cddad-40b2-4805-90a7-48ad0373b0fe with nextest profile: ci_gammaloop
  53. 43.89 s gammaloop-nextest-docs> Starting 129 tests across 2 binaries
  54. 43.91 s gammaloop-nextest-docs> FAIL [ 0.009s] ( 23/129) alphal00p-docs-builder tests::developer_architecture_is_classified_searchable_and_source_backed
  55. 43.91 s gammaloop-nextest-docs> stdout ---
  56. 43.91 s gammaloop-nextest-docs>
  57. 43.91 s gammaloop-nextest-docs> running 1 test
  58. 43.91 s gammaloop-nextest-docs> test tests::developer_architecture_is_classified_searchable_and_source_backed ... FAILED
  59. 43.91 s gammaloop-nextest-docs>
  60. 43.91 s gammaloop-nextest-docs> failures:
  61. 43.91 s gammaloop-nextest-docs>
  62. 43.91 s gammaloop-nextest-docs> failures:
  63. 43.91 s gammaloop-nextest-docs> tests::developer_architecture_is_classified_searchable_and_source_backed
  64. 43.91 s gammaloop-nextest-docs>
  65. 43.91 s gammaloop-nextest-docs> test result: FAILED. 0 passed; 1 failed; 0 ignored; 0 measured; 128 filtered out; finished in 0.01s
  66. 43.91 s gammaloop-nextest-docs>
  67. 43.91 s gammaloop-nextest-docs> stderr ---
  68. 43.91 s gammaloop-nextest-docs>
  69. 43.91 s gammaloop-nextest-docs> thread 'tests::developer_architecture_is_classified_searchable_and_source_backed' (276) panicked at crates/alphal00p-docs-builder/src/lib.rs:12751:14:
  70. 43.91 s gammaloop-nextest-docs> called `Result::unwrap()` on an `Err` value: failed to copy documentation asset crates/spynso3/typst/STIXTwoMath-Regular.woff2
  71. 43.91 s gammaloop-nextest-docs>
  72. 43.91 s gammaloop-nextest-docs> Caused by:
  73. 43.91 s gammaloop-nextest-docs> No such file or directory (os error 2)
  74. 43.91 s gammaloop-nextest-docs>
  75. 43.91 s gammaloop-nextest-docs> Location:
  76. 43.91 s gammaloop-nextest-docs> crates/alphal00p-docs-builder/src/lib.rs:2276:18
  77. 43.91 s gammaloop-nextest-docs> stack backtrace:
  78. 43.91 s gammaloop-nextest-docs> 0: __rustc::rust_begin_unwind
  79. 43.91 s gammaloop-nextest-docs> 1: core::panicking::panic_fmt
  80. 43.91 s gammaloop-nextest-docs> 2: core::result::unwrap_failed
  81. 43.91 s gammaloop-nextest-docs> 3: alphal00p_docs_builder::tests::developer_architecture_is_classified_searchable_and_source_backed
  82. 43.91 s gammaloop-nextest-docs> 4: <alphal00p_docs_builder::tests::developer_architecture_is_classified_searchable_and_source_backed::{closure#0} as core::ops::function::FnOnce<()>>::call_once
  83. 43.91 s gammaloop-nextest-docs> note: Some details are omitted, run with `RUST_BACKTRACE=full` for a verbose backtrace.
  84. 43.91 s gammaloop-nextest-docs>
  85. 43.92 s gammaloop-nextest-docs> FAIL [ 0.011s] ( 30/129) alphal00p-docs-builder tests::every_product_orients_rust_to_native_rustdoc_and_keeps_legacy_redirects
  86. 43.92 s gammaloop-nextest-docs> stdout ---
  87. 43.92 s gammaloop-nextest-docs>
  88. 43.92 s gammaloop-nextest-docs> running 1 test
  89. 43.92 s gammaloop-nextest-docs> test tests::every_product_orients_rust_to_native_rustdoc_and_keeps_legacy_redirects ... FAILED
  90. 43.92 s gammaloop-nextest-docs>
  91. 43.92 s gammaloop-nextest-docs> failures:
  92. 43.92 s gammaloop-nextest-docs>
  93. 43.92 s gammaloop-nextest-docs> failures:
  94. 43.92 s gammaloop-nextest-docs> tests::every_product_orients_rust_to_native_rustdoc_and_keeps_legacy_redirects
  95. 43.92 s gammaloop-nextest-docs>
  96. 43.92 s gammaloop-nextest-docs> test result: FAILED. 0 passed; 1 failed; 0 ignored; 0 measured; 128 filtered out; finished in 0.01s
  97. 43.92 s gammaloop-nextest-docs>
  98. 43.92 s gammaloop-nextest-docs> stderr ---
  99. 43.92 s gammaloop-nextest-docs>
  100. 43.92 s gammaloop-nextest-docs> thread 'tests::every_product_orients_rust_to_native_rustdoc_and_keeps_legacy_redirects' (302) panicked at crates/alphal00p-docs-builder/src/lib.rs:12555:46:
  101. 43.92 s gammaloop-nextest-docs> called `Result::unwrap()` on an `Err` value: failed to copy documentation asset crates/spynso3/typst/STIXTwoMath-Regular.woff2
  102. 43.92 s gammaloop-nextest-docs>
  103. 43.92 s gammaloop-nextest-docs> Caused by:
  104. 43.92 s gammaloop-nextest-docs> No such file or directory (os error 2)
  105. 43.92 s gammaloop-nextest-docs>
  106. 43.92 s gammaloop-nextest-docs> Location:
  107. 43.92 s gammaloop-nextest-docs> crates/alphal00p-docs-builder/src/lib.rs:2276:18
  108. 43.92 s gammaloop-nextest-docs> stack backtrace:
  109. 43.92 s gammaloop-nextest-docs> 0: __rustc::rust_begin_unwind
  110. 43.92 s gammaloop-nextest-docs> 1: core::panicking::panic_fmt
  111. 43.92 s gammaloop-nextest-docs> 2: core::result::unwrap_failed
  112. 43.92 s gammaloop-nextest-docs> 3: alphal00p_docs_builder::tests::every_product_orients_rust_to_native_rustdoc_and_keeps_legacy_redirects
  113. 43.92 s gammaloop-nextest-docs> 4: <alphal00p_docs_builder::tests::every_product_orients_rust_to_native_rustdoc_and_keeps_legacy_redirects::{closure#0} as core::ops::function::FnOnce<()>>::call_once
  114. 43.92 s gammaloop-nextest-docs> note: Some details are omitted, run with `RUST_BACKTRACE=full` for a verbose backtrace.
  115. 43.92 s gammaloop-nextest-docs>
  116. 43.95 s gammaloop-nextest-docs> FAIL [ 0.009s] ( 54/129) alphal00p-docs-builder tests::portal_and_developer_pages_use_federated_search_and_feedback
  117. 43.95 s gammaloop-nextest-docs> stdout ---
  118. 43.95 s gammaloop-nextest-docs>
  119. 43.95 s gammaloop-nextest-docs> running 1 test
  120. 43.95 s gammaloop-nextest-docs> test tests::portal_and_developer_pages_use_federated_search_and_feedback ... FAILED
  121. 43.95 s gammaloop-nextest-docs>
  122. 43.95 s gammaloop-nextest-docs> failures:
  123. 43.95 s gammaloop-nextest-docs>
  124. 43.95 s gammaloop-nextest-docs> failures:
  125. 43.95 s gammaloop-nextest-docs> tests::portal_and_developer_pages_use_federated_search_and_feedback
  126. 43.95 s gammaloop-nextest-docs>
  127. 43.95 s gammaloop-nextest-docs> test result: FAILED. 0 passed; 1 failed; 0 ignored; 0 measured; 128 filtered out; finished in 0.01s
  128. 43.95 s gammaloop-nextest-docs>
  129. 43.95 s gammaloop-nextest-docs> stderr ---
  130. 43.95 s gammaloop-nextest-docs>
  131. 43.95 s gammaloop-nextest-docs> thread 'tests::portal_and_developer_pages_use_federated_search_and_feedback' (416) panicked at crates/alphal00p-docs-builder/src/lib.rs:9684:14:
  132. 43.95 s gammaloop-nextest-docs> called `Result::unwrap()` on an `Err` value: failed to copy documentation asset crates/spynso3/typst/STIXTwoMath-Regular.woff2
  133. 43.95 s gammaloop-nextest-docs>
  134. 43.95 s gammaloop-nextest-docs> Caused by:
  135. 43.95 s gammaloop-nextest-docs> No such file or directory (os error 2)
  136. 43.95 s gammaloop-nextest-docs>
  137. 43.95 s gammaloop-nextest-docs> Location:
  138. 43.95 s gammaloop-nextest-docs> crates/alphal00p-docs-builder/src/lib.rs:2276:18
  139. 43.95 s gammaloop-nextest-docs> stack backtrace:
  140. 43.95 s gammaloop-nextest-docs> 0: __rustc::rust_begin_unwind
  141. 43.95 s gammaloop-nextest-docs> 1: core::panicking::panic_fmt
  142. 43.95 s gammaloop-nextest-docs> 2: core::result::unwrap_failed
  143. 43.95 s gammaloop-nextest-docs> 3: alphal00p_docs_builder::tests::write_test_portal
  144. 43.95 s gammaloop-nextest-docs> 4: alphal00p_docs_builder::tests::portal_and_developer_pages_use_federated_search_and_feedback
  145. 43.95 s gammaloop-nextest-docs> 5: <alphal00p_docs_builder::tests::portal_and_developer_pages_use_federated_search_and_feedback::{closure#0} as core::ops::function::FnOnce<()>>::call_once
  146. 43.95 s gammaloop-nextest-docs> note: Some details are omitted, run with `RUST_BACKTRACE=full` for a verbose backtrace.
  147. 43.95 s gammaloop-nextest-docs>
  148. 43.95 s gammaloop-nextest-docs> FAIL [ 0.008s] ( 55/129) alphal00p-docs-builder tests::portal_emits_routes_and_valid_assets
  149. 43.95 s gammaloop-nextest-docs> stdout ---
  150. 43.95 s gammaloop-nextest-docs>
  151. 43.95 s gammaloop-nextest-docs> running 1 test
  152. 43.95 s gammaloop-nextest-docs> test tests::portal_emits_routes_and_valid_assets ... FAILED
  153. 43.95 s gammaloop-nextest-docs>
  154. 43.95 s gammaloop-nextest-docs> failures:
  155. 43.95 s gammaloop-nextest-docs>
  156. 43.95 s gammaloop-nextest-docs> failures:
  157. 43.95 s gammaloop-nextest-docs> tests::portal_emits_routes_and_valid_assets
  158. 43.95 s gammaloop-nextest-docs>
  159. 43.95 s gammaloop-nextest-docs> test result: FAILED. 0 passed; 1 failed; 0 ignored; 0 measured; 128 filtered out; finished in 0.00s
  160. 43.95 s gammaloop-nextest-docs>
  161. 43.95 s gammaloop-nextest-docs> stderr ---
  162. 43.95 s gammaloop-nextest-docs>
  163. 43.95 s gammaloop-nextest-docs> thread 'tests::portal_emits_routes_and_valid_assets' (422) panicked at crates/alphal00p-docs-builder/src/lib.rs:9684:14:
  164. 43.95 s gammaloop-nextest-docs> called `Result::unwrap()` on an `Err` value: failed to copy documentation asset crates/spynso3/typst/STIXTwoMath-Regular.woff2
  165. 43.95 s gammaloop-nextest-docs>
  166. 43.95 s gammaloop-nextest-docs> Caused by:
  167. 43.95 s gammaloop-nextest-docs> No such file or directory (os error 2)
  168. 43.95 s gammaloop-nextest-docs>
  169. 43.95 s gammaloop-nextest-docs> Location:
  170. 43.95 s gammaloop-nextest-docs> crates/alphal00p-docs-builder/src/lib.rs:2276:18
  171. 43.95 s gammaloop-nextest-docs> stack backtrace:
  172. 43.95 s gammaloop-nextest-docs> 0: __rustc::rust_begin_unwind
  173. 43.95 s gammaloop-nextest-docs> 1: core::panicking::panic_fmt
  174. 43.95 s gammaloop-nextest-docs> 2: core::result::unwrap_failed
  175. 43.95 s gammaloop-nextest-docs> 3: alphal00p_docs_builder::tests::write_test_portal
  176. 43.95 s gammaloop-nextest-docs> 4: alphal00p_docs_builder::tests::portal_emits_routes_and_valid_assets
  177. 43.95 s gammaloop-nextest-docs> 5: <alphal00p_docs_builder::tests::portal_emits_routes_and_valid_assets::{closure#0} as core::ops::function::FnOnce<()>>::call_once
  178. 43.95 s gammaloop-nextest-docs> note: Some details are omitted, run with `RUST_BACKTRACE=full` for a verbose backtrace.
  179. 43.95 s gammaloop-nextest-docs>
  180. 43.95 s gammaloop-nextest-docs> FAIL [ 0.010s] ( 56/129) alphal00p-docs-builder tests::portal_task_chooser_routes_each_goal_to_the_registered_quickstart
  181. 43.95 s gammaloop-nextest-docs> stdout ---
  182. 43.95 s gammaloop-nextest-docs>
  183. 43.95 s gammaloop-nextest-docs> running 1 test
  184. 43.95 s gammaloop-nextest-docs> test tests::portal_task_chooser_routes_each_goal_to_the_registered_quickstart ... FAILED
  185. 43.95 s gammaloop-nextest-docs>
  186. 43.95 s gammaloop-nextest-docs> failures:
  187. 43.95 s gammaloop-nextest-docs>
  188. 43.95 s gammaloop-nextest-docs> failures:
  189. 43.95 s gammaloop-nextest-docs> tests::portal_task_chooser_routes_each_goal_to_the_registered_quickstart
  190. 43.95 s gammaloop-nextest-docs>
  191. 43.95 s gammaloop-nextest-docs> test result: FAILED. 0 passed; 1 failed; 0 ignored; 0 measured; 128 filtered out; finished in 0.01s
  192. 43.95 s gammaloop-nextest-docs>
  193. 43.95 s gammaloop-nextest-docs> stderr ---
  194. 43.95 s gammaloop-nextest-docs>
  195. 43.95 s gammaloop-nextest-docs> thread 'tests::portal_task_chooser_routes_each_goal_to_the_registered_quickstart' (427) panicked at crates/alphal00p-docs-builder/src/lib.rs:9684:14:
  196. 43.95 s gammaloop-nextest-docs> called `Result::unwrap()` on an `Err` value: failed to copy documentation asset crates/spynso3/typst/STIXTwoMath-Regular.woff2
  197. 43.95 s gammaloop-nextest-docs>
  198. 43.95 s gammaloop-nextest-docs> Caused by:
  199. 43.95 s gammaloop-nextest-docs> No such file or directory (os error 2)
  200. 43.95 s gammaloop-nextest-docs>
  201. 43.95 s gammaloop-nextest-docs> Location:
  202. 43.95 s gammaloop-nextest-docs> crates/alphal00p-docs-builder/src/lib.rs:2276:18
  203. 43.95 s gammaloop-nextest-docs> stack backtrace:
  204. 43.95 s gammaloop-nextest-docs> 0: __rustc::rust_begin_unwind
  205. 43.95 s gammaloop-nextest-docs> 1: core::panicking::panic_fmt
  206. 43.95 s gammaloop-nextest-docs> 2: core::result::unwrap_failed
  207. 43.95 s gammaloop-nextest-docs> 3: alphal00p_docs_builder::tests::write_test_portal
  208. 43.95 s gammaloop-nextest-docs> 4: alphal00p_docs_builder::tests::portal_task_chooser_routes_each_goal_to_the_registered_quickstart
  209. 43.95 s gammaloop-nextest-docs> 5: <alphal00p_docs_builder::tests::portal_task_chooser_routes_each_goal_to_the_registered_quickstart::{closure#0} as core::ops::function::FnOnce<()>>::call_once
  210. 43.95 s gammaloop-nextest-docs> note: Some details are omitted, run with `RUST_BACKTRACE=full` for a verbose backtrace.
  211. 43.95 s gammaloop-nextest-docs>
  212. 44.00 s gammaloop-nextest-docs> FAIL [ 0.009s] ( 86/129) alphal00p-docs-builder tests::site_assets_replace_read_only_generated_files
  213. 44.00 s gammaloop-nextest-docs> stdout ---
  214. 44.00 s gammaloop-nextest-docs>
  215. 44.00 s gammaloop-nextest-docs> running 1 test
  216. 44.00 s gammaloop-nextest-docs> test tests::site_assets_replace_read_only_generated_files ... FAILED
  217. 44.00 s gammaloop-nextest-docs>
  218. 44.00 s gammaloop-nextest-docs> failures:
  219. 44.00 s gammaloop-nextest-docs>
  220. 44.00 s gammaloop-nextest-docs> failures:
  221. 44.00 s gammaloop-nextest-docs> tests::site_assets_replace_read_only_generated_files
  222. 44.00 s gammaloop-nextest-docs>
  223. 44.00 s gammaloop-nextest-docs> test result: FAILED. 0 passed; 1 failed; 0 ignored; 0 measured; 128 filtered out; finished in 0.00s
  224. 44.00 s gammaloop-nextest-docs>
  225. 44.00 s gammaloop-nextest-docs> stderr ---
  226. 44.00 s gammaloop-nextest-docs>
  227. 44.00 s gammaloop-nextest-docs> thread 'tests::site_assets_replace_read_only_generated_files' (648) panicked at crates/alphal00p-docs-builder/src/lib.rs:12305:50:
  228. 44.00 s gammaloop-nextest-docs> called `Result::unwrap()` on an `Err` value: failed to copy documentation asset crates/spynso3/typst/STIXTwoMath-Regular.woff2
  229. 44.00 s gammaloop-nextest-docs>
  230. 44.00 s gammaloop-nextest-docs> Caused by:
  231. 44.00 s gammaloop-nextest-docs> No such file or directory (os error 2)
  232. 44.00 s gammaloop-nextest-docs>
  233. 44.00 s gammaloop-nextest-docs> Location:
  234. 44.00 s gammaloop-nextest-docs> crates/alphal00p-docs-builder/src/lib.rs:2276:18
  235. 44.00 s gammaloop-nextest-docs> stack backtrace:
  236. 44.00 s gammaloop-nextest-docs> 0: __rustc::rust_begin_unwind
  237. 44.00 s gammaloop-nextest-docs> 1: core::panicking::panic_fmt
  238. 44.00 s gammaloop-nextest-docs> 2: core::result::unwrap_failed
  239. 44.00 s gammaloop-nextest-docs> 3: alphal00p_docs_builder::tests::site_assets_replace_read_only_generated_files
  240. 44.00 s gammaloop-nextest-docs> 4: <alphal00p_docs_builder::tests::site_assets_replace_read_only_generated_files::{closure#0} as core::ops::function::FnOnce<()>>::call_once
  241. 44.00 s gammaloop-nextest-docs> note: Some details are omitted, run with `RUST_BACKTRACE=full` for a verbose backtrace.
  242. 44.00 s gammaloop-nextest-docs>
  243. 44.01 s gammaloop-nextest-docs> FAIL [ 0.122s] ( 91/129) alphal00p-docs-builder tests::checked_in_registry_is_valid
  244. 44.01 s gammaloop-nextest-docs> stdout ---
  245. 44.01 s gammaloop-nextest-docs>
  246. 44.01 s gammaloop-nextest-docs> running 1 test
  247. 44.01 s gammaloop-nextest-docs> test tests::checked_in_registry_is_valid ... FAILED
  248. 44.01 s gammaloop-nextest-docs>
  249. 44.01 s gammaloop-nextest-docs> failures:
  250. 44.01 s gammaloop-nextest-docs>
  251. 44.01 s gammaloop-nextest-docs> failures:
  252. 44.01 s gammaloop-nextest-docs> tests::checked_in_registry_is_valid
  253. 44.01 s gammaloop-nextest-docs>
  254. 44.01 s gammaloop-nextest-docs> test result: FAILED. 0 passed; 1 failed; 0 ignored; 0 measured; 128 filtered out; finished in 0.11s
  255. 44.01 s gammaloop-nextest-docs>
  256. 44.01 s gammaloop-nextest-docs> stderr ---
  257. 44.01 s gammaloop-nextest-docs>
  258. 44.01 s gammaloop-nextest-docs> thread 'tests::checked_in_registry_is_valid' (241) panicked at crates/alphal00p-docs-builder/src/lib.rs:12260:50:
  259. 44.01 s gammaloop-nextest-docs> called `Result::unwrap()` on an `Err` value: required documentation source is missing: /build/source/crates/spynso3/typst/STIXTwoMath-Regular.woff2
  260. 44.01 s gammaloop-nextest-docs>
  261. 44.01 s gammaloop-nextest-docs> Location:
  262. 44.01 s gammaloop-nextest-docs> crates/alphal00p-docs-builder/src/lib.rs:5103:9
  263. 44.01 s gammaloop-nextest-docs> stack backtrace:
  264. 44.01 s gammaloop-nextest-docs> 0: __rustc::rust_begin_unwind
  265. 44.01 s gammaloop-nextest-docs> 1: core::panicking::panic_fmt
  266. 44.01 s gammaloop-nextest-docs> 2: core::result::unwrap_failed
  267. 44.01 s gammaloop-nextest-docs> 3: alphal00p_docs_builder::tests::checked_in_registry_is_valid
  268. 44.01 s gammaloop-nextest-docs> 4: <alphal00p_docs_builder::tests::checked_in_registry_is_valid::{closure#0} as core::ops::function::FnOnce<()>>::call_once
  269. 44.01 s gammaloop-nextest-docs> note: Some details are omitted, run with `RUST_BACKTRACE=full` for a verbose backtrace.
  270. 44.01 s gammaloop-nextest-docs>
  271. 44.02 s gammaloop-nextest-docs> FAIL [ 0.130s] ( 97/129) alphal00p-docs-builder provenance_tests::each_build_captures_one_revision_before_rendering
  272. 44.02 s gammaloop-nextest-docs> stdout ---
  273. 44.02 s gammaloop-nextest-docs>
  274. 44.02 s gammaloop-nextest-docs> running 1 test
  275. 44.02 s gammaloop-nextest-docs>
  276. 44.02 s gammaloop-nextest-docs> running 1 test
  277. 44.02 s gammaloop-nextest-docs> test provenance_tests::each_build_captures_one_revision_before_rendering ... FAILED
  278. 44.02 s gammaloop-nextest-docs>
  279. 44.02 s gammaloop-nextest-docs> failures:
  280. 44.02 s gammaloop-nextest-docs>
  281. 44.02 s gammaloop-nextest-docs> failures:
  282. 44.02 s gammaloop-nextest-docs> provenance_tests::each_build_captures_one_revision_before_rendering
  283. 44.02 s gammaloop-nextest-docs>
  284. 44.02 s gammaloop-nextest-docs> test result: FAILED. 0 passed; 1 failed; 0 ignored; 0 measured; 128 filtered out; finished in 0.11s
  285. 44.02 s gammaloop-nextest-docs>
  286. 44.02 s gammaloop-nextest-docs> test provenance_tests::each_build_captures_one_revision_before_rendering ... FAILED
  287. 44.02 s gammaloop-nextest-docs>
  288. 44.02 s gammaloop-nextest-docs> failures:
  289. 44.02 s gammaloop-nextest-docs>
  290. 44.02 s gammaloop-nextest-docs> failures:
  291. 44.02 s gammaloop-nextest-docs> provenance_tests::each_build_captures_one_revision_before_rendering
  292. 44.02 s gammaloop-nextest-docs>
  293. 44.02 s gammaloop-nextest-docs> test result: FAILED. 0 passed; 1 failed; 0 ignored; 0 measured; 128 filtered out; finished in 0.12s
  294. 44.02 s gammaloop-nextest-docs>
  295. 44.02 s gammaloop-nextest-docs> stderr ---
  296. 44.02 s gammaloop-nextest-docs>
  297. 44.02 s gammaloop-nextest-docs> thread 'provenance_tests::each_build_captures_one_revision_before_rendering' (260) panicked at crates/alphal00p-docs-builder/src/provenance_tests.rs:297:14:
  298. 44.02 s gammaloop-nextest-docs> called `Result::unwrap()` on an `Err` value: required documentation source is missing: /build/source/target/nix-ci-tmp/.tmp3od26f/checkout/crates/spynso3/typst/STIXTwoMath-Regular.woff2
  299. 44.02 s gammaloop-nextest-docs>
  300. 44.02 s gammaloop-nextest-docs> Location:
  301. 44.02 s gammaloop-nextest-docs> crates/alphal00p-docs-builder/src/lib.rs:5103:9
  302. 44.02 s gammaloop-nextest-docs> stack backtrace:
  303. 44.02 s gammaloop-nextest-docs> 0: __rustc::rust_begin_unwind
  304. 44.02 s gammaloop-nextest-docs> 1: core::panicking::panic_fmt
  305. 44.02 s gammaloop-nextest-docs> 2: core::result::unwrap_failed
  306. 44.02 s gammaloop-nextest-docs> 3: alphal00p_docs_builder::provenance_tests::each_build_captures_one_revision_before_rendering
  307. 44.02 s gammaloop-nextest-docs> 4: <alphal00p_docs_builder::provenance_tests::each_build_captures_one_revision_before_rendering::{closure#0} as core::ops::function::FnOnce<()>>::call_once
  308. 44.02 s gammaloop-nextest-docs> note: Some details are omitted, run with `RUST_BACKTRACE=full` for a verbose backtrace.
  309. 44.02 s gammaloop-nextest-docs>
  310. 44.02 s gammaloop-nextest-docs> thread 'provenance_tests::each_build_captures_one_revision_before_rendering' (226) panicked at crates/alphal00p-docs-builder/src/provenance_tests.rs:274:9:
  311. 44.02 s gammaloop-nextest-docs> assertion failed: command.status().unwrap().success()
  312. 44.02 s gammaloop-nextest-docs> stack backtrace:
  313. 44.02 s gammaloop-nextest-docs> 0: __rustc::rust_begin_unwind
  314. 44.02 s gammaloop-nextest-docs> 1: core::panicking::panic_fmt
  315. 44.02 s gammaloop-nextest-docs> 2: core::panicking::panic
  316. 44.02 s gammaloop-nextest-docs> 3: alphal00p_docs_builder::provenance_tests::each_build_captures_one_revision_before_rendering
  317. 44.02 s gammaloop-nextest-docs> 4: <alphal00p_docs_builder::provenance_tests::each_build_captures_one_revision_before_rendering::{closure#0} as core::ops::function::FnOnce<()>>::call_once
  318. 44.02 s gammaloop-nextest-docs> note: Some details are omitted, run with `RUST_BACKTRACE=full` for a verbose backtrace.
  319. 44.02 s gammaloop-nextest-docs>
  320. 44.02 s gammaloop-nextest-docs> FAIL [ 0.116s] (100/129) alphal00p-docs-builder tests::developer_scope_ranges_ignore_unrelated_edits_and_warn_only_while_watching
  321. 44.02 s gammaloop-nextest-docs> stdout ---
  322. 44.02 s gammaloop-nextest-docs>
  323. 44.02 s gammaloop-nextest-docs> running 1 test
  324. 44.02 s gammaloop-nextest-docs> test tests::developer_scope_ranges_ignore_unrelated_edits_and_warn_only_while_watching ... FAILED
  325. 44.02 s gammaloop-nextest-docs>
  326. 44.02 s gammaloop-nextest-docs> failures:
  327. 44.02 s gammaloop-nextest-docs>
  328. 44.02 s gammaloop-nextest-docs> failures:
  329. 44.02 s gammaloop-nextest-docs> tests::developer_scope_ranges_ignore_unrelated_edits_and_warn_only_while_watching
  330. 44.02 s gammaloop-nextest-docs>
  331. 44.02 s gammaloop-nextest-docs> test result: FAILED. 0 passed; 1 failed; 0 ignored; 0 measured; 128 filtered out; finished in 0.11s
  332. 44.02 s gammaloop-nextest-docs>
  333. 44.02 s gammaloop-nextest-docs> stderr ---
  334. 44.02 s gammaloop-nextest-docs>
  335. 44.02 s gammaloop-nextest-docs> thread 'tests::developer_scope_ranges_ignore_unrelated_edits_and_warn_only_while_watching' (284) panicked at crates/alphal00p-docs-builder/src/lib.rs:12350:29:
  336. 44.02 s gammaloop-nextest-docs> called `Result::unwrap()` on an `Err` value: required documentation source is missing: /build/source/crates/spynso3/typst/STIXTwoMath-Regular.woff2
  337. 44.02 s gammaloop-nextest-docs>
  338. 44.02 s gammaloop-nextest-docs> Location:
  339. 44.02 s gammaloop-nextest-docs> crates/alphal00p-docs-builder/src/lib.rs:5103:9
  340. 44.02 s gammaloop-nextest-docs> stack backtrace:
  341. 44.02 s gammaloop-nextest-docs> 0: __rustc::rust_begin_unwind
  342. 44.02 s gammaloop-nextest-docs> 1: core::panicking::panic_fmt
  343. 44.02 s gammaloop-nextest-docs> 2: core::result::unwrap_failed
  344. 44.02 s gammaloop-nextest-docs> 3: alphal00p_docs_builder::tests::developer_scope_ranges_ignore_unrelated_edits_and_warn_only_while_watching
  345. 44.02 s gammaloop-nextest-docs> 4: <alphal00p_docs_builder::tests::developer_scope_ranges_ignore_unrelated_edits_and_warn_only_while_watching::{closure#0} as core::ops::function::FnOnce<()>>::call_once
  346. 44.02 s gammaloop-nextest-docs> note: Some details are omitted, run with `RUST_BACKTRACE=full` for a verbose backtrace.
  347. 44.02 s gammaloop-nextest-docs>
  348. 44.03 s gammaloop-nextest-docs> FAIL [ 0.120s] (111/129) alphal00p-docs-builder tests::every_product_requires_a_task_chooser_and_each_supported_interface
  349. 44.03 s gammaloop-nextest-docs> stdout ---
  350. 44.03 s gammaloop-nextest-docs>
  351. 44.03 s gammaloop-nextest-docs> running 1 test
  352. 44.03 s gammaloop-nextest-docs> test tests::every_product_requires_a_task_chooser_and_each_supported_interface ... FAILED
  353. 44.03 s gammaloop-nextest-docs>
  354. 44.03 s gammaloop-nextest-docs> failures:
  355. 44.03 s gammaloop-nextest-docs>
  356. 44.03 s gammaloop-nextest-docs> failures:
  357. 44.03 s gammaloop-nextest-docs> tests::every_product_requires_a_task_chooser_and_each_supported_interface
  358. 44.03 s gammaloop-nextest-docs>
  359. 44.03 s gammaloop-nextest-docs> test result: FAILED. 0 passed; 1 failed; 0 ignored; 0 measured; 128 filtered out; finished in 0.12s
  360. 44.03 s gammaloop-nextest-docs>
  361. 44.03 s gammaloop-nextest-docs> stderr ---
  362. 44.03 s gammaloop-nextest-docs>
  363. 44.03 s gammaloop-nextest-docs> thread 'tests::every_product_requires_a_task_chooser_and_each_supported_interface' (309) panicked at crates/alphal00p-docs-builder/src/lib.rs:12274:9:
  364. 44.03 s gammaloop-nextest-docs> assertion failed: format!("{error:#}").contains("has no quickstart page")
  365. 44.03 s gammaloop-nextest-docs> stack backtrace:
  366. 44.03 s gammaloop-nextest-docs> 0: __rustc::rust_begin_unwind
  367. 44.03 s gammaloop-nextest-docs> 1: core::panicking::panic_fmt
  368. 44.03 s gammaloop-nextest-docs> 2: core::panicking::panic
  369. 44.03 s gammaloop-nextest-docs> 3: alphal00p_docs_builder::tests::every_product_requires_a_task_chooser_and_each_supported_interface
  370. 44.03 s gammaloop-nextest-docs> 4: <alphal00p_docs_builder::tests::every_product_requires_a_task_chooser_and_each_supported_interface::{closure#0} as core::ops::function::FnOnce<()>>::call_once
  371. 44.03 s gammaloop-nextest-docs> note: Some details are omitted, run with `RUST_BACKTRACE=full` for a verbose backtrace.
  372. 44.03 s gammaloop-nextest-docs>
  373. 44.05 s gammaloop-nextest-docs> FAIL [ 0.112s] (122/129) alphal00p-docs-builder tests::pdf_manual_chapter_order_must_match_the_page_registry
  374. 44.05 s gammaloop-nextest-docs> stdout ---
  375. 44.05 s gammaloop-nextest-docs>
  376. 44.05 s gammaloop-nextest-docs> running 1 test
  377. 44.05 s gammaloop-nextest-docs> test tests::pdf_manual_chapter_order_must_match_the_page_registry ... FAILED
  378. 44.05 s gammaloop-nextest-docs>
  379. 44.05 s gammaloop-nextest-docs> failures:
  380. 44.05 s gammaloop-nextest-docs>
  381. 44.05 s gammaloop-nextest-docs> failures:
  382. 44.05 s gammaloop-nextest-docs> tests::pdf_manual_chapter_order_must_match_the_page_registry
  383. 44.05 s gammaloop-nextest-docs>
  384. 44.05 s gammaloop-nextest-docs> test result: FAILED. 0 passed; 1 failed; 0 ignored; 0 measured; 128 filtered out; finished in 0.11s
  385. 44.05 s gammaloop-nextest-docs>
  386. 44.05 s gammaloop-nextest-docs> stderr ---
  387. 44.05 s gammaloop-nextest-docs>
  388. 44.05 s gammaloop-nextest-docs> thread 'tests::pdf_manual_chapter_order_must_match_the_page_registry' (402) panicked at crates/alphal00p-docs-builder/src/lib.rs:12330:9:
  389. 44.05 s gammaloop-nextest-docs> assertion failed: format!("{error:#}").contains("PDF manual chapter order differs")
  390. 44.05 s gammaloop-nextest-docs> stack backtrace:
  391. 44.05 s gammaloop-nextest-docs> 0: __rustc::rust_begin_unwind
  392. 44.05 s gammaloop-nextest-docs> 1: core::panicking::panic_fmt
  393. 44.05 s gammaloop-nextest-docs> 2: core::panicking::panic
  394. 44.05 s gammaloop-nextest-docs> 3: alphal00p_docs_builder::tests::pdf_manual_chapter_order_must_match_the_page_registry
  395. 44.05 s gammaloop-nextest-docs> 4: <alphal00p_docs_builder::tests::pdf_manual_chapter_order_must_match_the_page_registry::{closure#0} as core::ops::function::FnOnce<()>>::call_once
  396. 44.05 s gammaloop-nextest-docs> note: Some details are omitted, run with `RUST_BACKTRACE=full` for a verbose backtrace.
  397. 44.05 s gammaloop-nextest-docs>
  398. 54.95 s gammaloop-nextest-docs> ------------
  399. 54.95 s gammaloop-nextest-docs> Summary [ 11.064s] 129 tests run: 118 passed, 11 failed, 0 skipped
  400. 54.95 s gammaloop-nextest-docs> FAIL [ 0.009s] ( 23/129) alphal00p-docs-builder tests::developer_architecture_is_classified_searchable_and_source_backed
  401. 54.95 s gammaloop-nextest-docs> stdout ---
  402. 54.95 s gammaloop-nextest-docs>
  403. 54.95 s gammaloop-nextest-docs> running 1 test
  404. 54.95 s gammaloop-nextest-docs> test tests::developer_architecture_is_classified_searchable_and_source_backed ... FAILED
  405. 54.95 s gammaloop-nextest-docs>
  406. 54.95 s gammaloop-nextest-docs> failures:
  407. 54.95 s gammaloop-nextest-docs>
  408. 54.95 s gammaloop-nextest-docs> failures:
  409. 54.95 s gammaloop-nextest-docs> tests::developer_architecture_is_classified_searchable_and_source_backed
  410. 54.95 s gammaloop-nextest-docs>
  411. 54.95 s gammaloop-nextest-docs> test result: FAILED. 0 passed; 1 failed; 0 ignored; 0 measured; 128 filtered out; finished in 0.01s
  412. 54.95 s gammaloop-nextest-docs>
  413. 54.95 s gammaloop-nextest-docs> stderr ---
  414. 54.95 s gammaloop-nextest-docs>
  415. 54.95 s gammaloop-nextest-docs> thread 'tests::developer_architecture_is_classified_searchable_and_source_backed' (276) panicked at crates/alphal00p-docs-builder/src/lib.rs:12751:14:
  416. 54.95 s gammaloop-nextest-docs> called `Result::unwrap()` on an `Err` value: failed to copy documentation asset crates/spynso3/typst/STIXTwoMath-Regular.woff2
  417. 54.95 s gammaloop-nextest-docs>
  418. 54.95 s gammaloop-nextest-docs> Caused by:
  419. 54.95 s gammaloop-nextest-docs> No such file or directory (os error 2)
  420. 54.95 s gammaloop-nextest-docs>
  421. 54.95 s gammaloop-nextest-docs> Location:
  422. 54.95 s gammaloop-nextest-docs> crates/alphal00p-docs-builder/src/lib.rs:2276:18
  423. 54.95 s gammaloop-nextest-docs> stack backtrace:
  424. 54.95 s gammaloop-nextest-docs> 0: __rustc::rust_begin_unwind
  425. 54.95 s gammaloop-nextest-docs> 1: core::panicking::panic_fmt
  426. 54.95 s gammaloop-nextest-docs> 2: core::result::unwrap_failed
  427. 54.95 s gammaloop-nextest-docs> 3: alphal00p_docs_builder::tests::developer_architecture_is_classified_searchable_and_source_backed
  428. 54.95 s gammaloop-nextest-docs> 4: <alphal00p_docs_builder::tests::developer_architecture_is_classified_searchable_and_source_backed::{closure#0} as core::ops::function::FnOnce<()>>::call_once
  429. 54.95 s gammaloop-nextest-docs> note: Some details are omitted, run with `RUST_BACKTRACE=full` for a verbose backtrace.
  430. 54.95 s gammaloop-nextest-docs>
  431. 54.95 s gammaloop-nextest-docs> FAIL [ 0.011s] ( 30/129) alphal00p-docs-builder tests::every_product_orients_rust_to_native_rustdoc_and_keeps_legacy_redirects
  432. 54.95 s gammaloop-nextest-docs> stdout ---
  433. 54.95 s gammaloop-nextest-docs>
  434. 54.95 s gammaloop-nextest-docs> running 1 test
  435. 54.95 s gammaloop-nextest-docs> test tests::every_product_orients_rust_to_native_rustdoc_and_keeps_legacy_redirects ... FAILED
  436. 54.95 s gammaloop-nextest-docs>
  437. 54.95 s gammaloop-nextest-docs> failures:
  438. 54.95 s gammaloop-nextest-docs>
  439. 54.95 s gammaloop-nextest-docs> failures:
  440. 54.95 s gammaloop-nextest-docs> tests::every_product_orients_rust_to_native_rustdoc_and_keeps_legacy_redirects
  441. 54.95 s gammaloop-nextest-docs>
  442. 54.95 s gammaloop-nextest-docs> test result: FAILED. 0 passed; 1 failed; 0 ignored; 0 measured; 128 filtered out; finished in 0.01s
  443. 54.95 s gammaloop-nextest-docs>
  444. 54.95 s gammaloop-nextest-docs> stderr ---
  445. 54.95 s gammaloop-nextest-docs>
  446. 54.95 s gammaloop-nextest-docs> thread 'tests::every_product_orients_rust_to_native_rustdoc_and_keeps_legacy_redirects' (302) panicked at crates/alphal00p-docs-builder/src/lib.rs:12555:46:
  447. 54.95 s gammaloop-nextest-docs> called `Result::unwrap()` on an `Err` value: failed to copy documentation asset crates/spynso3/typst/STIXTwoMath-Regular.woff2
  448. 54.95 s gammaloop-nextest-docs>
  449. 54.95 s gammaloop-nextest-docs> Caused by:
  450. 54.95 s gammaloop-nextest-docs> No such file or directory (os error 2)
  451. 54.95 s gammaloop-nextest-docs>
  452. 54.95 s gammaloop-nextest-docs> Location:
  453. 54.95 s gammaloop-nextest-docs> crates/alphal00p-docs-builder/src/lib.rs:2276:18
  454. 54.95 s gammaloop-nextest-docs> stack backtrace:
  455. 54.95 s gammaloop-nextest-docs> 0: __rustc::rust_begin_unwind
  456. 54.95 s gammaloop-nextest-docs> 1: core::panicking::panic_fmt
  457. 54.95 s gammaloop-nextest-docs> 2: core::result::unwrap_failed
  458. 54.95 s gammaloop-nextest-docs> 3: alphal00p_docs_builder::tests::every_product_orients_rust_to_native_rustdoc_and_keeps_legacy_redirects
  459. 54.95 s gammaloop-nextest-docs> 4: <alphal00p_docs_builder::tests::every_product_orients_rust_to_native_rustdoc_and_keeps_legacy_redirects::{closure#0} as core::ops::function::FnOnce<()>>::call_once
  460. 54.95 s gammaloop-nextest-docs> note: Some details are omitted, run with `RUST_BACKTRACE=full` for a verbose backtrace.
  461. 54.95 s gammaloop-nextest-docs>
  462. 54.95 s gammaloop-nextest-docs> FAIL [ 0.009s] ( 54/129) alphal00p-docs-builder tests::portal_and_developer_pages_use_federated_search_and_feedback
  463. 54.95 s gammaloop-nextest-docs> stdout ---
  464. 54.95 s gammaloop-nextest-docs>
  465. 54.95 s gammaloop-nextest-docs> running 1 test
  466. 54.95 s gammaloop-nextest-docs> test tests::portal_and_developer_pages_use_federated_search_and_feedback ... FAILED
  467. 54.95 s gammaloop-nextest-docs>
  468. 54.95 s gammaloop-nextest-docs> failures:
  469. 54.95 s gammaloop-nextest-docs>
  470. 54.95 s gammaloop-nextest-docs> failures:
  471. 54.95 s gammaloop-nextest-docs> tests::portal_and_developer_pages_use_federated_search_and_feedback
  472. 54.95 s gammaloop-nextest-docs>
  473. 54.95 s gammaloop-nextest-docs> test result: FAILED. 0 passed; 1 failed; 0 ignored; 0 measured; 128 filtered out; finished in 0.01s
  474. 54.95 s gammaloop-nextest-docs>
  475. 54.95 s gammaloop-nextest-docs> stderr ---
  476. 54.95 s gammaloop-nextest-docs>
  477. 54.95 s gammaloop-nextest-docs> thread 'tests::portal_and_developer_pages_use_federated_search_and_feedback' (416) panicked at crates/alphal00p-docs-builder/src/lib.rs:9684:14:
  478. 54.95 s gammaloop-nextest-docs> called `Result::unwrap()` on an `Err` value: failed to copy documentation asset crates/spynso3/typst/STIXTwoMath-Regular.woff2
  479. 54.95 s gammaloop-nextest-docs>
  480. 54.95 s gammaloop-nextest-docs> Caused by:
  481. 54.95 s gammaloop-nextest-docs> No such file or directory (os error 2)
  482. 54.95 s gammaloop-nextest-docs>
  483. 54.95 s gammaloop-nextest-docs> Location:
  484. 54.95 s gammaloop-nextest-docs> crates/alphal00p-docs-builder/src/lib.rs:2276:18
  485. 54.95 s gammaloop-nextest-docs> stack backtrace:
  486. 54.95 s gammaloop-nextest-docs> 0: __rustc::rust_begin_unwind
  487. 54.95 s gammaloop-nextest-docs> 1: core::panicking::panic_fmt
  488. 54.95 s gammaloop-nextest-docs> 2: core::result::unwrap_failed
  489. 54.95 s gammaloop-nextest-docs> 3: alphal00p_docs_builder::tests::write_test_portal
  490. 54.95 s gammaloop-nextest-docs> 4: alphal00p_docs_builder::tests::portal_and_developer_pages_use_federated_search_and_feedback
  491. 54.95 s gammaloop-nextest-docs> 5: <alphal00p_docs_builder::tests::portal_and_developer_pages_use_federated_search_and_feedback::{closure#0} as core::ops::function::FnOnce<()>>::call_once
  492. 54.95 s gammaloop-nextest-docs> note: Some details are omitted, run with `RUST_BACKTRACE=full` for a verbose backtrace.
  493. 54.95 s gammaloop-nextest-docs>
  494. 54.95 s gammaloop-nextest-docs> FAIL [ 0.008s] ( 55/129) alphal00p-docs-builder tests::portal_emits_routes_and_valid_assets
  495. 54.95 s gammaloop-nextest-docs> stdout ---
  496. 54.95 s gammaloop-nextest-docs>
  497. 54.95 s gammaloop-nextest-docs> running 1 test
  498. 54.95 s gammaloop-nextest-docs> test tests::portal_emits_routes_and_valid_assets ... FAILED
  499. 54.95 s gammaloop-nextest-docs>
  500. 54.95 s gammaloop-nextest-docs> failures:
  501. 54.95 s gammaloop-nextest-docs>
  502. 54.95 s gammaloop-nextest-docs> failures:
  503. 54.95 s gammaloop-nextest-docs> tests::portal_emits_routes_and_valid_assets
  504. 54.95 s gammaloop-nextest-docs>
  505. 54.95 s gammaloop-nextest-docs> test result: FAILED. 0 passed; 1 failed; 0 ignored; 0 measured; 128 filtered out; finished in 0.00s
  506. 54.95 s gammaloop-nextest-docs>
  507. 54.95 s gammaloop-nextest-docs> stderr ---
  508. 54.95 s gammaloop-nextest-docs>
  509. 54.95 s gammaloop-nextest-docs> thread 'tests::portal_emits_routes_and_valid_assets' (422) panicked at crates/alphal00p-docs-builder/src/lib.rs:9684:14:
  510. 54.95 s gammaloop-nextest-docs> called `Result::unwrap()` on an `Err` value: failed to copy documentation asset crates/spynso3/typst/STIXTwoMath-Regular.woff2
  511. 54.95 s gammaloop-nextest-docs>
  512. 54.95 s gammaloop-nextest-docs> Caused by:
  513. 54.95 s gammaloop-nextest-docs> No such file or directory (os error 2)
  514. 54.95 s gammaloop-nextest-docs>
  515. 54.95 s gammaloop-nextest-docs> Location:
  516. 54.95 s gammaloop-nextest-docs> crates/alphal00p-docs-builder/src/lib.rs:2276:18
  517. 54.95 s gammaloop-nextest-docs> stack backtrace:
  518. 54.95 s gammaloop-nextest-docs> 0: __rustc::rust_begin_unwind
  519. 54.95 s gammaloop-nextest-docs> 1: core::panicking::panic_fmt
  520. 54.95 s gammaloop-nextest-docs> 2: core::result::unwrap_failed
  521. 54.95 s gammaloop-nextest-docs> 3: alphal00p_docs_builder::tests::write_test_portal
  522. 54.95 s gammaloop-nextest-docs> 4: alphal00p_docs_builder::tests::portal_emits_routes_and_valid_assets
  523. 54.95 s gammaloop-nextest-docs> 5: <alphal00p_docs_builder::tests::portal_emits_routes_and_valid_assets::{closure#0} as core::ops::function::FnOnce<()>>::call_once
  524. 54.95 s gammaloop-nextest-docs> note: Some details are omitted, run with `RUST_BACKTRACE=full` for a verbose backtrace.
  525. 54.95 s gammaloop-nextest-docs>
  526. 54.95 s gammaloop-nextest-docs> FAIL [ 0.010s] ( 56/129) alphal00p-docs-builder tests::portal_task_chooser_routes_each_goal_to_the_registered_quickstart
  527. 54.95 s gammaloop-nextest-docs> stdout ---
  528. 54.95 s gammaloop-nextest-docs>
  529. 54.95 s gammaloop-nextest-docs> running 1 test
  530. 54.95 s gammaloop-nextest-docs> test tests::portal_task_chooser_routes_each_goal_to_the_registered_quickstart ... FAILED
  531. 54.95 s gammaloop-nextest-docs>
  532. 54.95 s gammaloop-nextest-docs> failures:
  533. 54.95 s gammaloop-nextest-docs>
  534. 54.95 s gammaloop-nextest-docs> failures:
  535. 54.95 s gammaloop-nextest-docs> tests::portal_task_chooser_routes_each_goal_to_the_registered_quickstart
  536. 54.95 s gammaloop-nextest-docs>
  537. 54.95 s gammaloop-nextest-docs> test result: FAILED. 0 passed; 1 failed; 0 ignored; 0 measured; 128 filtered out; finished in 0.01s
  538. 54.95 s gammaloop-nextest-docs>
  539. 54.95 s gammaloop-nextest-docs> stderr ---
  540. 54.95 s gammaloop-nextest-docs>
  541. 54.95 s gammaloop-nextest-docs> thread 'tests::portal_task_chooser_routes_each_goal_to_the_registered_quickstart' (427) panicked at crates/alphal00p-docs-builder/src/lib.rs:9684:14:
  542. 54.95 s gammaloop-nextest-docs> called `Result::unwrap()` on an `Err` value: failed to copy documentation asset crates/spynso3/typst/STIXTwoMath-Regular.woff2
  543. 54.95 s gammaloop-nextest-docs>
  544. 54.95 s gammaloop-nextest-docs> Caused by:
  545. 54.95 s gammaloop-nextest-docs> No such file or directory (os error 2)
  546. 54.95 s gammaloop-nextest-docs>
  547. 54.95 s gammaloop-nextest-docs> Location:
  548. 54.95 s gammaloop-nextest-docs> crates/alphal00p-docs-builder/src/lib.rs:2276:18
  549. 54.95 s gammaloop-nextest-docs> stack backtrace:
  550. 54.95 s gammaloop-nextest-docs> 0: __rustc::rust_begin_unwind
  551. 54.95 s gammaloop-nextest-docs> 1: core::panicking::panic_fmt
  552. 54.95 s gammaloop-nextest-docs> 2: core::result::unwrap_failed
  553. 54.95 s gammaloop-nextest-docs> 3: alphal00p_docs_builder::tests::write_test_portal
  554. 54.95 s gammaloop-nextest-docs> 4: alphal00p_docs_builder::tests::portal_task_chooser_routes_each_goal_to_the_registered_quickstart
  555. 54.95 s gammaloop-nextest-docs> 5: <alphal00p_docs_builder::tests::portal_task_chooser_routes_each_goal_to_the_registered_quickstart::{closure#0} as core::ops::function::FnOnce<()>>::call_once
  556. 54.95 s gammaloop-nextest-docs> note: Some details are omitted, run with `RUST_BACKTRACE=full` for a verbose backtrace.
  557. 54.95 s gammaloop-nextest-docs>
  558. 54.95 s gammaloop-nextest-docs> FAIL [ 0.009s] ( 86/129) alphal00p-docs-builder tests::site_assets_replace_read_only_generated_files
  559. 54.95 s gammaloop-nextest-docs> stdout ---
  560. 54.95 s gammaloop-nextest-docs>
  561. 54.95 s gammaloop-nextest-docs> running 1 test
  562. 54.95 s gammaloop-nextest-docs> test tests::site_assets_replace_read_only_generated_files ... FAILED
  563. 54.95 s gammaloop-nextest-docs>
  564. 54.95 s gammaloop-nextest-docs> failures:
  565. 54.95 s gammaloop-nextest-docs>
  566. 54.95 s gammaloop-nextest-docs> failures:
  567. 54.95 s gammaloop-nextest-docs> tests::site_assets_replace_read_only_generated_files
  568. 54.95 s gammaloop-nextest-docs>
  569. 54.95 s gammaloop-nextest-docs> test result: FAILED. 0 passed; 1 failed; 0 ignored; 0 measured; 128 filtered out; finished in 0.00s
  570. 54.95 s gammaloop-nextest-docs>
  571. 54.95 s gammaloop-nextest-docs> stderr ---
  572. 54.95 s gammaloop-nextest-docs>
  573. 54.95 s gammaloop-nextest-docs> thread 'tests::site_assets_replace_read_only_generated_files' (648) panicked at crates/alphal00p-docs-builder/src/lib.rs:12305:50:
  574. 54.95 s gammaloop-nextest-docs> called `Result::unwrap()` on an `Err` value: failed to copy documentation asset crates/spynso3/typst/STIXTwoMath-Regular.woff2
  575. 54.95 s gammaloop-nextest-docs>
  576. 54.95 s gammaloop-nextest-docs> Caused by:
  577. 54.95 s gammaloop-nextest-docs> No such file or directory (os error 2)
  578. 54.95 s gammaloop-nextest-docs>
  579. 54.95 s gammaloop-nextest-docs> Location:
  580. 54.95 s gammaloop-nextest-docs> crates/alphal00p-docs-builder/src/lib.rs:2276:18
  581. 54.95 s gammaloop-nextest-docs> stack backtrace:
  582. 54.95 s gammaloop-nextest-docs> 0: __rustc::rust_begin_unwind
  583. 54.95 s gammaloop-nextest-docs> 1: core::panicking::panic_fmt
  584. 54.95 s gammaloop-nextest-docs> 2: core::result::unwrap_failed
  585. 54.95 s gammaloop-nextest-docs> 3: alphal00p_docs_builder::tests::site_assets_replace_read_only_generated_files
  586. 54.95 s gammaloop-nextest-docs> 4: <alphal00p_docs_builder::tests::site_assets_replace_read_only_generated_files::{closure#0} as core::ops::function::FnOnce<()>>::call_once
  587. 54.95 s gammaloop-nextest-docs> note: Some details are omitted, run with `RUST_BACKTRACE=full` for a verbose backtrace.
  588. 54.95 s gammaloop-nextest-docs>
  589. 54.95 s gammaloop-nextest-docs> FAIL [ 0.122s] ( 91/129) alphal00p-docs-builder tests::checked_in_registry_is_valid
  590. 54.95 s gammaloop-nextest-docs> stdout ---
  591. 54.95 s gammaloop-nextest-docs>
  592. 54.95 s gammaloop-nextest-docs> running 1 test
  593. 54.95 s gammaloop-nextest-docs> test tests::checked_in_registry_is_valid ... FAILED
  594. 54.95 s gammaloop-nextest-docs>
  595. 54.95 s gammaloop-nextest-docs> failures:
  596. 54.95 s gammaloop-nextest-docs>
  597. 54.95 s gammaloop-nextest-docs> failures:
  598. 54.95 s gammaloop-nextest-docs> tests::checked_in_registry_is_valid
  599. 54.95 s gammaloop-nextest-docs>
  600. 54.95 s gammaloop-nextest-docs> test result: FAILED. 0 passed; 1 failed; 0 ignored; 0 measured; 128 filtered out; finished in 0.11s
  601. 54.95 s gammaloop-nextest-docs>
  602. 54.95 s gammaloop-nextest-docs> stderr ---
  603. 54.95 s gammaloop-nextest-docs>
  604. 54.95 s gammaloop-nextest-docs> thread 'tests::checked_in_registry_is_valid' (241) panicked at crates/alphal00p-docs-builder/src/lib.rs:12260:50:
  605. 54.95 s gammaloop-nextest-docs> called `Result::unwrap()` on an `Err` value: required documentation source is missing: /build/source/crates/spynso3/typst/STIXTwoMath-Regular.woff2
  606. 54.95 s gammaloop-nextest-docs>
  607. 54.95 s gammaloop-nextest-docs> Location:
  608. 54.95 s gammaloop-nextest-docs> crates/alphal00p-docs-builder/src/lib.rs:5103:9
  609. 54.95 s gammaloop-nextest-docs> stack backtrace:
  610. 54.95 s gammaloop-nextest-docs> 0: __rustc::rust_begin_unwind
  611. 54.95 s gammaloop-nextest-docs> 1: core::panicking::panic_fmt
  612. 54.95 s gammaloop-nextest-docs> 2: core::result::unwrap_failed
  613. 54.95 s gammaloop-nextest-docs> 3: alphal00p_docs_builder::tests::checked_in_registry_is_valid
  614. 54.95 s gammaloop-nextest-docs> 4: <alphal00p_docs_builder::tests::checked_in_registry_is_valid::{closure#0} as core::ops::function::FnOnce<()>>::call_once
  615. 54.95 s gammaloop-nextest-docs> note: Some details are omitted, run with `RUST_BACKTRACE=full` for a verbose backtrace.
  616. 54.95 s gammaloop-nextest-docs>
  617. 54.95 s gammaloop-nextest-docs> FAIL [ 0.130s] ( 97/129) alphal00p-docs-builder provenance_tests::each_build_captures_one_revision_before_rendering
  618. 54.95 s gammaloop-nextest-docs> stdout ---
  619. 54.95 s gammaloop-nextest-docs>
  620. 54.95 s gammaloop-nextest-docs> running 1 test
  621. 54.95 s gammaloop-nextest-docs>
  622. 54.95 s gammaloop-nextest-docs> running 1 test
  623. 54.95 s gammaloop-nextest-docs> test provenance_tests::each_build_captures_one_revision_before_rendering ... FAILED
  624. 54.95 s gammaloop-nextest-docs>
  625. 54.95 s gammaloop-nextest-docs> failures:
  626. 54.95 s gammaloop-nextest-docs>
  627. 54.95 s gammaloop-nextest-docs> failures:
  628. 54.95 s gammaloop-nextest-docs> provenance_tests::each_build_captures_one_revision_before_rendering
  629. 54.95 s gammaloop-nextest-docs>
  630. 54.95 s gammaloop-nextest-docs> test result: FAILED. 0 passed; 1 failed; 0 ignored; 0 measured; 128 filtered out; finished in 0.11s
  631. 54.95 s gammaloop-nextest-docs>
  632. 54.95 s gammaloop-nextest-docs> test provenance_tests::each_build_captures_one_revision_before_rendering ... FAILED
  633. 54.95 s gammaloop-nextest-docs>
  634. 54.95 s gammaloop-nextest-docs> failures:
  635. 54.95 s gammaloop-nextest-docs>
  636. 54.95 s gammaloop-nextest-docs> failures:
  637. 54.95 s gammaloop-nextest-docs> provenance_tests::each_build_captures_one_revision_before_rendering
  638. 54.95 s gammaloop-nextest-docs>
  639. 54.95 s gammaloop-nextest-docs> test result: FAILED. 0 passed; 1 failed; 0 ignored; 0 measured; 128 filtered out; finished in 0.12s
  640. 54.95 s gammaloop-nextest-docs>
  641. 54.95 s gammaloop-nextest-docs> stderr ---
  642. 54.95 s gammaloop-nextest-docs>
  643. 54.95 s gammaloop-nextest-docs> thread 'provenance_tests::each_build_captures_one_revision_before_rendering' (260) panicked at crates/alphal00p-docs-builder/src/provenance_tests.rs:297:14:
  644. 54.95 s gammaloop-nextest-docs> called `Result::unwrap()` on an `Err` value: required documentation source is missing: /build/source/target/nix-ci-tmp/.tmp3od26f/checkout/crates/spynso3/typst/STIXTwoMath-Regular.woff2
  645. 54.95 s gammaloop-nextest-docs>
  646. 54.95 s gammaloop-nextest-docs> Location:
  647. 54.95 s gammaloop-nextest-docs> crates/alphal00p-docs-builder/src/lib.rs:5103:9
  648. 54.95 s gammaloop-nextest-docs> stack backtrace:
  649. 54.95 s gammaloop-nextest-docs> 0: __rustc::rust_begin_unwind
  650. 54.95 s gammaloop-nextest-docs> 1: core::panicking::panic_fmt
  651. 54.95 s gammaloop-nextest-docs> 2: core::result::unwrap_failed
  652. 54.95 s gammaloop-nextest-docs> 3: alphal00p_docs_builder::provenance_tests::each_build_captures_one_revision_before_rendering
  653. 54.95 s gammaloop-nextest-docs> 4: <alphal00p_docs_builder::provenance_tests::each_build_captures_one_revision_before_rendering::{closure#0} as core::ops::function::FnOnce<()>>::call_once
  654. 54.95 s gammaloop-nextest-docs> note: Some details are omitted, run with `RUST_BACKTRACE=full` for a verbose backtrace.
  655. 54.95 s gammaloop-nextest-docs>
  656. 54.95 s gammaloop-nextest-docs> thread 'provenance_tests::each_build_captures_one_revision_before_rendering' (226) panicked at crates/alphal00p-docs-builder/src/provenance_tests.rs:274:9:
  657. 54.95 s gammaloop-nextest-docs> assertion failed: command.status().unwrap().success()
  658. 54.95 s gammaloop-nextest-docs> stack backtrace:
  659. 54.95 s gammaloop-nextest-docs> 0: __rustc::rust_begin_unwind
  660. 54.95 s gammaloop-nextest-docs> 1: core::panicking::panic_fmt
  661. 54.95 s gammaloop-nextest-docs> 2: core::panicking::panic
  662. 54.95 s gammaloop-nextest-docs> 3: alphal00p_docs_builder::provenance_tests::each_build_captures_one_revision_before_rendering
  663. 54.95 s gammaloop-nextest-docs> 4: <alphal00p_docs_builder::provenance_tests::each_build_captures_one_revision_before_rendering::{closure#0} as core::ops::function::FnOnce<()>>::call_once
  664. 54.95 s gammaloop-nextest-docs> note: Some details are omitted, run with `RUST_BACKTRACE=full` for a verbose backtrace.
  665. 54.95 s gammaloop-nextest-docs>
  666. 54.95 s gammaloop-nextest-docs> FAIL [ 0.116s] (100/129) alphal00p-docs-builder tests::developer_scope_ranges_ignore_unrelated_edits_and_warn_only_while_watching
  667. 54.95 s gammaloop-nextest-docs> stdout ---
  668. 54.95 s gammaloop-nextest-docs>
  669. 54.95 s gammaloop-nextest-docs> running 1 test
  670. 54.95 s gammaloop-nextest-docs> test tests::developer_scope_ranges_ignore_unrelated_edits_and_warn_only_while_watching ... FAILED
  671. 54.95 s gammaloop-nextest-docs>
  672. 54.95 s gammaloop-nextest-docs> failures:
  673. 54.95 s gammaloop-nextest-docs>
  674. 54.95 s gammaloop-nextest-docs> failures:
  675. 54.95 s gammaloop-nextest-docs> tests::developer_scope_ranges_ignore_unrelated_edits_and_warn_only_while_watching
  676. 54.95 s gammaloop-nextest-docs>
  677. 54.95 s gammaloop-nextest-docs> test result: FAILED. 0 passed; 1 failed; 0 ignored; 0 measured; 128 filtered out; finished in 0.11s
  678. 54.95 s gammaloop-nextest-docs>
  679. 54.95 s gammaloop-nextest-docs> stderr ---
  680. 54.95 s gammaloop-nextest-docs>
  681. 54.95 s gammaloop-nextest-docs> thread 'tests::developer_scope_ranges_ignore_unrelated_edits_and_warn_only_while_watching' (284) panicked at crates/alphal00p-docs-builder/src/lib.rs:12350:29:
  682. 54.95 s gammaloop-nextest-docs> called `Result::unwrap()` on an `Err` value: required documentation source is missing: /build/source/crates/spynso3/typst/STIXTwoMath-Regular.woff2
  683. 54.95 s gammaloop-nextest-docs>
  684. 54.95 s gammaloop-nextest-docs> Location:
  685. 54.95 s gammaloop-nextest-docs> crates/alphal00p-docs-builder/src/lib.rs:5103:9
  686. 54.95 s gammaloop-nextest-docs> stack backtrace:
  687. 54.95 s gammaloop-nextest-docs> 0: __rustc::rust_begin_unwind
  688. 54.95 s gammaloop-nextest-docs> 1: core::panicking::panic_fmt
  689. 54.95 s gammaloop-nextest-docs> 2: core::result::unwrap_failed
  690. 54.95 s gammaloop-nextest-docs> 3: alphal00p_docs_builder::tests::developer_scope_ranges_ignore_unrelated_edits_and_warn_only_while_watching
  691. 54.95 s gammaloop-nextest-docs> 4: <alphal00p_docs_builder::tests::developer_scope_ranges_ignore_unrelated_edits_and_warn_only_while_watching::{closure#0} as core::ops::function::FnOnce<()>>::call_once
  692. 54.95 s gammaloop-nextest-docs> note: Some details are omitted, run with `RUST_BACKTRACE=full` for a verbose backtrace.
  693. 54.95 s gammaloop-nextest-docs>
  694. 54.95 s gammaloop-nextest-docs> FAIL [ 0.120s] (111/129) alphal00p-docs-builder tests::every_product_requires_a_task_chooser_and_each_supported_interface
  695. 54.95 s gammaloop-nextest-docs> stdout ---
  696. 54.95 s gammaloop-nextest-docs>
  697. 54.95 s gammaloop-nextest-docs> running 1 test
  698. 54.95 s gammaloop-nextest-docs> test tests::every_product_requires_a_task_chooser_and_each_supported_interface ... FAILED
  699. 54.95 s gammaloop-nextest-docs>
  700. 54.95 s gammaloop-nextest-docs> failures:
  701. 54.95 s gammaloop-nextest-docs>
  702. 54.95 s gammaloop-nextest-docs> failures:
  703. 54.95 s gammaloop-nextest-docs> tests::every_product_requires_a_task_chooser_and_each_supported_interface
  704. 54.95 s gammaloop-nextest-docs>
  705. 54.95 s gammaloop-nextest-docs> test result: FAILED. 0 passed; 1 failed; 0 ignored; 0 measured; 128 filtered out; finished in 0.12s
  706. 54.95 s gammaloop-nextest-docs>
  707. 54.95 s gammaloop-nextest-docs> stderr ---
  708. 54.95 s gammaloop-nextest-docs>
  709. 54.95 s gammaloop-nextest-docs> thread 'tests::every_product_requires_a_task_chooser_and_each_supported_interface' (309) panicked at crates/alphal00p-docs-builder/src/lib.rs:12274:9:
  710. 54.95 s gammaloop-nextest-docs> assertion failed: format!("{error:#}").contains("has no quickstart page")
  711. 54.95 s gammaloop-nextest-docs> stack backtrace:
  712. 54.95 s gammaloop-nextest-docs> 0: __rustc::rust_begin_unwind
  713. 54.95 s gammaloop-nextest-docs> 1: core::panicking::panic_fmt
  714. 54.95 s gammaloop-nextest-docs> 2: core::panicking::panic
  715. 54.95 s gammaloop-nextest-docs> 3: alphal00p_docs_builder::tests::every_product_requires_a_task_chooser_and_each_supported_interface
  716. 54.95 s gammaloop-nextest-docs> 4: <alphal00p_docs_builder::tests::every_product_requires_a_task_chooser_and_each_supported_interface::{closure#0} as core::ops::function::FnOnce<()>>::call_once
  717. 54.95 s gammaloop-nextest-docs> note: Some details are omitted, run with `RUST_BACKTRACE=full` for a verbose backtrace.
  718. 54.95 s gammaloop-nextest-docs>
  719. 54.95 s gammaloop-nextest-docs> FAIL [ 0.112s] (122/129) alphal00p-docs-builder tests::pdf_manual_chapter_order_must_match_the_page_registry
  720. 54.95 s gammaloop-nextest-docs> stdout ---
  721. 54.95 s gammaloop-nextest-docs>
  722. 54.95 s gammaloop-nextest-docs> running 1 test
  723. 54.95 s gammaloop-nextest-docs> test tests::pdf_manual_chapter_order_must_match_the_page_registry ... FAILED
  724. 54.95 s gammaloop-nextest-docs>
  725. 54.95 s gammaloop-nextest-docs> failures:
  726. 54.95 s gammaloop-nextest-docs>
  727. 54.95 s gammaloop-nextest-docs> failures:
  728. 54.95 s gammaloop-nextest-docs> tests::pdf_manual_chapter_order_must_match_the_page_registry
  729. 54.95 s gammaloop-nextest-docs>
  730. 54.95 s gammaloop-nextest-docs> test result: FAILED. 0 passed; 1 failed; 0 ignored; 0 measured; 128 filtered out; finished in 0.11s
  731. 54.95 s gammaloop-nextest-docs>
  732. 54.95 s gammaloop-nextest-docs> stderr ---
  733. 54.95 s gammaloop-nextest-docs>
  734. 54.95 s gammaloop-nextest-docs> thread 'tests::pdf_manual_chapter_order_must_match_the_page_registry' (402) panicked at crates/alphal00p-docs-builder/src/lib.rs:12330:9:
  735. 54.95 s gammaloop-nextest-docs> assertion failed: format!("{error:#}").contains("PDF manual chapter order differs")
  736. 54.95 s gammaloop-nextest-docs> stack backtrace:
  737. 54.95 s gammaloop-nextest-docs> 0: __rustc::rust_begin_unwind
  738. 54.95 s gammaloop-nextest-docs> 1: core::panicking::panic_fmt
  739. 54.95 s gammaloop-nextest-docs> 2: core::panicking::panic
  740. 54.95 s gammaloop-nextest-docs> 3: alphal00p_docs_builder::tests::pdf_manual_chapter_order_must_match_the_page_registry
  741. 54.95 s gammaloop-nextest-docs> 4: <alphal00p_docs_builder::tests::pdf_manual_chapter_order_must_match_the_page_registry::{closure#0} as core::ops::function::FnOnce<()>>::call_once
  742. 54.95 s gammaloop-nextest-docs> note: Some details are omitted, run with `RUST_BACKTRACE=full` for a verbose backtrace.
  743. 54.95 s gammaloop-nextest-docs>
  744. 54.96 s gammaloop-nextest-docs> error: test run failed
  745. 54.98 s gammaloop-nextest-docs>
  746. 54.98 s gammaloop-nextest-docs> ========== nextest test summary ==========
  747. 54.98 s gammaloop-nextest-docs> report: target/nextest/ci_gammaloop/junit.xml
  748. 54.98 s gammaloop-nextest-docs> tests: 129, failures: 11, errors: 0
  749. 54.98 s gammaloop-nextest-docs>
  750. 54.98 s gammaloop-nextest-docs> 1. alphal00p-docs-builder::tests::developer_architecture_is_classified_searchable_and_source_backed
  751. 54.98 s gammaloop-nextest-docs> failure: test failure with exit code 101
  752. 54.98 s gammaloop-nextest-docs> thread 'tests::developer_architecture_is_classified_searchable_and_source_backed' (276) panicked at crates/alphal00p-docs-builder/src/lib.rs:12751:14:
  753. 54.98 s gammaloop-nextest-docs> called `Result::unwrap()` on an `Err` value: failed to copy documentation asset crates/spynso3/typst/STIXTwoMath-Regular.woff2
  754. 54.98 s gammaloop-nextest-docs>
  755. 54.98 s gammaloop-nextest-docs> Caused by:
  756. 54.98 s gammaloop-nextest-docs> No such file or directory (os error 2)
  757. 54.98 s gammaloop-nextest-docs>
  758. 54.98 s gammaloop-nextest-docs> Location:
  759. 54.98 s gammaloop-nextest-docs> crates/alphal00p-docs-builder/src/lib.rs:2276:18
  760. 54.98 s gammaloop-nextest-docs> stack backtrace:
  761. 54.98 s gammaloop-nextest-docs> 0: __rustc::rust_begin_unwind
  762. 54.98 s gammaloop-nextest-docs> 1: core::panicking::panic_fmt
  763. 54.98 s gammaloop-nextest-docs> 2: core::result::unwrap_failed
  764. 54.98 s gammaloop-nextest-docs> 3: alphal00p_docs_builder::tests::developer_architecture_is_classified_searchable_and_source_backed
  765. 54.98 s gammaloop-nextest-docs> 4: <alphal00p_docs_builder::tests::developer_architecture_is_classified_searchable_and_source_backed::{closure#0} as core::ops::function::FnOnce<()>>::call_once
  766. 54.98 s gammaloop-nextest-docs> note: Some details are omitted, run with `RUST_BACKTRACE=full` for a verbose backtrace.
  767. 54.98 s gammaloop-nextest-docs> system-out
  768. 54.98 s gammaloop-nextest-docs> running 1 test
  769. 54.98 s gammaloop-nextest-docs> test tests::developer_architecture_is_classified_searchable_and_source_backed ... FAILED
  770. 54.98 s gammaloop-nextest-docs>
  771. 54.98 s gammaloop-nextest-docs> failures:
  772. 54.98 s gammaloop-nextest-docs>
  773. 54.98 s gammaloop-nextest-docs> failures:
  774. 54.98 s gammaloop-nextest-docs> tests::developer_architecture_is_classified_searchable_and_source_backed
  775. 54.98 s gammaloop-nextest-docs>
  776. 54.98 s gammaloop-nextest-docs> test result: FAILED. 0 passed; 1 failed; 0 ignored; 0 measured; 128 filtered out; finished in 0.01s
  777. 54.98 s gammaloop-nextest-docs> system-err
  778. 54.98 s gammaloop-nextest-docs> thread 'tests::developer_architecture_is_classified_searchable_and_source_backed' (276) panicked at crates/alphal00p-docs-builder/src/lib.rs:12751:14:
  779. 54.98 s gammaloop-nextest-docs> called `Result::unwrap()` on an `Err` value: failed to copy documentation asset crates/spynso3/typst/STIXTwoMath-Regular.woff2
  780. 54.98 s gammaloop-nextest-docs>
  781. 54.98 s gammaloop-nextest-docs> Caused by:
  782. 54.98 s gammaloop-nextest-docs> No such file or directory (os error 2)
  783. 54.98 s gammaloop-nextest-docs>
  784. 54.98 s gammaloop-nextest-docs> Location:
  785. 54.98 s gammaloop-nextest-docs> crates/alphal00p-docs-builder/src/lib.rs:2276:18
  786. 54.98 s gammaloop-nextest-docs> stack backtrace:
  787. 54.98 s gammaloop-nextest-docs> 0: __rustc::rust_begin_unwind
  788. 54.98 s gammaloop-nextest-docs> 1: core::panicking::panic_fmt
  789. 54.98 s gammaloop-nextest-docs> 2: core::result::unwrap_failed
  790. 54.98 s gammaloop-nextest-docs> 3: alphal00p_docs_builder::tests::developer_architecture_is_classified_searchable_and_source_backed
  791. 54.98 s gammaloop-nextest-docs> 4: <alphal00p_docs_builder::tests::developer_architecture_is_classified_searchable_and_source_backed::{closure#0} as core::ops::function::FnOnce<()>>::call_once
  792. 54.98 s gammaloop-nextest-docs> note: Some details are omitted, run with `RUST_BACKTRACE=full` for a verbose backtrace.
  793. 54.98 s gammaloop-nextest-docs>
  794. 54.98 s gammaloop-nextest-docs> 2. alphal00p-docs-builder::tests::every_product_orients_rust_to_native_rustdoc_and_keeps_legacy_redirects
  795. 54.98 s gammaloop-nextest-docs> failure: test failure with exit code 101
  796. 54.98 s gammaloop-nextest-docs> thread 'tests::every_product_orients_rust_to_native_rustdoc_and_keeps_legacy_redirects' (302) panicked at crates/alphal00p-docs-builder/src/lib.rs:12555:46:
  797. 54.98 s gammaloop-nextest-docs> called `Result::unwrap()` on an `Err` value: failed to copy documentation asset crates/spynso3/typst/STIXTwoMath-Regular.woff2
  798. 54.98 s gammaloop-nextest-docs>
  799. 54.98 s gammaloop-nextest-docs> Caused by:
  800. 54.98 s gammaloop-nextest-docs> No such file or directory (os error 2)
  801. 54.98 s gammaloop-nextest-docs>
  802. 54.98 s gammaloop-nextest-docs> Location:
  803. 54.98 s gammaloop-nextest-docs> crates/alphal00p-docs-builder/src/lib.rs:2276:18
  804. 54.98 s gammaloop-nextest-docs> stack backtrace:
  805. 54.98 s gammaloop-nextest-docs> 0: __rustc::rust_begin_unwind
  806. 54.98 s gammaloop-nextest-docs> 1: core::panicking::panic_fmt
  807. 54.98 s gammaloop-nextest-docs> 2: core::result::unwrap_failed
  808. 54.98 s gammaloop-nextest-docs> 3: alphal00p_docs_builder::tests::every_product_orients_rust_to_native_rustdoc_and_keeps_legacy_redirects
  809. 54.98 s gammaloop-nextest-docs> 4: <alphal00p_docs_builder::tests::every_product_orients_rust_to_native_rustdoc_and_keeps_legacy_redirects::{closure#0} as core::ops::function::FnOnce<()>>::call_once
  810. 54.98 s gammaloop-nextest-docs> note: Some details are omitted, run with `RUST_BACKTRACE=full` for a verbose backtrace.
  811. 54.98 s gammaloop-nextest-docs> system-out
  812. 54.98 s gammaloop-nextest-docs> running 1 test
  813. 54.98 s gammaloop-nextest-docs> test tests::every_product_orients_rust_to_native_rustdoc_and_keeps_legacy_redirects ... FAILED
  814. 54.98 s gammaloop-nextest-docs>
  815. 54.98 s gammaloop-nextest-docs> failures:
  816. 54.98 s gammaloop-nextest-docs>
  817. 54.98 s gammaloop-nextest-docs> failures:
  818. 54.98 s gammaloop-nextest-docs> tests::every_product_orients_rust_to_native_rustdoc_and_keeps_legacy_redirects
  819. 54.98 s gammaloop-nextest-docs>
  820. 54.98 s gammaloop-nextest-docs> test result: FAILED. 0 passed; 1 failed; 0 ignored; 0 measured; 128 filtered out; finished in 0.01s
  821. 54.98 s gammaloop-nextest-docs> system-err
  822. 54.98 s gammaloop-nextest-docs> thread 'tests::every_product_orients_rust_to_native_rustdoc_and_keeps_legacy_redirects' (302) panicked at crates/alphal00p-docs-builder/src/lib.rs:12555:46:
  823. 54.98 s gammaloop-nextest-docs> called `Result::unwrap()` on an `Err` value: failed to copy documentation asset crates/spynso3/typst/STIXTwoMath-Regular.woff2
  824. 54.98 s gammaloop-nextest-docs>
  825. 54.98 s gammaloop-nextest-docs> Caused by:
  826. 54.98 s gammaloop-nextest-docs> No such file or directory (os error 2)
  827. 54.98 s gammaloop-nextest-docs>
  828. 54.98 s gammaloop-nextest-docs> Location:
  829. 54.98 s gammaloop-nextest-docs> crates/alphal00p-docs-builder/src/lib.rs:2276:18
  830. 54.98 s gammaloop-nextest-docs> stack backtrace:
  831. 54.98 s gammaloop-nextest-docs> 0: __rustc::rust_begin_unwind
  832. 54.98 s gammaloop-nextest-docs> 1: core::panicking::panic_fmt
  833. 54.98 s gammaloop-nextest-docs> 2: core::result::unwrap_failed
  834. 54.98 s gammaloop-nextest-docs> 3: alphal00p_docs_builder::tests::every_product_orients_rust_to_native_rustdoc_and_keeps_legacy_redirects
  835. 54.98 s gammaloop-nextest-docs> 4: <alphal00p_docs_builder::tests::every_product_orients_rust_to_native_rustdoc_and_keeps_legacy_redirects::{closure#0} as core::ops::function::FnOnce<()>>::call_once
  836. 54.98 s gammaloop-nextest-docs> note: Some details are omitted, run with `RUST_BACKTRACE=full` for a verbose backtrace.
  837. 54.98 s gammaloop-nextest-docs>
  838. 54.98 s gammaloop-nextest-docs> 3. alphal00p-docs-builder::tests::portal_and_developer_pages_use_federated_search_and_feedback
  839. 54.98 s gammaloop-nextest-docs> failure: test failure with exit code 101
  840. 54.98 s gammaloop-nextest-docs> thread 'tests::portal_and_developer_pages_use_federated_search_and_feedback' (416) panicked at crates/alphal00p-docs-builder/src/lib.rs:9684:14:
  841. 54.98 s gammaloop-nextest-docs> called `Result::unwrap()` on an `Err` value: failed to copy documentation asset crates/spynso3/typst/STIXTwoMath-Regular.woff2
  842. 54.98 s gammaloop-nextest-docs>
  843. 54.98 s gammaloop-nextest-docs> Caused by:
  844. 54.98 s gammaloop-nextest-docs> No such file or directory (os error 2)
  845. 54.98 s gammaloop-nextest-docs>
  846. 54.98 s gammaloop-nextest-docs> Location:
  847. 54.98 s gammaloop-nextest-docs> crates/alphal00p-docs-builder/src/lib.rs:2276:18
  848. 54.98 s gammaloop-nextest-docs> stack backtrace:
  849. 54.98 s gammaloop-nextest-docs> 0: __rustc::rust_begin_unwind
  850. 54.98 s gammaloop-nextest-docs> 1: core::panicking::panic_fmt
  851. 54.98 s gammaloop-nextest-docs> 2: core::result::unwrap_failed
  852. 54.98 s gammaloop-nextest-docs> 3: alphal00p_docs_builder::tests::write_test_portal
  853. 54.98 s gammaloop-nextest-docs> 4: alphal00p_docs_builder::tests::portal_and_developer_pages_use_federated_search_and_feedback
  854. 54.98 s gammaloop-nextest-docs> 5: <alphal00p_docs_builder::tests::portal_and_developer_pages_use_federated_search_and_feedback::{closure#0} as core::ops::function::FnOnce<()>>::call_once
  855. 54.98 s gammaloop-nextest-docs> note: Some details are omitted, run with `RUST_BACKTRACE=full` for a verbose backtrace.
  856. 54.98 s gammaloop-nextest-docs> system-out
  857. 54.98 s gammaloop-nextest-docs> running 1 test
  858. 54.98 s gammaloop-nextest-docs> test tests::portal_and_developer_pages_use_federated_search_and_feedback ... FAILED
  859. 54.98 s gammaloop-nextest-docs>
  860. 54.98 s gammaloop-nextest-docs> failures:
  861. 54.98 s gammaloop-nextest-docs>
  862. 54.98 s gammaloop-nextest-docs> failures:
  863. 54.98 s gammaloop-nextest-docs> tests::portal_and_developer_pages_use_federated_search_and_feedback
  864. 54.98 s gammaloop-nextest-docs>
  865. 54.98 s gammaloop-nextest-docs> test result: FAILED. 0 passed; 1 failed; 0 ignored; 0 measured; 128 filtered out; finished in 0.01s
  866. 54.98 s gammaloop-nextest-docs> system-err
  867. 54.98 s gammaloop-nextest-docs> thread 'tests::portal_and_developer_pages_use_federated_search_and_feedback' (416) panicked at crates/alphal00p-docs-builder/src/lib.rs:9684:14:
  868. 54.98 s gammaloop-nextest-docs> called `Result::unwrap()` on an `Err` value: failed to copy documentation asset crates/spynso3/typst/STIXTwoMath-Regular.woff2
  869. 54.98 s gammaloop-nextest-docs>
  870. 54.98 s gammaloop-nextest-docs> Caused by:
  871. 54.98 s gammaloop-nextest-docs> No such file or directory (os error 2)
  872. 54.98 s gammaloop-nextest-docs>
  873. 54.98 s gammaloop-nextest-docs> Location:
  874. 54.98 s gammaloop-nextest-docs> crates/alphal00p-docs-builder/src/lib.rs:2276:18
  875. 54.99 s gammaloop-nextest-docs> stack backtrace:
  876. 54.99 s gammaloop-nextest-docs> 0: __rustc::rust_begin_unwind
  877. 54.99 s gammaloop-nextest-docs> 1: core::panicking::panic_fmt
  878. 54.99 s gammaloop-nextest-docs> 2: core::result::unwrap_failed
  879. 54.99 s gammaloop-nextest-docs> 3: alphal00p_docs_builder::tests::write_test_portal
  880. 54.99 s gammaloop-nextest-docs> 4: alphal00p_docs_builder::tests::portal_and_developer_pages_use_federated_search_and_feedback
  881. 54.99 s gammaloop-nextest-docs> 5: <alphal00p_docs_builder::tests::portal_and_developer_pages_use_federated_search_and_feedback::{closure#0} as core::ops::function::FnOnce<()>>::call_once
  882. 54.99 s gammaloop-nextest-docs> note: Some details are omitted, run with `RUST_BACKTRACE=full` for a verbose backtrace.
  883. 54.99 s gammaloop-nextest-docs>
  884. 54.99 s gammaloop-nextest-docs> 4. alphal00p-docs-builder::tests::portal_emits_routes_and_valid_assets
  885. 54.99 s gammaloop-nextest-docs> failure: test failure with exit code 101
  886. 54.99 s gammaloop-nextest-docs> thread 'tests::portal_emits_routes_and_valid_assets' (422) panicked at crates/alphal00p-docs-builder/src/lib.rs:9684:14:
  887. 54.99 s gammaloop-nextest-docs> called `Result::unwrap()` on an `Err` value: failed to copy documentation asset crates/spynso3/typst/STIXTwoMath-Regular.woff2
  888. 54.99 s gammaloop-nextest-docs>
  889. 54.99 s gammaloop-nextest-docs> Caused by:
  890. 54.99 s gammaloop-nextest-docs> No such file or directory (os error 2)
  891. 54.99 s gammaloop-nextest-docs>
  892. 54.99 s gammaloop-nextest-docs> Location:
  893. 54.99 s gammaloop-nextest-docs> crates/alphal00p-docs-builder/src/lib.rs:2276:18
  894. 54.99 s gammaloop-nextest-docs> stack backtrace:
  895. 54.99 s gammaloop-nextest-docs> 0: __rustc::rust_begin_unwind
  896. 54.99 s gammaloop-nextest-docs> 1: core::panicking::panic_fmt
  897. 54.99 s gammaloop-nextest-docs> 2: core::result::unwrap_failed
  898. 54.99 s gammaloop-nextest-docs> 3: alphal00p_docs_builder::tests::write_test_portal
  899. 54.99 s gammaloop-nextest-docs> 4: alphal00p_docs_builder::tests::portal_emits_routes_and_valid_assets
  900. 54.99 s gammaloop-nextest-docs> 5: <alphal00p_docs_builder::tests::portal_emits_routes_and_valid_assets::{closure#0} as core::ops::function::FnOnce<()>>::call_once
  901. 54.99 s gammaloop-nextest-docs> note: Some details are omitted, run with `RUST_BACKTRACE=full` for a verbose backtrace.
  902. 54.99 s gammaloop-nextest-docs> system-out
  903. 54.99 s gammaloop-nextest-docs> running 1 test
  904. 54.99 s gammaloop-nextest-docs> test tests::portal_emits_routes_and_valid_assets ... FAILED
  905. 54.99 s gammaloop-nextest-docs>
  906. 54.99 s gammaloop-nextest-docs> failures:
  907. 54.99 s gammaloop-nextest-docs>
  908. 54.99 s gammaloop-nextest-docs> failures:
  909. 54.99 s gammaloop-nextest-docs> tests::portal_emits_routes_and_valid_assets
  910. 54.99 s gammaloop-nextest-docs>
  911. 54.99 s gammaloop-nextest-docs> test result: FAILED. 0 passed; 1 failed; 0 ignored; 0 measured; 128 filtered out; finished in 0.00s
  912. 54.99 s gammaloop-nextest-docs> system-err
  913. 54.99 s gammaloop-nextest-docs> thread 'tests::portal_emits_routes_and_valid_assets' (422) panicked at crates/alphal00p-docs-builder/src/lib.rs:9684:14:
  914. 54.99 s gammaloop-nextest-docs> called `Result::unwrap()` on an `Err` value: failed to copy documentation asset crates/spynso3/typst/STIXTwoMath-Regular.woff2
  915. 54.99 s gammaloop-nextest-docs>
  916. 54.99 s gammaloop-nextest-docs> Caused by:
  917. 54.99 s gammaloop-nextest-docs> No such file or directory (os error 2)
  918. 54.99 s gammaloop-nextest-docs>
  919. 54.99 s gammaloop-nextest-docs> Location:
  920. 54.99 s gammaloop-nextest-docs> crates/alphal00p-docs-builder/src/lib.rs:2276:18
  921. 54.99 s gammaloop-nextest-docs> stack backtrace:
  922. 54.99 s gammaloop-nextest-docs> 0: __rustc::rust_begin_unwind
  923. 54.99 s gammaloop-nextest-docs> 1: core::panicking::panic_fmt
  924. 54.99 s gammaloop-nextest-docs> 2: core::result::unwrap_failed
  925. 54.99 s gammaloop-nextest-docs> 3: alphal00p_docs_builder::tests::write_test_portal
  926. 54.99 s gammaloop-nextest-docs> 4: alphal00p_docs_builder::tests::portal_emits_routes_and_valid_assets
  927. 54.99 s gammaloop-nextest-docs> 5: <alphal00p_docs_builder::tests::portal_emits_routes_and_valid_assets::{closure#0} as core::ops::function::FnOnce<()>>::call_once
  928. 54.99 s gammaloop-nextest-docs> note: Some details are omitted, run with `RUST_BACKTRACE=full` for a verbose backtrace.
  929. 54.99 s gammaloop-nextest-docs>
  930. 54.99 s gammaloop-nextest-docs> 5. alphal00p-docs-builder::tests::portal_task_chooser_routes_each_goal_to_the_registered_quickstart
  931. 54.99 s gammaloop-nextest-docs> failure: test failure with exit code 101
  932. 54.99 s gammaloop-nextest-docs> thread 'tests::portal_task_chooser_routes_each_goal_to_the_registered_quickstart' (427) panicked at crates/alphal00p-docs-builder/src/lib.rs:9684:14:
  933. 54.99 s gammaloop-nextest-docs> called `Result::unwrap()` on an `Err` value: failed to copy documentation asset crates/spynso3/typst/STIXTwoMath-Regular.woff2
  934. 54.99 s gammaloop-nextest-docs>
  935. 54.99 s gammaloop-nextest-docs> Caused by:
  936. 54.99 s gammaloop-nextest-docs> No such file or directory (os error 2)
  937. 54.99 s gammaloop-nextest-docs>
  938. 54.99 s gammaloop-nextest-docs> Location:
  939. 54.99 s gammaloop-nextest-docs> crates/alphal00p-docs-builder/src/lib.rs:2276:18
  940. 54.99 s gammaloop-nextest-docs> stack backtrace:
  941. 54.99 s gammaloop-nextest-docs> 0: __rustc::rust_begin_unwind
  942. 54.99 s gammaloop-nextest-docs> 1: core::panicking::panic_fmt
  943. 54.99 s gammaloop-nextest-docs> 2: core::result::unwrap_failed
  944. 54.99 s gammaloop-nextest-docs> 3: alphal00p_docs_builder::tests::write_test_portal
  945. 54.99 s gammaloop-nextest-docs> 4: alphal00p_docs_builder::tests::portal_task_chooser_routes_each_goal_to_the_registered_quickstart
  946. 54.99 s gammaloop-nextest-docs> 5: <alphal00p_docs_builder::tests::portal_task_chooser_routes_each_goal_to_the_registered_quickstart::{closure#0} as core::ops::function::FnOnce<()>>::call_once
  947. 54.99 s gammaloop-nextest-docs> note: Some details are omitted, run with `RUST_BACKTRACE=full` for a verbose backtrace.
  948. 54.99 s gammaloop-nextest-docs> system-out
  949. 54.99 s gammaloop-nextest-docs> running 1 test
  950. 54.99 s gammaloop-nextest-docs> test tests::portal_task_chooser_routes_each_goal_to_the_registered_quickstart ... FAILED
  951. 54.99 s gammaloop-nextest-docs>
  952. 54.99 s gammaloop-nextest-docs> failures:
  953. 54.99 s gammaloop-nextest-docs>
  954. 54.99 s gammaloop-nextest-docs> failures:
  955. 54.99 s gammaloop-nextest-docs> tests::portal_task_chooser_routes_each_goal_to_the_registered_quickstart
  956. 54.99 s gammaloop-nextest-docs>
  957. 54.99 s gammaloop-nextest-docs> test result: FAILED. 0 passed; 1 failed; 0 ignored; 0 measured; 128 filtered out; finished in 0.01s
  958. 54.99 s gammaloop-nextest-docs> system-err
  959. 54.99 s gammaloop-nextest-docs> thread 'tests::portal_task_chooser_routes_each_goal_to_the_registered_quickstart' (427) panicked at crates/alphal00p-docs-builder/src/lib.rs:9684:14:
  960. 54.99 s gammaloop-nextest-docs> called `Result::unwrap()` on an `Err` value: failed to copy documentation asset crates/spynso3/typst/STIXTwoMath-Regular.woff2
  961. 54.99 s gammaloop-nextest-docs>
  962. 54.99 s gammaloop-nextest-docs> Caused by:
  963. 54.99 s gammaloop-nextest-docs> No such file or directory (os error 2)
  964. 54.99 s gammaloop-nextest-docs>
  965. 54.99 s gammaloop-nextest-docs> Location:
  966. 54.99 s gammaloop-nextest-docs> crates/alphal00p-docs-builder/src/lib.rs:2276:18
  967. 54.99 s gammaloop-nextest-docs> stack backtrace:
  968. 54.99 s gammaloop-nextest-docs> 0: __rustc::rust_begin_unwind
  969. 54.99 s gammaloop-nextest-docs> 1: core::panicking::panic_fmt
  970. 54.99 s gammaloop-nextest-docs> 2: core::result::unwrap_failed
  971. 54.99 s gammaloop-nextest-docs> 3: alphal00p_docs_builder::tests::write_test_portal
  972. 54.99 s gammaloop-nextest-docs> 4: alphal00p_docs_builder::tests::portal_task_chooser_routes_each_goal_to_the_registered_quickstart
  973. 54.99 s gammaloop-nextest-docs> 5: <alphal00p_docs_builder::tests::portal_task_chooser_routes_each_goal_to_the_registered_quickstart::{closure#0} as core::ops::function::FnOnce<()>>::call_once
  974. 54.99 s gammaloop-nextest-docs> note: Some details are omitted, run with `RUST_BACKTRACE=full` for a verbose backtrace.
  975. 54.99 s gammaloop-nextest-docs>
  976. 54.99 s gammaloop-nextest-docs> 6. alphal00p-docs-builder::tests::site_assets_replace_read_only_generated_files
  977. 54.99 s gammaloop-nextest-docs> failure: test failure with exit code 101
  978. 54.99 s gammaloop-nextest-docs> thread 'tests::site_assets_replace_read_only_generated_files' (648) panicked at crates/alphal00p-docs-builder/src/lib.rs:12305:50:
  979. 54.99 s gammaloop-nextest-docs> called `Result::unwrap()` on an `Err` value: failed to copy documentation asset crates/spynso3/typst/STIXTwoMath-Regular.woff2
  980. 54.99 s gammaloop-nextest-docs>
  981. 54.99 s gammaloop-nextest-docs> Caused by:
  982. 54.99 s gammaloop-nextest-docs> No such file or directory (os error 2)
  983. 54.99 s gammaloop-nextest-docs>
  984. 54.99 s gammaloop-nextest-docs> Location:
  985. 54.99 s gammaloop-nextest-docs> crates/alphal00p-docs-builder/src/lib.rs:2276:18
  986. 54.99 s gammaloop-nextest-docs> stack backtrace:
  987. 54.99 s gammaloop-nextest-docs> 0: __rustc::rust_begin_unwind
  988. 54.99 s gammaloop-nextest-docs> 1: core::panicking::panic_fmt
  989. 54.99 s gammaloop-nextest-docs> 2: core::result::unwrap_failed
  990. 54.99 s gammaloop-nextest-docs> 3: alphal00p_docs_builder::tests::site_assets_replace_read_only_generated_files
  991. 54.99 s gammaloop-nextest-docs> 4: <alphal00p_docs_builder::tests::site_assets_replace_read_only_generated_files::{closure#0} as core::ops::function::FnOnce<()>>::call_once
  992. 54.99 s gammaloop-nextest-docs> note: Some details are omitted, run with `RUST_BACKTRACE=full` for a verbose backtrace.
  993. 54.99 s gammaloop-nextest-docs> system-out
  994. 54.99 s gammaloop-nextest-docs> running 1 test
  995. 54.99 s gammaloop-nextest-docs> test tests::site_assets_replace_read_only_generated_files ... FAILED
  996. 54.99 s gammaloop-nextest-docs>
  997. 54.99 s gammaloop-nextest-docs> failures:
  998. 54.99 s gammaloop-nextest-docs>
  999. 54.99 s gammaloop-nextest-docs> failures:
  1000. 54.99 s gammaloop-nextest-docs> tests::site_assets_replace_read_only_generated_files
  1001. 54.99 s gammaloop-nextest-docs>
  1002. 54.99 s gammaloop-nextest-docs> test result: FAILED. 0 passed; 1 failed; 0 ignored; 0 measured; 128 filtered out; finished in 0.00s
  1003. 54.99 s gammaloop-nextest-docs> system-err
  1004. 54.99 s gammaloop-nextest-docs> thread 'tests::site_assets_replace_read_only_generated_files' (648) panicked at crates/alphal00p-docs-builder/src/lib.rs:12305:50:
  1005. 54.99 s gammaloop-nextest-docs> called `Result::unwrap()` on an `Err` value: failed to copy documentation asset crates/spynso3/typst/STIXTwoMath-Regular.woff2
  1006. 54.99 s gammaloop-nextest-docs>
  1007. 54.99 s gammaloop-nextest-docs> Caused by:
  1008. 54.99 s gammaloop-nextest-docs> No such file or directory (os error 2)
  1009. 54.99 s gammaloop-nextest-docs>
  1010. 54.99 s gammaloop-nextest-docs> Location:
  1011. 54.99 s gammaloop-nextest-docs> crates/alphal00p-docs-builder/src/lib.rs:2276:18
  1012. 54.99 s gammaloop-nextest-docs> stack backtrace:
  1013. 54.99 s gammaloop-nextest-docs> 0: __rustc::rust_begin_unwind
  1014. 54.99 s gammaloop-nextest-docs> 1: core::panicking::panic_fmt
  1015. 54.99 s gammaloop-nextest-docs> 2: core::result::unwrap_failed
  1016. 54.99 s gammaloop-nextest-docs> 3: alphal00p_docs_builder::tests::site_assets_replace_read_only_generated_files
  1017. 54.99 s gammaloop-nextest-docs> 4: <alphal00p_docs_builder::tests::site_assets_replace_read_only_generated_files::{closure#0} as core::ops::function::FnOnce<()>>::call_once
  1018. 54.99 s gammaloop-nextest-docs> note: Some details are omitted, run with `RUST_BACKTRACE=full` for a verbose backtrace.
  1019. 54.99 s gammaloop-nextest-docs>
  1020. 54.99 s gammaloop-nextest-docs> 7. alphal00p-docs-builder::tests::checked_in_registry_is_valid
  1021. 54.99 s gammaloop-nextest-docs> failure: test failure with exit code 101
  1022. 54.99 s gammaloop-nextest-docs> thread 'tests::checked_in_registry_is_valid' (241) panicked at crates/alphal00p-docs-builder/src/lib.rs:12260:50:
  1023. 54.99 s gammaloop-nextest-docs> called `Result::unwrap()` on an `Err` value: required documentation source is missing: /build/source/crates/spynso3/typst/STIXTwoMath-Regular.woff2
  1024. 54.99 s gammaloop-nextest-docs>
  1025. 54.99 s gammaloop-nextest-docs> Location:
  1026. 54.99 s gammaloop-nextest-docs> crates/alphal00p-docs-builder/src/lib.rs:5103:9
  1027. 54.99 s gammaloop-nextest-docs> stack backtrace:
  1028. 54.99 s gammaloop-nextest-docs> 0: __rustc::rust_begin_unwind
  1029. 54.99 s gammaloop-nextest-docs> 1: core::panicking::panic_fmt
  1030. 54.99 s gammaloop-nextest-docs> 2: core::result::unwrap_failed
  1031. 54.99 s gammaloop-nextest-docs> 3: alphal00p_docs_builder::tests::checked_in_registry_is_valid
  1032. 54.99 s gammaloop-nextest-docs> 4: <alphal00p_docs_builder::tests::checked_in_registry_is_valid::{closure#0} as core::ops::function::FnOnce<()>>::call_once
  1033. 54.99 s gammaloop-nextest-docs> note: Some details are omitted, run with `RUST_BACKTRACE=full` for a verbose backtrace.
  1034. 54.99 s gammaloop-nextest-docs> system-out
  1035. 54.99 s gammaloop-nextest-docs> running 1 test
  1036. 54.99 s gammaloop-nextest-docs> test tests::checked_in_registry_is_valid ... FAILED
  1037. 54.99 s gammaloop-nextest-docs>
  1038. 54.99 s gammaloop-nextest-docs> failures:
  1039. 54.99 s gammaloop-nextest-docs>
  1040. 54.99 s gammaloop-nextest-docs> failures:
  1041. 54.99 s gammaloop-nextest-docs> tests::checked_in_registry_is_valid
  1042. 54.99 s gammaloop-nextest-docs>
  1043. 54.99 s gammaloop-nextest-docs> test result: FAILED. 0 passed; 1 failed; 0 ignored; 0 measured; 128 filtered out; finished in 0.11s
  1044. 54.99 s gammaloop-nextest-docs> system-err
  1045. 54.99 s gammaloop-nextest-docs> thread 'tests::checked_in_registry_is_valid' (241) panicked at crates/alphal00p-docs-builder/src/lib.rs:12260:50:
  1046. 54.99 s gammaloop-nextest-docs> called `Result::unwrap()` on an `Err` value: required documentation source is missing: /build/source/crates/spynso3/typst/STIXTwoMath-Regular.woff2
  1047. 54.99 s gammaloop-nextest-docs>
  1048. 54.99 s gammaloop-nextest-docs> Location:
  1049. 54.99 s gammaloop-nextest-docs> crates/alphal00p-docs-builder/src/lib.rs:5103:9
  1050. 54.99 s gammaloop-nextest-docs> stack backtrace:
  1051. 54.99 s gammaloop-nextest-docs> 0: __rustc::rust_begin_unwind
  1052. 54.99 s gammaloop-nextest-docs> 1: core::panicking::panic_fmt
  1053. 54.99 s gammaloop-nextest-docs> 2: core::result::unwrap_failed
  1054. 54.99 s gammaloop-nextest-docs> 3: alphal00p_docs_builder::tests::checked_in_registry_is_valid
  1055. 54.99 s gammaloop-nextest-docs> 4: <alphal00p_docs_builder::tests::checked_in_registry_is_valid::{closure#0} as core::ops::function::FnOnce<()>>::call_once
  1056. 54.99 s gammaloop-nextest-docs> note: Some details are omitted, run with `RUST_BACKTRACE=full` for a verbose backtrace.
  1057. 54.99 s gammaloop-nextest-docs>
  1058. 54.99 s gammaloop-nextest-docs> 8. alphal00p-docs-builder::provenance_tests::each_build_captures_one_revision_before_rendering
  1059. 54.99 s gammaloop-nextest-docs> failure: test failure with exit code 101
  1060. 54.99 s gammaloop-nextest-docs> thread 'provenance_tests::each_build_captures_one_revision_before_rendering' (226) panicked at crates/alphal00p-docs-builder/src/provenance_tests.rs:274:9:
  1061. 54.99 s gammaloop-nextest-docs> assertion failed: command.status().unwrap().success()
  1062. 54.99 s gammaloop-nextest-docs> stack backtrace:
  1063. 54.99 s gammaloop-nextest-docs> 0: __rustc::rust_begin_unwind
  1064. 54.99 s gammaloop-nextest-docs> 1: core::panicking::panic_fmt
  1065. 54.99 s gammaloop-nextest-docs> 2: core::panicking::panic
  1066. 54.99 s gammaloop-nextest-docs> 3: alphal00p_docs_builder::provenance_tests::each_build_captures_one_revision_before_rendering
  1067. 54.99 s gammaloop-nextest-docs> 4: <alphal00p_docs_builder::provenance_tests::each_build_captures_one_revision_before_rendering::{closure#0} as core::ops::function::FnOnce<()>>::call_once
  1068. 54.99 s gammaloop-nextest-docs> note: Some details are omitted, run with `RUST_BACKTRACE=full` for a verbose backtrace.
  1069. 54.99 s gammaloop-nextest-docs> system-out
  1070. 54.99 s gammaloop-nextest-docs> running 1 test
  1071. 54.99 s gammaloop-nextest-docs>
  1072. 54.99 s gammaloop-nextest-docs> running 1 test
  1073. 54.99 s gammaloop-nextest-docs> test provenance_tests::each_build_captures_one_revision_before_rendering ... FAILED
  1074. 54.99 s gammaloop-nextest-docs>
  1075. 54.99 s gammaloop-nextest-docs> failures:
  1076. 54.99 s gammaloop-nextest-docs>
  1077. 54.99 s gammaloop-nextest-docs> failures:
  1078. 54.99 s gammaloop-nextest-docs> provenance_tests::each_build_captures_one_revision_before_rendering
  1079. 54.99 s gammaloop-nextest-docs>
  1080. 54.99 s gammaloop-nextest-docs> test result: FAILED. 0 passed; 1 failed; 0 ignored; 0 measured; 128 filtered out; finished in 0.11s
  1081. 54.99 s gammaloop-nextest-docs>
  1082. 54.99 s gammaloop-nextest-docs> test provenance_tests::each_build_captures_one_revision_before_rendering ... FAILED
  1083. 54.99 s gammaloop-nextest-docs>
  1084. 54.99 s gammaloop-nextest-docs> failures:
  1085. 54.99 s gammaloop-nextest-docs>
  1086. 54.99 s gammaloop-nextest-docs> failures:
  1087. 54.99 s gammaloop-nextest-docs> provenance_tests::each_build_captures_one_revision_before_rendering
  1088. 54.99 s gammaloop-nextest-docs>
  1089. 54.99 s gammaloop-nextest-docs> test result: FAILED. 0 passed; 1 failed; 0 ignored; 0 measured; 128 filtered out; finished in 0.12s
  1090. 54.99 s gammaloop-nextest-docs> system-err
  1091. 54.99 s gammaloop-nextest-docs> thread 'provenance_tests::each_build_captures_one_revision_before_rendering' (260) panicked at crates/alphal00p-docs-builder/src/provenance_tests.rs:297:14:
  1092. 54.99 s gammaloop-nextest-docs> called `Result::unwrap()` on an `Err` value: required documentation source is missing: /build/source/target/nix-ci-tmp/.tmp3od26f/checkout/crates/spynso3/typst/STIXTwoMath-Regular.woff2
  1093. 54.99 s gammaloop-nextest-docs>
  1094. 54.99 s gammaloop-nextest-docs> Location:
  1095. 54.99 s gammaloop-nextest-docs> crates/alphal00p-docs-builder/src/lib.rs:5103:9
  1096. 54.99 s gammaloop-nextest-docs> stack backtrace:
  1097. 54.99 s gammaloop-nextest-docs> 0: __rustc::rust_begin_unwind
  1098. 54.99 s gammaloop-nextest-docs> 1: core::panicking::panic_fmt
  1099. 54.99 s gammaloop-nextest-docs> 2: core::result::unwrap_failed
  1100. 54.99 s gammaloop-nextest-docs> 3: alphal00p_docs_builder::provenance_tests::each_build_captures_one_revision_before_rendering
  1101. 54.99 s gammaloop-nextest-docs> 4: <alphal00p_docs_builder::provenance_tests::each_build_captures_one_revision_before_rendering::{closure#0} as core::ops::function::FnOnce<()>>::call_once
  1102. 54.99 s gammaloop-nextest-docs> note: Some details are omitted, run with `RUST_BACKTRACE=full` for a verbose backtrace.
  1103. 54.99 s gammaloop-nextest-docs>
  1104. 54.99 s gammaloop-nextest-docs> thread 'provenance_tests::each_build_captures_one_revision_before_rendering' (226) panicked at crates/alphal00p-docs-builder/src/provenance_tests.rs:274:9:
  1105. 54.99 s gammaloop-nextest-docs> assertion failed: command.status().unwrap().success()
  1106. 54.99 s gammaloop-nextest-docs> stack backtrace:
  1107. 54.99 s gammaloop-nextest-docs> 0: __rustc::rust_begin_unwind
  1108. 54.99 s gammaloop-nextest-docs> 1: core::panicking::panic_fmt
  1109. 54.99 s gammaloop-nextest-docs> 2: core::panicking::panic
  1110. 54.99 s gammaloop-nextest-docs> 3: alphal00p_docs_builder::provenance_tests::each_build_captures_one_revision_before_rendering
  1111. 54.99 s gammaloop-nextest-docs> 4: <alphal00p_docs_builder::provenance_tests::each_build_captures_one_revision_before_rendering::{closure#0} as core::ops::function::FnOnce<()>>::call_once
  1112. 54.99 s gammaloop-nextest-docs> note: Some details are omitted, run with `RUST_BACKTRACE=full` for a verbose backtrace.
  1113. 54.99 s gammaloop-nextest-docs>
  1114. 54.99 s gammaloop-nextest-docs> 9. alphal00p-docs-builder::tests::developer_scope_ranges_ignore_unrelated_edits_and_warn_only_while_watching
  1115. 54.99 s gammaloop-nextest-docs> failure: test failure with exit code 101
  1116. 54.99 s gammaloop-nextest-docs> thread 'tests::developer_scope_ranges_ignore_unrelated_edits_and_warn_only_while_watching' (284) panicked at crates/alphal00p-docs-builder/src/lib.rs:12350:29:
  1117. 54.99 s gammaloop-nextest-docs> called `Result::unwrap()` on an `Err` value: required documentation source is missing: /build/source/crates/spynso3/typst/STIXTwoMath-Regular.woff2
  1118. 54.99 s gammaloop-nextest-docs>
  1119. 54.99 s gammaloop-nextest-docs> Location:
  1120. 54.99 s gammaloop-nextest-docs> crates/alphal00p-docs-builder/src/lib.rs:5103:9
  1121. 54.99 s gammaloop-nextest-docs> stack backtrace:
  1122. 54.99 s gammaloop-nextest-docs> 0: __rustc::rust_begin_unwind
  1123. 54.99 s gammaloop-nextest-docs> 1: core::panicking::panic_fmt
  1124. 54.99 s gammaloop-nextest-docs> 2: core::result::unwrap_failed
  1125. 54.99 s gammaloop-nextest-docs> 3: alphal00p_docs_builder::tests::developer_scope_ranges_ignore_unrelated_edits_and_warn_only_while_watching
  1126. 54.99 s gammaloop-nextest-docs> 4: <alphal00p_docs_builder::tests::developer_scope_ranges_ignore_unrelated_edits_and_warn_only_while_watching::{closure#0} as core::ops::function::FnOnce<()>>::call_once
  1127. 54.99 s gammaloop-nextest-docs> note: Some details are omitted, run with `RUST_BACKTRACE=full` for a verbose backtrace.
  1128. 54.99 s gammaloop-nextest-docs> system-out
  1129. 54.99 s gammaloop-nextest-docs> running 1 test
  1130. 54.99 s gammaloop-nextest-docs> test tests::developer_scope_ranges_ignore_unrelated_edits_and_warn_only_while_watching ... FAILED
  1131. 54.99 s gammaloop-nextest-docs>
  1132. 54.99 s gammaloop-nextest-docs> failures:
  1133. 54.99 s gammaloop-nextest-docs>
  1134. 54.99 s gammaloop-nextest-docs> failures:
  1135. 54.99 s gammaloop-nextest-docs> tests::developer_scope_ranges_ignore_unrelated_edits_and_warn_only_while_watching
  1136. 54.99 s gammaloop-nextest-docs>
  1137. 54.99 s gammaloop-nextest-docs> test result: FAILED. 0 passed; 1 failed; 0 ignored; 0 measured; 128 filtered out; finished in 0.11s
  1138. 54.99 s gammaloop-nextest-docs> system-err
  1139. 54.99 s gammaloop-nextest-docs> thread 'tests::developer_scope_ranges_ignore_unrelated_edits_and_warn_only_while_watching' (284) panicked at crates/alphal00p-docs-builder/src/lib.rs:12350:29:
  1140. 54.99 s gammaloop-nextest-docs> called `Result::unwrap()` on an `Err` value: required documentation source is missing: /build/source/crates/spynso3/typst/STIXTwoMath-Regular.woff2
  1141. 54.99 s gammaloop-nextest-docs>
  1142. 54.99 s gammaloop-nextest-docs> Location:
  1143. 54.99 s gammaloop-nextest-docs> crates/alphal00p-docs-builder/src/lib.rs:5103:9
  1144. 54.99 s gammaloop-nextest-docs> stack backtrace:
  1145. 54.99 s gammaloop-nextest-docs> 0: __rustc::rust_begin_unwind
  1146. 54.99 s gammaloop-nextest-docs> 1: core::panicking::panic_fmt
  1147. 54.99 s gammaloop-nextest-docs> 2: core::result::unwrap_failed
  1148. 54.99 s gammaloop-nextest-docs> 3: alphal00p_docs_builder::tests::developer_scope_ranges_ignore_unrelated_edits_and_warn_only_while_watching
  1149. 54.99 s gammaloop-nextest-docs> 4: <alphal00p_docs_builder::tests::developer_scope_ranges_ignore_unrelated_edits_and_warn_only_while_watching::{closure#0} as core::ops::function::FnOnce<()>>::call_once
  1150. 54.99 s gammaloop-nextest-docs> note: Some details are omitted, run with `RUST_BACKTRACE=full` for a verbose backtrace.
  1151. 54.99 s gammaloop-nextest-docs>
  1152. 54.99 s gammaloop-nextest-docs> 10. alphal00p-docs-builder::tests::every_product_requires_a_task_chooser_and_each_supported_interface
  1153. 54.99 s gammaloop-nextest-docs> failure: test failure with exit code 101
  1154. 54.99 s gammaloop-nextest-docs> thread 'tests::every_product_requires_a_task_chooser_and_each_supported_interface' (309) panicked at crates/alphal00p-docs-builder/src/lib.rs:12274:9:
  1155. 54.99 s gammaloop-nextest-docs> assertion failed: format!("{error:#}").contains("has no quickstart page")
  1156. 54.99 s gammaloop-nextest-docs> stack backtrace:
  1157. 54.99 s gammaloop-nextest-docs> 0: __rustc::rust_begin_unwind
  1158. 54.99 s gammaloop-nextest-docs> 1: core::panicking::panic_fmt
  1159. 54.99 s gammaloop-nextest-docs> 2: core::panicking::panic
  1160. 54.99 s gammaloop-nextest-docs> 3: alphal00p_docs_builder::tests::every_product_requires_a_task_chooser_and_each_supported_interface
  1161. 54.99 s gammaloop-nextest-docs> 4: <alphal00p_docs_builder::tests::every_product_requires_a_task_chooser_and_each_supported_interface::{closure#0} as core::ops::function::FnOnce<()>>::call_once
  1162. 54.99 s gammaloop-nextest-docs> note: Some details are omitted, run with `RUST_BACKTRACE=full` for a verbose backtrace.
  1163. 54.99 s gammaloop-nextest-docs> system-out
  1164. 54.99 s gammaloop-nextest-docs> running 1 test
  1165. 54.99 s gammaloop-nextest-docs> test tests::every_product_requires_a_task_chooser_and_each_supported_interface ... FAILED
  1166. 54.99 s gammaloop-nextest-docs>
  1167. 54.99 s gammaloop-nextest-docs> failures:
  1168. 54.99 s gammaloop-nextest-docs>
  1169. 54.99 s gammaloop-nextest-docs> failures:
  1170. 54.99 s gammaloop-nextest-docs> tests::every_product_requires_a_task_chooser_and_each_supported_interface
  1171. 54.99 s gammaloop-nextest-docs>
  1172. 54.99 s gammaloop-nextest-docs> test result: FAILED. 0 passed; 1 failed; 0 ignored; 0 measured; 128 filtered out; finished in 0.12s
  1173. 54.99 s gammaloop-nextest-docs> system-err
  1174. 54.99 s gammaloop-nextest-docs> thread 'tests::every_product_requires_a_task_chooser_and_each_supported_interface' (309) panicked at crates/alphal00p-docs-builder/src/lib.rs:12274:9:
  1175. 54.99 s gammaloop-nextest-docs> assertion failed: format!("{error:#}").contains("has no quickstart page")
  1176. 54.99 s gammaloop-nextest-docs> stack backtrace:
  1177. 54.99 s gammaloop-nextest-docs> 0: __rustc::rust_begin_unwind
  1178. 54.99 s gammaloop-nextest-docs> 1: core::panicking::panic_fmt
  1179. 54.99 s gammaloop-nextest-docs> 2: core::panicking::panic
  1180. 54.99 s gammaloop-nextest-docs> 3: alphal00p_docs_builder::tests::every_product_requires_a_task_chooser_and_each_supported_interface
  1181. 54.99 s gammaloop-nextest-docs> 4: <alphal00p_docs_builder::tests::every_product_requires_a_task_chooser_and_each_supported_interface::{closure#0} as core::ops::function::FnOnce<()>>::call_once
  1182. 54.99 s gammaloop-nextest-docs> note: Some details are omitted, run with `RUST_BACKTRACE=full` for a verbose backtrace.
  1183. 54.99 s gammaloop-nextest-docs>
  1184. 54.99 s gammaloop-nextest-docs> 11. alphal00p-docs-builder::tests::pdf_manual_chapter_order_must_match_the_page_registry
  1185. 54.99 s gammaloop-nextest-docs> failure: test failure with exit code 101
  1186. 54.99 s gammaloop-nextest-docs> thread 'tests::pdf_manual_chapter_order_must_match_the_page_registry' (402) panicked at crates/alphal00p-docs-builder/src/lib.rs:12330:9:
  1187. 54.99 s gammaloop-nextest-docs> assertion failed: format!("{error:#}").contains("PDF manual chapter order differs")
  1188. 54.99 s gammaloop-nextest-docs> stack backtrace:
  1189. 54.99 s gammaloop-nextest-docs> 0: __rustc::rust_begin_unwind
  1190. 54.99 s gammaloop-nextest-docs> 1: core::panicking::panic_fmt
  1191. 54.99 s gammaloop-nextest-docs> 2: core::panicking::panic
  1192. 54.99 s gammaloop-nextest-docs> 3: alphal00p_docs_builder::tests::pdf_manual_chapter_order_must_match_the_page_registry
  1193. 54.99 s gammaloop-nextest-docs> 4: <alphal00p_docs_builder::tests::pdf_manual_chapter_order_must_match_the_page_registry::{closure#0} as core::ops::function::FnOnce<()>>::call_once
  1194. 54.99 s gammaloop-nextest-docs> note: Some details are omitted, run with `RUST_BACKTRACE=full` for a verbose backtrace.
  1195. 54.99 s gammaloop-nextest-docs> system-out
  1196. 54.99 s gammaloop-nextest-docs> running 1 test
  1197. 54.99 s gammaloop-nextest-docs> test tests::pdf_manual_chapter_order_must_match_the_page_registry ... FAILED
  1198. 54.99 s gammaloop-nextest-docs>
  1199. 54.99 s gammaloop-nextest-docs> failures:
  1200. 54.99 s gammaloop-nextest-docs>
  1201. 54.99 s gammaloop-nextest-docs> failures:
  1202. 54.99 s gammaloop-nextest-docs> tests::pdf_manual_chapter_order_must_match_the_page_registry
  1203. 54.99 s gammaloop-nextest-docs>
  1204. 54.99 s gammaloop-nextest-docs> test result: FAILED. 0 passed; 1 failed; 0 ignored; 0 measured; 128 filtered out; finished in 0.11s
  1205. 54.99 s gammaloop-nextest-docs> system-err
  1206. 54.99 s gammaloop-nextest-docs> thread 'tests::pdf_manual_chapter_order_must_match_the_page_registry' (402) panicked at crates/alphal00p-docs-builder/src/lib.rs:12330:9:
  1207. 54.99 s gammaloop-nextest-docs> assertion failed: format!("{error:#}").contains("PDF manual chapter order differs")
  1208. 54.99 s gammaloop-nextest-docs> stack backtrace:
  1209. 54.99 s gammaloop-nextest-docs> 0: __rustc::rust_begin_unwind
  1210. 54.99 s gammaloop-nextest-docs> 1: core::panicking::panic_fmt
  1211. 54.99 s gammaloop-nextest-docs> 2: core::panicking::panic
  1212. 54.99 s gammaloop-nextest-docs> 3: alphal00p_docs_builder::tests::pdf_manual_chapter_order_must_match_the_page_registry
  1213. 54.99 s gammaloop-nextest-docs> 4: <alphal00p_docs_builder::tests::pdf_manual_chapter_order_must_match_the_page_registry::{closure#0} as core::ops::function::FnOnce<()>>::call_once
  1214. 54.99 s gammaloop-nextest-docs> note: Some details are omitted, run with `RUST_BACKTRACE=full` for a verbose backtrace.
  1215. 54.99 s gammaloop-nextest-docs> =========================================
  1216. 55.00 s gammaloop-nextest-docs> Extracting 2 binaries to /build/source
  1217. 55.03 s gammaloop-nextest-docs> Extracted 5 files to /build/source in 0.03s
  1218. 55.04 s gammaloop-nextest-docs> ------------
  1219. 55.04 s gammaloop-nextest-docs> Nextest run ID ab300ae5-3f22-4230-b31a-4f7de1fb8f7c with nextest profile: ci_gammaloop
  1220. 55.04 s gammaloop-nextest-docs> Starting 22 tests across 2 binaries
  1221. 55.06 s gammaloop-nextest-docs> ------------
  1222. 55.06 s gammaloop-nextest-docs> Summary [ 0.018s] 22 tests run: 22 passed, 0 skipped
  1223. 55.09 s gammaloop-nextest-docs>
  1224. 55.09 s gammaloop-nextest-docs> ========== nextest test summary ==========
  1225. 55.09 s gammaloop-nextest-docs> report: target/nextest/ci_gammaloop/junit.xml
  1226. 55.09 s gammaloop-nextest-docs> tests: 22, failures: 0, errors: 0
  1227. 55.09 s gammaloop-nextest-docs> No failing testcases found.
  1228. 55.09 s gammaloop-nextest-docs> =========================================
  1229. 55.10 s gammaloop-nextest-docs> Extracting 3 binaries (including 2 non-test binaries), 1 build script output directory, and 2 linked paths to /build/source
  1230. 55.37 s gammaloop-nextest-docs> Extracted 22 files to /build/source in 0.27s
  1231. 55.38 s gammaloop-nextest-docs> ------------
  1232. 55.38 s gammaloop-nextest-docs> Nextest run ID df153d31-f0fb-4864-ab82-c414d8ea411a with nextest profile: ci_gammaloop
  1233. 55.38 s gammaloop-nextest-docs> Starting 89 tests across 1 binary
  1234. 55.42 s gammaloop-nextest-docs> ------------
  1235. 55.42 s gammaloop-nextest-docs> Summary [ 0.037s] 89 tests run: 89 passed, 0 skipped
  1236. 55.44 s gammaloop-nextest-docs>
  1237. 55.44 s gammaloop-nextest-docs> ========== nextest test summary ==========
  1238. 55.44 s gammaloop-nextest-docs> report: target/nextest/ci_gammaloop/junit.xml
  1239. 55.44 s gammaloop-nextest-docs> tests: 89, failures: 0, errors: 0
  1240. 55.44 s gammaloop-nextest-docs> No failing testcases found.
  1241. 55.44 s gammaloop-nextest-docs> =========================================
  1242. 55.45 s gammaloop-nextest-docs> Extracting 2 binaries to /build/source
  1243. 55.49 s gammaloop-nextest-docs> Extracted 5 files to /build/source in 0.04s
  1244. 55.50 s gammaloop-nextest-docs> ------------
  1245. 55.50 s gammaloop-nextest-docs> Nextest run ID aafb35f4-0aa3-479d-a18a-042b5fce0863 with nextest profile: ci_gammaloop
  1246. 55.50 s gammaloop-nextest-docs> Starting 10 tests across 2 binaries
  1247. 67.58 s gammaloop-nextest-docs> ------------
  1248. 67.58 s gammaloop-nextest-docs> Summary [ 12.075s] 10 tests run: 10 passed, 0 skipped
  1249. 67.60 s gammaloop-nextest-docs>
  1250. 67.60 s gammaloop-nextest-docs> ========== nextest test summary ==========
  1251. 67.60 s gammaloop-nextest-docs> report: target/nextest/ci_gammaloop/junit.xml
  1252. 67.60 s gammaloop-nextest-docs> tests: 10, failures: 0, errors: 0
  1253. 67.60 s gammaloop-nextest-docs> No failing testcases found.
  1254. 67.60 s gammaloop-nextest-docs> =========================================
  1255. 67.61 s gammaloop-nextest-docs> Extracting 1 binary to /build/source
  1256. 67.65 s gammaloop-nextest-docs> Extracted 4 files to /build/source in 0.03s
  1257. 67.65 s gammaloop-nextest-docs> ------------
  1258. 67.65 s gammaloop-nextest-docs> Nextest run ID b18503e4-e052-423a-ad8b-5d5cb1010cae with nextest profile: ci_gammaloop
  1259. 67.65 s gammaloop-nextest-docs> Starting 0 tests across 1 binary
  1260. 67.65 s gammaloop-nextest-docs> ------------
  1261. 67.65 s gammaloop-nextest-docs> Summary [ 0.000s] 0 tests run: 0 passed, 0 skipped
  1262. 67.68 s gammaloop-nextest-docs>
  1263. 67.68 s gammaloop-nextest-docs> ========== nextest test summary ==========
  1264. 67.68 s gammaloop-nextest-docs> report: target/nextest/ci_gammaloop/junit.xml
  1265. 67.68 s gammaloop-nextest-docs> tests: 0, failures: 0, errors: 0
  1266. 67.68 s gammaloop-nextest-docs> No failing testcases found.
  1267. 67.68 s gammaloop-nextest-docs> =========================================
  1268. 67.69 s gammaloop-nextest-docs> Extracting 1 binary to /build/source
  1269. 67.72 s gammaloop-nextest-docs> Extracted 4 files to /build/source in 0.03s
  1270. 67.73 s gammaloop-nextest-docs> ------------
  1271. 67.73 s gammaloop-nextest-docs> Nextest run ID 32218442-73be-48a1-95ce-22bbd599d23b with nextest profile: ci_gammaloop
  1272. 67.73 s gammaloop-nextest-docs> Starting 5 tests across 1 binary
  1273. 67.74 s gammaloop-nextest-docs> ------------
  1274. 67.74 s gammaloop-nextest-docs> Summary [ 0.005s] 5 tests run: 5 passed, 0 skipped
  1275. 67.77 s gammaloop-nextest-docs>
  1276. 67.77 s gammaloop-nextest-docs> ========== nextest test summary ==========
  1277. 67.77 s gammaloop-nextest-docs> report: target/nextest/ci_gammaloop/junit.xml
  1278. 67.77 s gammaloop-nextest-docs> tests: 5, failures: 0, errors: 0
  1279. 67.77 s gammaloop-nextest-docs> No failing testcases found.
  1280. 67.77 s gammaloop-nextest-docs> =========================================
  1281. 67.96 s error: Cannot build '/nix/store/yhcpczfzd32fj8slcs1lsa10nlfs6yzl-gammaloop-nextest-docs.drv'.
  1282. 67.96 s Reason: builder failed with exit code 100.
  1283. 67.96 s Output paths:
  1284. 67.96 s /nix/store/j1nkfs263f0lyg41i99f3f56r6b8p9mh-gammaloop-nextest-docs
  1285. 67.96 s Last 1232 log lines:
  1286. 67.96 s > Extracting 2 binaries to /build/source
  1287. 67.96 s > Extracted 5 files to /build/source in 0.04s
  1288. 67.96 s > ------------
  1289. 67.96 s > Nextest run ID 084cddad-40b2-4805-90a7-48ad0373b0fe with nextest profile: ci_gammaloop
  1290. 67.96 s > Starting 129 tests across 2 binaries
  1291. 67.96 s > FAIL [ 0.009s] ( 23/129) alphal00p-docs-builder tests::developer_architecture_is_classified_searchable_and_source_backed
  1292. 67.96 s > stdout ---
  1293. 67.96 s >
  1294. 67.96 s > running 1 test
  1295. 67.96 s > test tests::developer_architecture_is_classified_searchable_and_source_backed ... FAILED
  1296. 67.96 s >
  1297. 67.96 s > failures:
  1298. 67.96 s >
  1299. 67.96 s > failures:
  1300. 67.96 s > tests::developer_architecture_is_classified_searchable_and_source_backed
  1301. 67.96 s >
  1302. 67.96 s > test result: FAILED. 0 passed; 1 failed; 0 ignored; 0 measured; 128 filtered out; finished in 0.01s
  1303. 67.96 s >
  1304. 67.96 s > stderr ---
  1305. 67.96 s >
  1306. 67.96 s > thread 'tests::developer_architecture_is_classified_searchable_and_source_backed' (276) panicked at crates/alphal00p-docs-builder/src/lib.rs:12751:14:
  1307. 67.96 s > called `Result::unwrap()` on an `Err` value: failed to copy documentation asset crates/spynso3/typst/STIXTwoMath-Regular.woff2
  1308. 67.96 s >
  1309. 67.96 s > Caused by:
  1310. 67.96 s > No such file or directory (os error 2)
  1311. 67.96 s >
  1312. 67.96 s > Location:
  1313. 67.96 s > crates/alphal00p-docs-builder/src/lib.rs:2276:18
  1314. 67.96 s > stack backtrace:
  1315. 67.96 s > 0: __rustc::rust_begin_unwind
  1316. 67.96 s > 1: core::panicking::panic_fmt
  1317. 67.96 s > 2: core::result::unwrap_failed
  1318. 67.96 s > 3: alphal00p_docs_builder::tests::developer_architecture_is_classified_searchable_and_source_backed
  1319. 67.96 s > 4: <alphal00p_docs_builder::tests::developer_architecture_is_classified_searchable_and_source_backed::{closure#0} as core::ops::function::FnOnce<()>>::call_once
  1320. 67.96 s > note: Some details are omitted, run with `RUST_BACKTRACE=full` for a verbose backtrace.
  1321. 67.96 s >
  1322. 67.96 s > FAIL [ 0.011s] ( 30/129) alphal00p-docs-builder tests::every_product_orients_rust_to_native_rustdoc_and_keeps_legacy_redirects
  1323. 67.96 s > stdout ---
  1324. 67.96 s >
  1325. 67.96 s > running 1 test
  1326. 67.96 s > test tests::every_product_orients_rust_to_native_rustdoc_and_keeps_legacy_redirects ... FAILED
  1327. 67.96 s >
  1328. 67.96 s > failures:
  1329. 67.96 s >
  1330. 67.96 s > failures:
  1331. 67.96 s > tests::every_product_orients_rust_to_native_rustdoc_and_keeps_legacy_redirects
  1332. 67.96 s >
  1333. 67.96 s > test result: FAILED. 0 passed; 1 failed; 0 ignored; 0 measured; 128 filtered out; finished in 0.01s
  1334. 67.96 s >
  1335. 67.96 s > stderr ---
  1336. 67.96 s >
  1337. 67.96 s > thread 'tests::every_product_orients_rust_to_native_rustdoc_and_keeps_legacy_redirects' (302) panicked at crates/alphal00p-docs-builder/src/lib.rs:12555:46:
  1338. 67.96 s > called `Result::unwrap()` on an `Err` value: failed to copy documentation asset crates/spynso3/typst/STIXTwoMath-Regular.woff2
  1339. 67.96 s >
  1340. 67.96 s > Caused by:
  1341. 67.96 s > No such file or directory (os error 2)
  1342. 67.96 s >
  1343. 67.96 s > Location:
  1344. 67.96 s > crates/alphal00p-docs-builder/src/lib.rs:2276:18
  1345. 67.96 s > stack backtrace:
  1346. 67.96 s > 0: __rustc::rust_begin_unwind
  1347. 67.96 s > 1: core::panicking::panic_fmt
  1348. 67.96 s > 2: core::result::unwrap_failed
  1349. 67.96 s > 3: alphal00p_docs_builder::tests::every_product_orients_rust_to_native_rustdoc_and_keeps_legacy_redirects
  1350. 67.96 s > 4: <alphal00p_docs_builder::tests::every_product_orients_rust_to_native_rustdoc_and_keeps_legacy_redirects::{closure#0} as core::ops::function::FnOnce<()>>::call_once
  1351. 67.96 s > note: Some details are omitted, run with `RUST_BACKTRACE=full` for a verbose backtrace.
  1352. 67.96 s >
  1353. 67.96 s > FAIL [ 0.009s] ( 54/129) alphal00p-docs-builder tests::portal_and_developer_pages_use_federated_search_and_feedback
  1354. 67.96 s > stdout ---
  1355. 67.96 s >
  1356. 67.96 s > running 1 test
  1357. 67.96 s > test tests::portal_and_developer_pages_use_federated_search_and_feedback ... FAILED
  1358. 67.96 s >
  1359. 67.96 s > failures:
  1360. 67.96 s >
  1361. 67.96 s > failures:
  1362. 67.96 s > tests::portal_and_developer_pages_use_federated_search_and_feedback
  1363. 67.96 s >
  1364. 67.96 s > test result: FAILED. 0 passed; 1 failed; 0 ignored; 0 measured; 128 filtered out; finished in 0.01s
  1365. 67.96 s >
  1366. 67.96 s > stderr ---
  1367. 67.96 s >
  1368. 67.96 s > thread 'tests::portal_and_developer_pages_use_federated_search_and_feedback' (416) panicked at crates/alphal00p-docs-builder/src/lib.rs:9684:14:
  1369. 67.96 s > called `Result::unwrap()` on an `Err` value: failed to copy documentation asset crates/spynso3/typst/STIXTwoMath-Regular.woff2
  1370. 67.96 s >
  1371. 67.96 s > Caused by:
  1372. 67.96 s > No such file or directory (os error 2)
  1373. 67.96 s >
  1374. 67.96 s > Location:
  1375. 67.96 s > crates/alphal00p-docs-builder/src/lib.rs:2276:18
  1376. 67.96 s > stack backtrace:
  1377. 67.96 s > 0: __rustc::rust_begin_unwind
  1378. 67.96 s > 1: core::panicking::panic_fmt
  1379. 67.96 s > 2: core::result::unwrap_failed
  1380. 67.96 s > 3: alphal00p_docs_builder::tests::write_test_portal
  1381. 67.96 s > 4: alphal00p_docs_builder::tests::portal_and_developer_pages_use_federated_search_and_feedback
  1382. 67.96 s > 5: <alphal00p_docs_builder::tests::portal_and_developer_pages_use_federated_search_and_feedback::{closure#0} as core::ops::function::FnOnce<()>>::call_once
  1383. 67.96 s > note: Some details are omitted, run with `RUST_BACKTRACE=full` for a verbose backtrace.
  1384. 67.96 s >
  1385. 67.96 s > FAIL [ 0.008s] ( 55/129) alphal00p-docs-builder tests::portal_emits_routes_and_valid_assets
  1386. 67.96 s > stdout ---
  1387. 67.96 s >
  1388. 67.96 s > running 1 test
  1389. 67.96 s > test tests::portal_emits_routes_and_valid_assets ... FAILED
  1390. 67.96 s >
  1391. 67.96 s > failures:
  1392. 67.96 s >
  1393. 67.96 s > failures:
  1394. 67.96 s > tests::portal_emits_routes_and_valid_assets
  1395. 67.96 s >
  1396. 67.96 s > test result: FAILED. 0 passed; 1 failed; 0 ignored; 0 measured; 128 filtered out; finished in 0.00s
  1397. 67.96 s >
  1398. 67.96 s > stderr ---
  1399. 67.96 s >
  1400. 67.96 s > thread 'tests::portal_emits_routes_and_valid_assets' (422) panicked at crates/alphal00p-docs-builder/src/lib.rs:9684:14:
  1401. 67.96 s > called `Result::unwrap()` on an `Err` value: failed to copy documentation asset crates/spynso3/typst/STIXTwoMath-Regular.woff2
  1402. 67.96 s >
  1403. 67.96 s > Caused by:
  1404. 67.96 s > No such file or directory (os error 2)
  1405. 67.96 s >
  1406. 67.96 s > Location:
  1407. 67.96 s > crates/alphal00p-docs-builder/src/lib.rs:2276:18
  1408. 67.96 s > stack backtrace:
  1409. 67.96 s > 0: __rustc::rust_begin_unwind
  1410. 67.96 s > 1: core::panicking::panic_fmt
  1411. 67.96 s > 2: core::result::unwrap_failed
  1412. 67.96 s > 3: alphal00p_docs_builder::tests::write_test_portal
  1413. 67.96 s > 4: alphal00p_docs_builder::tests::portal_emits_routes_and_valid_assets
  1414. 67.96 s > 5: <alphal00p_docs_builder::tests::portal_emits_routes_and_valid_assets::{closure#0} as core::ops::function::FnOnce<()>>::call_once
  1415. 67.96 s > note: Some details are omitted, run with `RUST_BACKTRACE=full` for a verbose backtrace.
  1416. 67.96 s >
  1417. 67.96 s > FAIL [ 0.010s] ( 56/129) alphal00p-docs-builder tests::portal_task_chooser_routes_each_goal_to_the_registered_quickstart
  1418. 67.96 s > stdout ---
  1419. 67.96 s >
  1420. 67.96 s > running 1 test
  1421. 67.96 s > test tests::portal_task_chooser_routes_each_goal_to_the_registered_quickstart ... FAILED
  1422. 67.96 s >
  1423. 67.96 s > failures:
  1424. 67.96 s >
  1425. 67.96 s > failures:
  1426. 67.96 s > tests::portal_task_chooser_routes_each_goal_to_the_registered_quickstart
  1427. 67.96 s >
  1428. 67.96 s > test result: FAILED. 0 passed; 1 failed; 0 ignored; 0 measured; 128 filtered out; finished in 0.01s
  1429. 67.96 s >
  1430. 67.96 s > stderr ---
  1431. 67.96 s >
  1432. 67.96 s > thread 'tests::portal_task_chooser_routes_each_goal_to_the_registered_quickstart' (427) panicked at crates/alphal00p-docs-builder/src/lib.rs:9684:14:
  1433. 67.96 s > called `Result::unwrap()` on an `Err` value: failed to copy documentation asset crates/spynso3/typst/STIXTwoMath-Regular.woff2
  1434. 67.96 s >
  1435. 67.96 s > Caused by:
  1436. 67.96 s > No such file or directory (os error 2)
  1437. 67.96 s >
  1438. 67.96 s > Location:
  1439. 67.96 s > crates/alphal00p-docs-builder/src/lib.rs:2276:18
  1440. 67.96 s > stack backtrace:
  1441. 67.96 s > 0: __rustc::rust_begin_unwind
  1442. 67.96 s > 1: core::panicking::panic_fmt
  1443. 67.96 s > 2: core::result::unwrap_failed
  1444. 67.96 s > 3: alphal00p_docs_builder::tests::write_test_portal
  1445. 67.96 s > 4: alphal00p_docs_builder::tests::portal_task_chooser_routes_each_goal_to_the_registered_quickstart
  1446. 67.96 s > 5: <alphal00p_docs_builder::tests::portal_task_chooser_routes_each_goal_to_the_registered_quickstart::{closure#0} as core::ops::function::FnOnce<()>>::call_once
  1447. 67.96 s > note: Some details are omitted, run with `RUST_BACKTRACE=full` for a verbose backtrace.
  1448. 67.96 s >
  1449. 67.96 s > FAIL [ 0.009s] ( 86/129) alphal00p-docs-builder tests::site_assets_replace_read_only_generated_files
  1450. 67.96 s > stdout ---
  1451. 67.96 s >
  1452. 67.96 s > running 1 test
  1453. 67.96 s > test tests::site_assets_replace_read_only_generated_files ... FAILED
  1454. 67.96 s >
  1455. 67.96 s > failures:
  1456. 67.96 s >
  1457. 67.96 s > failures:
  1458. 67.96 s > tests::site_assets_replace_read_only_generated_files
  1459. 67.96 s >
  1460. 67.96 s > test result: FAILED. 0 passed; 1 failed; 0 ignored; 0 measured; 128 filtered out; finished in 0.00s
  1461. 67.96 s >
  1462. 67.96 s > stderr ---
  1463. 67.96 s >
  1464. 67.96 s > thread 'tests::site_assets_replace_read_only_generated_files' (648) panicked at crates/alphal00p-docs-builder/src/lib.rs:12305:50:
  1465. 67.96 s > called `Result::unwrap()` on an `Err` value: failed to copy documentation asset crates/spynso3/typst/STIXTwoMath-Regular.woff2
  1466. 67.96 s >
  1467. 67.96 s > Caused by:
  1468. 67.96 s > No such file or directory (os error 2)
  1469. 67.96 s >
  1470. 67.96 s > Location:
  1471. 67.96 s > crates/alphal00p-docs-builder/src/lib.rs:2276:18
  1472. 67.96 s > stack backtrace:
  1473. 67.96 s > 0: __rustc::rust_begin_unwind
  1474. 67.96 s > 1: core::panicking::panic_fmt
  1475. 67.96 s > 2: core::result::unwrap_failed
  1476. 67.96 s > 3: alphal00p_docs_builder::tests::site_assets_replace_read_only_generated_files
  1477. 67.96 s > 4: <alphal00p_docs_builder::tests::site_assets_replace_read_only_generated_files::{closure#0} as core::ops::function::FnOnce<()>>::call_once
  1478. 67.96 s > note: Some details are omitted, run with `RUST_BACKTRACE=full` for a verbose backtrace.
  1479. 67.96 s >
  1480. 67.96 s > FAIL [ 0.122s] ( 91/129) alphal00p-docs-builder tests::checked_in_registry_is_valid
  1481. 67.96 s > stdout ---
  1482. 67.96 s >
  1483. 67.96 s > running 1 test
  1484. 67.96 s > test tests::checked_in_registry_is_valid ... FAILED
  1485. 67.96 s >
  1486. 67.96 s > failures:
  1487. 67.96 s >
  1488. 67.96 s > failures:
  1489. 67.96 s > tests::checked_in_registry_is_valid
  1490. 67.96 s >
  1491. 67.96 s > test result: FAILED. 0 passed; 1 failed; 0 ignored; 0 measured; 128 filtered out; finished in 0.11s
  1492. 67.96 s >
  1493. 67.96 s > stderr ---
  1494. 67.96 s >
  1495. 67.96 s > thread 'tests::checked_in_registry_is_valid' (241) panicked at crates/alphal00p-docs-builder/src/lib.rs:12260:50:
  1496. 67.96 s > called `Result::unwrap()` on an `Err` value: required documentation source is missing: /build/source/crates/spynso3/typst/STIXTwoMath-Regular.woff2
  1497. 67.96 s >
  1498. 67.96 s > Location:
  1499. 67.96 s > crates/alphal00p-docs-builder/src/lib.rs:5103:9
  1500. 67.96 s > stack backtrace:
  1501. 67.96 s > 0: __rustc::rust_begin_unwind
  1502. 67.96 s > 1: core::panicking::panic_fmt
  1503. 67.96 s > 2: core::result::unwrap_failed
  1504. 67.96 s > 3: alphal00p_docs_builder::tests::checked_in_registry_is_valid
  1505. 67.96 s > 4: <alphal00p_docs_builder::tests::checked_in_registry_is_valid::{closure#0} as core::ops::function::FnOnce<()>>::call_once
  1506. 67.96 s > note: Some details are omitted, run with `RUST_BACKTRACE=full` for a verbose backtrace.
  1507. 67.96 s >
  1508. 67.96 s > FAIL [ 0.130s] ( 97/129) alphal00p-docs-builder provenance_tests::each_build_captures_one_revision_before_rendering
  1509. 67.96 s > stdout ---
  1510. 67.96 s >
  1511. 67.96 s > running 1 test
  1512. 67.96 s >
  1513. 67.96 s > running 1 test
  1514. 67.96 s > test provenance_tests::each_build_captures_one_revision_before_rendering ... FAILED
  1515. 67.96 s >
  1516. 67.96 s > failures:
  1517. 67.96 s >
  1518. 67.96 s > failures:
  1519. 67.96 s > provenance_tests::each_build_captures_one_revision_before_rendering
  1520. 67.96 s >
  1521. 67.96 s > test result: FAILED. 0 passed; 1 failed; 0 ignored; 0 measured; 128 filtered out; finished in 0.11s
  1522. 67.96 s >
  1523. 67.96 s > test provenance_tests::each_build_captures_one_revision_before_rendering ... FAILED
  1524. 67.96 s >
  1525. 67.96 s > failures:
  1526. 67.96 s >
  1527. 67.96 s > failures:
  1528. 67.96 s > provenance_tests::each_build_captures_one_revision_before_rendering
  1529. 67.96 s >
  1530. 67.96 s > test result: FAILED. 0 passed; 1 failed; 0 ignored; 0 measured; 128 filtered out; finished in 0.12s
  1531. 67.96 s >
  1532. 67.96 s > stderr ---
  1533. 67.96 s >
  1534. 67.96 s > thread 'provenance_tests::each_build_captures_one_revision_before_rendering' (260) panicked at crates/alphal00p-docs-builder/src/provenance_tests.rs:297:14:
  1535. 67.96 s > called `Result::unwrap()` on an `Err` value: required documentation source is missing: /build/source/target/nix-ci-tmp/.tmp3od26f/checkout/crates/spynso3/typst/STIXTwoMath-Regular.woff2
  1536. 67.96 s >
  1537. 67.96 s > Location:
  1538. 67.96 s > crates/alphal00p-docs-builder/src/lib.rs:5103:9
  1539. 67.96 s > stack backtrace:
  1540. 67.96 s > 0: __rustc::rust_begin_unwind
  1541. 67.96 s > 1: core::panicking::panic_fmt
  1542. 67.96 s > 2: core::result::unwrap_failed
  1543. 67.96 s > 3: alphal00p_docs_builder::provenance_tests::each_build_captures_one_revision_before_rendering
  1544. 67.96 s > 4: <alphal00p_docs_builder::provenance_tests::each_build_captures_one_revision_before_rendering::{closure#0} as core::ops::function::FnOnce<()>>::call_once
  1545. 67.96 s > note: Some details are omitted, run with `RUST_BACKTRACE=full` for a verbose backtrace.
  1546. 67.96 s >
  1547. 67.96 s > thread 'provenance_tests::each_build_captures_one_revision_before_rendering' (226) panicked at crates/alphal00p-docs-builder/src/provenance_tests.rs:274:9:
  1548. 67.96 s > assertion failed: command.status().unwrap().success()
  1549. 67.96 s > stack backtrace:
  1550. 67.96 s > 0: __rustc::rust_begin_unwind
  1551. 67.96 s > 1: core::panicking::panic_fmt
  1552. 67.96 s > 2: core::panicking::panic
  1553. 67.96 s > 3: alphal00p_docs_builder::provenance_tests::each_build_captures_one_revision_before_rendering
  1554. 67.96 s > 4: <alphal00p_docs_builder::provenance_tests::each_build_captures_one_revision_before_rendering::{closure#0} as core::ops::function::FnOnce<()>>::call_once
  1555. 67.96 s > note: Some details are omitted, run with `RUST_BACKTRACE=full` for a verbose backtrace.
  1556. 67.96 s >
  1557. 67.96 s > FAIL [ 0.116s] (100/129) alphal00p-docs-builder tests::developer_scope_ranges_ignore_unrelated_edits_and_warn_only_while_watching
  1558. 67.96 s > stdout ---
  1559. 67.96 s >
  1560. 67.96 s > running 1 test
  1561. 67.96 s > test tests::developer_scope_ranges_ignore_unrelated_edits_and_warn_only_while_watching ... FAILED
  1562. 67.96 s >
  1563. 67.96 s > failures:
  1564. 67.96 s >
  1565. 67.96 s > failures:
  1566. 67.96 s > tests::developer_scope_ranges_ignore_unrelated_edits_and_warn_only_while_watching
  1567. 67.96 s >
  1568. 67.96 s > test result: FAILED. 0 passed; 1 failed; 0 ignored; 0 measured; 128 filtered out; finished in 0.11s
  1569. 67.96 s >
  1570. 67.96 s > stderr ---
  1571. 67.96 s >
  1572. 67.96 s > thread 'tests::developer_scope_ranges_ignore_unrelated_edits_and_warn_only_while_watching' (284) panicked at crates/alphal00p-docs-builder/src/lib.rs:12350:29:
  1573. 67.96 s > called `Result::unwrap()` on an `Err` value: required documentation source is missing: /build/source/crates/spynso3/typst/STIXTwoMath-Regular.woff2
  1574. 67.96 s >
  1575. 67.96 s > Location:
  1576. 67.96 s > crates/alphal00p-docs-builder/src/lib.rs:5103:9
  1577. 67.96 s > stack backtrace:
  1578. 67.96 s > 0: __rustc::rust_begin_unwind
  1579. 67.96 s > 1: core::panicking::panic_fmt
  1580. 67.96 s > 2: core::result::unwrap_failed
  1581. 67.96 s > 3: alphal00p_docs_builder::tests::developer_scope_ranges_ignore_unrelated_edits_and_warn_only_while_watching
  1582. 67.96 s > 4: <alphal00p_docs_builder::tests::developer_scope_ranges_ignore_unrelated_edits_and_warn_only_while_watching::{closure#0} as core::ops::function::FnOnce<()>>::call_once
  1583. 67.96 s > note: Some details are omitted, run with `RUST_BACKTRACE=full` for a verbose backtrace.
  1584. 67.96 s >
  1585. 67.96 s > FAIL [ 0.120s] (111/129) alphal00p-docs-builder tests::every_product_requires_a_task_chooser_and_each_supported_interface
  1586. 67.96 s > stdout ---
  1587. 67.96 s >
  1588. 67.96 s > running 1 test
  1589. 67.96 s > test tests::every_product_requires_a_task_chooser_and_each_supported_interface ... FAILED
  1590. 67.96 s >
  1591. 67.96 s > failures:
  1592. 67.96 s >
  1593. 67.96 s > failures:
  1594. 67.96 s > tests::every_product_requires_a_task_chooser_and_each_supported_interface
  1595. 67.96 s >
  1596. 67.96 s > test result: FAILED. 0 passed; 1 failed; 0 ignored; 0 measured; 128 filtered out; finished in 0.12s
  1597. 67.96 s >
  1598. 67.96 s > stderr ---
  1599. 67.96 s >
  1600. 67.96 s > thread 'tests::every_product_requires_a_task_chooser_and_each_supported_interface' (309) panicked at crates/alphal00p-docs-builder/src/lib.rs:12274:9:
  1601. 67.96 s > assertion failed: format!("{error:#}").contains("has no quickstart page")
  1602. 67.96 s > stack backtrace:
  1603. 67.96 s > 0: __rustc::rust_begin_unwind
  1604. 67.96 s > 1: core::panicking::panic_fmt
  1605. 67.96 s > 2: core::panicking::panic
  1606. 67.96 s > 3: alphal00p_docs_builder::tests::every_product_requires_a_task_chooser_and_each_supported_interface
  1607. 67.96 s > 4: <alphal00p_docs_builder::tests::every_product_requires_a_task_chooser_and_each_supported_interface::{closure#0} as core::ops::function::FnOnce<()>>::call_once
  1608. 67.96 s > note: Some details are omitted, run with `RUST_BACKTRACE=full` for a verbose backtrace.
  1609. 67.96 s >
  1610. 67.96 s > FAIL [ 0.112s] (122/129) alphal00p-docs-builder tests::pdf_manual_chapter_order_must_match_the_page_registry
  1611. 67.96 s > stdout ---
  1612. 67.96 s >
  1613. 67.96 s > running 1 test
  1614. 67.96 s > test tests::pdf_manual_chapter_order_must_match_the_page_registry ... FAILED
  1615. 67.96 s >
  1616. 67.96 s > failures:
  1617. 67.96 s >
  1618. 67.96 s > failures:
  1619. 67.96 s > tests::pdf_manual_chapter_order_must_match_the_page_registry
  1620. 67.96 s >
  1621. 67.96 s > test result: FAILED. 0 passed; 1 failed; 0 ignored; 0 measured; 128 filtered out; finished in 0.11s
  1622. 67.96 s >
  1623. 67.96 s > stderr ---
  1624. 67.96 s >
  1625. 67.96 s > thread 'tests::pdf_manual_chapter_order_must_match_the_page_registry' (402) panicked at crates/alphal00p-docs-builder/src/lib.rs:12330:9:
  1626. 67.96 s > assertion failed: format!("{error:#}").contains("PDF manual chapter order differs")
  1627. 67.96 s > stack backtrace:
  1628. 67.96 s > 0: __rustc::rust_begin_unwind
  1629. 67.96 s > 1: core::panicking::panic_fmt
  1630. 67.96 s > 2: core::panicking::panic
  1631. 67.96 s > 3: alphal00p_docs_builder::tests::pdf_manual_chapter_order_must_match_the_page_registry
  1632. 67.96 s > 4: <alphal00p_docs_builder::tests::pdf_manual_chapter_order_must_match_the_page_registry::{closure#0} as core::ops::function::FnOnce<()>>::call_once
  1633. 67.96 s > note: Some details are omitted, run with `RUST_BACKTRACE=full` for a verbose backtrace.
  1634. 67.96 s >
  1635. 67.96 s > ------------
  1636. 67.96 s > Summary [ 11.064s] 129 tests run: 118 passed, 11 failed, 0 skipped
  1637. 67.96 s > FAIL [ 0.009s] ( 23/129) alphal00p-docs-builder tests::developer_architecture_is_classified_searchable_and_source_backed
  1638. 67.96 s > stdout ---
  1639. 67.96 s >
  1640. 67.96 s > running 1 test
  1641. 67.96 s > test tests::developer_architecture_is_classified_searchable_and_source_backed ... FAILED
  1642. 67.96 s >
  1643. 67.96 s > failures:
  1644. 67.96 s >
  1645. 67.96 s > failures:
  1646. 67.96 s > tests::developer_architecture_is_classified_searchable_and_source_backed
  1647. 67.96 s >
  1648. 67.96 s > test result: FAILED. 0 passed; 1 failed; 0 ignored; 0 measured; 128 filtered out; finished in 0.01s
  1649. 67.96 s >
  1650. 67.96 s > stderr ---
  1651. 67.96 s >
  1652. 67.96 s > thread 'tests::developer_architecture_is_classified_searchable_and_source_backed' (276) panicked at crates/alphal00p-docs-builder/src/lib.rs:12751:14:
  1653. 67.96 s > called `Result::unwrap()` on an `Err` value: failed to copy documentation asset crates/spynso3/typst/STIXTwoMath-Regular.woff2
  1654. 67.96 s >
  1655. 67.96 s > Caused by:
  1656. 67.96 s > No such file or directory (os error 2)
  1657. 67.96 s >
  1658. 67.96 s > Location:
  1659. 67.96 s > crates/alphal00p-docs-builder/src/lib.rs:2276:18
  1660. 67.96 s > stack backtrace:
  1661. 67.96 s > 0: __rustc::rust_begin_unwind
  1662. 67.96 s > 1: core::panicking::panic_fmt
  1663. 67.96 s > 2: core::result::unwrap_failed
  1664. 67.96 s > 3: alphal00p_docs_builder::tests::developer_architecture_is_classified_searchable_and_source_backed
  1665. 67.96 s > 4: <alphal00p_docs_builder::tests::developer_architecture_is_classified_searchable_and_source_backed::{closure#0} as core::ops::function::FnOnce<()>>::call_once
  1666. 67.96 s > note: Some details are omitted, run with `RUST_BACKTRACE=full` for a verbose backtrace.
  1667. 67.96 s >
  1668. 67.96 s > FAIL [ 0.011s] ( 30/129) alphal00p-docs-builder tests::every_product_orients_rust_to_native_rustdoc_and_keeps_legacy_redirects
  1669. 67.96 s > stdout ---
  1670. 67.96 s >
  1671. 67.96 s > running 1 test
  1672. 67.96 s > test tests::every_product_orients_rust_to_native_rustdoc_and_keeps_legacy_redirects ... FAILED
  1673. 67.96 s >
  1674. 67.96 s > failures:
  1675. 67.96 s >
  1676. 67.96 s > failures:
  1677. 67.96 s > tests::every_product_orients_rust_to_native_rustdoc_and_keeps_legacy_redirects
  1678. 67.96 s >
  1679. 67.96 s > test result: FAILED. 0 passed; 1 failed; 0 ignored; 0 measured; 128 filtered out; finished in 0.01s
  1680. 67.96 s >
  1681. 67.96 s > stderr ---
  1682. 67.96 s >
  1683. 67.96 s > thread 'tests::every_product_orients_rust_to_native_rustdoc_and_keeps_legacy_redirects' (302) panicked at crates/alphal00p-docs-builder/src/lib.rs:12555:46:
  1684. 67.96 s > called `Result::unwrap()` on an `Err` value: failed to copy documentation asset crates/spynso3/typst/STIXTwoMath-Regular.woff2
  1685. 67.96 s >
  1686. 67.96 s > Caused by:
  1687. 67.96 s > No such file or directory (os error 2)
  1688. 67.96 s >
  1689. 67.96 s > Location:
  1690. 67.96 s > crates/alphal00p-docs-builder/src/lib.rs:2276:18
  1691. 67.96 s > stack backtrace:
  1692. 67.96 s > 0: __rustc::rust_begin_unwind
  1693. 67.96 s > 1: core::panicking::panic_fmt
  1694. 67.96 s > 2: core::result::unwrap_failed
  1695. 67.96 s > 3: alphal00p_docs_builder::tests::every_product_orients_rust_to_native_rustdoc_and_keeps_legacy_redirects
  1696. 67.96 s > 4: <alphal00p_docs_builder::tests::every_product_orients_rust_to_native_rustdoc_and_keeps_legacy_redirects::{closure#0} as core::ops::function::FnOnce<()>>::call_once
  1697. 67.96 s > note: Some details are omitted, run with `RUST_BACKTRACE=full` for a verbose backtrace.
  1698. 67.96 s >
  1699. 67.96 s > FAIL [ 0.009s] ( 54/129) alphal00p-docs-builder tests::portal_and_developer_pages_use_federated_search_and_feedback
  1700. 67.96 s > stdout ---
  1701. 67.96 s >
  1702. 67.96 s > running 1 test
  1703. 67.96 s > test tests::portal_and_developer_pages_use_federated_search_and_feedback ... FAILED
  1704. 67.96 s >
  1705. 67.96 s > failures:
  1706. 67.96 s >
  1707. 67.96 s > failures:
  1708. 67.96 s > tests::portal_and_developer_pages_use_federated_search_and_feedback
  1709. 67.96 s >
  1710. 67.96 s > test result: FAILED. 0 passed; 1 failed; 0 ignored; 0 measured; 128 filtered out; finished in 0.01s
  1711. 67.96 s >
  1712. 67.96 s > stderr ---
  1713. 67.96 s >
  1714. 67.96 s > thread 'tests::portal_and_developer_pages_use_federated_search_and_feedback' (416) panicked at crates/alphal00p-docs-builder/src/lib.rs:9684:14:
  1715. 67.96 s > called `Result::unwrap()` on an `Err` value: failed to copy documentation asset crates/spynso3/typst/STIXTwoMath-Regular.woff2
  1716. 67.96 s >
  1717. 67.96 s > Caused by:
  1718. 67.96 s > No such file or directory (os error 2)
  1719. 67.96 s >
  1720. 67.96 s > Location:
  1721. 67.96 s > crates/alphal00p-docs-builder/src/lib.rs:2276:18
  1722. 67.96 s > stack backtrace:
  1723. 67.96 s > 0: __rustc::rust_begin_unwind
  1724. 67.96 s > 1: core::panicking::panic_fmt
  1725. 67.96 s > 2: core::result::unwrap_failed
  1726. 67.96 s > 3: alphal00p_docs_builder::tests::write_test_portal
  1727. 67.96 s > 4: alphal00p_docs_builder::tests::portal_and_developer_pages_use_federated_search_and_feedback
  1728. 67.96 s > 5: <alphal00p_docs_builder::tests::portal_and_developer_pages_use_federated_search_and_feedback::{closure#0} as core::ops::function::FnOnce<()>>::call_once
  1729. 67.96 s > note: Some details are omitted, run with `RUST_BACKTRACE=full` for a verbose backtrace.
  1730. 67.96 s >
  1731. 67.96 s > FAIL [ 0.008s] ( 55/129) alphal00p-docs-builder tests::portal_emits_routes_and_valid_assets
  1732. 67.96 s > stdout ---
  1733. 67.96 s >
  1734. 67.96 s > running 1 test
  1735. 67.96 s > test tests::portal_emits_routes_and_valid_assets ... FAILED
  1736. 67.96 s >
  1737. 67.96 s > failures:
  1738. 67.96 s >
  1739. 67.96 s > failures:
  1740. 67.96 s > tests::portal_emits_routes_and_valid_assets
  1741. 67.96 s >
  1742. 67.96 s > test result: FAILED. 0 passed; 1 failed; 0 ignored; 0 measured; 128 filtered out; finished in 0.00s
  1743. 67.96 s >
  1744. 67.96 s > stderr ---
  1745. 67.96 s >
  1746. 67.96 s > thread 'tests::portal_emits_routes_and_valid_assets' (422) panicked at crates/alphal00p-docs-builder/src/lib.rs:9684:14:
  1747. 67.96 s > called `Result::unwrap()` on an `Err` value: failed to copy documentation asset crates/spynso3/typst/STIXTwoMath-Regular.woff2
  1748. 67.96 s >
  1749. 67.96 s > Caused by:
  1750. 67.96 s > No such file or directory (os error 2)
  1751. 67.96 s >
  1752. 67.96 s > Location:
  1753. 67.96 s > crates/alphal00p-docs-builder/src/lib.rs:2276:18
  1754. 67.96 s > stack backtrace:
  1755. 67.96 s > 0: __rustc::rust_begin_unwind
  1756. 67.96 s > 1: core::panicking::panic_fmt
  1757. 67.96 s > 2: core::result::unwrap_failed
  1758. 67.96 s > 3: alphal00p_docs_builder::tests::write_test_portal
  1759. 67.96 s > 4: alphal00p_docs_builder::tests::portal_emits_routes_and_valid_assets
  1760. 67.96 s > 5: <alphal00p_docs_builder::tests::portal_emits_routes_and_valid_assets::{closure#0} as core::ops::function::FnOnce<()>>::call_once
  1761. 67.96 s > note: Some details are omitted, run with `RUST_BACKTRACE=full` for a verbose backtrace.
  1762. 67.96 s >
  1763. 67.96 s > FAIL [ 0.010s] ( 56/129) alphal00p-docs-builder tests::portal_task_chooser_routes_each_goal_to_the_registered_quickstart
  1764. 67.96 s > stdout ---
  1765. 67.96 s >
  1766. 67.96 s > running 1 test
  1767. 67.96 s > test tests::portal_task_chooser_routes_each_goal_to_the_registered_quickstart ... FAILED
  1768. 67.96 s >
  1769. 67.96 s > failures:
  1770. 67.96 s >
  1771. 67.96 s > failures:
  1772. 67.96 s > tests::portal_task_chooser_routes_each_goal_to_the_registered_quickstart
  1773. 67.96 s >
  1774. 67.96 s > test result: FAILED. 0 passed; 1 failed; 0 ignored; 0 measured; 128 filtered out; finished in 0.01s
  1775. 67.96 s >
  1776. 67.96 s > stderr ---
  1777. 67.96 s >
  1778. 67.96 s > thread 'tests::portal_task_chooser_routes_each_goal_to_the_registered_quickstart' (427) panicked at crates/alphal00p-docs-builder/src/lib.rs:9684:14:
  1779. 67.96 s > called `Result::unwrap()` on an `Err` value: failed to copy documentation asset crates/spynso3/typst/STIXTwoMath-Regular.woff2
  1780. 67.96 s >
  1781. 67.96 s > Caused by:
  1782. 67.96 s > No such file or directory (os error 2)
  1783. 67.96 s >
  1784. 67.96 s > Location:
  1785. 67.96 s > crates/alphal00p-docs-builder/src/lib.rs:2276:18
  1786. 67.96 s > stack backtrace:
  1787. 67.96 s > 0: __rustc::rust_begin_unwind
  1788. 67.96 s > 1: core::panicking::panic_fmt
  1789. 67.96 s > 2: core::result::unwrap_failed
  1790. 67.96 s > 3: alphal00p_docs_builder::tests::write_test_portal
  1791. 67.96 s > 4: alphal00p_docs_builder::tests::portal_task_chooser_routes_each_goal_to_the_registered_quickstart
  1792. 67.96 s > 5: <alphal00p_docs_builder::tests::portal_task_chooser_routes_each_goal_to_the_registered_quickstart::{closure#0} as core::ops::function::FnOnce<()>>::call_once
  1793. 67.96 s > note: Some details are omitted, run with `RUST_BACKTRACE=full` for a verbose backtrace.
  1794. 67.96 s >
  1795. 67.96 s > FAIL [ 0.009s] ( 86/129) alphal00p-docs-builder tests::site_assets_replace_read_only_generated_files
  1796. 67.96 s > stdout ---
  1797. 67.96 s >
  1798. 67.96 s > running 1 test
  1799. 67.96 s > test tests::site_assets_replace_read_only_generated_files ... FAILED
  1800. 67.96 s >
  1801. 67.96 s > failures:
  1802. 67.96 s >
  1803. 67.96 s > failures:
  1804. 67.96 s > tests::site_assets_replace_read_only_generated_files
  1805. 67.96 s >
  1806. 67.96 s > test result: FAILED. 0 passed; 1 failed; 0 ignored; 0 measured; 128 filtered out; finished in 0.00s
  1807. 67.96 s >
  1808. 67.96 s > stderr ---
  1809. 67.96 s >
  1810. 67.96 s > thread 'tests::site_assets_replace_read_only_generated_files' (648) panicked at crates/alphal00p-docs-builder/src/lib.rs:12305:50:
  1811. 67.96 s > called `Result::unwrap()` on an `Err` value: failed to copy documentation asset crates/spynso3/typst/STIXTwoMath-Regular.woff2
  1812. 67.96 s >
  1813. 67.96 s > Caused by:
  1814. 67.96 s > No such file or directory (os error 2)
  1815. 67.96 s >
  1816. 67.96 s > Location:
  1817. 67.96 s > crates/alphal00p-docs-builder/src/lib.rs:2276:18
  1818. 67.96 s > stack backtrace:
  1819. 67.96 s > 0: __rustc::rust_begin_unwind
  1820. 67.96 s > 1: core::panicking::panic_fmt
  1821. 67.96 s > 2: core::result::unwrap_failed
  1822. 67.96 s > 3: alphal00p_docs_builder::tests::site_assets_replace_read_only_generated_files
  1823. 67.96 s > 4: <alphal00p_docs_builder::tests::site_assets_replace_read_only_generated_files::{closure#0} as core::ops::function::FnOnce<()>>::call_once
  1824. 67.96 s > note: Some details are omitted, run with `RUST_BACKTRACE=full` for a verbose backtrace.
  1825. 67.96 s >
  1826. 67.96 s > FAIL [ 0.122s] ( 91/129) alphal00p-docs-builder tests::checked_in_registry_is_valid
  1827. 67.96 s > stdout ---
  1828. 67.96 s >
  1829. 67.96 s > running 1 test
  1830. 67.96 s > test tests::checked_in_registry_is_valid ... FAILED
  1831. 67.96 s >
  1832. 67.96 s > failures:
  1833. 67.96 s >
  1834. 67.96 s > failures:
  1835. 67.96 s > tests::checked_in_registry_is_valid
  1836. 67.96 s >
  1837. 67.96 s > test result: FAILED. 0 passed; 1 failed; 0 ignored; 0 measured; 128 filtered out; finished in 0.11s
  1838. 67.96 s >
  1839. 67.96 s > stderr ---
  1840. 67.96 s >
  1841. 67.96 s > thread 'tests::checked_in_registry_is_valid' (241) panicked at crates/alphal00p-docs-builder/src/lib.rs:12260:50:
  1842. 67.96 s > called `Result::unwrap()` on an `Err` value: required documentation source is missing: /build/source/crates/spynso3/typst/STIXTwoMath-Regular.woff2
  1843. 67.96 s >
  1844. 67.96 s > Location:
  1845. 67.96 s > crates/alphal00p-docs-builder/src/lib.rs:5103:9
  1846. 67.96 s > stack backtrace:
  1847. 67.96 s > 0: __rustc::rust_begin_unwind
  1848. 67.96 s > 1: core::panicking::panic_fmt
  1849. 67.96 s > 2: core::result::unwrap_failed
  1850. 67.96 s > 3: alphal00p_docs_builder::tests::checked_in_registry_is_valid
  1851. 67.96 s > 4: <alphal00p_docs_builder::tests::checked_in_registry_is_valid::{closure#0} as core::ops::function::FnOnce<()>>::call_once
  1852. 67.96 s > note: Some details are omitted, run with `RUST_BACKTRACE=full` for a verbose backtrace.
  1853. 67.96 s >
  1854. 67.96 s > FAIL [ 0.130s] ( 97/129) alphal00p-docs-builder provenance_tests::each_build_captures_one_revision_before_rendering
  1855. 67.96 s > stdout ---
  1856. 67.96 s >
  1857. 67.96 s > running 1 test
  1858. 67.96 s >
  1859. 67.96 s > running 1 test
  1860. 67.96 s > test provenance_tests::each_build_captures_one_revision_before_rendering ... FAILED
  1861. 67.96 s >
  1862. 67.96 s > failures:
  1863. 67.96 s >
  1864. 67.96 s > failures:
  1865. 67.96 s > provenance_tests::each_build_captures_one_revision_before_rendering
  1866. 67.96 s >
  1867. 67.96 s > test result: FAILED. 0 passed; 1 failed; 0 ignored; 0 measured; 128 filtered out; finished in 0.11s
  1868. 67.96 s >
  1869. 67.96 s > test provenance_tests::each_build_captures_one_revision_before_rendering ... FAILED
  1870. 67.96 s >
  1871. 67.96 s > failures:
  1872. 67.96 s >
  1873. 67.96 s > failures:
  1874. 67.96 s > provenance_tests::each_build_captures_one_revision_before_rendering
  1875. 67.96 s >
  1876. 67.96 s > test result: FAILED. 0 passed; 1 failed; 0 ignored; 0 measured; 128 filtered out; finished in 0.12s
  1877. 67.96 s >
  1878. 67.96 s > stderr ---
  1879. 67.96 s >
  1880. 67.96 s > thread 'provenance_tests::each_build_captures_one_revision_before_rendering' (260) panicked at crates/alphal00p-docs-builder/src/provenance_tests.rs:297:14:
  1881. 67.96 s > called `Result::unwrap()` on an `Err` value: required documentation source is missing: /build/source/target/nix-ci-tmp/.tmp3od26f/checkout/crates/spynso3/typst/STIXTwoMath-Regular.woff2
  1882. 67.96 s >
  1883. 67.96 s > Location:
  1884. 67.96 s > crates/alphal00p-docs-builder/src/lib.rs:5103:9
  1885. 67.96 s > stack backtrace:
  1886. 67.96 s > 0: __rustc::rust_begin_unwind
  1887. 67.96 s > 1: core::panicking::panic_fmt
  1888. 67.96 s > 2: core::result::unwrap_failed
  1889. 67.96 s > 3: alphal00p_docs_builder::provenance_tests::each_build_captures_one_revision_before_rendering
  1890. 67.96 s > 4: <alphal00p_docs_builder::provenance_tests::each_build_captures_one_revision_before_rendering::{closure#0} as core::ops::function::FnOnce<()>>::call_once
  1891. 67.96 s > note: Some details are omitted, run with `RUST_BACKTRACE=full` for a verbose backtrace.
  1892. 67.96 s >
  1893. 67.96 s > thread 'provenance_tests::each_build_captures_one_revision_before_rendering' (226) panicked at crates/alphal00p-docs-builder/src/provenance_tests.rs:274:9:
  1894. 67.96 s > assertion failed: command.status().unwrap().success()
  1895. 67.96 s > stack backtrace:
  1896. 67.96 s > 0: __rustc::rust_begin_unwind
  1897. 67.96 s > 1: core::panicking::panic_fmt
  1898. 67.96 s > 2: core::panicking::panic
  1899. 67.96 s > 3: alphal00p_docs_builder::provenance_tests::each_build_captures_one_revision_before_rendering
  1900. 67.96 s > 4: <alphal00p_docs_builder::provenance_tests::each_build_captures_one_revision_before_rendering::{closure#0} as core::ops::function::FnOnce<()>>::call_once
  1901. 67.96 s > note: Some details are omitted, run with `RUST_BACKTRACE=full` for a verbose backtrace.
  1902. 67.96 s >
  1903. 67.96 s > FAIL [ 0.116s] (100/129) alphal00p-docs-builder tests::developer_scope_ranges_ignore_unrelated_edits_and_warn_only_while_watching
  1904. 67.96 s > stdout ---
  1905. 67.96 s >
  1906. 67.96 s > running 1 test
  1907. 67.96 s > test tests::developer_scope_ranges_ignore_unrelated_edits_and_warn_only_while_watching ... FAILED
  1908. 67.96 s >
  1909. 67.96 s > failures:
  1910. 67.96 s >
  1911. 67.96 s > failures:
  1912. 67.96 s > tests::developer_scope_ranges_ignore_unrelated_edits_and_warn_only_while_watching
  1913. 67.96 s >
  1914. 67.96 s > test result: FAILED. 0 passed; 1 failed; 0 ignored; 0 measured; 128 filtered out; finished in 0.11s
  1915. 67.96 s >
  1916. 67.96 s > stderr ---
  1917. 67.96 s >
  1918. 67.96 s > thread 'tests::developer_scope_ranges_ignore_unrelated_edits_and_warn_only_while_watching' (284) panicked at crates/alphal00p-docs-builder/src/lib.rs:12350:29:
  1919. 67.96 s > called `Result::unwrap()` on an `Err` value: required documentation source is missing: /build/source/crates/spynso3/typst/STIXTwoMath-Regular.woff2
  1920. 67.96 s >
  1921. 67.96 s > Location:
  1922. 67.96 s > crates/alphal00p-docs-builder/src/lib.rs:5103:9
  1923. 67.96 s > stack backtrace:
  1924. 67.96 s > 0: __rustc::rust_begin_unwind
  1925. 67.96 s > 1: core::panicking::panic_fmt
  1926. 67.96 s > 2: core::result::unwrap_failed
  1927. 67.96 s > 3: alphal00p_docs_builder::tests::developer_scope_ranges_ignore_unrelated_edits_and_warn_only_while_watching
  1928. 67.96 s > 4: <alphal00p_docs_builder::tests::developer_scope_ranges_ignore_unrelated_edits_and_warn_only_while_watching::{closure#0} as core::ops::function::FnOnce<()>>::call_once
  1929. 67.96 s > note: Some details are omitted, run with `RUST_BACKTRACE=full` for a verbose backtrace.
  1930. 67.96 s >
  1931. 67.96 s > FAIL [ 0.120s] (111/129) alphal00p-docs-builder tests::every_product_requires_a_task_chooser_and_each_supported_interface
  1932. 67.96 s > stdout ---
  1933. 67.96 s >
  1934. 67.96 s > running 1 test
  1935. 67.96 s > test tests::every_product_requires_a_task_chooser_and_each_supported_interface ... FAILED
  1936. 67.96 s >
  1937. 67.96 s > failures:
  1938. 67.96 s >
  1939. 67.96 s > failures:
  1940. 67.96 s > tests::every_product_requires_a_task_chooser_and_each_supported_interface
  1941. 67.96 s >
  1942. 67.96 s > test result: FAILED. 0 passed; 1 failed; 0 ignored; 0 measured; 128 filtered out; finished in 0.12s
  1943. 67.96 s >
  1944. 67.96 s > stderr ---
  1945. 67.96 s >
  1946. 67.96 s > thread 'tests::every_product_requires_a_task_chooser_and_each_supported_interface' (309) panicked at crates/alphal00p-docs-builder/src/lib.rs:12274:9:
  1947. 67.96 s > assertion failed: format!("{error:#}").contains("has no quickstart page")
  1948. 67.96 s > stack backtrace:
  1949. 67.96 s > 0: __rustc::rust_begin_unwind
  1950. 67.96 s > 1: core::panicking::panic_fmt
  1951. 67.96 s > 2: core::panicking::panic
  1952. 67.96 s > 3: alphal00p_docs_builder::tests::every_product_requires_a_task_chooser_and_each_supported_interface
  1953. 67.96 s > 4: <alphal00p_docs_builder::tests::every_product_requires_a_task_chooser_and_each_supported_interface::{closure#0} as core::ops::function::FnOnce<()>>::call_once
  1954. 67.96 s > note: Some details are omitted, run with `RUST_BACKTRACE=full` for a verbose backtrace.
  1955. 67.96 s >
  1956. 67.96 s > FAIL [ 0.112s] (122/129) alphal00p-docs-builder tests::pdf_manual_chapter_order_must_match_the_page_registry
  1957. 67.96 s > stdout ---
  1958. 67.96 s >
  1959. 67.96 s > running 1 test
  1960. 67.96 s > test tests::pdf_manual_chapter_order_must_match_the_page_registry ... FAILED
  1961. 67.96 s >
  1962. 67.96 s > failures:
  1963. 67.96 s >
  1964. 67.96 s > failures:
  1965. 67.96 s > tests::pdf_manual_chapter_order_must_match_the_page_registry
  1966. 67.96 s >
  1967. 67.96 s > test result: FAILED. 0 passed; 1 failed; 0 ignored; 0 measured; 128 filtered out; finished in 0.11s
  1968. 67.96 s >
  1969. 67.96 s > stderr ---
  1970. 67.96 s >
  1971. 67.96 s > thread 'tests::pdf_manual_chapter_order_must_match_the_page_registry' (402) panicked at crates/alphal00p-docs-builder/src/lib.rs:12330:9:
  1972. 67.96 s > assertion failed: format!("{error:#}").contains("PDF manual chapter order differs")
  1973. 67.96 s > stack backtrace:
  1974. 67.96 s > 0: __rustc::rust_begin_unwind
  1975. 67.96 s > 1: core::panicking::panic_fmt
  1976. 67.96 s > 2: core::panicking::panic
  1977. 67.96 s > 3: alphal00p_docs_builder::tests::pdf_manual_chapter_order_must_match_the_page_registry
  1978. 67.96 s > 4: <alphal00p_docs_builder::tests::pdf_manual_chapter_order_must_match_the_page_registry::{closure#0} as core::ops::function::FnOnce<()>>::call_once
  1979. 67.96 s > note: Some details are omitted, run with `RUST_BACKTRACE=full` for a verbose backtrace.
  1980. 67.96 s >
  1981. 67.96 s > error: test run failed
  1982. 67.96 s >
  1983. 67.96 s > ========== nextest test summary ==========
  1984. 67.96 s > report: target/nextest/ci_gammaloop/junit.xml
  1985. 67.96 s > tests: 129, failures: 11, errors: 0
  1986. 67.96 s >
  1987. 67.96 s > 1. alphal00p-docs-builder::tests::developer_architecture_is_classified_searchable_and_source_backed
  1988. 67.96 s > failure: test failure with exit code 101
  1989. 67.96 s > thread 'tests::developer_architecture_is_classified_searchable_and_source_backed' (276) panicked at crates/alphal00p-docs-builder/src/lib.rs:12751:14:
  1990. 67.96 s > called `Result::unwrap()` on an `Err` value: failed to copy documentation asset crates/spynso3/typst/STIXTwoMath-Regular.woff2
  1991. 67.96 s >
  1992. 67.96 s > Caused by:
  1993. 67.96 s > No such file or directory (os error 2)
  1994. 67.96 s >
  1995. 67.96 s > Location:
  1996. 67.96 s > crates/alphal00p-docs-builder/src/lib.rs:2276:18
  1997. 67.96 s > stack backtrace:
  1998. 67.96 s > 0: __rustc::rust_begin_unwind
  1999. 67.96 s > 1: core::panicking::panic_fmt
  2000. 67.96 s > 2: core::result::unwrap_failed
  2001. 67.96 s > 3: alphal00p_docs_builder::tests::developer_architecture_is_classified_searchable_and_source_backed
  2002. 67.96 s > 4: <alphal00p_docs_builder::tests::developer_architecture_is_classified_searchable_and_source_backed::{closure#0} as core::ops::function::FnOnce<()>>::call_once
  2003. 67.96 s > note: Some details are omitted, run with `RUST_BACKTRACE=full` for a verbose backtrace.
  2004. 67.96 s > system-out
  2005. 67.96 s > running 1 test
  2006. 67.96 s > test tests::developer_architecture_is_classified_searchable_and_source_backed ... FAILED
  2007. 67.96 s >
  2008. 67.96 s > failures:
  2009. 67.96 s >
  2010. 67.96 s > failures:
  2011. 67.96 s > tests::developer_architecture_is_classified_searchable_and_source_backed
  2012. 67.96 s >
  2013. 67.96 s > test result: FAILED. 0 passed; 1 failed; 0 ignored; 0 measured; 128 filtered out; finished in 0.01s
  2014. 67.96 s > system-err
  2015. 67.96 s > thread 'tests::developer_architecture_is_classified_searchable_and_source_backed' (276) panicked at crates/alphal00p-docs-builder/src/lib.rs:12751:14:
  2016. 67.96 s > called `Result::unwrap()` on an `Err` value: failed to copy documentation asset crates/spynso3/typst/STIXTwoMath-Regular.woff2
  2017. 67.96 s >
  2018. 67.96 s > Caused by:
  2019. 67.96 s > No such file or directory (os error 2)
  2020. 67.96 s >
  2021. 67.96 s > Location:
  2022. 67.96 s > crates/alphal00p-docs-builder/src/lib.rs:2276:18
  2023. 67.96 s > stack backtrace:
  2024. 67.96 s > 0: __rustc::rust_begin_unwind
  2025. 67.96 s > 1: core::panicking::panic_fmt
  2026. 67.96 s > 2: core::result::unwrap_failed
  2027. 67.96 s > 3: alphal00p_docs_builder::tests::developer_architecture_is_classified_searchable_and_source_backed
  2028. 67.96 s > 4: <alphal00p_docs_builder::tests::developer_architecture_is_classified_searchable_and_source_backed::{closure#0} as core::ops::function::FnOnce<()>>::call_once
  2029. 67.96 s > note: Some details are omitted, run with `RUST_BACKTRACE=full` for a verbose backtrace.
  2030. 67.96 s >
  2031. 67.96 s > 2. alphal00p-docs-builder::tests::every_product_orients_rust_to_native_rustdoc_and_keeps_legacy_redirects
  2032. 67.96 s > failure: test failure with exit code 101
  2033. 67.96 s > thread 'tests::every_product_orients_rust_to_native_rustdoc_and_keeps_legacy_redirects' (302) panicked at crates/alphal00p-docs-builder/src/lib.rs:12555:46:
  2034. 67.96 s > called `Result::unwrap()` on an `Err` value: failed to copy documentation asset crates/spynso3/typst/STIXTwoMath-Regular.woff2
  2035. 67.96 s >
  2036. 67.96 s > Caused by:
  2037. 67.96 s > No such file or directory (os error 2)
  2038. 67.96 s >
  2039. 67.96 s > Location:
  2040. 67.96 s > crates/alphal00p-docs-builder/src/lib.rs:2276:18
  2041. 67.96 s > stack backtrace:
  2042. 67.96 s > 0: __rustc::rust_begin_unwind
  2043. 67.96 s > 1: core::panicking::panic_fmt
  2044. 67.96 s > 2: core::result::unwrap_failed
  2045. 67.96 s > 3: alphal00p_docs_builder::tests::every_product_orients_rust_to_native_rustdoc_and_keeps_legacy_redirects
  2046. 67.96 s > 4: <alphal00p_docs_builder::tests::every_product_orients_rust_to_native_rustdoc_and_keeps_legacy_redirects::{closure#0} as core::ops::function::FnOnce<()>>::call_once
  2047. 67.96 s > note: Some details are omitted, run with `RUST_BACKTRACE=full` for a verbose backtrace.
  2048. 67.96 s > system-out
  2049. 67.96 s > running 1 test
  2050. 67.96 s > test tests::every_product_orients_rust_to_native_rustdoc_and_keeps_legacy_redirects ... FAILED
  2051. 67.96 s >
  2052. 67.96 s > failures:
  2053. 67.96 s >
  2054. 67.96 s > failures:
  2055. 67.96 s > tests::every_product_orients_rust_to_native_rustdoc_and_keeps_legacy_redirects
  2056. 67.96 s >
  2057. 67.96 s > test result: FAILED. 0 passed; 1 failed; 0 ignored; 0 measured; 128 filtered out; finished in 0.01s
  2058. 67.96 s > system-err
  2059. 67.96 s > thread 'tests::every_product_orients_rust_to_native_rustdoc_and_keeps_legacy_redirects' (302) panicked at crates/alphal00p-docs-builder/src/lib.rs:12555:46:
  2060. 67.96 s > called `Result::unwrap()` on an `Err` value: failed to copy documentation asset crates/spynso3/typst/STIXTwoMath-Regular.woff2
  2061. 67.96 s >
  2062. 67.96 s > Caused by:
  2063. 67.96 s > No such file or directory (os error 2)
  2064. 67.96 s >
  2065. 67.96 s > Location:
  2066. 67.96 s > crates/alphal00p-docs-builder/src/lib.rs:2276:18
  2067. 67.96 s > stack backtrace:
  2068. 67.96 s > 0: __rustc::rust_begin_unwind
  2069. 67.96 s > 1: core::panicking::panic_fmt
  2070. 67.96 s > 2: core::result::unwrap_failed
  2071. 67.96 s > 3: alphal00p_docs_builder::tests::every_product_orients_rust_to_native_rustdoc_and_keeps_legacy_redirects
  2072. 67.96 s > 4: <alphal00p_docs_builder::tests::every_product_orients_rust_to_native_rustdoc_and_keeps_legacy_redirects::{closure#0} as core::ops::function::FnOnce<()>>::call_once
  2073. 67.96 s > note: Some details are omitted, run with `RUST_BACKTRACE=full` for a verbose backtrace.
  2074. 67.96 s >
  2075. 67.96 s > 3. alphal00p-docs-builder::tests::portal_and_developer_pages_use_federated_search_and_feedback
  2076. 67.96 s > failure: test failure with exit code 101
  2077. 67.96 s > thread 'tests::portal_and_developer_pages_use_federated_search_and_feedback' (416) panicked at crates/alphal00p-docs-builder/src/lib.rs:9684:14:
  2078. 67.96 s > called `Result::unwrap()` on an `Err` value: failed to copy documentation asset crates/spynso3/typst/STIXTwoMath-Regular.woff2
  2079. 67.96 s >
  2080. 67.96 s > Caused by:
  2081. 67.96 s > No such file or directory (os error 2)
  2082. 67.96 s >
  2083. 67.96 s > Location:
  2084. 67.96 s > crates/alphal00p-docs-builder/src/lib.rs:2276:18
  2085. 67.96 s > stack backtrace:
  2086. 67.96 s > 0: __rustc::rust_begin_unwind
  2087. 67.96 s > 1: core::panicking::panic_fmt
  2088. 67.96 s > 2: core::result::unwrap_failed
  2089. 67.96 s > 3: alphal00p_docs_builder::tests::write_test_portal
  2090. 67.96 s > 4: alphal00p_docs_builder::tests::portal_and_developer_pages_use_federated_search_and_feedback
  2091. 67.96 s > 5: <alphal00p_docs_builder::tests::portal_and_developer_pages_use_federated_search_and_feedback::{closure#0} as core::ops::function::FnOnce<()>>::call_once
  2092. 67.96 s > note: Some details are omitted, run with `RUST_BACKTRACE=full` for a verbose backtrace.
  2093. 67.96 s > system-out
  2094. 67.96 s > running 1 test
  2095. 67.96 s > test tests::portal_and_developer_pages_use_federated_search_and_feedback ... FAILED
  2096. 67.96 s >
  2097. 67.96 s > failures:
  2098. 67.96 s >
  2099. 67.96 s > failures:
  2100. 67.96 s > tests::portal_and_developer_pages_use_federated_search_and_feedback
  2101. 67.96 s >
  2102. 67.96 s > test result: FAILED. 0 passed; 1 failed; 0 ignored; 0 measured; 128 filtered out; finished in 0.01s
  2103. 67.96 s > system-err
  2104. 67.96 s > thread 'tests::portal_and_developer_pages_use_federated_search_and_feedback' (416) panicked at crates/alphal00p-docs-builder/src/lib.rs:9684:14:
  2105. 67.96 s > called `Result::unwrap()` on an `Err` value: failed to copy documentation asset crates/spynso3/typst/STIXTwoMath-Regular.woff2
  2106. 67.96 s >
  2107. 67.96 s > Caused by:
  2108. 67.96 s > No such file or directory (os error 2)
  2109. 67.96 s >
  2110. 67.96 s > Location:
  2111. 67.96 s > crates/alphal00p-docs-builder/src/lib.rs:2276:18
  2112. 67.96 s > stack backtrace:
  2113. 67.96 s > 0: __rustc::rust_begin_unwind
  2114. 67.96 s > 1: core::panicking::panic_fmt
  2115. 67.96 s > 2: core::result::unwrap_failed
  2116. 67.96 s > 3: alphal00p_docs_builder::tests::write_test_portal
  2117. 67.96 s > 4: alphal00p_docs_builder::tests::portal_and_developer_pages_use_federated_search_and_feedback
  2118. 67.96 s > 5: <alphal00p_docs_builder::tests::portal_and_developer_pages_use_federated_search_and_feedback::{closure#0} as core::ops::function::FnOnce<()>>::call_once
  2119. 67.96 s > note: Some details are omitted, run with `RUST_BACKTRACE=full` for a verbose backtrace.
  2120. 67.96 s >
  2121. 67.96 s > 4. alphal00p-docs-builder::tests::portal_emits_routes_and_valid_assets
  2122. 67.96 s > failure: test failure with exit code 101
  2123. 67.96 s > thread 'tests::portal_emits_routes_and_valid_assets' (422) panicked at crates/alphal00p-docs-builder/src/lib.rs:9684:14:
  2124. 67.96 s > called `Result::unwrap()` on an `Err` value: failed to copy documentation asset crates/spynso3/typst/STIXTwoMath-Regular.woff2
  2125. 67.96 s >
  2126. 67.96 s > Caused by:
  2127. 67.96 s > No such file or directory (os error 2)
  2128. 67.96 s >
  2129. 67.96 s > Location:
  2130. 67.96 s > crates/alphal00p-docs-builder/src/lib.rs:2276:18
  2131. 67.96 s > stack backtrace:
  2132. 67.96 s > 0: __rustc::rust_begin_unwind
  2133. 67.96 s > 1: core::panicking::panic_fmt
  2134. 67.96 s > 2: core::result::unwrap_failed
  2135. 67.96 s > 3: alphal00p_docs_builder::tests::write_test_portal
  2136. 67.96 s > 4: alphal00p_docs_builder::tests::portal_emits_routes_and_valid_assets
  2137. 67.96 s > 5: <alphal00p_docs_builder::tests::portal_emits_routes_and_valid_assets::{closure#0} as core::ops::function::FnOnce<()>>::call_once
  2138. 67.96 s > note: Some details are omitted, run with `RUST_BACKTRACE=full` for a verbose backtrace.
  2139. 67.96 s > system-out
  2140. 67.96 s > running 1 test
  2141. 67.96 s > test tests::portal_emits_routes_and_valid_assets ... FAILED
  2142. 67.96 s >
  2143. 67.96 s > failures:
  2144. 67.96 s >
  2145. 67.96 s > failures:
  2146. 67.96 s > tests::portal_emits_routes_and_valid_assets
  2147. 67.96 s >
  2148. 67.96 s > test result: FAILED. 0 passed; 1 failed; 0 ignored; 0 measured; 128 filtered out; finished in 0.00s
  2149. 67.96 s > system-err
  2150. 67.96 s > thread 'tests::portal_emits_routes_and_valid_assets' (422) panicked at crates/alphal00p-docs-builder/src/lib.rs:9684:14:
  2151. 67.96 s > called `Result::unwrap()` on an `Err` value: failed to copy documentation asset crates/spynso3/typst/STIXTwoMath-Regular.woff2
  2152. 67.96 s >
  2153. 67.96 s > Caused by:
  2154. 67.96 s > No such file or directory (os error 2)
  2155. 67.96 s >
  2156. 67.96 s > Location:
  2157. 67.96 s > crates/alphal00p-docs-builder/src/lib.rs:2276:18
  2158. 67.96 s > stack backtrace:
  2159. 67.96 s > 0: __rustc::rust_begin_unwind
  2160. 67.96 s > 1: core::panicking::panic_fmt
  2161. 67.96 s > 2: core::result::unwrap_failed
  2162. 67.96 s > 3: alphal00p_docs_builder::tests::write_test_portal
  2163. 67.96 s > 4: alphal00p_docs_builder::tests::portal_emits_routes_and_valid_assets
  2164. 67.96 s > 5: <alphal00p_docs_builder::tests::portal_emits_routes_and_valid_assets::{closure#0} as core::ops::function::FnOnce<()>>::call_once
  2165. 67.96 s > note: Some details are omitted, run with `RUST_BACKTRACE=full` for a verbose backtrace.
  2166. 67.96 s >
  2167. 67.96 s > 5. alphal00p-docs-builder::tests::portal_task_chooser_routes_each_goal_to_the_registered_quickstart
  2168. 67.96 s > failure: test failure with exit code 101
  2169. 67.96 s > thread 'tests::portal_task_chooser_routes_each_goal_to_the_registered_quickstart' (427) panicked at crates/alphal00p-docs-builder/src/lib.rs:9684:14:
  2170. 67.96 s > called `Result::unwrap()` on an `Err` value: failed to copy documentation asset crates/spynso3/typst/STIXTwoMath-Regular.woff2
  2171. 67.96 s >
  2172. 67.96 s > Caused by:
  2173. 67.96 s > No such file or directory (os error 2)
  2174. 67.96 s >
  2175. 67.96 s > Location:
  2176. 67.96 s > crates/alphal00p-docs-builder/src/lib.rs:2276:18
  2177. 67.96 s > stack backtrace:
  2178. 67.96 s > 0: __rustc::rust_begin_unwind
  2179. 67.96 s > 1: core::panicking::panic_fmt
  2180. 67.96 s > 2: core::result::unwrap_failed
  2181. 67.96 s > 3: alphal00p_docs_builder::tests::write_test_portal
  2182. 67.96 s > 4: alphal00p_docs_builder::tests::portal_task_chooser_routes_each_goal_to_the_registered_quickstart
  2183. 67.96 s > 5: <alphal00p_docs_builder::tests::portal_task_chooser_routes_each_goal_to_the_registered_quickstart::{closure#0} as core::ops::function::FnOnce<()>>::call_once
  2184. 67.96 s > note: Some details are omitted, run with `RUST_BACKTRACE=full` for a verbose backtrace.
  2185. 67.96 s > system-out
  2186. 67.96 s > running 1 test
  2187. 67.96 s > test tests::portal_task_chooser_routes_each_goal_to_the_registered_quickstart ... FAILED
  2188. 67.96 s >
  2189. 67.96 s > failures:
  2190. 67.96 s >
  2191. 67.96 s > failures:
  2192. 67.96 s > tests::portal_task_chooser_routes_each_goal_to_the_registered_quickstart
  2193. 67.96 s >
  2194. 67.96 s > test result: FAILED. 0 passed; 1 failed; 0 ignored; 0 measured; 128 filtered out; finished in 0.01s
  2195. 67.96 s > system-err
  2196. 67.96 s > thread 'tests::portal_task_chooser_routes_each_goal_to_the_registered_quickstart' (427) panicked at crates/alphal00p-docs-builder/src/lib.rs:9684:14:
  2197. 67.96 s > called `Result::unwrap()` on an `Err` value: failed to copy documentation asset crates/spynso3/typst/STIXTwoMath-Regular.woff2
  2198. 67.96 s >
  2199. 67.96 s > Caused by:
  2200. 67.96 s > No such file or directory (os error 2)
  2201. 67.96 s >
  2202. 67.96 s > Location:
  2203. 67.96 s > crates/alphal00p-docs-builder/src/lib.rs:2276:18
  2204. 67.96 s > stack backtrace:
  2205. 67.96 s > 0: __rustc::rust_begin_unwind
  2206. 67.96 s > 1: core::panicking::panic_fmt
  2207. 67.96 s > 2: core::result::unwrap_failed
  2208. 67.96 s > 3: alphal00p_docs_builder::tests::write_test_portal
  2209. 67.96 s > 4: alphal00p_docs_builder::tests::portal_task_chooser_routes_each_goal_to_the_registered_quickstart
  2210. 67.96 s > 5: <alphal00p_docs_builder::tests::portal_task_chooser_routes_each_goal_to_the_registered_quickstart::{closure#0} as core::ops::function::FnOnce<()>>::call_once
  2211. 67.96 s > note: Some details are omitted, run with `RUST_BACKTRACE=full` for a verbose backtrace.
  2212. 67.96 s >
  2213. 67.96 s > 6. alphal00p-docs-builder::tests::site_assets_replace_read_only_generated_files
  2214. 67.96 s > failure: test failure with exit code 101
  2215. 67.96 s > thread 'tests::site_assets_replace_read_only_generated_files' (648) panicked at crates/alphal00p-docs-builder/src/lib.rs:12305:50:
  2216. 67.96 s > called `Result::unwrap()` on an `Err` value: failed to copy documentation asset crates/spynso3/typst/STIXTwoMath-Regular.woff2
  2217. 67.96 s >
  2218. 67.96 s > Caused by:
  2219. 67.96 s > No such file or directory (os error 2)
  2220. 67.96 s >
  2221. 67.96 s > Location:
  2222. 67.96 s > crates/alphal00p-docs-builder/src/lib.rs:2276:18
  2223. 67.96 s > stack backtrace:
  2224. 67.96 s > 0: __rustc::rust_begin_unwind
  2225. 67.96 s > 1: core::panicking::panic_fmt
  2226. 67.96 s > 2: core::result::unwrap_failed
  2227. 67.96 s > 3: alphal00p_docs_builder::tests::site_assets_replace_read_only_generated_files
  2228. 67.96 s > 4: <alphal00p_docs_builder::tests::site_assets_replace_read_only_generated_files::{closure#0} as core::ops::function::FnOnce<()>>::call_once
  2229. 67.96 s > note: Some details are omitted, run with `RUST_BACKTRACE=full` for a verbose backtrace.
  2230. 67.96 s > system-out
  2231. 67.96 s > running 1 test
  2232. 67.96 s > test tests::site_assets_replace_read_only_generated_files ... FAILED
  2233. 67.96 s >
  2234. 67.96 s > failures:
  2235. 67.96 s >
  2236. 67.96 s > failures:
  2237. 67.96 s > tests::site_assets_replace_read_only_generated_files
  2238. 67.96 s >
  2239. 67.96 s > test result: FAILED. 0 passed; 1 failed; 0 ignored; 0 measured; 128 filtered out; finished in 0.00s
  2240. 67.96 s > system-err
  2241. 67.96 s > thread 'tests::site_assets_replace_read_only_generated_files' (648) panicked at crates/alphal00p-docs-builder/src/lib.rs:12305:50:
  2242. 67.96 s > called `Result::unwrap()` on an `Err` value: failed to copy documentation asset crates/spynso3/typst/STIXTwoMath-Regular.woff2
  2243. 67.96 s >
  2244. 67.96 s > Caused by:
  2245. 67.96 s > No such file or directory (os error 2)
  2246. 67.96 s >
  2247. 67.96 s > Location:
  2248. 67.96 s > crates/alphal00p-docs-builder/src/lib.rs:2276:18
  2249. 67.96 s > stack backtrace:
  2250. 67.96 s > 0: __rustc::rust_begin_unwind
  2251. 67.96 s > 1: core::panicking::panic_fmt
  2252. 67.96 s > 2: core::result::unwrap_failed
  2253. 67.96 s > 3: alphal00p_docs_builder::tests::site_assets_replace_read_only_generated_files
  2254. 67.96 s > 4: <alphal00p_docs_builder::tests::site_assets_replace_read_only_generated_files::{closure#0} as core::ops::function::FnOnce<()>>::call_once
  2255. 67.96 s > note: Some details are omitted, run with `RUST_BACKTRACE=full` for a verbose backtrace.
  2256. 67.96 s >
  2257. 67.96 s > 7. alphal00p-docs-builder::tests::checked_in_registry_is_valid
  2258. 67.96 s > failure: test failure with exit code 101
  2259. 67.96 s > thread 'tests::checked_in_registry_is_valid' (241) panicked at crates/alphal00p-docs-builder/src/lib.rs:12260:50:
  2260. 67.96 s > called `Result::unwrap()` on an `Err` value: required documentation source is missing: /build/source/crates/spynso3/typst/STIXTwoMath-Regular.woff2
  2261. 67.96 s >
  2262. 67.96 s > Location:
  2263. 67.96 s > crates/alphal00p-docs-builder/src/lib.rs:5103:9
  2264. 67.96 s > stack backtrace:
  2265. 67.96 s > 0: __rustc::rust_begin_unwind
  2266. 67.96 s > 1: core::panicking::panic_fmt
  2267. 67.96 s > 2: core::result::unwrap_failed
  2268. 67.96 s > 3: alphal00p_docs_builder::tests::checked_in_registry_is_valid
  2269. 67.96 s > 4: <alphal00p_docs_builder::tests::checked_in_registry_is_valid::{closure#0} as core::ops::function::FnOnce<()>>::call_once
  2270. 67.96 s > note: Some details are omitted, run with `RUST_BACKTRACE=full` for a verbose backtrace.
  2271. 67.96 s > system-out
  2272. 67.96 s > running 1 test
  2273. 67.96 s > test tests::checked_in_registry_is_valid ... FAILED
  2274. 67.96 s >
  2275. 67.96 s > failures:
  2276. 67.96 s >
  2277. 67.96 s > failures:
  2278. 67.96 s > tests::checked_in_registry_is_valid
  2279. 67.96 s >
  2280. 67.96 s > test result: FAILED. 0 passed; 1 failed; 0 ignored; 0 measured; 128 filtered out; finished in 0.11s
  2281. 67.96 s > system-err
  2282. 67.96 s > thread 'tests::checked_in_registry_is_valid' (241) panicked at crates/alphal00p-docs-builder/src/lib.rs:12260:50:
  2283. 67.96 s > called `Result::unwrap()` on an `Err` value: required documentation source is missing: /build/source/crates/spynso3/typst/STIXTwoMath-Regular.woff2
  2284. 67.96 s >
  2285. 67.96 s > Location:
  2286. 67.96 s > crates/alphal00p-docs-builder/src/lib.rs:5103:9
  2287. 67.96 s > stack backtrace:
  2288. 67.96 s > 0: __rustc::rust_begin_unwind
  2289. 67.96 s > 1: core::panicking::panic_fmt
  2290. 67.96 s > 2: core::result::unwrap_failed
  2291. 67.96 s > 3: alphal00p_docs_builder::tests::checked_in_registry_is_valid
  2292. 67.96 s > 4: <alphal00p_docs_builder::tests::checked_in_registry_is_valid::{closure#0} as core::ops::function::FnOnce<()>>::call_once
  2293. 67.96 s > note: Some details are omitted, run with `RUST_BACKTRACE=full` for a verbose backtrace.
  2294. 67.96 s >
  2295. 67.96 s > 8. alphal00p-docs-builder::provenance_tests::each_build_captures_one_revision_before_rendering
  2296. 67.96 s > failure: test failure with exit code 101
  2297. 67.96 s > thread 'provenance_tests::each_build_captures_one_revision_before_rendering' (226) panicked at crates/alphal00p-docs-builder/src/provenance_tests.rs:274:9:
  2298. 67.96 s > assertion failed: command.status().unwrap().success()
  2299. 67.96 s > stack backtrace:
  2300. 67.96 s > 0: __rustc::rust_begin_unwind
  2301. 67.96 s > 1: core::panicking::panic_fmt
  2302. 67.96 s > 2: core::panicking::panic
  2303. 67.96 s > 3: alphal00p_docs_builder::provenance_tests::each_build_captures_one_revision_before_rendering
  2304. 67.96 s > 4: <alphal00p_docs_builder::provenance_tests::each_build_captures_one_revision_before_rendering::{closure#0} as core::ops::function::FnOnce<()>>::call_once
  2305. 67.96 s > note: Some details are omitted, run with `RUST_BACKTRACE=full` for a verbose backtrace.
  2306. 67.96 s > system-out
  2307. 67.96 s > running 1 test
  2308. 67.96 s >
  2309. 67.96 s > running 1 test
  2310. 67.96 s > test provenance_tests::each_build_captures_one_revision_before_rendering ... FAILED
  2311. 67.96 s >
  2312. 67.96 s > failures:
  2313. 67.96 s >
  2314. 67.96 s > failures:
  2315. 67.96 s > provenance_tests::each_build_captures_one_revision_before_rendering
  2316. 67.96 s >
  2317. 67.96 s > test result: FAILED. 0 passed; 1 failed; 0 ignored; 0 measured; 128 filtered out; finished in 0.11s
  2318. 67.96 s >
  2319. 67.96 s > test provenance_tests::each_build_captures_one_revision_before_rendering ... FAILED
  2320. 67.96 s >
  2321. 67.96 s > failures:
  2322. 67.96 s >
  2323. 67.96 s > failures:
  2324. 67.96 s > provenance_tests::each_build_captures_one_revision_before_rendering
  2325. 67.96 s >
  2326. 67.96 s > test result: FAILED. 0 passed; 1 failed; 0 ignored; 0 measured; 128 filtered out; finished in 0.12s
  2327. 67.96 s > system-err
  2328. 67.96 s > thread 'provenance_tests::each_build_captures_one_revision_before_rendering' (260) panicked at crates/alphal00p-docs-builder/src/provenance_tests.rs:297:14:
  2329. 67.96 s > called `Result::unwrap()` on an `Err` value: required documentation source is missing: /build/source/target/nix-ci-tmp/.tmp3od26f/checkout/crates/spynso3/typst/STIXTwoMath-Regular.woff2
  2330. 67.96 s >
  2331. 67.96 s > Location:
  2332. 67.96 s > crates/alphal00p-docs-builder/src/lib.rs:5103:9
  2333. 67.96 s > stack backtrace:
  2334. 67.96 s > 0: __rustc::rust_begin_unwind
  2335. 67.96 s > 1: core::panicking::panic_fmt
  2336. 67.96 s > 2: core::result::unwrap_failed
  2337. 67.96 s > 3: alphal00p_docs_builder::provenance_tests::each_build_captures_one_revision_before_rendering
  2338. 67.96 s > 4: <alphal00p_docs_builder::provenance_tests::each_build_captures_one_revision_before_rendering::{closure#0} as core::ops::function::FnOnce<()>>::call_once
  2339. 67.96 s > note: Some details are omitted, run with `RUST_BACKTRACE=full` for a verbose backtrace.
  2340. 67.96 s >
  2341. 67.96 s > thread 'provenance_tests::each_build_captures_one_revision_before_rendering' (226) panicked at crates/alphal00p-docs-builder/src/provenance_tests.rs:274:9:
  2342. 67.96 s > assertion failed: command.status().unwrap().success()
  2343. 67.96 s > stack backtrace:
  2344. 67.96 s > 0: __rustc::rust_begin_unwind
  2345. 67.96 s > 1: core::panicking::panic_fmt
  2346. 67.96 s > 2: core::panicking::panic
  2347. 67.96 s > 3: alphal00p_docs_builder::provenance_tests::each_build_captures_one_revision_before_rendering
  2348. 67.96 s > 4: <alphal00p_docs_builder::provenance_tests::each_build_captures_one_revision_before_rendering::{closure#0} as core::ops::function::FnOnce<()>>::call_once
  2349. 67.96 s > note: Some details are omitted, run with `RUST_BACKTRACE=full` for a verbose backtrace.
  2350. 67.96 s >
  2351. 67.96 s > 9. alphal00p-docs-builder::tests::developer_scope_ranges_ignore_unrelated_edits_and_warn_only_while_watching
  2352. 67.96 s > failure: test failure with exit code 101
  2353. 67.96 s > thread 'tests::developer_scope_ranges_ignore_unrelated_edits_and_warn_only_while_watching' (284) panicked at crates/alphal00p-docs-builder/src/lib.rs:12350:29:
  2354. 67.96 s > called `Result::unwrap()` on an `Err` value: required documentation source is missing: /build/source/crates/spynso3/typst/STIXTwoMath-Regular.woff2
  2355. 67.96 s >
  2356. 67.96 s > Location:
  2357. 67.96 s > crates/alphal00p-docs-builder/src/lib.rs:5103:9
  2358. 67.96 s > stack backtrace:
  2359. 67.96 s > 0: __rustc::rust_begin_unwind
  2360. 67.96 s > 1: core::panicking::panic_fmt
  2361. 67.96 s > 2: core::result::unwrap_failed
  2362. 67.96 s > 3: alphal00p_docs_builder::tests::developer_scope_ranges_ignore_unrelated_edits_and_warn_only_while_watching
  2363. 67.96 s > 4: <alphal00p_docs_builder::tests::developer_scope_ranges_ignore_unrelated_edits_and_warn_only_while_watching::{closure#0} as core::ops::function::FnOnce<()>>::call_once
  2364. 67.96 s > note: Some details are omitted, run with `RUST_BACKTRACE=full` for a verbose backtrace.
  2365. 67.96 s > system-out
  2366. 67.96 s > running 1 test
  2367. 67.96 s > test tests::developer_scope_ranges_ignore_unrelated_edits_and_warn_only_while_watching ... FAILED
  2368. 67.96 s >
  2369. 67.96 s > failures:
  2370. 67.96 s >
  2371. 67.96 s > failures:
  2372. 67.96 s > tests::developer_scope_ranges_ignore_unrelated_edits_and_warn_only_while_watching
  2373. 67.96 s >
  2374. 67.96 s > test result: FAILED. 0 passed; 1 failed; 0 ignored; 0 measured; 128 filtered out; finished in 0.11s
  2375. 67.96 s > system-err
  2376. 67.96 s > thread 'tests::developer_scope_ranges_ignore_unrelated_edits_and_warn_only_while_watching' (284) panicked at crates/alphal00p-docs-builder/src/lib.rs:12350:29:
  2377. 67.96 s > called `Result::unwrap()` on an `Err` value: required documentation source is missing: /build/source/crates/spynso3/typst/STIXTwoMath-Regular.woff2
  2378. 67.96 s >
  2379. 67.96 s > Location:
  2380. 67.96 s > crates/alphal00p-docs-builder/src/lib.rs:5103:9
  2381. 67.96 s > stack backtrace:
  2382. 67.96 s > 0: __rustc::rust_begin_unwind
  2383. 67.96 s > 1: core::panicking::panic_fmt
  2384. 67.96 s > 2: core::result::unwrap_failed
  2385. 67.96 s > 3: alphal00p_docs_builder::tests::developer_scope_ranges_ignore_unrelated_edits_and_warn_only_while_watching
  2386. 67.96 s > 4: <alphal00p_docs_builder::tests::developer_scope_ranges_ignore_unrelated_edits_and_warn_only_while_watching::{closure#0} as core::ops::function::FnOnce<()>>::call_once
  2387. 67.96 s > note: Some details are omitted, run with `RUST_BACKTRACE=full` for a verbose backtrace.
  2388. 67.96 s >
  2389. 67.96 s > 10. alphal00p-docs-builder::tests::every_product_requires_a_task_chooser_and_each_supported_interface
  2390. 67.96 s > failure: test failure with exit code 101
  2391. 67.96 s > thread 'tests::every_product_requires_a_task_chooser_and_each_supported_interface' (309) panicked at crates/alphal00p-docs-builder/src/lib.rs:12274:9:
  2392. 67.96 s > assertion failed: format!("{error:#}").contains("has no quickstart page")
  2393. 67.96 s > stack backtrace:
  2394. 67.96 s > 0: __rustc::rust_begin_unwind
  2395. 67.96 s > 1: core::panicking::panic_fmt
  2396. 67.96 s > 2: core::panicking::panic
  2397. 67.96 s > 3: alphal00p_docs_builder::tests::every_product_requires_a_task_chooser_and_each_supported_interface
  2398. 67.96 s > 4: <alphal00p_docs_builder::tests::every_product_requires_a_task_chooser_and_each_supported_interface::{closure#0} as core::ops::function::FnOnce<()>>::call_once
  2399. 67.96 s > note: Some details are omitted, run with `RUST_BACKTRACE=full` for a verbose backtrace.
  2400. 67.96 s > system-out
  2401. 67.96 s > running 1 test
  2402. 67.96 s > test tests::every_product_requires_a_task_chooser_and_each_supported_interface ... FAILED
  2403. 67.96 s >
  2404. 67.96 s > failures:
  2405. 67.96 s >
  2406. 67.96 s > failures:
  2407. 67.96 s > tests::every_product_requires_a_task_chooser_and_each_supported_interface
  2408. 67.96 s >
  2409. 67.96 s > test result: FAILED. 0 passed; 1 failed; 0 ignored; 0 measured; 128 filtered out; finished in 0.12s
  2410. 67.96 s > system-err
  2411. 67.96 s > thread 'tests::every_product_requires_a_task_chooser_and_each_supported_interface' (309) panicked at crates/alphal00p-docs-builder/src/lib.rs:12274:9:
  2412. 67.96 s > assertion failed: format!("{error:#}").contains("has no quickstart page")
  2413. 67.96 s > stack backtrace:
  2414. 67.96 s > 0: __rustc::rust_begin_unwind
  2415. 67.96 s > 1: core::panicking::panic_fmt
  2416. 67.96 s > 2: core::panicking::panic
  2417. 67.96 s > 3: alphal00p_docs_builder::tests::every_product_requires_a_task_chooser_and_each_supported_interface
  2418. 67.96 s > 4: <alphal00p_docs_builder::tests::every_product_requires_a_task_chooser_and_each_supported_interface::{closure#0} as core::ops::function::FnOnce<()>>::call_once
  2419. 67.96 s > note: Some details are omitted, run with `RUST_BACKTRACE=full` for a verbose backtrace.
  2420. 67.96 s >
  2421. 67.96 s > 11. alphal00p-docs-builder::tests::pdf_manual_chapter_order_must_match_the_page_registry
  2422. 67.96 s > failure: test failure with exit code 101
  2423. 67.96 s > thread 'tests::pdf_manual_chapter_order_must_match_the_page_registry' (402) panicked at crates/alphal00p-docs-builder/src/lib.rs:12330:9:
  2424. 67.96 s > assertion failed: format!("{error:#}").contains("PDF manual chapter order differs")
  2425. 67.96 s > stack backtrace:
  2426. 67.96 s > 0: __rustc::rust_begin_unwind
  2427. 67.96 s > 1: core::panicking::panic_fmt
  2428. 67.96 s > 2: core::panicking::panic
  2429. 67.96 s > 3: alphal00p_docs_builder::tests::pdf_manual_chapter_order_must_match_the_page_registry
  2430. 67.96 s > 4: <alphal00p_docs_builder::tests::pdf_manual_chapter_order_must_match_the_page_registry::{closure#0} as core::ops::function::FnOnce<()>>::call_once
  2431. 67.96 s > note: Some details are omitted, run with `RUST_BACKTRACE=full` for a verbose backtrace.
  2432. 67.96 s > system-out
  2433. 67.96 s > running 1 test
  2434. 67.96 s > test tests::pdf_manual_chapter_order_must_match_the_page_registry ... FAILED
  2435. 67.96 s >
  2436. 67.96 s > failures:
  2437. 67.96 s >
  2438. 67.96 s > failures:
  2439. 67.96 s > tests::pdf_manual_chapter_order_must_match_the_page_registry
  2440. 67.96 s >
  2441. 67.96 s > test result: FAILED. 0 passed; 1 failed; 0 ignored; 0 measured; 128 filtered out; finished in 0.11s
  2442. 67.96 s > system-err
  2443. 67.96 s > thread 'tests::pdf_manual_chapter_order_must_match_the_page_registry' (402) panicked at crates/alphal00p-docs-builder/src/lib.rs:12330:9:
  2444. 67.96 s > assertion failed: format!("{error:#}").contains("PDF manual chapter order differs")
  2445. 67.96 s > stack backtrace:
  2446. 67.96 s > 0: __rustc::rust_begin_unwind
  2447. 67.96 s > 1: core::panicking::panic_fmt
  2448. 67.96 s > 2: core::panicking::panic
  2449. 67.96 s > 3: alphal00p_docs_builder::tests::pdf_manual_chapter_order_must_match_the_page_registry
  2450. 67.96 s > 4: <alphal00p_docs_builder::tests::pdf_manual_chapter_order_must_match_the_page_registry::{closure#0} as core::ops::function::FnOnce<()>>::call_once
  2451. 67.96 s > note: Some details are omitted, run with `RUST_BACKTRACE=full` for a verbose backtrace.
  2452. 67.96 s > =========================================
  2453. 67.96 s > Extracting 2 binaries to /build/source
  2454. 67.96 s > Extracted 5 files to /build/source in 0.03s
  2455. 67.96 s > ------------
  2456. 67.96 s > Nextest run ID ab300ae5-3f22-4230-b31a-4f7de1fb8f7c with nextest profile: ci_gammaloop
  2457. 67.96 s > Starting 22 tests across 2 binaries
  2458. 67.96 s > ------------
  2459. 67.96 s > Summary [ 0.018s] 22 tests run: 22 passed, 0 skipped
  2460. 67.96 s >
  2461. 67.96 s > ========== nextest test summary ==========
  2462. 67.96 s > report: target/nextest/ci_gammaloop/junit.xml
  2463. 67.96 s > tests: 22, failures: 0, errors: 0
  2464. 67.96 s > No failing testcases found.
  2465. 67.96 s > =========================================
  2466. 67.96 s > Extracting 3 binaries (including 2 non-test binaries), 1 build script output directory, and 2 linked paths to /build/source
  2467. 67.96 s > Extracted 22 files to /build/source in 0.27s
  2468. 67.96 s > ------------
  2469. 67.96 s > Nextest run ID df153d31-f0fb-4864-ab82-c414d8ea411a with nextest profile: ci_gammaloop
  2470. 67.96 s > Starting 89 tests across 1 binary
  2471. 67.96 s > ------------
  2472. 67.96 s > Summary [ 0.037s] 89 tests run: 89 passed, 0 skipped
  2473. 67.96 s >
  2474. 67.96 s > ========== nextest test summary ==========
  2475. 67.96 s > report: target/nextest/ci_gammaloop/junit.xml
  2476. 67.96 s > tests: 89, failures: 0, errors: 0
  2477. 67.96 s > No failing testcases found.
  2478. 67.96 s > =========================================
  2479. 67.96 s > Extracting 2 binaries to /build/source
  2480. 67.96 s > Extracted 5 files to /build/source in 0.04s
  2481. 67.96 s > ------------
  2482. 67.96 s > Nextest run ID aafb35f4-0aa3-479d-a18a-042b5fce0863 with nextest profile: ci_gammaloop
  2483. 67.96 s > Starting 10 tests across 2 binaries
  2484. 67.96 s > ------------
  2485. 67.96 s > Summary [ 12.075s] 10 tests run: 10 passed, 0 skipped
  2486. 67.96 s >
  2487. 67.96 s > ========== nextest test summary ==========
  2488. 67.96 s > report: target/nextest/ci_gammaloop/junit.xml
  2489. 67.96 s > tests: 10, failures: 0, errors: 0
  2490. 67.96 s > No failing testcases found.
  2491. 67.96 s > =========================================
  2492. 67.96 s > Extracting 1 binary to /build/source
  2493. 67.96 s > Extracted 4 files to /build/source in 0.03s
  2494. 67.96 s > ------------
  2495. 67.96 s > Nextest run ID b18503e4-e052-423a-ad8b-5d5cb1010cae with nextest profile: ci_gammaloop
  2496. 67.96 s > Starting 0 tests across 1 binary
  2497. 67.96 s > ------------
  2498. 67.96 s > Summary [ 0.000s] 0 tests run: 0 passed, 0 skipped
  2499. 67.96 s >
  2500. 67.96 s > ========== nextest test summary ==========
  2501. 67.96 s > report: target/nextest/ci_gammaloop/junit.xml
  2502. 67.96 s > tests: 0, failures: 0, errors: 0
  2503. 67.96 s > No failing testcases found.
  2504. 67.96 s > =========================================
  2505. 67.96 s > Extracting 1 binary to /build/source
  2506. 67.96 s > Extracted 4 files to /build/source in 0.03s
  2507. 67.96 s > ------------
  2508. 67.96 s > Nextest run ID 32218442-73be-48a1-95ce-22bbd599d23b with nextest profile: ci_gammaloop
  2509. 67.96 s > Starting 5 tests across 1 binary
  2510. 67.96 s > ------------
  2511. 67.96 s > Summary [ 0.005s] 5 tests run: 5 passed, 0 skipped
  2512. 67.96 s >
  2513. 67.96 s > ========== nextest test summary ==========
  2514. 67.96 s > report: target/nextest/ci_gammaloop/junit.xml
  2515. 67.96 s > tests: 5, failures: 0, errors: 0
  2516. 67.96 s > No failing testcases found.
  2517. 67.96 s > =========================================
  2518. 67.96 s For full logs, run:
  2519. 67.96 s nix log /nix/store/yhcpczfzd32fj8slcs1lsa10nlfs6yzl-gammaloop-nextest-docs.drv
  2520. 68.13 s [2 built (1 failed), 103Run failed.