1. 0.00 s $ /nix/store/61685rbaxmpigwi3z23i33sv3jyfl70q-coreutils-9.11/bin/timeout --kill-after=15s 7200s /nix/store/wknkybkzrc16r11vk5vrykh4wmw7a353-nix-2.34.8/bin/nix --extra-experimental-features nix-command --extra-experimental-features flakes flake clone git+https://github.com/alphal00p/gammaloop --dest /tmp/nix-ci-worker/stable-pwd/repo/
  2. 0.07 s Cloning into '/tmp/nix-ci-worker/stable-pwd/repo'...
  3. 0.80 s remote: Enumerating objects: 103784, done.
  4. 0.96 s remote: Counting objects: 0% (1/9421) remote: Counting objects: 1% (95/9421) remote: Counting objects: 2% (189/9421) remote: Counting objects: 3% (283/9421) remote: Counting objects: 4% (377/9421) remote: Counting objects: 5% (472/9421) remote: Counting objects: 6% (566/9421) remote: Counting objects: 7% (660/9421) remote: Counting objects: 8% (754/9421) remote: Counting objects: 9% (848/9421) remote: Counting objects: 10% (943/9421) remote: Counting objects: 11% (1037/9421) remote: Counting objects: 12% (1131/9421) remote: Counting objects: 13% (1225/9421) remote: Counting objects: 14% (1319/9421) remote: Counting objects: 15% (1414/9421) remote: Counting objects: 16% (1508/9421) remote: Counting objects: 17% (1602/9421) remote: Counting objects: 18% (1696/9421) remote: Counting objects: 19% (1790/9421) remote: Counting objects: 20% (1885/9421) remote: Counting objects: 21% (1979/9421) remote: Counting objects: 22% (2073/9421) remote: Counting objects: 23% (2167/9421) remote: Counting objects: 24% (2262/9421) remote: Counting objects: 25% (2356/9421) remote: Counting objects: 26% (2450/9421) remote: Counting objects: 27% (2544/9421) remote: Counting objects: 28% (2638/9421) remote: Counting objects: 29% (2733/9421) remote: Counting objects: 30% (2827/9421) remote: Counting objects: 31% (2921/9421) remote: Counting objects: 32% (3015/9421) remote: Counting objects: 33% (3109/9421) remote: Counting objects: 34% (3204/9421) remote: Counting objects: 35% (3298/9421) remote: Counting objects: 36% (3392/9421) remote: Counting objects: 37% (3486/9421) remote: Counting objects: 38% (3580/9421) remote: Counting objects: 39% (3675/9421) remote: Counting objects: 40% (3769/9421) remote: Counting objects: 41% (3863/9421) remote: Counting objects: 42% (3957/9421) remote: Counting objects: 43% (4052/9421) remote: Counting objects: 44% (4146/9421) remote: Counting objects: 45% (4240/9421) remote: Counting objects: 46% (4334/9421) remote: Counting objects: 47% (4428/9421) remote: Counting objects: 48% (4523/9421) remote: Counting objects: 49% (4617/9421) remote: Counting objects: 50% (4711/9421) remote: Counting objects: 51% (4805/9421) remote: Counting objects: 52% (4899/9421) remote: Counting objects: 53% (4994/9421) remote: Counting objects: 54% (5088/9421) remote: Counting objects: 55% (5182/9421) remote: Counting objects: 56% (5276/9421) remote: Counting objects: 57% (5370/9421) remote: Counting objects: 58% (5465/9421) remote: Counting objects: 59% (5559/9421) remote: Counting objects: 60% (5653/9421) remote: Counting objects: 61% (5747/9421) remote: Counting objects: 62% (5842/9421) remote: Counting objects: 63% (5936/9421) remote: Counting objects: 64% (6030/9421) remote: Counting objects: 65% (6124/9421) remote: Counting objects: 66% (6218/9421) remote: Counting objects: 67% (6313/9421) remote: Counting objects: 68% (6407/9421) remote: Counting objects: 69% (6501/9421) remote: Counting objects: 70% (6595/9421) remote: Counting objects: 71% (6689/9421) remote: Counting objects: 72% (6784/9421) remote: Counting objects: 73% (6878/9421) remote: Counting objects: 74% (6972/9421) remote: Counting objects: 75% (7066/9421) remote: Counting objects: 76% (7160/9421) remote: Counting objects: 77% (7255/9421) remote: Counting objects: 78% (7349/9421) remote: Counting objects: 79% (7443/9421) remote: Counting objects: 80% (7537/9421) remote: Counting objects: 81% (7632/9421) remote: Counting objects: 82% (7726/9421) remote: Counting objects: 83% (7820/9421) remote: Counting objects: 84% (7914/9421) remote: Counting objects: 85% (8008/9421) remote: Counting objects: 86% (8103/9421) remote: Counting objects: 87% (8197/9421) remote: Counting objects: 88% (8291/9421) remote: Counting objects: 89% (8385/9421) remote: Counting objects: 90% (8479/9421) remote: Counting objects: 91% (8574/9421) remote: Counting objects: 92% (8668/9421) remote: Counting objects: 93% (8762/9421) remote: Counting objects: 94% (8856/9421) remote: Counting objects: 95% (8950/9421) remote: Counting objects: 96% (9045/9421) remote: Counting objects: 97% (9139/9421) remote: Counting objects: 98% (9233/9421) remote: Counting objects: 99% (9327/9421) remote: Counting objects: 100% (9421/9421) remote: Counting objects: 100% (9421/9421), done.
  5. 2.88 s remote: Compressing objects: 0% (1/2027) remote: Compressing objects: 1% (21/2027) remote: Compressing objects: 2% (41/2027) remote: Compressing objects: 3% (61/2027) remote: Compressing objects: 4% (82/2027) remote: Compressing objects: 5% (102/2027) remote: Compressing objects: 6% (122/2027) remote: Compressing objects: 7% (142/2027) remote: Compressing objects: 8% (163/2027) remote: Compressing objects: 9% (183/2027) remote: Compressing objects: 10% (203/2027) remote: Compressing objects: 10% (219/2027) remote: Compressing objects: 11% (223/2027) remote: Compressing objects: 12% (244/2027) remote: Compressing objects: 13% (264/2027) remote: Compressing objects: 14% (284/2027) remote: Compressing objects: 15% (305/2027) remote: Compressing objects: 16% (325/2027) remote: Compressing objects: 17% (345/2027) remote: Compressing objects: 18% (365/2027) remote: Compressing objects: 19% (386/2027) remote: Compressing objects: 20% (406/2027) remote: Compressing objects: 21% (426/2027) remote: Compressing objects: 22% (446/2027) remote: Compressing objects: 23% (467/2027) remote: Compressing objects: 24% (487/2027) remote: Compressing objects: 25% (507/2027) remote: Compressing objects: 26% (528/2027) remote: Compressing objects: 27% (548/2027) remote: Compressing objects: 28% (568/2027) remote: Compressing objects: 29% (588/2027) remote: Compressing objects: 30% (609/2027) remote: Compressing objects: 31% (629/2027) remote: Compressing objects: 32% (649/2027) remote: Compressing objects: 33% (669/2027) remote: Compressing objects: 34% (690/2027) remote: Compressing objects: 34% (705/2027) remote: Compressing objects: 35% (710/2027) remote: Compressing objects: 36% (730/2027) remote: Compressing objects: 37% (750/2027) remote: Compressing objects: 38% (771/2027) remote: Compressing objects: 39% (791/2027) remote: Compressing objects: 40% (811/2027) remote: Compressing objects: 41% (832/2027) remote: Compressing objects: 42% (852/2027) remote: Compressing objects: 43% (872/2027) remote: Compressing objects: 44% (892/2027) remote: Compressing objects: 45% (913/2027) remote: Compressing objects: 46% (933/2027) remote: Compressing objects: 47% (953/2027) remote: Compressing objects: 48% (973/2027) remote: Compressing objects: 49% (994/2027) remote: Compressing objects: 50% (1014/2027) remote: Compressing objects: 51% (1034/2027) remote: Compressing objects: 52% (1055/2027) remote: Compressing objects: 53% (1075/2027) remote: Compressing objects: 54% (1095/2027) remote: Compressing objects: 55% (1115/2027) remote: Compressing objects: 56% (1136/2027) remote: Compressing objects: 57% (1156/2027) remote: Compressing objects: 58% (1176/2027) remote: Compressing objects: 59% (1196/2027) remote: Compressing objects: 60% (1217/2027) remote: Compressing objects: 61% (1237/2027) remote: Compressing objects: 62% (1257/2027) remote: Compressing objects: 63% (1278/2027) remote: Compressing objects: 64% (1298/2027) remote: Compressing objects: 65% (1318/2027) remote: Compressing objects: 66% (1338/2027) remote: Compressing objects: 67% (1359/2027) remote: Compressing objects: 68% (1379/2027) remote: Compressing objects: 69% (1399/2027) remote: Compressing objects: 70% (1419/2027) remote: Compressing objects: 71% (1440/2027) remote: Compressing objects: 72% (1460/2027) remote: Compressing objects: 73% (1480/2027) remote: Compressing objects: 74% (1500/2027) remote: Compressing objects: 75% (1521/2027) remote: Compressing objects: 76% (1541/2027) remote: Compressing objects: 77% (1561/2027) remote: Compressing objects: 78% (1582/2027) remote: Compressing objects: 79% (1602/2027) remote: Compressing objects: 80% (1622/2027) remote: Compressing objects: 81% (1642/2027) remote: Compressing objects: 82% (1663/2027) remote: Compressing objects: 83% (1683/2027) remote: Compressing objects: 84% (1703/2027) remote: Compressing objects: 85% (1723/2027) remote: Compressing objects: 86% (1744/2027) remote: Compressing objects: 87% (1764/2027) remote: Compressing objects: 88% (1784/2027) remote: Compressing objects: 89% (1805/2027) remote: Compressing objects: 90% (1825/2027) remote: Compressing objects: 91% (1845/2027) remote: Compressing objects: 92% (1865/2027) remote: Compressing objects: 93% (1886/2027) remote: Compressing objects: 94% (1906/2027) remote: Compressing objects: 95% (1926/2027) remote: Compressing objects: 96% (1946/2027) remote: Compressing objects: 97% (1967/2027) remote: Compressing objects: 98% (1987/2027) remote: Compressing objects: 99% (2007/2027) remote: Compressing objects: 100% (2027/2027) remote: Compressing objects: 100% (2027/2027), done.
  6. 15.49 s Receiving objects: 0% (1/103784) Receiving objects: 1% (1038/103784) Receiving objects: 2% (2076/103784) Receiving objects: 3% (3114/103784) Receiving objects: 4% (4152/103784) Receiving objects: 5% (5190/103784) Receiving objects: 6% (6228/103784) Receiving objects: 7% (7265/103784), 16.36 MiB | 32.69 MiB/s Receiving objects: 8% (8303/103784), 16.36 MiB | 32.69 MiB/s Receiving objects: 9% (9341/103784), 16.36 MiB | 32.69 MiB/s Receiving objects: 10% (10379/103784), 16.36 MiB | 32.69 MiB/s Receiving objects: 11% (11417/103784), 16.36 MiB | 32.69 MiB/s Receiving objects: 12% (12455/103784), 16.36 MiB | 32.69 MiB/s Receiving objects: 13% (13492/103784), 16.36 MiB | 32.69 MiB/s Receiving objects: 14% (14530/103784), 16.36 MiB | 32.69 MiB/s Receiving objects: 15% (15568/103784), 16.36 MiB | 32.69 MiB/s Receiving objects: 16% (16606/103784), 16.36 MiB | 32.69 MiB/s Receiving objects: 17% (17644/103784), 16.36 MiB | 32.69 MiB/s Receiving objects: 18% (18682/103784), 16.36 MiB | 32.69 MiB/s Receiving objects: 19% (19719/103784), 16.36 MiB | 32.69 MiB/s Receiving objects: 20% (20757/103784), 16.36 MiB | 32.69 MiB/s Receiving objects: 21% (21795/103784), 16.36 MiB | 32.69 MiB/s Receiving objects: 22% (22833/103784), 16.36 MiB | 32.69 MiB/s Receiving objects: 23% (23871/103784), 16.36 MiB | 32.69 MiB/s Receiving objects: 24% (24909/103784), 16.36 MiB | 32.69 MiB/s Receiving objects: 25% (25946/103784), 16.36 MiB | 32.69 MiB/s Receiving objects: 26% (26984/103784), 16.36 MiB | 32.69 MiB/s Receiving objects: 27% (28022/103784), 16.36 MiB | 32.69 MiB/s Receiving objects: 28% (29060/103784), 16.36 MiB | 32.69 MiB/s Receiving objects: 29% (30098/103784), 16.36 MiB | 32.69 MiB/s Receiving objects: 30% (31136/103784), 16.36 MiB | 32.69 MiB/s Receiving objects: 31% (32174/103784), 16.36 MiB | 32.69 MiB/s Receiving objects: 32% (33211/103784), 16.36 MiB | 32.69 MiB/s Receiving objects: 33% (34249/103784), 16.36 MiB | 32.69 MiB/s Receiving objects: 33% (34896/103784), 34.69 MiB | 34.68 MiB/s Receiving objects: 34% (35287/103784), 34.69 MiB | 34.68 MiB/s Receiving objects: 35% (36325/103784), 34.69 MiB | 34.68 MiB/s Receiving objects: 36% (37363/103784), 34.69 MiB | 34.68 MiB/s Receiving objects: 37% (38401/103784), 34.69 MiB | 34.68 MiB/s Receiving objects: 38% (39438/103784), 34.69 MiB | 34.68 MiB/s Receiving objects: 39% (40476/103784), 34.69 MiB | 34.68 MiB/s Receiving objects: 40% (41514/103784), 34.69 MiB | 34.68 MiB/s Receiving objects: 41% (42552/103784), 34.69 MiB | 34.68 MiB/s Receiving objects: 42% (43590/103784), 34.69 MiB | 34.68 MiB/s Receiving objects: 43% (44628/103784), 53.02 MiB | 34.25 MiB/s Receiving objects: 44% (45665/103784), 53.02 MiB | 34.25 MiB/s Receiving objects: 45% (46703/103784), 53.02 MiB | 34.25 MiB/s Receiving objects: 46% (47741/103784), 53.02 MiB | 34.25 MiB/s Receiving objects: 47% (48779/103784), 53.02 MiB | 34.25 MiB/s Receiving objects: 47% (49667/103784), 53.02 MiB | 34.25 MiB/s Receiving objects: 48% (49817/103784), 53.02 MiB | 34.25 MiB/s Receiving objects: 49% (50855/103784), 53.02 MiB | 34.25 MiB/s Receiving objects: 50% (51892/103784), 71.80 MiB | 35.06 MiB/s Receiving objects: 51% (52930/103784), 71.80 MiB | 35.06 MiB/s Receiving objects: 52% (53968/103784), 71.80 MiB | 35.06 MiB/s Receiving objects: 53% (55006/103784), 71.80 MiB | 35.06 MiB/s Receiving objects: 54% (56044/103784), 71.80 MiB | 35.06 MiB/s Receiving objects: 54% (57048/103784), 87.87 MiB | 34.48 MiB/s Receiving objects: 55% (57082/103784), 122.70 MiB | 34.58 MiB/s Receiving objects: 55% (58051/103784), 141.00 MiB | 34.83 MiB/s Receiving objects: 56% (58120/103784), 157.34 MiB | 34.59 MiB/s Receiving objects: 56% (58121/103784), 157.34 MiB | 34.59 MiB/s Receiving objects: 56% (58333/103784), 192.23 MiB | 34.62 MiB/s Receiving objects: 57% (59157/103784), 227.19 MiB | 34.51 MiB/s Receiving objects: 58% (60195/103784), 227.19 MiB | 34.51 MiB/s Receiving objects: 59% (61233/103784), 227.19 MiB | 34.51 MiB/s Receiving objects: 60% (62271/103784), 227.19 MiB | 34.51 MiB/s Receiving objects: 61% (63309/103784), 227.19 MiB | 34.51 MiB/s Receiving objects: 62% (64347/103784), 227.19 MiB | 34.51 MiB/s Receiving objects: 62% (64488/103784), 246.05 MiB | 34.80 MiB/s Receiving objects: 63% (65384/103784), 246.05 MiB | 34.80 MiB/s Receiving objects: 64% (66422/103784), 246.05 MiB | 34.80 MiB/s Receiving objects: 65% (67460/103784), 246.05 MiB | 34.80 MiB/s Receiving objects: 66% (68498/103784), 246.05 MiB | 34.80 MiB/s Receiving objects: 67% (69536/103784), 246.05 MiB | 34.80 MiB/s Receiving objects: 68% (70574/103784), 246.05 MiB | 34.80 MiB/s Receiving objects: 69% (71611/103784), 246.05 MiB | 34.80 MiB/s Receiving objects: 70% (72649/103784), 246.05 MiB | 34.80 MiB/s Receiving objects: 71% (73687/103784), 246.05 MiB | 34.80 MiB/s Receiving objects: 72% (74725/103784), 264.54 MiB | 34.71 MiB/s Receiving objects: 73% (75763/103784), 264.54 MiB | 34.71 MiB/s Receiving objects: 73% (76766/103784), 264.54 MiB | 34.71 MiB/s Receiving objects: 74% (76801/103784), 264.54 MiB | 34.71 MiB/s Receiving objects: 75% (77838/103784), 280.73 MiB | 34.77 MiB/s Receiving objects: 76% (78876/103784), 299.35 MiB | 34.84 MiB/s Receiving objects: 77% (79914/103784), 299.35 MiB | 34.84 MiB/s Receiving objects: 78% (80952/103784), 299.35 MiB | 34.84 MiB/s Receiving objects: 79% (81990/103784), 299.35 MiB | 34.84 MiB/s Receiving objects: 80% (83028/103784), 299.35 MiB | 34.84 MiB/s Receiving objects: 80% (83509/103784), 299.35 MiB | 34.84 MiB/s Receiving objects: 81% (84066/103784), 299.35 MiB | 34.84 MiB/s Receiving objects: 82% (85103/103784), 315.81 MiB | 34.87 MiB/s Receiving objects: 82% (85496/103784), 334.02 MiB | 34.90 MiB/s Receiving objects: 83% (86141/103784), 350.76 MiB | 34.90 MiB/s Receiving objects: 84% (87179/103784), 368.91 MiB | 34.86 MiB/s Receiving objects: 85% (88217/103784), 368.91 MiB | 34.86 MiB/s Receiving objects: 85% (88955/103784), 368.91 MiB | 34.86 MiB/s Receiving objects: 86% (89255/103784), 368.91 MiB | 34.86 MiB/s Receiving objects: 87% (90293/103784), 385.57 MiB | 34.86 MiB/s Receiving objects: 88% (91330/103784), 385.57 MiB | 34.86 MiB/s Receiving objects: 89% (92368/103784), 385.57 MiB | 34.86 MiB/s Receiving objects: 89% (92484/103784), 404.37 MiB | 35.19 MiB/s Receiving objects: 90% (93406/103784), 420.54 MiB | 34.68 MiB/s Receiving objects: 91% (94444/103784), 420.54 MiB | 34.68 MiB/s Receiving objects: 92% (95482/103784), 420.54 MiB | 34.68 MiB/s Receiving objects: 93% (96520/103784), 420.54 MiB | 34.68 MiB/s Receiving objects: 94% (97557/103784), 420.54 MiB | 34.68 MiB/s Receiving objects: 95% (98595/103784), 420.54 MiB | 34.68 MiB/s Receiving objects: 96% (99633/103784), 420.54 MiB | 34.68 MiB/s Receiving objects: 97% (100671/103784), 420.54 MiB | 34.68 MiB/s Receiving objects: 98% (101709/103784), 420.54 MiB | 34.68 MiB/s Receiving objects: 99% (102747/103784), 420.54 MiB | 34.68 MiB/s remote: Total 103784 (delta 8150), reused 7457 (delta 7388), pack-reused 94363 (from 4)
  7. 15.49 s Receiving objects: 100% (103784/103784), 438.93 MiB | 35.16 MiB/s Receiving objects: 100% (103784/103784), 439.18 MiB | 34.84 MiB/s, done.
  8. 16.67 s Resolving deltas: 0% (0/67929) Resolving deltas: 1% (681/67929) Resolving deltas: 2% (1359/67929) Resolving deltas: 3% (2038/67929) Resolving deltas: 4% (2719/67929) Resolving deltas: 5% (3397/67929) Resolving deltas: 6% (4077/67929) Resolving deltas: 7% (4757/67929) Resolving deltas: 8% (5435/67929) Resolving deltas: 9% (6115/67929) Resolving deltas: 10% (6793/67929) Resolving deltas: 11% (7473/67929) Resolving deltas: 12% (8152/67929) Resolving deltas: 13% (8831/67929) Resolving deltas: 14% (9512/67929) Resolving deltas: 15% (10190/67929) Resolving deltas: 16% (10870/67929) Resolving deltas: 17% (11548/67929) Resolving deltas: 18% (12228/67929) Resolving deltas: 19% (12910/67929) Resolving deltas: 20% (13586/67929) Resolving deltas: 21% (14266/67929) Resolving deltas: 22% (14946/67929) Resolving deltas: 23% (15624/67929) Resolving deltas: 24% (16303/67929) Resolving deltas: 25% (16983/67929) Resolving deltas: 26% (17662/67929) Resolving deltas: 27% (18342/67929) Resolving deltas: 28% (19021/67929) Resolving deltas: 29% (19701/67929) Resolving deltas: 30% (20379/67929) Resolving deltas: 31% (21058/67929) Resolving deltas: 32% (21739/67929) Resolving deltas: 33% (22417/67929) Resolving deltas: 34% (23096/67929) Resolving deltas: 35% (23778/67929) Resolving deltas: 36% (24455/67929) Resolving deltas: 37% (25134/67929) Resolving deltas: 38% (25814/67929) Resolving deltas: 39% (26493/67929) Resolving deltas: 40% (27172/67929) Resolving deltas: 41% (27851/67929) Resolving deltas: 42% (28531/67929) Resolving deltas: 43% (29210/67929) Resolving deltas: 44% (29890/67929) Resolving deltas: 45% (30569/67929) Resolving deltas: 46% (31248/67929) Resolving deltas: 47% (31927/67929) Resolving deltas: 48% (32607/67929) Resolving deltas: 49% (33286/67929) Resolving deltas: 50% (33965/67929) Resolving deltas: 51% (34644/67929) Resolving deltas: 52% (35324/67929) Resolving deltas: 53% (36003/67929) Resolving deltas: 54% (36682/67929) Resolving deltas: 55% (37361/67929) Resolving deltas: 56% (38041/67929) Resolving deltas: 57% (38720/67929) Resolving deltas: 58% (39399/67929) Resolving deltas: 59% (40079/67929) Resolving deltas: 60% (40758/67929) Resolving deltas: 61% (41437/67929) Resolving deltas: 62% (42116/67929) Resolving deltas: 63% (42796/67929) Resolving deltas: 64% (43475/67929) Resolving deltas: 65% (44155/67929) Resolving deltas: 66% (44834/67929) Resolving deltas: 67% (45513/67929) Resolving deltas: 68% (46193/67929) Resolving deltas: 69% (46872/67929) Resolving deltas: 70% (47554/67929) Resolving deltas: 71% (48233/67929) Resolving deltas: 72% (48909/67929) Resolving deltas: 73% (49589/67929) Resolving deltas: 74% (50268/67929) Resolving deltas: 75% (50947/67929) Resolving deltas: 76% (51627/67929) Resolving deltas: 77% (52306/67929) Resolving deltas: 78% (52985/67929) Resolving deltas: 79% (53664/67929) Resolving deltas: 80% (54344/67929) Resolving deltas: 81% (55023/67929) Resolving deltas: 82% (55703/67929) Resolving deltas: 83% (56382/67929) Resolving deltas: 83% (56593/67929) Resolving deltas: 84% (57061/67929) Resolving deltas: 85% (57740/67929) Resolving deltas: 86% (58419/67929) Resolving deltas: 87% (59099/67929) Resolving deltas: 88% (59778/67929) Resolving deltas: 89% (60457/67929) Resolving deltas: 90% (61138/67929) Resolving deltas: 91% (61816/67929) Resolving deltas: 92% (62495/67929) Resolving deltas: 93% (63174/67929) Resolving deltas: 94% (63854/67929) Resolving deltas: 95% (64534/67929) Resolving deltas: 96% (65212/67929) Resolving deltas: 97% (65892/67929) Resolving deltas: 98% (66571/67929) Resolving deltas: 99% (67250/67929) Resolving deltas: 100% (67929/67929) Resolving deltas: 100% (67929/67929), done.
  9. 17.32 s Fetching commit 58aaf5380023d118a91aa4083c01395586246f14 for feynkit ...
  10. 17.32 s $ /nix/store/5vpcfsdx1lcnlb2y4k7xyc74shp5qwbh-git-2.54.0/bin/git fetch origin 58aaf5380023d118a91aa4083c01395586246f14
  11. 17.75 s From https://github.com/alphal00p/gammaloop
  12. 17.75 s * branch 58aaf5380023d118a91aa4083c01395586246f14 -> FETCH_HEAD
  13. 17.76 s $ /nix/store/61685rbaxmpigwi3z23i33sv3jyfl70q-coreutils-9.11/bin/timeout --kill-after=15s 7200s /nix/store/5vpcfsdx1lcnlb2y4k7xyc74shp5qwbh-git-2.54.0/bin/git -c advice.detachedHead=false checkout 58aaf5380023d118a91aa4083c01395586246f14
  14. 17.99 s HEAD is now at 58aaf5380 share physics layout across graph renderers
  15. 18.00 s $ /nix/store/61685rbaxmpigwi3z23i33sv3jyfl70q-coreutils-9.11/bin/timeout --kill-after=15s 7200s /nix/store/wknkybkzrc16r11vk5vrykh4wmw7a353-nix-2.34.8/bin/nix --extra-experimental-features nix-command --extra-experimental-features flakes --log-format internal-json run .#packages.x86_64-linux.nix-ci-check-gammaloop-nextest-docs --print-build-logs
  16. 18.11 s warning: ignoring untrusted flake configuration setting 'extra-substituters'.
  17. 18.11 s Pass '--accept-flake-config' to trust it
  18. 18.11 s warning: ignoring untrusted flake configuration setting 'extra-trusted-public-keys'.
  19. 18.11 s Pass '--accept-flake-config' to trust it
  20. 23.21 s
  21. 23.39 s Building /nix/store/kh6i5plwn7icsqrhd1m3zlwyf46nl6vh-nix-ci-check-gammaloop-nextest-docs.drv
  22. 23.39 s [nix-ci-check-gammaloop-nextest-docs] structuredAttrs is enabled
  23. 23.43 s [nix-ci-check-gammaloop-nextest-docs:post-build] Uploading to the NixCI cache: /nix/store/n2ihcws0cs2avlarm0ag3pxj3q2zq3d4-nix-ci-check-gammaloop-nextest-docs
  24. 23.47 s [nix-ci-check-gammaloop-nextest-docs:post-build] warning: 'warn-short-path-literals' is deprecated, use 'lint-short-path-literals = ignore' instead
  25. 23.48 s [nix-ci-check-gammaloop-nextest-docs:post-build] copying 1 paths...
  26. 23.48 s [nix-ci-check-gammaloop-nextest-docs:post-build] copying path '/nix/store/n2ihcws0cs2avlarm0ag3pxj3q2zq3d4-nix-ci-check-gammaloop-nextest-docs' to 'https://cache.nix-ci.com'...
  27. 23.65 s [nix-ci-check-gammaloop-nextest-docs:post-build] warning: 'warn-short-path-literals' is deprecated, use 'lint-short-path-literals = ignore' instead
  28. 23.77 s [nix-ci-check-gammaloop-nextest-docs:post-build] copying 0 paths...
  29. 23.78 s Uploaded nix-ci-check-gammaloop-nextest-docs in 357ms
  30. 23.78 s Progress: 1 of 2 built
  31. 23.78 s Built nix-ci-check-gammaloop-nextest-docs in 393ms
  32. 23.78 s Progress: 2 of 2 built
  33. 23.91 s evaluating derivation 'gdo you want to allow configuration setting 'extra-substituters' to be set to 'https://cache.nix-ci.com' (y/N)? do you want to permanently mark this value as untrusted (y/N)? warning: ignoring untrusted flake configuration setting 'extra-substituters'.
  34. 23.91 s Pass '--accept-flake-config' to trust it
  35. 23.91 s do you want to allow configuration setting 'extra-trusted-public-keys' to be set to 'nix-ci:g3xV5BDTLtIBZr/A00IU1x0EtKKlb7YLgBN2SgYgM6A=' (y/N)? do you want to permanently mark this value as untrusted (y/N)? warning: ignoring untrusted flake configuration setting 'extra-trusted-public-keys'.
  36. 23.91 s Pass '--accept-flake-config' to trust it
  37. 31.18 s copying '/nix/store/566x evaluating derivation 'g copying '/nix/store/566x evaluating derivation 'g copying '/nix/store/566x evaluating derivation 'g copying '/nix/store/566x evaluating derivation 'g copying '/nix/store/566x evaluating derivation 'g copying '/nix/store/566x evaluating derivation 'g copying '/nix/store/566x evaluating derivation 'g copying '/nix/store/566x evaluating derivation 'g copying '/nix/store/566x evaluating derivation 'g querying gammaloop-nexte [20.9 KiB DL] querying g [67.9 KiB DL] querying p [0/27 built, 16/0/86 copbuilder.pl> structuredAttrs is enabled
  38. 31.20 s [1/0/27 built, 16/14/120builder.pl> Running phase: patchPhase
  39. 31.20 s builder.pl> Running phase: updateAutotoolsGnuConfigScriptsPhase
  40. 31.21 s [1/0/27 built, 16/15/120builder.pl> Running phase: configurePhase
  41. 31.22 s [1/0/26 built, 16/17/120builder.pl> no configure script, doing nothing
  42. 31.22 s [1/0/26 built, 16/20/120builder.pl> Running phase: buildPhase
  43. 31.23 s builder.pl> Running phase: checkPhase
  44. 31.23 s builder.pl> Running phase: installPhase
  45. 31.23 s builder.pl> no Makefile or custom installPhase, doing nothing
  46. 31.24 s builder.pl> Running phase: fixupPhase
  47. 31.24 s builder.pl> shrinking RPATHs of ELF executables and libraries in /nix/store/8l4s0n61pskzsgr2ccdfj70fd3vcz0gv-builder.pl
  48. 31.25 s builder.pl> checking for references to /build/ in /nix/store/8l4s0n61pskzsgr2ccdfj70fd3vcz0gv-builder.pl...
  49. 31.26 s builder.pl> patching script interpreter paths in /nix/store/8l4s0n61pskzsgr2ccdfj70fd3vcz0gv-builder.pl
  50. 31.29 s [1/0/25 built, 16/22/120 [1/0/25 built, 16/23/120builder.pl (post)> Uploading to the NixCI cache: /nix/store/8l4s0n61pskzsgr2ccdfj70fd3vcz0gv-builder.pl
  51. 31.35 s builder.pl (post)> warning: 'warn-short-path-literals' is deprecated, use 'lint-short-path-literals = ignore' instead
  52. 31.38 s builder.pl (post)> copying 0 paths...
  53. 31.46 s builder.pl (post)> warning: 'warn-short-path-literals' is deprecated, use 'lint-short-path-literals = ignore' instead
  54. 31.50 s builder.pl (post)> copying 0 paths...
  55. 31.69 s [1/19 built, 16/37/120 c [1/1/18 built, 16/38/120 [1/1/17 built, 16/39/120gammaloop-nextest-binaries-docs (post)> Uploading to the NixCI cache: /nix/store/lgdv2gzcb5mil429jvj3jjx85cg6w64z-gammaloop-nextest-binaries-docs
  56. 31.73 s gammaloop-nextest-binaries-docs (post)> warning: 'warn-short-path-literals' is deprecated, use 'lint-short-path-literals = ignore' instead
  57. 31.73 s gammaloop-nextest-binaries-docs (post)> copying 1 paths...
  58. 31.74 s gammaloop-nextest-binaries-docs (post)> copying path '/nix/store/lgdv2gzcb5mil429jvj3jjx85cg6w64z-gammaloop-nextest-binaries-docs' to 'https://cache.nix-ci.com'...
  59. 31.82 s gammaloop-nextest-binaries-docs (post)> warning: 'warn-short-path-literals' is deprecated, use 'lint-short-path-literals = ignore' instead
  60. 31.99 s gammaloop-nextest-binaries-docs (post)> copying 0 paths...
  61. 32.87 s [2/14 built, 13/52/120 c [2/13 built, 6/61/120 co [2/13 built, 5/66/120 co [2/13 built, 5/69/120 co [2/13 built, 4/70/120 co [2/13 built, 4/72/120 co [2/13 built, 3/74/120 co [2/13 built, 16/75/120 c [2/12 built, 16/86/120 c [2/12 built, 12/93/120 c [2/12 built, 5/101/120 c [2/12 built, 7/103/120 c [2/12 built, 6/106/120 c [2/12 built, 8/107/120 c [2/12 built, 7/109/120 c [1/2/10 built, 5/111/120python3> structuredAttrs is enabled
  62. 32.91 s [2/2/10 built, 5/111/120builder.pl> Running phase: patchPhase
  63. 32.91 s builder.pl> Running phase: updateAutotoolsGnuConfigScriptsPhase
  64. 32.91 s python3> created 227 symlinks in user environment
  65. 32.92 s builder.pl> Running phase: configurePhase
  66. 32.93 s builder.pl> no configure script, doing nothing
  67. 32.93 s builder.pl> Running phase: buildPhase
  68. 32.94 s builder.pl> Running phase: checkPhase
  69. 32.94 s builder.pl> Running phase: installPhase
  70. 32.94 s builder.pl> no Makefile or custom installPhase, doing nothing
  71. 32.95 s builder.pl> Running phase: fixupPhase
  72. 32.96 s builder.pl> shrinking RPATHs of ELF executables and libraries in /nix/store/zzmspl8wdn2a3ancrz8dg3kci887nw6d-builder.pl
  73. 32.96 s builder.pl> checking for references to /build/ in /nix/store/zzmspl8wdn2a3ancrz8dg3kci887nw6d-builder.pl...
  74. 32.97 s builder.pl> patching script interpreter paths in /nix/store/zzmspl8wdn2a3ancrz8dg3kci887nw6d-builder.pl
  75. 33.00 s builder.pl (post)> Uploading to the NixCI cache: /nix/store/zzmspl8wdn2a3ancrz8dg3kci887nw6d-builder.pl
  76. 33.04 s builder.pl (post)> warning: 'warn-short-path-literals' is deprecated, use 'lint-short-path-literals = ignore' instead
  77. 33.07 s builder.pl (post)> copying 0 paths...
  78. 33.13 s builder.pl (post)> warning: 'warn-short-path-literals' is deprecated, use 'lint-short-path-literals = ignore' instead
  79. 33.56 s builder.pl (post)> copying 0 paths...
  80. 33.85 s [1/3/8 built, 3/114/120 [1/3/8 built, 2/115/120 [1/3/8 built, 2/116/120 python3 (post)> Uploading to the NixCI cache: /nix/store/f6fan92527vlpn6frzipn50020yw45nw-python3-3.13.15-env
  81. 33.89 s python3 (post)> warning: 'warn-short-path-literals' is deprecated, use 'lint-short-path-literals = ignore' instead
  82. 33.92 s python3 (post)> copying 0 paths...
  83. 33.97 s python3 (post)> warning: 'warn-short-path-literals' is deprecated, use 'lint-short-path-literals = ignore' instead
  84. 34.11 s python3 (post)> copying 0 paths...
  85. 34.39 s [4/7 built, 1/117/120 co [4/7 built, 1/118/120 cotypst> structuredAttrs is enabled
  86. 34.44 s [1/4/6 built, 120 copiedtypst> created 4 symlinks in user environment
  87. 34.54 s typst (post)> Uploading to the NixCI cache: /nix/store/yc93gbspdkf53nwjsf1mbydbsaq9snxl-typst-0.15.1-env
  88. 34.57 s typst (post)> warning: 'warn-short-path-literals' is deprecated, use 'lint-short-path-literals = ignore' instead
  89. 34.60 s typst (post)> copying 0 paths...
  90. 34.65 s typst (post)> warning: 'warn-short-path-literals' is deprecated, use 'lint-short-path-literals = ignore' instead
  91. 35.09 s typst (post)> copying 0 paths...
  92. 35.52 s [5/7 built, 120 copied ( [1/5/6 built, 120 copiedgammaloop-nextest-docs> Extracting 2 binaries to /build/source
  93. 35.56 s gammaloop-nextest-docs> Extracted 5 files to /build/source in 0.04s
  94. 35.57 s gammaloop-nextest-docs> ------------
  95. 35.57 s gammaloop-nextest-docs> Nextest run ID 66408cd5-4292-4ece-98d1-c63d8bc8a919 with nextest profile: ci_gammaloop
  96. 35.57 s gammaloop-nextest-docs> Starting 129 tests across 2 binaries
  97. 35.60 s gammaloop-nextest-docs> FAIL [ 0.012s] ( 22/129) alphal00p-docs-builder tests::developer_architecture_is_classified_searchable_and_source_backed
  98. 35.60 s gammaloop-nextest-docs> stdout ---
  99. 35.60 s gammaloop-nextest-docs>
  100. 35.60 s gammaloop-nextest-docs> running 1 test
  101. 35.60 s gammaloop-nextest-docs> test tests::developer_architecture_is_classified_searchable_and_source_backed ... FAILED
  102. 35.60 s gammaloop-nextest-docs>
  103. 35.60 s gammaloop-nextest-docs> failures:
  104. 35.60 s gammaloop-nextest-docs>
  105. 35.60 s gammaloop-nextest-docs> failures:
  106. 35.60 s gammaloop-nextest-docs> tests::developer_architecture_is_classified_searchable_and_source_backed
  107. 35.60 s gammaloop-nextest-docs>
  108. 35.60 s gammaloop-nextest-docs> test result: FAILED. 0 passed; 1 failed; 0 ignored; 0 measured; 128 filtered out; finished in 0.01s
  109. 35.60 s gammaloop-nextest-docs>
  110. 35.60 s gammaloop-nextest-docs> stderr ---
  111. 35.60 s gammaloop-nextest-docs>
  112. 35.60 s gammaloop-nextest-docs> thread 'tests::developer_architecture_is_classified_searchable_and_source_backed' (273) panicked at crates/alphal00p-docs-builder/src/lib.rs:12751:14:
  113. 35.60 s gammaloop-nextest-docs> called `Result::unwrap()` on an `Err` value: failed to copy documentation asset crates/spynso3/typst/STIXTwoMath-Regular.woff2
  114. 35.60 s gammaloop-nextest-docs>
  115. 35.60 s gammaloop-nextest-docs> Caused by:
  116. 35.60 s gammaloop-nextest-docs> No such file or directory (os error 2)
  117. 35.60 s gammaloop-nextest-docs>
  118. 35.60 s gammaloop-nextest-docs> Location:
  119. 35.60 s gammaloop-nextest-docs> crates/alphal00p-docs-builder/src/lib.rs:2276:18
  120. 35.60 s gammaloop-nextest-docs> stack backtrace:
  121. 35.60 s gammaloop-nextest-docs> 0: __rustc::rust_begin_unwind
  122. 35.60 s gammaloop-nextest-docs> 1: core::panicking::panic_fmt
  123. 35.60 s gammaloop-nextest-docs> 2: core::result::unwrap_failed
  124. 35.60 s gammaloop-nextest-docs> 3: alphal00p_docs_builder::tests::developer_architecture_is_classified_searchable_and_source_backed
  125. 35.60 s gammaloop-nextest-docs> 4: <alphal00p_docs_builder::tests::developer_architecture_is_classified_searchable_and_source_backed::{closure#0} as core::ops::function::FnOnce<()>>::call_once
  126. 35.60 s gammaloop-nextest-docs> note: Some details are omitted, run with `RUST_BACKTRACE=full` for a verbose backtrace.
  127. 35.60 s gammaloop-nextest-docs>
  128. 35.61 s gammaloop-nextest-docs> FAIL [ 0.011s] ( 29/129) alphal00p-docs-builder tests::every_product_orients_rust_to_native_rustdoc_and_keeps_legacy_redirects
  129. 35.61 s gammaloop-nextest-docs> stdout ---
  130. 35.61 s gammaloop-nextest-docs>
  131. 35.61 s gammaloop-nextest-docs> running 1 test
  132. 35.61 s gammaloop-nextest-docs> test tests::every_product_orients_rust_to_native_rustdoc_and_keeps_legacy_redirects ... FAILED
  133. 35.61 s gammaloop-nextest-docs>
  134. 35.61 s gammaloop-nextest-docs> failures:
  135. 35.61 s gammaloop-nextest-docs>
  136. 35.61 s gammaloop-nextest-docs> failures:
  137. 35.61 s gammaloop-nextest-docs> tests::every_product_orients_rust_to_native_rustdoc_and_keeps_legacy_redirects
  138. 35.61 s gammaloop-nextest-docs>
  139. 35.61 s gammaloop-nextest-docs> test result: FAILED. 0 passed; 1 failed; 0 ignored; 0 measured; 128 filtered out; finished in 0.01s
  140. 35.61 s gammaloop-nextest-docs>
  141. 35.61 s gammaloop-nextest-docs> stderr ---
  142. 35.61 s gammaloop-nextest-docs>
  143. 35.61 s gammaloop-nextest-docs> thread 'tests::every_product_orients_rust_to_native_rustdoc_and_keeps_legacy_redirects' (301) panicked at crates/alphal00p-docs-builder/src/lib.rs:12555:46:
  144. 35.61 s gammaloop-nextest-docs> called `Result::unwrap()` on an `Err` value: failed to copy documentation asset crates/spynso3/typst/STIXTwoMath-Regular.woff2
  145. 35.61 s gammaloop-nextest-docs>
  146. 35.61 s gammaloop-nextest-docs> Caused by:
  147. 35.61 s gammaloop-nextest-docs> No such file or directory (os error 2)
  148. 35.61 s gammaloop-nextest-docs>
  149. 35.61 s gammaloop-nextest-docs> Location:
  150. 35.61 s gammaloop-nextest-docs> crates/alphal00p-docs-builder/src/lib.rs:2276:18
  151. 35.61 s gammaloop-nextest-docs> stack backtrace:
  152. 35.61 s gammaloop-nextest-docs> 0: __rustc::rust_begin_unwind
  153. 35.61 s gammaloop-nextest-docs> 1: core::panicking::panic_fmt
  154. 35.61 s gammaloop-nextest-docs> 2: core::result::unwrap_failed
  155. 35.61 s gammaloop-nextest-docs> 3: alphal00p_docs_builder::tests::every_product_orients_rust_to_native_rustdoc_and_keeps_legacy_redirects
  156. 35.61 s gammaloop-nextest-docs> 4: <alphal00p_docs_builder::tests::every_product_orients_rust_to_native_rustdoc_and_keeps_legacy_redirects::{closure#0} as core::ops::function::FnOnce<()>>::call_once
  157. 35.61 s gammaloop-nextest-docs> note: Some details are omitted, run with `RUST_BACKTRACE=full` for a verbose backtrace.
  158. 35.61 s gammaloop-nextest-docs>
  159. 35.65 s gammaloop-nextest-docs> FAIL [ 0.010s] ( 53/129) alphal00p-docs-builder tests::portal_emits_routes_and_valid_assets
  160. 35.65 s gammaloop-nextest-docs> stdout ---
  161. 35.65 s gammaloop-nextest-docs>
  162. 35.65 s gammaloop-nextest-docs> running 1 test
  163. 35.65 s gammaloop-nextest-docs> test tests::portal_emits_routes_and_valid_assets ... FAILED
  164. 35.65 s gammaloop-nextest-docs>
  165. 35.65 s gammaloop-nextest-docs> failures:
  166. 35.65 s gammaloop-nextest-docs>
  167. 35.65 s gammaloop-nextest-docs> failures:
  168. 35.65 s gammaloop-nextest-docs> tests::portal_emits_routes_and_valid_assets
  169. 35.65 s gammaloop-nextest-docs>
  170. 35.65 s gammaloop-nextest-docs> test result: FAILED. 0 passed; 1 failed; 0 ignored; 0 measured; 128 filtered out; finished in 0.00s
  171. 35.65 s gammaloop-nextest-docs>
  172. 35.65 s gammaloop-nextest-docs> stderr ---
  173. 35.65 s gammaloop-nextest-docs>
  174. 35.65 s gammaloop-nextest-docs> thread 'tests::portal_emits_routes_and_valid_assets' (429) panicked at crates/alphal00p-docs-builder/src/lib.rs:9684:14:
  175. 35.65 s gammaloop-nextest-docs> called `Result::unwrap()` on an `Err` value: failed to copy documentation asset crates/spynso3/typst/STIXTwoMath-Regular.woff2
  176. 35.65 s gammaloop-nextest-docs>
  177. 35.65 s gammaloop-nextest-docs> Caused by:
  178. 35.65 s gammaloop-nextest-docs> No such file or directory (os error 2)
  179. 35.65 s gammaloop-nextest-docs>
  180. 35.65 s gammaloop-nextest-docs> Location:
  181. 35.65 s gammaloop-nextest-docs> crates/alphal00p-docs-builder/src/lib.rs:2276:18
  182. 35.65 s gammaloop-nextest-docs> stack backtrace:
  183. 35.65 s gammaloop-nextest-docs> 0: __rustc::rust_begin_unwind
  184. 35.65 s gammaloop-nextest-docs> 1: core::panicking::panic_fmt
  185. 35.65 s gammaloop-nextest-docs> 2: core::result::unwrap_failed
  186. 35.65 s gammaloop-nextest-docs> 3: alphal00p_docs_builder::tests::write_test_portal
  187. 35.65 s gammaloop-nextest-docs> 4: alphal00p_docs_builder::tests::portal_emits_routes_and_valid_assets
  188. 35.65 s gammaloop-nextest-docs> 5: <alphal00p_docs_builder::tests::portal_emits_routes_and_valid_assets::{closure#0} as core::ops::function::FnOnce<()>>::call_once
  189. 35.65 s gammaloop-nextest-docs> note: Some details are omitted, run with `RUST_BACKTRACE=full` for a verbose backtrace.
  190. 35.65 s gammaloop-nextest-docs>
  191. 35.65 s gammaloop-nextest-docs> FAIL [ 0.011s] ( 54/129) alphal00p-docs-builder tests::portal_and_developer_pages_use_federated_search_and_feedback
  192. 35.65 s gammaloop-nextest-docs> stdout ---
  193. 35.65 s gammaloop-nextest-docs>
  194. 35.65 s gammaloop-nextest-docs> running 1 test
  195. 35.65 s gammaloop-nextest-docs> test tests::portal_and_developer_pages_use_federated_search_and_feedback ... FAILED
  196. 35.65 s gammaloop-nextest-docs>
  197. 35.65 s gammaloop-nextest-docs> failures:
  198. 35.65 s gammaloop-nextest-docs>
  199. 35.65 s gammaloop-nextest-docs> failures:
  200. 35.65 s gammaloop-nextest-docs> tests::portal_and_developer_pages_use_federated_search_and_feedback
  201. 35.65 s gammaloop-nextest-docs>
  202. 35.65 s gammaloop-nextest-docs> test result: FAILED. 0 passed; 1 failed; 0 ignored; 0 measured; 128 filtered out; finished in 0.01s
  203. 35.65 s gammaloop-nextest-docs>
  204. 35.65 s gammaloop-nextest-docs> stderr ---
  205. 35.65 s gammaloop-nextest-docs>
  206. 35.65 s gammaloop-nextest-docs> thread 'tests::portal_and_developer_pages_use_federated_search_and_feedback' (430) panicked at crates/alphal00p-docs-builder/src/lib.rs:9684:14:
  207. 35.65 s gammaloop-nextest-docs> called `Result::unwrap()` on an `Err` value: failed to copy documentation asset crates/spynso3/typst/STIXTwoMath-Regular.woff2
  208. 35.65 s gammaloop-nextest-docs>
  209. 35.65 s gammaloop-nextest-docs> Caused by:
  210. 35.65 s gammaloop-nextest-docs> No such file or directory (os error 2)
  211. 35.65 s gammaloop-nextest-docs>
  212. 35.65 s gammaloop-nextest-docs> Location:
  213. 35.65 s gammaloop-nextest-docs> crates/alphal00p-docs-builder/src/lib.rs:2276:18
  214. 35.65 s gammaloop-nextest-docs> stack backtrace:
  215. 35.65 s gammaloop-nextest-docs> 0: __rustc::rust_begin_unwind
  216. 35.65 s gammaloop-nextest-docs> 1: core::panicking::panic_fmt
  217. 35.65 s gammaloop-nextest-docs> 2: core::result::unwrap_failed
  218. 35.65 s gammaloop-nextest-docs> 3: alphal00p_docs_builder::tests::write_test_portal
  219. 35.65 s gammaloop-nextest-docs> 4: alphal00p_docs_builder::tests::portal_and_developer_pages_use_federated_search_and_feedback
  220. 35.65 s gammaloop-nextest-docs> 5: <alphal00p_docs_builder::tests::portal_and_developer_pages_use_federated_search_and_feedback::{closure#0} as core::ops::function::FnOnce<()>>::call_once
  221. 35.65 s gammaloop-nextest-docs> note: Some details are omitted, run with `RUST_BACKTRACE=full` for a verbose backtrace.
  222. 35.65 s gammaloop-nextest-docs>
  223. 35.65 s gammaloop-nextest-docs> FAIL [ 0.009s] ( 55/129) alphal00p-docs-builder tests::portal_task_chooser_routes_each_goal_to_the_registered_quickstart
  224. 35.65 s gammaloop-nextest-docs> stdout ---
  225. 35.65 s gammaloop-nextest-docs>
  226. 35.65 s gammaloop-nextest-docs> running 1 test
  227. 35.65 s gammaloop-nextest-docs> test tests::portal_task_chooser_routes_each_goal_to_the_registered_quickstart ... FAILED
  228. 35.65 s gammaloop-nextest-docs>
  229. 35.65 s gammaloop-nextest-docs> failures:
  230. 35.65 s gammaloop-nextest-docs>
  231. 35.65 s gammaloop-nextest-docs> failures:
  232. 35.65 s gammaloop-nextest-docs> tests::portal_task_chooser_routes_each_goal_to_the_registered_quickstart
  233. 35.65 s gammaloop-nextest-docs>
  234. 35.65 s gammaloop-nextest-docs> test result: FAILED. 0 passed; 1 failed; 0 ignored; 0 measured; 128 filtered out; finished in 0.00s
  235. 35.65 s gammaloop-nextest-docs>
  236. 35.65 s gammaloop-nextest-docs> stderr ---
  237. 35.65 s gammaloop-nextest-docs>
  238. 35.65 s gammaloop-nextest-docs> thread 'tests::portal_task_chooser_routes_each_goal_to_the_registered_quickstart' (443) panicked at crates/alphal00p-docs-builder/src/lib.rs:9684:14:
  239. 35.65 s gammaloop-nextest-docs> called `Result::unwrap()` on an `Err` value: failed to copy documentation asset crates/spynso3/typst/STIXTwoMath-Regular.woff2
  240. 35.65 s gammaloop-nextest-docs>
  241. 35.65 s gammaloop-nextest-docs> Caused by:
  242. 35.65 s gammaloop-nextest-docs> No such file or directory (os error 2)
  243. 35.65 s gammaloop-nextest-docs>
  244. 35.65 s gammaloop-nextest-docs> Location:
  245. 35.65 s gammaloop-nextest-docs> crates/alphal00p-docs-builder/src/lib.rs:2276:18
  246. 35.65 s gammaloop-nextest-docs> stack backtrace:
  247. 35.65 s gammaloop-nextest-docs> 0: __rustc::rust_begin_unwind
  248. 35.65 s gammaloop-nextest-docs> 1: core::panicking::panic_fmt
  249. 35.65 s gammaloop-nextest-docs> 2: core::result::unwrap_failed
  250. 35.65 s gammaloop-nextest-docs> 3: alphal00p_docs_builder::tests::write_test_portal
  251. 35.65 s gammaloop-nextest-docs> 4: alphal00p_docs_builder::tests::portal_task_chooser_routes_each_goal_to_the_registered_quickstart
  252. 35.65 s gammaloop-nextest-docs> 5: <alphal00p_docs_builder::tests::portal_task_chooser_routes_each_goal_to_the_registered_quickstart::{closure#0} as core::ops::function::FnOnce<()>>::call_once
  253. 35.65 s gammaloop-nextest-docs> note: Some details are omitted, run with `RUST_BACKTRACE=full` for a verbose backtrace.
  254. 35.65 s gammaloop-nextest-docs>
  255. 35.70 s gammaloop-nextest-docs> FAIL [ 0.123s] ( 83/129) alphal00p-docs-builder tests::checked_in_registry_is_valid
  256. 35.70 s gammaloop-nextest-docs> stdout ---
  257. 35.70 s gammaloop-nextest-docs>
  258. 35.70 s gammaloop-nextest-docs> running 1 test
  259. 35.70 s gammaloop-nextest-docs> test tests::checked_in_registry_is_valid ... FAILED
  260. 35.70 s gammaloop-nextest-docs>
  261. 35.70 s gammaloop-nextest-docs> failures:
  262. 35.70 s gammaloop-nextest-docs>
  263. 35.70 s gammaloop-nextest-docs> failures:
  264. 35.70 s gammaloop-nextest-docs> tests::checked_in_registry_is_valid
  265. 35.70 s gammaloop-nextest-docs>
  266. 35.70 s gammaloop-nextest-docs> test result: FAILED. 0 passed; 1 failed; 0 ignored; 0 measured; 128 filtered out; finished in 0.11s
  267. 35.70 s gammaloop-nextest-docs>
  268. 35.70 s gammaloop-nextest-docs> stderr ---
  269. 35.70 s gammaloop-nextest-docs>
  270. 35.70 s gammaloop-nextest-docs> thread 'tests::checked_in_registry_is_valid' (214) panicked at crates/alphal00p-docs-builder/src/lib.rs:12260:50:
  271. 35.70 s gammaloop-nextest-docs> called `Result::unwrap()` on an `Err` value: required documentation source is missing: /build/source/crates/spynso3/typst/STIXTwoMath-Regular.woff2
  272. 35.70 s gammaloop-nextest-docs>
  273. 35.70 s gammaloop-nextest-docs> Location:
  274. 35.70 s gammaloop-nextest-docs> crates/alphal00p-docs-builder/src/lib.rs:5103:9
  275. 35.70 s gammaloop-nextest-docs> stack backtrace:
  276. 35.70 s gammaloop-nextest-docs> 0: __rustc::rust_begin_unwind
  277. 35.70 s gammaloop-nextest-docs> 1: core::panicking::panic_fmt
  278. 35.70 s gammaloop-nextest-docs> 2: core::result::unwrap_failed
  279. 35.70 s gammaloop-nextest-docs> 3: alphal00p_docs_builder::tests::checked_in_registry_is_valid
  280. 35.70 s gammaloop-nextest-docs> 4: <alphal00p_docs_builder::tests::checked_in_registry_is_valid::{closure#0} as core::ops::function::FnOnce<()>>::call_once
  281. 35.70 s gammaloop-nextest-docs> note: Some details are omitted, run with `RUST_BACKTRACE=full` for a verbose backtrace.
  282. 35.70 s gammaloop-nextest-docs>
  283. 35.70 s gammaloop-nextest-docs> FAIL [ 0.009s] ( 87/129) alphal00p-docs-builder tests::site_assets_replace_read_only_generated_files
  284. 35.70 s gammaloop-nextest-docs> stdout ---
  285. 35.71 s gammaloop-nextest-docs>
  286. 35.71 s gammaloop-nextest-docs> running 1 test
  287. 35.71 s gammaloop-nextest-docs> test tests::site_assets_replace_read_only_generated_files ... FAILED
  288. 35.71 s gammaloop-nextest-docs>
  289. 35.71 s gammaloop-nextest-docs> failures:
  290. 35.71 s gammaloop-nextest-docs>
  291. 35.71 s gammaloop-nextest-docs> failures:
  292. 35.71 s gammaloop-nextest-docs> tests::site_assets_replace_read_only_generated_files
  293. 35.71 s gammaloop-nextest-docs>
  294. 35.71 s gammaloop-nextest-docs> test result: FAILED. 0 passed; 1 failed; 0 ignored; 0 measured; 128 filtered out; finished in 0.00s
  295. 35.71 s gammaloop-nextest-docs>
  296. 35.71 s gammaloop-nextest-docs> stderr ---
  297. 35.71 s gammaloop-nextest-docs>
  298. 35.71 s gammaloop-nextest-docs> thread 'tests::site_assets_replace_read_only_generated_files' (669) panicked at crates/alphal00p-docs-builder/src/lib.rs:12305:50:
  299. 35.71 s gammaloop-nextest-docs> called `Result::unwrap()` on an `Err` value: failed to copy documentation asset crates/spynso3/typst/STIXTwoMath-Regular.woff2
  300. 35.71 s gammaloop-nextest-docs>
  301. 35.71 s gammaloop-nextest-docs> Caused by:
  302. 35.71 s gammaloop-nextest-docs> No such file or directory (os error 2)
  303. 35.71 s gammaloop-nextest-docs>
  304. 35.71 s gammaloop-nextest-docs> Location:
  305. 35.71 s gammaloop-nextest-docs> crates/alphal00p-docs-builder/src/lib.rs:2276:18
  306. 35.71 s gammaloop-nextest-docs> stack backtrace:
  307. 35.71 s gammaloop-nextest-docs> 0: __rustc::rust_begin_unwind
  308. 35.71 s gammaloop-nextest-docs> 1: core::panicking::panic_fmt
  309. 35.71 s gammaloop-nextest-docs> 2: core::result::unwrap_failed
  310. 35.71 s gammaloop-nextest-docs> 3: alphal00p_docs_builder::tests::site_assets_replace_read_only_generated_files
  311. 35.71 s gammaloop-nextest-docs> 4: <alphal00p_docs_builder::tests::site_assets_replace_read_only_generated_files::{closure#0} as core::ops::function::FnOnce<()>>::call_once
  312. 35.71 s gammaloop-nextest-docs> note: Some details are omitted, run with `RUST_BACKTRACE=full` for a verbose backtrace.
  313. 35.71 s gammaloop-nextest-docs>
  314. 35.71 s gammaloop-nextest-docs> FAIL [ 0.114s] ( 89/129) alphal00p-docs-builder tests::developer_scope_ranges_ignore_unrelated_edits_and_warn_only_while_watching
  315. 35.71 s gammaloop-nextest-docs> stdout ---
  316. 35.71 s gammaloop-nextest-docs>
  317. 35.71 s gammaloop-nextest-docs> running 1 test
  318. 35.71 s gammaloop-nextest-docs> test tests::developer_scope_ranges_ignore_unrelated_edits_and_warn_only_while_watching ... FAILED
  319. 35.71 s gammaloop-nextest-docs>
  320. 35.71 s gammaloop-nextest-docs> failures:
  321. 35.71 s gammaloop-nextest-docs>
  322. 35.71 s gammaloop-nextest-docs> failures:
  323. 35.71 s gammaloop-nextest-docs> tests::developer_scope_ranges_ignore_unrelated_edits_and_warn_only_while_watching
  324. 35.71 s gammaloop-nextest-docs>
  325. 35.71 s gammaloop-nextest-docs> test result: FAILED. 0 passed; 1 failed; 0 ignored; 0 measured; 128 filtered out; finished in 0.11s
  326. 35.71 s gammaloop-nextest-docs>
  327. 35.71 s gammaloop-nextest-docs> stderr ---
  328. 35.71 s gammaloop-nextest-docs>
  329. 35.71 s gammaloop-nextest-docs> thread 'tests::developer_scope_ranges_ignore_unrelated_edits_and_warn_only_while_watching' (278) panicked at crates/alphal00p-docs-builder/src/lib.rs:12350:29:
  330. 35.71 s gammaloop-nextest-docs> called `Result::unwrap()` on an `Err` value: required documentation source is missing: /build/source/crates/spynso3/typst/STIXTwoMath-Regular.woff2
  331. 35.71 s gammaloop-nextest-docs>
  332. 35.71 s gammaloop-nextest-docs> Location:
  333. 35.71 s gammaloop-nextest-docs> crates/alphal00p-docs-builder/src/lib.rs:5103:9
  334. 35.71 s gammaloop-nextest-docs> stack backtrace:
  335. 35.71 s gammaloop-nextest-docs> 0: __rustc::rust_begin_unwind
  336. 35.71 s gammaloop-nextest-docs> 1: core::panicking::panic_fmt
  337. 35.71 s gammaloop-nextest-docs> 2: core::result::unwrap_failed
  338. 35.71 s gammaloop-nextest-docs> 3: alphal00p_docs_builder::tests::developer_scope_ranges_ignore_unrelated_edits_and_warn_only_while_watching
  339. 35.71 s gammaloop-nextest-docs> 4: <alphal00p_docs_builder::tests::developer_scope_ranges_ignore_unrelated_edits_and_warn_only_while_watching::{closure#0} as core::ops::function::FnOnce<()>>::call_once
  340. 35.71 s gammaloop-nextest-docs> note: Some details are omitted, run with `RUST_BACKTRACE=full` for a verbose backtrace.
  341. 35.71 s gammaloop-nextest-docs>
  342. 35.72 s gammaloop-nextest-docs> FAIL [ 0.142s] ( 96/129) alphal00p-docs-builder provenance_tests::each_build_captures_one_revision_before_rendering
  343. 35.72 s gammaloop-nextest-docs> stdout ---
  344. 35.72 s gammaloop-nextest-docs>
  345. 35.72 s gammaloop-nextest-docs> running 1 test
  346. 35.72 s gammaloop-nextest-docs>
  347. 35.72 s gammaloop-nextest-docs> running 1 test
  348. 35.72 s gammaloop-nextest-docs> test provenance_tests::each_build_captures_one_revision_before_rendering ... FAILED
  349. 35.72 s gammaloop-nextest-docs>
  350. 35.72 s gammaloop-nextest-docs> failures:
  351. 35.72 s gammaloop-nextest-docs>
  352. 35.72 s gammaloop-nextest-docs> failures:
  353. 35.72 s gammaloop-nextest-docs> provenance_tests::each_build_captures_one_revision_before_rendering
  354. 35.72 s gammaloop-nextest-docs>
  355. 35.72 s gammaloop-nextest-docs> test result: FAILED. 0 passed; 1 failed; 0 ignored; 0 measured; 128 filtered out; finished in 0.11s
  356. 35.72 s gammaloop-nextest-docs>
  357. 35.72 s gammaloop-nextest-docs> test provenance_tests::each_build_captures_one_revision_before_rendering ... FAILED
  358. 35.72 s gammaloop-nextest-docs>
  359. 35.72 s gammaloop-nextest-docs> failures:
  360. 35.72 s gammaloop-nextest-docs>
  361. 35.72 s gammaloop-nextest-docs> failures:
  362. 35.72 s gammaloop-nextest-docs> provenance_tests::each_build_captures_one_revision_before_rendering
  363. 35.72 s gammaloop-nextest-docs>
  364. 35.72 s gammaloop-nextest-docs> test result: FAILED. 0 passed; 1 failed; 0 ignored; 0 measured; 128 filtered out; finished in 0.13s
  365. 35.72 s gammaloop-nextest-docs>
  366. 35.72 s gammaloop-nextest-docs> stderr ---
  367. 35.72 s gammaloop-nextest-docs>
  368. 35.72 s gammaloop-nextest-docs> thread 'provenance_tests::each_build_captures_one_revision_before_rendering' (284) panicked at crates/alphal00p-docs-builder/src/provenance_tests.rs:297:14:
  369. 35.72 s gammaloop-nextest-docs> called `Result::unwrap()` on an `Err` value: required documentation source is missing: /build/source/target/nix-ci-tmp/.tmpAH3uti/checkout/crates/spynso3/typst/STIXTwoMath-Regular.woff2
  370. 35.72 s gammaloop-nextest-docs>
  371. 35.72 s gammaloop-nextest-docs> Location:
  372. 35.72 s gammaloop-nextest-docs> crates/alphal00p-docs-builder/src/lib.rs:5103:9
  373. 35.72 s gammaloop-nextest-docs> stack backtrace:
  374. 35.72 s gammaloop-nextest-docs> 0: __rustc::rust_begin_unwind
  375. 35.72 s gammaloop-nextest-docs> 1: core::panicking::panic_fmt
  376. 35.72 s gammaloop-nextest-docs> 2: core::result::unwrap_failed
  377. 35.72 s gammaloop-nextest-docs> 3: alphal00p_docs_builder::provenance_tests::each_build_captures_one_revision_before_rendering
  378. 35.72 s gammaloop-nextest-docs> 4: <alphal00p_docs_builder::provenance_tests::each_build_captures_one_revision_before_rendering::{closure#0} as core::ops::function::FnOnce<()>>::call_once
  379. 35.72 s gammaloop-nextest-docs> note: Some details are omitted, run with `RUST_BACKTRACE=full` for a verbose backtrace.
  380. 35.72 s gammaloop-nextest-docs>
  381. 35.72 s gammaloop-nextest-docs> thread 'provenance_tests::each_build_captures_one_revision_before_rendering' (218) panicked at crates/alphal00p-docs-builder/src/provenance_tests.rs:274:9:
  382. 35.72 s gammaloop-nextest-docs> assertion failed: command.status().unwrap().success()
  383. 35.72 s gammaloop-nextest-docs> stack backtrace:
  384. 35.72 s gammaloop-nextest-docs> 0: __rustc::rust_begin_unwind
  385. 35.72 s gammaloop-nextest-docs> 1: core::panicking::panic_fmt
  386. 35.72 s gammaloop-nextest-docs> 2: core::panicking::panic
  387. 35.72 s gammaloop-nextest-docs> 3: alphal00p_docs_builder::provenance_tests::each_build_captures_one_revision_before_rendering
  388. 35.72 s gammaloop-nextest-docs> 4: <alphal00p_docs_builder::provenance_tests::each_build_captures_one_revision_before_rendering::{closure#0} as core::ops::function::FnOnce<()>>::call_once
  389. 35.72 s gammaloop-nextest-docs> note: Some details are omitted, run with `RUST_BACKTRACE=full` for a verbose backtrace.
  390. 35.72 s gammaloop-nextest-docs>
  391. 35.72 s gammaloop-nextest-docs> FAIL [ 0.123s] (106/129) alphal00p-docs-builder tests::every_product_requires_a_task_chooser_and_each_supported_interface
  392. 35.72 s gammaloop-nextest-docs> stdout ---
  393. 35.72 s gammaloop-nextest-docs>
  394. 35.72 s gammaloop-nextest-docs> running 1 test
  395. 35.72 s gammaloop-nextest-docs> test tests::every_product_requires_a_task_chooser_and_each_supported_interface ... FAILED
  396. 35.72 s gammaloop-nextest-docs>
  397. 35.72 s gammaloop-nextest-docs> failures:
  398. 35.72 s gammaloop-nextest-docs>
  399. 35.72 s gammaloop-nextest-docs> failures:
  400. 35.72 s gammaloop-nextest-docs> tests::every_product_requires_a_task_chooser_and_each_supported_interface
  401. 35.72 s gammaloop-nextest-docs>
  402. 35.72 s gammaloop-nextest-docs> test result: FAILED. 0 passed; 1 failed; 0 ignored; 0 measured; 128 filtered out; finished in 0.12s
  403. 35.72 s gammaloop-nextest-docs>
  404. 35.72 s gammaloop-nextest-docs> stderr ---
  405. 35.72 s gammaloop-nextest-docs>
  406. 35.72 s gammaloop-nextest-docs> thread 'tests::every_product_requires_a_task_chooser_and_each_supported_interface' (312) panicked at crates/alphal00p-docs-builder/src/lib.rs:12274:9:
  407. 35.72 s gammaloop-nextest-docs> assertion failed: format!("{error:#}").contains("has no quickstart page")
  408. 35.72 s gammaloop-nextest-docs> stack backtrace:
  409. 35.72 s gammaloop-nextest-docs> 0: __rustc::rust_begin_unwind
  410. 35.72 s gammaloop-nextest-docs> 1: core::panicking::panic_fmt
  411. 35.72 s gammaloop-nextest-docs> 2: core::panicking::panic
  412. 35.72 s gammaloop-nextest-docs> 3: alphal00p_docs_builder::tests::every_product_requires_a_task_chooser_and_each_supported_interface
  413. 35.72 s gammaloop-nextest-docs> 4: <alphal00p_docs_builder::tests::every_product_requires_a_task_chooser_and_each_supported_interface::{closure#0} as core::ops::function::FnOnce<()>>::call_once
  414. 35.72 s gammaloop-nextest-docs> note: Some details are omitted, run with `RUST_BACKTRACE=full` for a verbose backtrace.
  415. 35.72 s gammaloop-nextest-docs>
  416. 35.75 s gammaloop-nextest-docs> FAIL [ 0.118s] (122/129) alphal00p-docs-builder tests::pdf_manual_chapter_order_must_match_the_page_registry
  417. 35.75 s gammaloop-nextest-docs> stdout ---
  418. 35.75 s gammaloop-nextest-docs>
  419. 35.75 s gammaloop-nextest-docs> running 1 test
  420. 35.75 s gammaloop-nextest-docs> test tests::pdf_manual_chapter_order_must_match_the_page_registry ... FAILED
  421. 35.75 s gammaloop-nextest-docs>
  422. 35.75 s gammaloop-nextest-docs> failures:
  423. 35.75 s gammaloop-nextest-docs>
  424. 35.75 s gammaloop-nextest-docs> failures:
  425. 35.75 s gammaloop-nextest-docs> tests::pdf_manual_chapter_order_must_match_the_page_registry
  426. 35.75 s gammaloop-nextest-docs>
  427. 35.75 s gammaloop-nextest-docs> test result: FAILED. 0 passed; 1 failed; 0 ignored; 0 measured; 128 filtered out; finished in 0.11s
  428. 35.75 s gammaloop-nextest-docs>
  429. 35.75 s gammaloop-nextest-docs> stderr ---
  430. 35.75 s gammaloop-nextest-docs>
  431. 35.75 s gammaloop-nextest-docs> thread 'tests::pdf_manual_chapter_order_must_match_the_page_registry' (397) panicked at crates/alphal00p-docs-builder/src/lib.rs:12330:9:
  432. 35.75 s gammaloop-nextest-docs> assertion failed: format!("{error:#}").contains("PDF manual chapter order differs")
  433. 35.75 s gammaloop-nextest-docs> stack backtrace:
  434. 35.75 s gammaloop-nextest-docs> 0: __rustc::rust_begin_unwind
  435. 35.75 s gammaloop-nextest-docs> 1: core::panicking::panic_fmt
  436. 35.75 s gammaloop-nextest-docs> 2: core::panicking::panic
  437. 35.75 s gammaloop-nextest-docs> 3: alphal00p_docs_builder::tests::pdf_manual_chapter_order_must_match_the_page_registry
  438. 35.75 s gammaloop-nextest-docs> 4: <alphal00p_docs_builder::tests::pdf_manual_chapter_order_must_match_the_page_registry::{closure#0} as core::ops::function::FnOnce<()>>::call_once
  439. 35.75 s gammaloop-nextest-docs> note: Some details are omitted, run with `RUST_BACKTRACE=full` for a verbose backtrace.
  440. 35.75 s gammaloop-nextest-docs>
  441. 46.78 s gammaloop-nextest-docs> ------------
  442. 46.78 s gammaloop-nextest-docs> Summary [ 11.214s] 129 tests run: 118 passed, 11 failed, 0 skipped
  443. 46.78 s gammaloop-nextest-docs> FAIL [ 0.012s] ( 22/129) alphal00p-docs-builder tests::developer_architecture_is_classified_searchable_and_source_backed
  444. 46.78 s gammaloop-nextest-docs> stdout ---
  445. 46.78 s gammaloop-nextest-docs>
  446. 46.78 s gammaloop-nextest-docs> running 1 test
  447. 46.78 s gammaloop-nextest-docs> test tests::developer_architecture_is_classified_searchable_and_source_backed ... FAILED
  448. 46.78 s gammaloop-nextest-docs>
  449. 46.78 s gammaloop-nextest-docs> failures:
  450. 46.78 s gammaloop-nextest-docs>
  451. 46.78 s gammaloop-nextest-docs> failures:
  452. 46.78 s gammaloop-nextest-docs> tests::developer_architecture_is_classified_searchable_and_source_backed
  453. 46.78 s gammaloop-nextest-docs>
  454. 46.78 s gammaloop-nextest-docs> test result: FAILED. 0 passed; 1 failed; 0 ignored; 0 measured; 128 filtered out; finished in 0.01s
  455. 46.78 s gammaloop-nextest-docs>
  456. 46.78 s gammaloop-nextest-docs> stderr ---
  457. 46.78 s gammaloop-nextest-docs>
  458. 46.78 s gammaloop-nextest-docs> thread 'tests::developer_architecture_is_classified_searchable_and_source_backed' (273) panicked at crates/alphal00p-docs-builder/src/lib.rs:12751:14:
  459. 46.78 s gammaloop-nextest-docs> called `Result::unwrap()` on an `Err` value: failed to copy documentation asset crates/spynso3/typst/STIXTwoMath-Regular.woff2
  460. 46.78 s gammaloop-nextest-docs>
  461. 46.78 s gammaloop-nextest-docs> Caused by:
  462. 46.78 s gammaloop-nextest-docs> No such file or directory (os error 2)
  463. 46.78 s gammaloop-nextest-docs>
  464. 46.78 s gammaloop-nextest-docs> Location:
  465. 46.78 s gammaloop-nextest-docs> crates/alphal00p-docs-builder/src/lib.rs:2276:18
  466. 46.79 s gammaloop-nextest-docs> stack backtrace:
  467. 46.79 s gammaloop-nextest-docs> 0: __rustc::rust_begin_unwind
  468. 46.79 s gammaloop-nextest-docs> 1: core::panicking::panic_fmt
  469. 46.79 s gammaloop-nextest-docs> 2: core::result::unwrap_failed
  470. 46.79 s gammaloop-nextest-docs> 3: alphal00p_docs_builder::tests::developer_architecture_is_classified_searchable_and_source_backed
  471. 46.79 s gammaloop-nextest-docs> 4: <alphal00p_docs_builder::tests::developer_architecture_is_classified_searchable_and_source_backed::{closure#0} as core::ops::function::FnOnce<()>>::call_once
  472. 46.79 s gammaloop-nextest-docs> note: Some details are omitted, run with `RUST_BACKTRACE=full` for a verbose backtrace.
  473. 46.79 s gammaloop-nextest-docs>
  474. 46.79 s gammaloop-nextest-docs> FAIL [ 0.011s] ( 29/129) alphal00p-docs-builder tests::every_product_orients_rust_to_native_rustdoc_and_keeps_legacy_redirects
  475. 46.79 s gammaloop-nextest-docs> stdout ---
  476. 46.79 s gammaloop-nextest-docs>
  477. 46.79 s gammaloop-nextest-docs> running 1 test
  478. 46.79 s gammaloop-nextest-docs> test tests::every_product_orients_rust_to_native_rustdoc_and_keeps_legacy_redirects ... FAILED
  479. 46.79 s gammaloop-nextest-docs>
  480. 46.79 s gammaloop-nextest-docs> failures:
  481. 46.79 s gammaloop-nextest-docs>
  482. 46.79 s gammaloop-nextest-docs> failures:
  483. 46.79 s gammaloop-nextest-docs> tests::every_product_orients_rust_to_native_rustdoc_and_keeps_legacy_redirects
  484. 46.79 s gammaloop-nextest-docs>
  485. 46.79 s gammaloop-nextest-docs> test result: FAILED. 0 passed; 1 failed; 0 ignored; 0 measured; 128 filtered out; finished in 0.01s
  486. 46.79 s gammaloop-nextest-docs>
  487. 46.79 s gammaloop-nextest-docs> stderr ---
  488. 46.79 s gammaloop-nextest-docs>
  489. 46.79 s gammaloop-nextest-docs> thread 'tests::every_product_orients_rust_to_native_rustdoc_and_keeps_legacy_redirects' (301) panicked at crates/alphal00p-docs-builder/src/lib.rs:12555:46:
  490. 46.79 s gammaloop-nextest-docs> called `Result::unwrap()` on an `Err` value: failed to copy documentation asset crates/spynso3/typst/STIXTwoMath-Regular.woff2
  491. 46.79 s gammaloop-nextest-docs>
  492. 46.79 s gammaloop-nextest-docs> Caused by:
  493. 46.79 s gammaloop-nextest-docs> No such file or directory (os error 2)
  494. 46.79 s gammaloop-nextest-docs>
  495. 46.79 s gammaloop-nextest-docs> Location:
  496. 46.79 s gammaloop-nextest-docs> crates/alphal00p-docs-builder/src/lib.rs:2276:18
  497. 46.79 s gammaloop-nextest-docs> stack backtrace:
  498. 46.79 s gammaloop-nextest-docs> 0: __rustc::rust_begin_unwind
  499. 46.79 s gammaloop-nextest-docs> 1: core::panicking::panic_fmt
  500. 46.79 s gammaloop-nextest-docs> 2: core::result::unwrap_failed
  501. 46.79 s gammaloop-nextest-docs> 3: alphal00p_docs_builder::tests::every_product_orients_rust_to_native_rustdoc_and_keeps_legacy_redirects
  502. 46.79 s gammaloop-nextest-docs> 4: <alphal00p_docs_builder::tests::every_product_orients_rust_to_native_rustdoc_and_keeps_legacy_redirects::{closure#0} as core::ops::function::FnOnce<()>>::call_once
  503. 46.79 s gammaloop-nextest-docs> note: Some details are omitted, run with `RUST_BACKTRACE=full` for a verbose backtrace.
  504. 46.79 s gammaloop-nextest-docs>
  505. 46.79 s gammaloop-nextest-docs> FAIL [ 0.010s] ( 53/129) alphal00p-docs-builder tests::portal_emits_routes_and_valid_assets
  506. 46.79 s gammaloop-nextest-docs> stdout ---
  507. 46.79 s gammaloop-nextest-docs>
  508. 46.79 s gammaloop-nextest-docs> running 1 test
  509. 46.79 s gammaloop-nextest-docs> test tests::portal_emits_routes_and_valid_assets ... FAILED
  510. 46.79 s gammaloop-nextest-docs>
  511. 46.79 s gammaloop-nextest-docs> failures:
  512. 46.79 s gammaloop-nextest-docs>
  513. 46.79 s gammaloop-nextest-docs> failures:
  514. 46.79 s gammaloop-nextest-docs> tests::portal_emits_routes_and_valid_assets
  515. 46.79 s gammaloop-nextest-docs>
  516. 46.79 s gammaloop-nextest-docs> test result: FAILED. 0 passed; 1 failed; 0 ignored; 0 measured; 128 filtered out; finished in 0.00s
  517. 46.79 s gammaloop-nextest-docs>
  518. 46.79 s gammaloop-nextest-docs> stderr ---
  519. 46.79 s gammaloop-nextest-docs>
  520. 46.79 s gammaloop-nextest-docs> thread 'tests::portal_emits_routes_and_valid_assets' (429) panicked at crates/alphal00p-docs-builder/src/lib.rs:9684:14:
  521. 46.79 s gammaloop-nextest-docs> called `Result::unwrap()` on an `Err` value: failed to copy documentation asset crates/spynso3/typst/STIXTwoMath-Regular.woff2
  522. 46.79 s gammaloop-nextest-docs>
  523. 46.79 s gammaloop-nextest-docs> Caused by:
  524. 46.79 s gammaloop-nextest-docs> No such file or directory (os error 2)
  525. 46.79 s gammaloop-nextest-docs>
  526. 46.79 s gammaloop-nextest-docs> Location:
  527. 46.79 s gammaloop-nextest-docs> crates/alphal00p-docs-builder/src/lib.rs:2276:18
  528. 46.79 s gammaloop-nextest-docs> stack backtrace:
  529. 46.79 s gammaloop-nextest-docs> 0: __rustc::rust_begin_unwind
  530. 46.79 s gammaloop-nextest-docs> 1: core::panicking::panic_fmt
  531. 46.79 s gammaloop-nextest-docs> 2: core::result::unwrap_failed
  532. 46.79 s gammaloop-nextest-docs> 3: alphal00p_docs_builder::tests::write_test_portal
  533. 46.79 s gammaloop-nextest-docs> 4: alphal00p_docs_builder::tests::portal_emits_routes_and_valid_assets
  534. 46.79 s gammaloop-nextest-docs> 5: <alphal00p_docs_builder::tests::portal_emits_routes_and_valid_assets::{closure#0} as core::ops::function::FnOnce<()>>::call_once
  535. 46.79 s gammaloop-nextest-docs> note: Some details are omitted, run with `RUST_BACKTRACE=full` for a verbose backtrace.
  536. 46.79 s gammaloop-nextest-docs>
  537. 46.79 s gammaloop-nextest-docs> FAIL [ 0.011s] ( 54/129) alphal00p-docs-builder tests::portal_and_developer_pages_use_federated_search_and_feedback
  538. 46.79 s gammaloop-nextest-docs> stdout ---
  539. 46.79 s gammaloop-nextest-docs>
  540. 46.79 s gammaloop-nextest-docs> running 1 test
  541. 46.79 s gammaloop-nextest-docs> test tests::portal_and_developer_pages_use_federated_search_and_feedback ... FAILED
  542. 46.79 s gammaloop-nextest-docs>
  543. 46.79 s gammaloop-nextest-docs> failures:
  544. 46.79 s gammaloop-nextest-docs>
  545. 46.79 s gammaloop-nextest-docs> failures:
  546. 46.79 s gammaloop-nextest-docs> tests::portal_and_developer_pages_use_federated_search_and_feedback
  547. 46.79 s gammaloop-nextest-docs>
  548. 46.79 s gammaloop-nextest-docs> test result: FAILED. 0 passed; 1 failed; 0 ignored; 0 measured; 128 filtered out; finished in 0.01s
  549. 46.79 s gammaloop-nextest-docs>
  550. 46.79 s gammaloop-nextest-docs> stderr ---
  551. 46.79 s gammaloop-nextest-docs>
  552. 46.79 s gammaloop-nextest-docs> thread 'tests::portal_and_developer_pages_use_federated_search_and_feedback' (430) panicked at crates/alphal00p-docs-builder/src/lib.rs:9684:14:
  553. 46.79 s gammaloop-nextest-docs> called `Result::unwrap()` on an `Err` value: failed to copy documentation asset crates/spynso3/typst/STIXTwoMath-Regular.woff2
  554. 46.79 s gammaloop-nextest-docs>
  555. 46.79 s gammaloop-nextest-docs> Caused by:
  556. 46.79 s gammaloop-nextest-docs> No such file or directory (os error 2)
  557. 46.79 s gammaloop-nextest-docs>
  558. 46.79 s gammaloop-nextest-docs> Location:
  559. 46.79 s gammaloop-nextest-docs> crates/alphal00p-docs-builder/src/lib.rs:2276:18
  560. 46.79 s gammaloop-nextest-docs> stack backtrace:
  561. 46.79 s gammaloop-nextest-docs> 0: __rustc::rust_begin_unwind
  562. 46.79 s gammaloop-nextest-docs> 1: core::panicking::panic_fmt
  563. 46.79 s gammaloop-nextest-docs> 2: core::result::unwrap_failed
  564. 46.79 s gammaloop-nextest-docs> 3: alphal00p_docs_builder::tests::write_test_portal
  565. 46.79 s gammaloop-nextest-docs> 4: alphal00p_docs_builder::tests::portal_and_developer_pages_use_federated_search_and_feedback
  566. 46.79 s gammaloop-nextest-docs> 5: <alphal00p_docs_builder::tests::portal_and_developer_pages_use_federated_search_and_feedback::{closure#0} as core::ops::function::FnOnce<()>>::call_once
  567. 46.79 s gammaloop-nextest-docs> note: Some details are omitted, run with `RUST_BACKTRACE=full` for a verbose backtrace.
  568. 46.79 s gammaloop-nextest-docs>
  569. 46.79 s gammaloop-nextest-docs> FAIL [ 0.009s] ( 55/129) alphal00p-docs-builder tests::portal_task_chooser_routes_each_goal_to_the_registered_quickstart
  570. 46.79 s gammaloop-nextest-docs> stdout ---
  571. 46.79 s gammaloop-nextest-docs>
  572. 46.79 s gammaloop-nextest-docs> running 1 test
  573. 46.79 s gammaloop-nextest-docs> test tests::portal_task_chooser_routes_each_goal_to_the_registered_quickstart ... FAILED
  574. 46.79 s gammaloop-nextest-docs>
  575. 46.79 s gammaloop-nextest-docs> failures:
  576. 46.79 s gammaloop-nextest-docs>
  577. 46.79 s gammaloop-nextest-docs> failures:
  578. 46.79 s gammaloop-nextest-docs> tests::portal_task_chooser_routes_each_goal_to_the_registered_quickstart
  579. 46.79 s gammaloop-nextest-docs>
  580. 46.79 s gammaloop-nextest-docs> test result: FAILED. 0 passed; 1 failed; 0 ignored; 0 measured; 128 filtered out; finished in 0.00s
  581. 46.79 s gammaloop-nextest-docs>
  582. 46.79 s gammaloop-nextest-docs> stderr ---
  583. 46.79 s gammaloop-nextest-docs>
  584. 46.79 s gammaloop-nextest-docs> thread 'tests::portal_task_chooser_routes_each_goal_to_the_registered_quickstart' (443) panicked at crates/alphal00p-docs-builder/src/lib.rs:9684:14:
  585. 46.79 s gammaloop-nextest-docs> called `Result::unwrap()` on an `Err` value: failed to copy documentation asset crates/spynso3/typst/STIXTwoMath-Regular.woff2
  586. 46.79 s gammaloop-nextest-docs>
  587. 46.79 s gammaloop-nextest-docs> Caused by:
  588. 46.79 s gammaloop-nextest-docs> No such file or directory (os error 2)
  589. 46.79 s gammaloop-nextest-docs>
  590. 46.79 s gammaloop-nextest-docs> Location:
  591. 46.79 s gammaloop-nextest-docs> crates/alphal00p-docs-builder/src/lib.rs:2276:18
  592. 46.79 s gammaloop-nextest-docs> stack backtrace:
  593. 46.79 s gammaloop-nextest-docs> 0: __rustc::rust_begin_unwind
  594. 46.79 s gammaloop-nextest-docs> 1: core::panicking::panic_fmt
  595. 46.79 s gammaloop-nextest-docs> 2: core::result::unwrap_failed
  596. 46.79 s gammaloop-nextest-docs> 3: alphal00p_docs_builder::tests::write_test_portal
  597. 46.79 s gammaloop-nextest-docs> 4: alphal00p_docs_builder::tests::portal_task_chooser_routes_each_goal_to_the_registered_quickstart
  598. 46.79 s gammaloop-nextest-docs> 5: <alphal00p_docs_builder::tests::portal_task_chooser_routes_each_goal_to_the_registered_quickstart::{closure#0} as core::ops::function::FnOnce<()>>::call_once
  599. 46.79 s gammaloop-nextest-docs> note: Some details are omitted, run with `RUST_BACKTRACE=full` for a verbose backtrace.
  600. 46.79 s gammaloop-nextest-docs>
  601. 46.79 s gammaloop-nextest-docs> FAIL [ 0.123s] ( 83/129) alphal00p-docs-builder tests::checked_in_registry_is_valid
  602. 46.79 s gammaloop-nextest-docs> stdout ---
  603. 46.79 s gammaloop-nextest-docs>
  604. 46.79 s gammaloop-nextest-docs> running 1 test
  605. 46.79 s gammaloop-nextest-docs> test tests::checked_in_registry_is_valid ... FAILED
  606. 46.79 s gammaloop-nextest-docs>
  607. 46.79 s gammaloop-nextest-docs> failures:
  608. 46.79 s gammaloop-nextest-docs>
  609. 46.79 s gammaloop-nextest-docs> failures:
  610. 46.79 s gammaloop-nextest-docs> tests::checked_in_registry_is_valid
  611. 46.79 s gammaloop-nextest-docs>
  612. 46.79 s gammaloop-nextest-docs> test result: FAILED. 0 passed; 1 failed; 0 ignored; 0 measured; 128 filtered out; finished in 0.11s
  613. 46.79 s gammaloop-nextest-docs>
  614. 46.79 s gammaloop-nextest-docs> stderr ---
  615. 46.79 s gammaloop-nextest-docs>
  616. 46.79 s gammaloop-nextest-docs> thread 'tests::checked_in_registry_is_valid' (214) panicked at crates/alphal00p-docs-builder/src/lib.rs:12260:50:
  617. 46.79 s gammaloop-nextest-docs> called `Result::unwrap()` on an `Err` value: required documentation source is missing: /build/source/crates/spynso3/typst/STIXTwoMath-Regular.woff2
  618. 46.79 s gammaloop-nextest-docs>
  619. 46.79 s gammaloop-nextest-docs> Location:
  620. 46.79 s gammaloop-nextest-docs> crates/alphal00p-docs-builder/src/lib.rs:5103:9
  621. 46.79 s gammaloop-nextest-docs> stack backtrace:
  622. 46.79 s gammaloop-nextest-docs> 0: __rustc::rust_begin_unwind
  623. 46.79 s gammaloop-nextest-docs> 1: core::panicking::panic_fmt
  624. 46.79 s gammaloop-nextest-docs> 2: core::result::unwrap_failed
  625. 46.79 s gammaloop-nextest-docs> 3: alphal00p_docs_builder::tests::checked_in_registry_is_valid
  626. 46.79 s gammaloop-nextest-docs> 4: <alphal00p_docs_builder::tests::checked_in_registry_is_valid::{closure#0} as core::ops::function::FnOnce<()>>::call_once
  627. 46.79 s gammaloop-nextest-docs> note: Some details are omitted, run with `RUST_BACKTRACE=full` for a verbose backtrace.
  628. 46.79 s gammaloop-nextest-docs>
  629. 46.79 s gammaloop-nextest-docs> FAIL [ 0.009s] ( 87/129) alphal00p-docs-builder tests::site_assets_replace_read_only_generated_files
  630. 46.79 s gammaloop-nextest-docs> stdout ---
  631. 46.79 s gammaloop-nextest-docs>
  632. 46.79 s gammaloop-nextest-docs> running 1 test
  633. 46.79 s gammaloop-nextest-docs> test tests::site_assets_replace_read_only_generated_files ... FAILED
  634. 46.79 s gammaloop-nextest-docs>
  635. 46.79 s gammaloop-nextest-docs> failures:
  636. 46.79 s gammaloop-nextest-docs>
  637. 46.79 s gammaloop-nextest-docs> failures:
  638. 46.79 s gammaloop-nextest-docs> tests::site_assets_replace_read_only_generated_files
  639. 46.79 s gammaloop-nextest-docs>
  640. 46.79 s gammaloop-nextest-docs> test result: FAILED. 0 passed; 1 failed; 0 ignored; 0 measured; 128 filtered out; finished in 0.00s
  641. 46.79 s gammaloop-nextest-docs>
  642. 46.79 s gammaloop-nextest-docs> stderr ---
  643. 46.79 s gammaloop-nextest-docs>
  644. 46.79 s gammaloop-nextest-docs> thread 'tests::site_assets_replace_read_only_generated_files' (669) panicked at crates/alphal00p-docs-builder/src/lib.rs:12305:50:
  645. 46.79 s gammaloop-nextest-docs> called `Result::unwrap()` on an `Err` value: failed to copy documentation asset crates/spynso3/typst/STIXTwoMath-Regular.woff2
  646. 46.79 s gammaloop-nextest-docs>
  647. 46.79 s gammaloop-nextest-docs> Caused by:
  648. 46.79 s gammaloop-nextest-docs> No such file or directory (os error 2)
  649. 46.79 s gammaloop-nextest-docs>
  650. 46.79 s gammaloop-nextest-docs> Location:
  651. 46.79 s gammaloop-nextest-docs> crates/alphal00p-docs-builder/src/lib.rs:2276:18
  652. 46.79 s gammaloop-nextest-docs> stack backtrace:
  653. 46.79 s gammaloop-nextest-docs> 0: __rustc::rust_begin_unwind
  654. 46.79 s gammaloop-nextest-docs> 1: core::panicking::panic_fmt
  655. 46.79 s gammaloop-nextest-docs> 2: core::result::unwrap_failed
  656. 46.79 s gammaloop-nextest-docs> 3: alphal00p_docs_builder::tests::site_assets_replace_read_only_generated_files
  657. 46.79 s gammaloop-nextest-docs> 4: <alphal00p_docs_builder::tests::site_assets_replace_read_only_generated_files::{closure#0} as core::ops::function::FnOnce<()>>::call_once
  658. 46.79 s gammaloop-nextest-docs> note: Some details are omitted, run with `RUST_BACKTRACE=full` for a verbose backtrace.
  659. 46.79 s gammaloop-nextest-docs>
  660. 46.79 s gammaloop-nextest-docs> FAIL [ 0.114s] ( 89/129) alphal00p-docs-builder tests::developer_scope_ranges_ignore_unrelated_edits_and_warn_only_while_watching
  661. 46.79 s gammaloop-nextest-docs> stdout ---
  662. 46.79 s gammaloop-nextest-docs>
  663. 46.79 s gammaloop-nextest-docs> running 1 test
  664. 46.79 s gammaloop-nextest-docs> test tests::developer_scope_ranges_ignore_unrelated_edits_and_warn_only_while_watching ... FAILED
  665. 46.79 s gammaloop-nextest-docs>
  666. 46.79 s gammaloop-nextest-docs> failures:
  667. 46.79 s gammaloop-nextest-docs>
  668. 46.79 s gammaloop-nextest-docs> failures:
  669. 46.79 s gammaloop-nextest-docs> tests::developer_scope_ranges_ignore_unrelated_edits_and_warn_only_while_watching
  670. 46.79 s gammaloop-nextest-docs>
  671. 46.79 s gammaloop-nextest-docs> test result: FAILED. 0 passed; 1 failed; 0 ignored; 0 measured; 128 filtered out; finished in 0.11s
  672. 46.79 s gammaloop-nextest-docs>
  673. 46.79 s gammaloop-nextest-docs> stderr ---
  674. 46.79 s gammaloop-nextest-docs>
  675. 46.79 s gammaloop-nextest-docs> thread 'tests::developer_scope_ranges_ignore_unrelated_edits_and_warn_only_while_watching' (278) panicked at crates/alphal00p-docs-builder/src/lib.rs:12350:29:
  676. 46.79 s gammaloop-nextest-docs> called `Result::unwrap()` on an `Err` value: required documentation source is missing: /build/source/crates/spynso3/typst/STIXTwoMath-Regular.woff2
  677. 46.79 s gammaloop-nextest-docs>
  678. 46.79 s gammaloop-nextest-docs> Location:
  679. 46.79 s gammaloop-nextest-docs> crates/alphal00p-docs-builder/src/lib.rs:5103:9
  680. 46.79 s gammaloop-nextest-docs> stack backtrace:
  681. 46.79 s gammaloop-nextest-docs> 0: __rustc::rust_begin_unwind
  682. 46.79 s gammaloop-nextest-docs> 1: core::panicking::panic_fmt
  683. 46.79 s gammaloop-nextest-docs> 2: core::result::unwrap_failed
  684. 46.79 s gammaloop-nextest-docs> 3: alphal00p_docs_builder::tests::developer_scope_ranges_ignore_unrelated_edits_and_warn_only_while_watching
  685. 46.79 s gammaloop-nextest-docs> 4: <alphal00p_docs_builder::tests::developer_scope_ranges_ignore_unrelated_edits_and_warn_only_while_watching::{closure#0} as core::ops::function::FnOnce<()>>::call_once
  686. 46.79 s gammaloop-nextest-docs> note: Some details are omitted, run with `RUST_BACKTRACE=full` for a verbose backtrace.
  687. 46.79 s gammaloop-nextest-docs>
  688. 46.79 s gammaloop-nextest-docs> FAIL [ 0.142s] ( 96/129) alphal00p-docs-builder provenance_tests::each_build_captures_one_revision_before_rendering
  689. 46.79 s gammaloop-nextest-docs> stdout ---
  690. 46.79 s gammaloop-nextest-docs>
  691. 46.79 s gammaloop-nextest-docs> running 1 test
  692. 46.79 s gammaloop-nextest-docs>
  693. 46.79 s gammaloop-nextest-docs> running 1 test
  694. 46.79 s gammaloop-nextest-docs> test provenance_tests::each_build_captures_one_revision_before_rendering ... FAILED
  695. 46.79 s gammaloop-nextest-docs>
  696. 46.79 s gammaloop-nextest-docs> failures:
  697. 46.79 s gammaloop-nextest-docs>
  698. 46.79 s gammaloop-nextest-docs> failures:
  699. 46.79 s gammaloop-nextest-docs> provenance_tests::each_build_captures_one_revision_before_rendering
  700. 46.79 s gammaloop-nextest-docs>
  701. 46.79 s gammaloop-nextest-docs> test result: FAILED. 0 passed; 1 failed; 0 ignored; 0 measured; 128 filtered out; finished in 0.11s
  702. 46.79 s gammaloop-nextest-docs>
  703. 46.79 s gammaloop-nextest-docs> test provenance_tests::each_build_captures_one_revision_before_rendering ... FAILED
  704. 46.79 s gammaloop-nextest-docs>
  705. 46.79 s gammaloop-nextest-docs> failures:
  706. 46.79 s gammaloop-nextest-docs>
  707. 46.79 s gammaloop-nextest-docs> failures:
  708. 46.79 s gammaloop-nextest-docs> provenance_tests::each_build_captures_one_revision_before_rendering
  709. 46.79 s gammaloop-nextest-docs>
  710. 46.79 s gammaloop-nextest-docs> test result: FAILED. 0 passed; 1 failed; 0 ignored; 0 measured; 128 filtered out; finished in 0.13s
  711. 46.79 s gammaloop-nextest-docs>
  712. 46.79 s gammaloop-nextest-docs> stderr ---
  713. 46.79 s gammaloop-nextest-docs>
  714. 46.79 s gammaloop-nextest-docs> thread 'provenance_tests::each_build_captures_one_revision_before_rendering' (284) panicked at crates/alphal00p-docs-builder/src/provenance_tests.rs:297:14:
  715. 46.79 s gammaloop-nextest-docs> called `Result::unwrap()` on an `Err` value: required documentation source is missing: /build/source/target/nix-ci-tmp/.tmpAH3uti/checkout/crates/spynso3/typst/STIXTwoMath-Regular.woff2
  716. 46.79 s gammaloop-nextest-docs>
  717. 46.79 s gammaloop-nextest-docs> Location:
  718. 46.79 s gammaloop-nextest-docs> crates/alphal00p-docs-builder/src/lib.rs:5103:9
  719. 46.79 s gammaloop-nextest-docs> stack backtrace:
  720. 46.79 s gammaloop-nextest-docs> 0: __rustc::rust_begin_unwind
  721. 46.79 s gammaloop-nextest-docs> 1: core::panicking::panic_fmt
  722. 46.79 s gammaloop-nextest-docs> 2: core::result::unwrap_failed
  723. 46.79 s gammaloop-nextest-docs> 3: alphal00p_docs_builder::provenance_tests::each_build_captures_one_revision_before_rendering
  724. 46.79 s gammaloop-nextest-docs> 4: <alphal00p_docs_builder::provenance_tests::each_build_captures_one_revision_before_rendering::{closure#0} as core::ops::function::FnOnce<()>>::call_once
  725. 46.79 s gammaloop-nextest-docs> note: Some details are omitted, run with `RUST_BACKTRACE=full` for a verbose backtrace.
  726. 46.79 s gammaloop-nextest-docs>
  727. 46.79 s gammaloop-nextest-docs> thread 'provenance_tests::each_build_captures_one_revision_before_rendering' (218) panicked at crates/alphal00p-docs-builder/src/provenance_tests.rs:274:9:
  728. 46.79 s gammaloop-nextest-docs> assertion failed: command.status().unwrap().success()
  729. 46.79 s gammaloop-nextest-docs> stack backtrace:
  730. 46.79 s gammaloop-nextest-docs> 0: __rustc::rust_begin_unwind
  731. 46.79 s gammaloop-nextest-docs> 1: core::panicking::panic_fmt
  732. 46.79 s gammaloop-nextest-docs> 2: core::panicking::panic
  733. 46.79 s gammaloop-nextest-docs> 3: alphal00p_docs_builder::provenance_tests::each_build_captures_one_revision_before_rendering
  734. 46.79 s gammaloop-nextest-docs> 4: <alphal00p_docs_builder::provenance_tests::each_build_captures_one_revision_before_rendering::{closure#0} as core::ops::function::FnOnce<()>>::call_once
  735. 46.79 s gammaloop-nextest-docs> note: Some details are omitted, run with `RUST_BACKTRACE=full` for a verbose backtrace.
  736. 46.79 s gammaloop-nextest-docs>
  737. 46.79 s gammaloop-nextest-docs> FAIL [ 0.123s] (106/129) alphal00p-docs-builder tests::every_product_requires_a_task_chooser_and_each_supported_interface
  738. 46.79 s gammaloop-nextest-docs> stdout ---
  739. 46.79 s gammaloop-nextest-docs>
  740. 46.79 s gammaloop-nextest-docs> running 1 test
  741. 46.79 s gammaloop-nextest-docs> test tests::every_product_requires_a_task_chooser_and_each_supported_interface ... FAILED
  742. 46.79 s gammaloop-nextest-docs>
  743. 46.79 s gammaloop-nextest-docs> failures:
  744. 46.79 s gammaloop-nextest-docs>
  745. 46.79 s gammaloop-nextest-docs> failures:
  746. 46.79 s gammaloop-nextest-docs> tests::every_product_requires_a_task_chooser_and_each_supported_interface
  747. 46.79 s gammaloop-nextest-docs>
  748. 46.79 s gammaloop-nextest-docs> test result: FAILED. 0 passed; 1 failed; 0 ignored; 0 measured; 128 filtered out; finished in 0.12s
  749. 46.79 s gammaloop-nextest-docs>
  750. 46.79 s gammaloop-nextest-docs> stderr ---
  751. 46.79 s gammaloop-nextest-docs>
  752. 46.79 s gammaloop-nextest-docs> thread 'tests::every_product_requires_a_task_chooser_and_each_supported_interface' (312) panicked at crates/alphal00p-docs-builder/src/lib.rs:12274:9:
  753. 46.79 s gammaloop-nextest-docs> assertion failed: format!("{error:#}").contains("has no quickstart page")
  754. 46.79 s gammaloop-nextest-docs> stack backtrace:
  755. 46.79 s gammaloop-nextest-docs> 0: __rustc::rust_begin_unwind
  756. 46.79 s gammaloop-nextest-docs> 1: core::panicking::panic_fmt
  757. 46.79 s gammaloop-nextest-docs> 2: core::panicking::panic
  758. 46.79 s gammaloop-nextest-docs> 3: alphal00p_docs_builder::tests::every_product_requires_a_task_chooser_and_each_supported_interface
  759. 46.79 s gammaloop-nextest-docs> 4: <alphal00p_docs_builder::tests::every_product_requires_a_task_chooser_and_each_supported_interface::{closure#0} as core::ops::function::FnOnce<()>>::call_once
  760. 46.79 s gammaloop-nextest-docs> note: Some details are omitted, run with `RUST_BACKTRACE=full` for a verbose backtrace.
  761. 46.79 s gammaloop-nextest-docs>
  762. 46.79 s gammaloop-nextest-docs> FAIL [ 0.118s] (122/129) alphal00p-docs-builder tests::pdf_manual_chapter_order_must_match_the_page_registry
  763. 46.79 s gammaloop-nextest-docs> stdout ---
  764. 46.79 s gammaloop-nextest-docs>
  765. 46.79 s gammaloop-nextest-docs> running 1 test
  766. 46.79 s gammaloop-nextest-docs> test tests::pdf_manual_chapter_order_must_match_the_page_registry ... FAILED
  767. 46.79 s gammaloop-nextest-docs>
  768. 46.79 s gammaloop-nextest-docs> failures:
  769. 46.79 s gammaloop-nextest-docs>
  770. 46.79 s gammaloop-nextest-docs> failures:
  771. 46.79 s gammaloop-nextest-docs> tests::pdf_manual_chapter_order_must_match_the_page_registry
  772. 46.79 s gammaloop-nextest-docs>
  773. 46.79 s gammaloop-nextest-docs> test result: FAILED. 0 passed; 1 failed; 0 ignored; 0 measured; 128 filtered out; finished in 0.11s
  774. 46.79 s gammaloop-nextest-docs>
  775. 46.79 s gammaloop-nextest-docs> stderr ---
  776. 46.79 s gammaloop-nextest-docs>
  777. 46.79 s gammaloop-nextest-docs> thread 'tests::pdf_manual_chapter_order_must_match_the_page_registry' (397) panicked at crates/alphal00p-docs-builder/src/lib.rs:12330:9:
  778. 46.79 s gammaloop-nextest-docs> assertion failed: format!("{error:#}").contains("PDF manual chapter order differs")
  779. 46.79 s gammaloop-nextest-docs> stack backtrace:
  780. 46.79 s gammaloop-nextest-docs> 0: __rustc::rust_begin_unwind
  781. 46.79 s gammaloop-nextest-docs> 1: core::panicking::panic_fmt
  782. 46.79 s gammaloop-nextest-docs> 2: core::panicking::panic
  783. 46.79 s gammaloop-nextest-docs> 3: alphal00p_docs_builder::tests::pdf_manual_chapter_order_must_match_the_page_registry
  784. 46.79 s gammaloop-nextest-docs> 4: <alphal00p_docs_builder::tests::pdf_manual_chapter_order_must_match_the_page_registry::{closure#0} as core::ops::function::FnOnce<()>>::call_once
  785. 46.79 s gammaloop-nextest-docs> note: Some details are omitted, run with `RUST_BACKTRACE=full` for a verbose backtrace.
  786. 46.79 s gammaloop-nextest-docs>
  787. 46.79 s gammaloop-nextest-docs> error: test run failed
  788. 46.82 s gammaloop-nextest-docs>
  789. 46.82 s gammaloop-nextest-docs> ========== nextest test summary ==========
  790. 46.82 s gammaloop-nextest-docs> report: target/nextest/ci_gammaloop/junit.xml
  791. 46.82 s gammaloop-nextest-docs> tests: 129, failures: 11, errors: 0
  792. 46.82 s gammaloop-nextest-docs>
  793. 46.82 s gammaloop-nextest-docs> 1. alphal00p-docs-builder::tests::developer_architecture_is_classified_searchable_and_source_backed
  794. 46.82 s gammaloop-nextest-docs> failure: test failure with exit code 101
  795. 46.82 s gammaloop-nextest-docs> thread 'tests::developer_architecture_is_classified_searchable_and_source_backed' (273) panicked at crates/alphal00p-docs-builder/src/lib.rs:12751:14:
  796. 46.82 s gammaloop-nextest-docs> called `Result::unwrap()` on an `Err` value: failed to copy documentation asset crates/spynso3/typst/STIXTwoMath-Regular.woff2
  797. 46.82 s gammaloop-nextest-docs>
  798. 46.82 s gammaloop-nextest-docs> Caused by:
  799. 46.82 s gammaloop-nextest-docs> No such file or directory (os error 2)
  800. 46.82 s gammaloop-nextest-docs>
  801. 46.82 s gammaloop-nextest-docs> Location:
  802. 46.82 s gammaloop-nextest-docs> crates/alphal00p-docs-builder/src/lib.rs:2276:18
  803. 46.82 s gammaloop-nextest-docs> stack backtrace:
  804. 46.82 s gammaloop-nextest-docs> 0: __rustc::rust_begin_unwind
  805. 46.82 s gammaloop-nextest-docs> 1: core::panicking::panic_fmt
  806. 46.82 s gammaloop-nextest-docs> 2: core::result::unwrap_failed
  807. 46.82 s gammaloop-nextest-docs> 3: alphal00p_docs_builder::tests::developer_architecture_is_classified_searchable_and_source_backed
  808. 46.82 s gammaloop-nextest-docs> 4: <alphal00p_docs_builder::tests::developer_architecture_is_classified_searchable_and_source_backed::{closure#0} as core::ops::function::FnOnce<()>>::call_once
  809. 46.82 s gammaloop-nextest-docs> note: Some details are omitted, run with `RUST_BACKTRACE=full` for a verbose backtrace.
  810. 46.82 s gammaloop-nextest-docs> system-out
  811. 46.82 s gammaloop-nextest-docs> running 1 test
  812. 46.82 s gammaloop-nextest-docs> test tests::developer_architecture_is_classified_searchable_and_source_backed ... FAILED
  813. 46.82 s gammaloop-nextest-docs>
  814. 46.82 s gammaloop-nextest-docs> failures:
  815. 46.82 s gammaloop-nextest-docs>
  816. 46.82 s gammaloop-nextest-docs> failures:
  817. 46.82 s gammaloop-nextest-docs> tests::developer_architecture_is_classified_searchable_and_source_backed
  818. 46.82 s gammaloop-nextest-docs>
  819. 46.82 s gammaloop-nextest-docs> test result: FAILED. 0 passed; 1 failed; 0 ignored; 0 measured; 128 filtered out; finished in 0.01s
  820. 46.82 s gammaloop-nextest-docs> system-err
  821. 46.82 s gammaloop-nextest-docs> thread 'tests::developer_architecture_is_classified_searchable_and_source_backed' (273) panicked at crates/alphal00p-docs-builder/src/lib.rs:12751:14:
  822. 46.82 s gammaloop-nextest-docs> called `Result::unwrap()` on an `Err` value: failed to copy documentation asset crates/spynso3/typst/STIXTwoMath-Regular.woff2
  823. 46.82 s gammaloop-nextest-docs>
  824. 46.82 s gammaloop-nextest-docs> Caused by:
  825. 46.82 s gammaloop-nextest-docs> No such file or directory (os error 2)
  826. 46.82 s gammaloop-nextest-docs>
  827. 46.82 s gammaloop-nextest-docs> Location:
  828. 46.82 s gammaloop-nextest-docs> crates/alphal00p-docs-builder/src/lib.rs:2276:18
  829. 46.82 s gammaloop-nextest-docs> stack backtrace:
  830. 46.82 s gammaloop-nextest-docs> 0: __rustc::rust_begin_unwind
  831. 46.82 s gammaloop-nextest-docs> 1: core::panicking::panic_fmt
  832. 46.82 s gammaloop-nextest-docs> 2: core::result::unwrap_failed
  833. 46.82 s gammaloop-nextest-docs> 3: alphal00p_docs_builder::tests::developer_architecture_is_classified_searchable_and_source_backed
  834. 46.82 s gammaloop-nextest-docs> 4: <alphal00p_docs_builder::tests::developer_architecture_is_classified_searchable_and_source_backed::{closure#0} as core::ops::function::FnOnce<()>>::call_once
  835. 46.82 s gammaloop-nextest-docs> note: Some details are omitted, run with `RUST_BACKTRACE=full` for a verbose backtrace.
  836. 46.82 s gammaloop-nextest-docs>
  837. 46.82 s gammaloop-nextest-docs> 2. alphal00p-docs-builder::tests::every_product_orients_rust_to_native_rustdoc_and_keeps_legacy_redirects
  838. 46.82 s gammaloop-nextest-docs> failure: test failure with exit code 101
  839. 46.82 s gammaloop-nextest-docs> thread 'tests::every_product_orients_rust_to_native_rustdoc_and_keeps_legacy_redirects' (301) panicked at crates/alphal00p-docs-builder/src/lib.rs:12555:46:
  840. 46.82 s gammaloop-nextest-docs> called `Result::unwrap()` on an `Err` value: failed to copy documentation asset crates/spynso3/typst/STIXTwoMath-Regular.woff2
  841. 46.82 s gammaloop-nextest-docs>
  842. 46.82 s gammaloop-nextest-docs> Caused by:
  843. 46.82 s gammaloop-nextest-docs> No such file or directory (os error 2)
  844. 46.82 s gammaloop-nextest-docs>
  845. 46.82 s gammaloop-nextest-docs> Location:
  846. 46.82 s gammaloop-nextest-docs> crates/alphal00p-docs-builder/src/lib.rs:2276:18
  847. 46.82 s gammaloop-nextest-docs> stack backtrace:
  848. 46.82 s gammaloop-nextest-docs> 0: __rustc::rust_begin_unwind
  849. 46.82 s gammaloop-nextest-docs> 1: core::panicking::panic_fmt
  850. 46.82 s gammaloop-nextest-docs> 2: core::result::unwrap_failed
  851. 46.82 s gammaloop-nextest-docs> 3: alphal00p_docs_builder::tests::every_product_orients_rust_to_native_rustdoc_and_keeps_legacy_redirects
  852. 46.82 s gammaloop-nextest-docs> 4: <alphal00p_docs_builder::tests::every_product_orients_rust_to_native_rustdoc_and_keeps_legacy_redirects::{closure#0} as core::ops::function::FnOnce<()>>::call_once
  853. 46.82 s gammaloop-nextest-docs> note: Some details are omitted, run with `RUST_BACKTRACE=full` for a verbose backtrace.
  854. 46.82 s gammaloop-nextest-docs> system-out
  855. 46.82 s gammaloop-nextest-docs> running 1 test
  856. 46.82 s gammaloop-nextest-docs> test tests::every_product_orients_rust_to_native_rustdoc_and_keeps_legacy_redirects ... FAILED
  857. 46.82 s gammaloop-nextest-docs>
  858. 46.82 s gammaloop-nextest-docs> failures:
  859. 46.82 s gammaloop-nextest-docs>
  860. 46.82 s gammaloop-nextest-docs> failures:
  861. 46.82 s gammaloop-nextest-docs> tests::every_product_orients_rust_to_native_rustdoc_and_keeps_legacy_redirects
  862. 46.82 s gammaloop-nextest-docs>
  863. 46.82 s gammaloop-nextest-docs> test result: FAILED. 0 passed; 1 failed; 0 ignored; 0 measured; 128 filtered out; finished in 0.01s
  864. 46.82 s gammaloop-nextest-docs> system-err
  865. 46.82 s gammaloop-nextest-docs> thread 'tests::every_product_orients_rust_to_native_rustdoc_and_keeps_legacy_redirects' (301) panicked at crates/alphal00p-docs-builder/src/lib.rs:12555:46:
  866. 46.82 s gammaloop-nextest-docs> called `Result::unwrap()` on an `Err` value: failed to copy documentation asset crates/spynso3/typst/STIXTwoMath-Regular.woff2
  867. 46.82 s gammaloop-nextest-docs>
  868. 46.82 s gammaloop-nextest-docs> Caused by:
  869. 46.82 s gammaloop-nextest-docs> No such file or directory (os error 2)
  870. 46.82 s gammaloop-nextest-docs>
  871. 46.82 s gammaloop-nextest-docs> Location:
  872. 46.82 s gammaloop-nextest-docs> crates/alphal00p-docs-builder/src/lib.rs:2276:18
  873. 46.82 s gammaloop-nextest-docs> stack backtrace:
  874. 46.82 s gammaloop-nextest-docs> 0: __rustc::rust_begin_unwind
  875. 46.82 s gammaloop-nextest-docs> 1: core::panicking::panic_fmt
  876. 46.82 s gammaloop-nextest-docs> 2: core::result::unwrap_failed
  877. 46.82 s gammaloop-nextest-docs> 3: alphal00p_docs_builder::tests::every_product_orients_rust_to_native_rustdoc_and_keeps_legacy_redirects
  878. 46.82 s gammaloop-nextest-docs> 4: <alphal00p_docs_builder::tests::every_product_orients_rust_to_native_rustdoc_and_keeps_legacy_redirects::{closure#0} as core::ops::function::FnOnce<()>>::call_once
  879. 46.82 s gammaloop-nextest-docs> note: Some details are omitted, run with `RUST_BACKTRACE=full` for a verbose backtrace.
  880. 46.82 s gammaloop-nextest-docs>
  881. 46.82 s gammaloop-nextest-docs> 3. alphal00p-docs-builder::tests::portal_emits_routes_and_valid_assets
  882. 46.82 s gammaloop-nextest-docs> failure: test failure with exit code 101
  883. 46.82 s gammaloop-nextest-docs> thread 'tests::portal_emits_routes_and_valid_assets' (429) panicked at crates/alphal00p-docs-builder/src/lib.rs:9684:14:
  884. 46.82 s gammaloop-nextest-docs> called `Result::unwrap()` on an `Err` value: failed to copy documentation asset crates/spynso3/typst/STIXTwoMath-Regular.woff2
  885. 46.82 s gammaloop-nextest-docs>
  886. 46.82 s gammaloop-nextest-docs> Caused by:
  887. 46.82 s gammaloop-nextest-docs> No such file or directory (os error 2)
  888. 46.82 s gammaloop-nextest-docs>
  889. 46.82 s gammaloop-nextest-docs> Location:
  890. 46.82 s gammaloop-nextest-docs> crates/alphal00p-docs-builder/src/lib.rs:2276:18
  891. 46.82 s gammaloop-nextest-docs> stack backtrace:
  892. 46.82 s gammaloop-nextest-docs> 0: __rustc::rust_begin_unwind
  893. 46.82 s gammaloop-nextest-docs> 1: core::panicking::panic_fmt
  894. 46.82 s gammaloop-nextest-docs> 2: core::result::unwrap_failed
  895. 46.82 s gammaloop-nextest-docs> 3: alphal00p_docs_builder::tests::write_test_portal
  896. 46.82 s gammaloop-nextest-docs> 4: alphal00p_docs_builder::tests::portal_emits_routes_and_valid_assets
  897. 46.82 s gammaloop-nextest-docs> 5: <alphal00p_docs_builder::tests::portal_emits_routes_and_valid_assets::{closure#0} as core::ops::function::FnOnce<()>>::call_once
  898. 46.82 s gammaloop-nextest-docs> note: Some details are omitted, run with `RUST_BACKTRACE=full` for a verbose backtrace.
  899. 46.82 s gammaloop-nextest-docs> system-out
  900. 46.82 s gammaloop-nextest-docs> running 1 test
  901. 46.82 s gammaloop-nextest-docs> test tests::portal_emits_routes_and_valid_assets ... FAILED
  902. 46.82 s gammaloop-nextest-docs>
  903. 46.82 s gammaloop-nextest-docs> failures:
  904. 46.82 s gammaloop-nextest-docs>
  905. 46.82 s gammaloop-nextest-docs> failures:
  906. 46.82 s gammaloop-nextest-docs> tests::portal_emits_routes_and_valid_assets
  907. 46.82 s gammaloop-nextest-docs>
  908. 46.82 s gammaloop-nextest-docs> test result: FAILED. 0 passed; 1 failed; 0 ignored; 0 measured; 128 filtered out; finished in 0.00s
  909. 46.82 s gammaloop-nextest-docs> system-err
  910. 46.82 s gammaloop-nextest-docs> thread 'tests::portal_emits_routes_and_valid_assets' (429) panicked at crates/alphal00p-docs-builder/src/lib.rs:9684:14:
  911. 46.82 s gammaloop-nextest-docs> called `Result::unwrap()` on an `Err` value: failed to copy documentation asset crates/spynso3/typst/STIXTwoMath-Regular.woff2
  912. 46.82 s gammaloop-nextest-docs>
  913. 46.82 s gammaloop-nextest-docs> Caused by:
  914. 46.82 s gammaloop-nextest-docs> No such file or directory (os error 2)
  915. 46.82 s gammaloop-nextest-docs>
  916. 46.82 s gammaloop-nextest-docs> Location:
  917. 46.82 s gammaloop-nextest-docs> crates/alphal00p-docs-builder/src/lib.rs:2276:18
  918. 46.82 s gammaloop-nextest-docs> stack backtrace:
  919. 46.82 s gammaloop-nextest-docs> 0: __rustc::rust_begin_unwind
  920. 46.82 s gammaloop-nextest-docs> 1: core::panicking::panic_fmt
  921. 46.82 s gammaloop-nextest-docs> 2: core::result::unwrap_failed
  922. 46.82 s gammaloop-nextest-docs> 3: alphal00p_docs_builder::tests::write_test_portal
  923. 46.82 s gammaloop-nextest-docs> 4: alphal00p_docs_builder::tests::portal_emits_routes_and_valid_assets
  924. 46.82 s gammaloop-nextest-docs> 5: <alphal00p_docs_builder::tests::portal_emits_routes_and_valid_assets::{closure#0} as core::ops::function::FnOnce<()>>::call_once
  925. 46.82 s gammaloop-nextest-docs> note: Some details are omitted, run with `RUST_BACKTRACE=full` for a verbose backtrace.
  926. 46.82 s gammaloop-nextest-docs>
  927. 46.82 s gammaloop-nextest-docs> 4. alphal00p-docs-builder::tests::portal_and_developer_pages_use_federated_search_and_feedback
  928. 46.82 s gammaloop-nextest-docs> failure: test failure with exit code 101
  929. 46.82 s gammaloop-nextest-docs> thread 'tests::portal_and_developer_pages_use_federated_search_and_feedback' (430) panicked at crates/alphal00p-docs-builder/src/lib.rs:9684:14:
  930. 46.82 s gammaloop-nextest-docs> called `Result::unwrap()` on an `Err` value: failed to copy documentation asset crates/spynso3/typst/STIXTwoMath-Regular.woff2
  931. 46.82 s gammaloop-nextest-docs>
  932. 46.82 s gammaloop-nextest-docs> Caused by:
  933. 46.82 s gammaloop-nextest-docs> No such file or directory (os error 2)
  934. 46.82 s gammaloop-nextest-docs>
  935. 46.82 s gammaloop-nextest-docs> Location:
  936. 46.82 s gammaloop-nextest-docs> crates/alphal00p-docs-builder/src/lib.rs:2276:18
  937. 46.82 s gammaloop-nextest-docs> stack backtrace:
  938. 46.82 s gammaloop-nextest-docs> 0: __rustc::rust_begin_unwind
  939. 46.82 s gammaloop-nextest-docs> 1: core::panicking::panic_fmt
  940. 46.82 s gammaloop-nextest-docs> 2: core::result::unwrap_failed
  941. 46.82 s gammaloop-nextest-docs> 3: alphal00p_docs_builder::tests::write_test_portal
  942. 46.82 s gammaloop-nextest-docs> 4: alphal00p_docs_builder::tests::portal_and_developer_pages_use_federated_search_and_feedback
  943. 46.82 s gammaloop-nextest-docs> 5: <alphal00p_docs_builder::tests::portal_and_developer_pages_use_federated_search_and_feedback::{closure#0} as core::ops::function::FnOnce<()>>::call_once
  944. 46.82 s gammaloop-nextest-docs> note: Some details are omitted, run with `RUST_BACKTRACE=full` for a verbose backtrace.
  945. 46.82 s gammaloop-nextest-docs> system-out
  946. 46.82 s gammaloop-nextest-docs> running 1 test
  947. 46.82 s gammaloop-nextest-docs> test tests::portal_and_developer_pages_use_federated_search_and_feedback ... FAILED
  948. 46.82 s gammaloop-nextest-docs>
  949. 46.82 s gammaloop-nextest-docs> failures:
  950. 46.82 s gammaloop-nextest-docs>
  951. 46.82 s gammaloop-nextest-docs> failures:
  952. 46.82 s gammaloop-nextest-docs> tests::portal_and_developer_pages_use_federated_search_and_feedback
  953. 46.82 s gammaloop-nextest-docs>
  954. 46.82 s gammaloop-nextest-docs> test result: FAILED. 0 passed; 1 failed; 0 ignored; 0 measured; 128 filtered out; finished in 0.01s
  955. 46.82 s gammaloop-nextest-docs> system-err
  956. 46.82 s gammaloop-nextest-docs> thread 'tests::portal_and_developer_pages_use_federated_search_and_feedback' (430) panicked at crates/alphal00p-docs-builder/src/lib.rs:9684:14:
  957. 46.82 s gammaloop-nextest-docs> called `Result::unwrap()` on an `Err` value: failed to copy documentation asset crates/spynso3/typst/STIXTwoMath-Regular.woff2
  958. 46.82 s gammaloop-nextest-docs>
  959. 46.82 s gammaloop-nextest-docs> Caused by:
  960. 46.82 s gammaloop-nextest-docs> No such file or directory (os error 2)
  961. 46.82 s gammaloop-nextest-docs>
  962. 46.82 s gammaloop-nextest-docs> Location:
  963. 46.82 s gammaloop-nextest-docs> crates/alphal00p-docs-builder/src/lib.rs:2276:18
  964. 46.82 s gammaloop-nextest-docs> stack backtrace:
  965. 46.82 s gammaloop-nextest-docs> 0: __rustc::rust_begin_unwind
  966. 46.82 s gammaloop-nextest-docs> 1: core::panicking::panic_fmt
  967. 46.82 s gammaloop-nextest-docs> 2: core::result::unwrap_failed
  968. 46.82 s gammaloop-nextest-docs> 3: alphal00p_docs_builder::tests::write_test_portal
  969. 46.82 s gammaloop-nextest-docs> 4: alphal00p_docs_builder::tests::portal_and_developer_pages_use_federated_search_and_feedback
  970. 46.82 s gammaloop-nextest-docs> 5: <alphal00p_docs_builder::tests::portal_and_developer_pages_use_federated_search_and_feedback::{closure#0} as core::ops::function::FnOnce<()>>::call_once
  971. 46.82 s gammaloop-nextest-docs> note: Some details are omitted, run with `RUST_BACKTRACE=full` for a verbose backtrace.
  972. 46.82 s gammaloop-nextest-docs>
  973. 46.82 s gammaloop-nextest-docs> 5. alphal00p-docs-builder::tests::portal_task_chooser_routes_each_goal_to_the_registered_quickstart
  974. 46.82 s gammaloop-nextest-docs> failure: test failure with exit code 101
  975. 46.82 s gammaloop-nextest-docs> thread 'tests::portal_task_chooser_routes_each_goal_to_the_registered_quickstart' (443) panicked at crates/alphal00p-docs-builder/src/lib.rs:9684:14:
  976. 46.82 s gammaloop-nextest-docs> called `Result::unwrap()` on an `Err` value: failed to copy documentation asset crates/spynso3/typst/STIXTwoMath-Regular.woff2
  977. 46.82 s gammaloop-nextest-docs>
  978. 46.82 s gammaloop-nextest-docs> Caused by:
  979. 46.82 s gammaloop-nextest-docs> No such file or directory (os error 2)
  980. 46.82 s gammaloop-nextest-docs>
  981. 46.82 s gammaloop-nextest-docs> Location:
  982. 46.82 s gammaloop-nextest-docs> crates/alphal00p-docs-builder/src/lib.rs:2276:18
  983. 46.82 s gammaloop-nextest-docs> stack backtrace:
  984. 46.82 s gammaloop-nextest-docs> 0: __rustc::rust_begin_unwind
  985. 46.82 s gammaloop-nextest-docs> 1: core::panicking::panic_fmt
  986. 46.82 s gammaloop-nextest-docs> 2: core::result::unwrap_failed
  987. 46.82 s gammaloop-nextest-docs> 3: alphal00p_docs_builder::tests::write_test_portal
  988. 46.82 s gammaloop-nextest-docs> 4: alphal00p_docs_builder::tests::portal_task_chooser_routes_each_goal_to_the_registered_quickstart
  989. 46.82 s gammaloop-nextest-docs> 5: <alphal00p_docs_builder::tests::portal_task_chooser_routes_each_goal_to_the_registered_quickstart::{closure#0} as core::ops::function::FnOnce<()>>::call_once
  990. 46.82 s gammaloop-nextest-docs> note: Some details are omitted, run with `RUST_BACKTRACE=full` for a verbose backtrace.
  991. 46.82 s gammaloop-nextest-docs> system-out
  992. 46.82 s gammaloop-nextest-docs> running 1 test
  993. 46.82 s gammaloop-nextest-docs> test tests::portal_task_chooser_routes_each_goal_to_the_registered_quickstart ... FAILED
  994. 46.82 s gammaloop-nextest-docs>
  995. 46.82 s gammaloop-nextest-docs> failures:
  996. 46.82 s gammaloop-nextest-docs>
  997. 46.82 s gammaloop-nextest-docs> failures:
  998. 46.82 s gammaloop-nextest-docs> tests::portal_task_chooser_routes_each_goal_to_the_registered_quickstart
  999. 46.82 s gammaloop-nextest-docs>
  1000. 46.82 s gammaloop-nextest-docs> test result: FAILED. 0 passed; 1 failed; 0 ignored; 0 measured; 128 filtered out; finished in 0.00s
  1001. 46.82 s gammaloop-nextest-docs> system-err
  1002. 46.82 s gammaloop-nextest-docs> thread 'tests::portal_task_chooser_routes_each_goal_to_the_registered_quickstart' (443) panicked at crates/alphal00p-docs-builder/src/lib.rs:9684:14:
  1003. 46.82 s gammaloop-nextest-docs> called `Result::unwrap()` on an `Err` value: failed to copy documentation asset crates/spynso3/typst/STIXTwoMath-Regular.woff2
  1004. 46.82 s gammaloop-nextest-docs>
  1005. 46.82 s gammaloop-nextest-docs> Caused by:
  1006. 46.82 s gammaloop-nextest-docs> No such file or directory (os error 2)
  1007. 46.82 s gammaloop-nextest-docs>
  1008. 46.82 s gammaloop-nextest-docs> Location:
  1009. 46.82 s gammaloop-nextest-docs> crates/alphal00p-docs-builder/src/lib.rs:2276:18
  1010. 46.82 s gammaloop-nextest-docs> stack backtrace:
  1011. 46.82 s gammaloop-nextest-docs> 0: __rustc::rust_begin_unwind
  1012. 46.82 s gammaloop-nextest-docs> 1: core::panicking::panic_fmt
  1013. 46.82 s gammaloop-nextest-docs> 2: core::result::unwrap_failed
  1014. 46.82 s gammaloop-nextest-docs> 3: alphal00p_docs_builder::tests::write_test_portal
  1015. 46.82 s gammaloop-nextest-docs> 4: alphal00p_docs_builder::tests::portal_task_chooser_routes_each_goal_to_the_registered_quickstart
  1016. 46.82 s gammaloop-nextest-docs> 5: <alphal00p_docs_builder::tests::portal_task_chooser_routes_each_goal_to_the_registered_quickstart::{closure#0} as core::ops::function::FnOnce<()>>::call_once
  1017. 46.82 s gammaloop-nextest-docs> note: Some details are omitted, run with `RUST_BACKTRACE=full` for a verbose backtrace.
  1018. 46.82 s gammaloop-nextest-docs>
  1019. 46.82 s gammaloop-nextest-docs> 6. alphal00p-docs-builder::tests::checked_in_registry_is_valid
  1020. 46.82 s gammaloop-nextest-docs> failure: test failure with exit code 101
  1021. 46.82 s gammaloop-nextest-docs> thread 'tests::checked_in_registry_is_valid' (214) panicked at crates/alphal00p-docs-builder/src/lib.rs:12260:50:
  1022. 46.82 s gammaloop-nextest-docs> called `Result::unwrap()` on an `Err` value: required documentation source is missing: /build/source/crates/spynso3/typst/STIXTwoMath-Regular.woff2
  1023. 46.82 s gammaloop-nextest-docs>
  1024. 46.82 s gammaloop-nextest-docs> Location:
  1025. 46.82 s gammaloop-nextest-docs> crates/alphal00p-docs-builder/src/lib.rs:5103:9
  1026. 46.82 s gammaloop-nextest-docs> stack backtrace:
  1027. 46.82 s gammaloop-nextest-docs> 0: __rustc::rust_begin_unwind
  1028. 46.82 s gammaloop-nextest-docs> 1: core::panicking::panic_fmt
  1029. 46.82 s gammaloop-nextest-docs> 2: core::result::unwrap_failed
  1030. 46.82 s gammaloop-nextest-docs> 3: alphal00p_docs_builder::tests::checked_in_registry_is_valid
  1031. 46.82 s gammaloop-nextest-docs> 4: <alphal00p_docs_builder::tests::checked_in_registry_is_valid::{closure#0} as core::ops::function::FnOnce<()>>::call_once
  1032. 46.82 s gammaloop-nextest-docs> note: Some details are omitted, run with `RUST_BACKTRACE=full` for a verbose backtrace.
  1033. 46.82 s gammaloop-nextest-docs> system-out
  1034. 46.82 s gammaloop-nextest-docs> running 1 test
  1035. 46.82 s gammaloop-nextest-docs> test tests::checked_in_registry_is_valid ... FAILED
  1036. 46.82 s gammaloop-nextest-docs>
  1037. 46.82 s gammaloop-nextest-docs> failures:
  1038. 46.82 s gammaloop-nextest-docs>
  1039. 46.82 s gammaloop-nextest-docs> failures:
  1040. 46.82 s gammaloop-nextest-docs> tests::checked_in_registry_is_valid
  1041. 46.82 s gammaloop-nextest-docs>
  1042. 46.82 s gammaloop-nextest-docs> test result: FAILED. 0 passed; 1 failed; 0 ignored; 0 measured; 128 filtered out; finished in 0.11s
  1043. 46.82 s gammaloop-nextest-docs> system-err
  1044. 46.82 s gammaloop-nextest-docs> thread 'tests::checked_in_registry_is_valid' (214) panicked at crates/alphal00p-docs-builder/src/lib.rs:12260:50:
  1045. 46.82 s gammaloop-nextest-docs> called `Result::unwrap()` on an `Err` value: required documentation source is missing: /build/source/crates/spynso3/typst/STIXTwoMath-Regular.woff2
  1046. 46.82 s gammaloop-nextest-docs>
  1047. 46.82 s gammaloop-nextest-docs> Location:
  1048. 46.82 s gammaloop-nextest-docs> crates/alphal00p-docs-builder/src/lib.rs:5103:9
  1049. 46.82 s gammaloop-nextest-docs> stack backtrace:
  1050. 46.82 s gammaloop-nextest-docs> 0: __rustc::rust_begin_unwind
  1051. 46.82 s gammaloop-nextest-docs> 1: core::panicking::panic_fmt
  1052. 46.82 s gammaloop-nextest-docs> 2: core::result::unwrap_failed
  1053. 46.82 s gammaloop-nextest-docs> 3: alphal00p_docs_builder::tests::checked_in_registry_is_valid
  1054. 46.82 s gammaloop-nextest-docs> 4: <alphal00p_docs_builder::tests::checked_in_registry_is_valid::{closure#0} as core::ops::function::FnOnce<()>>::call_once
  1055. 46.82 s gammaloop-nextest-docs> note: Some details are omitted, run with `RUST_BACKTRACE=full` for a verbose backtrace.
  1056. 46.82 s gammaloop-nextest-docs>
  1057. 46.82 s gammaloop-nextest-docs> 7. alphal00p-docs-builder::tests::site_assets_replace_read_only_generated_files
  1058. 46.82 s gammaloop-nextest-docs> failure: test failure with exit code 101
  1059. 46.82 s gammaloop-nextest-docs> thread 'tests::site_assets_replace_read_only_generated_files' (669) panicked at crates/alphal00p-docs-builder/src/lib.rs:12305:50:
  1060. 46.82 s gammaloop-nextest-docs> called `Result::unwrap()` on an `Err` value: failed to copy documentation asset crates/spynso3/typst/STIXTwoMath-Regular.woff2
  1061. 46.82 s gammaloop-nextest-docs>
  1062. 46.82 s gammaloop-nextest-docs> Caused by:
  1063. 46.82 s gammaloop-nextest-docs> No such file or directory (os error 2)
  1064. 46.82 s gammaloop-nextest-docs>
  1065. 46.82 s gammaloop-nextest-docs> Location:
  1066. 46.82 s gammaloop-nextest-docs> crates/alphal00p-docs-builder/src/lib.rs:2276:18
  1067. 46.82 s gammaloop-nextest-docs> stack backtrace:
  1068. 46.82 s gammaloop-nextest-docs> 0: __rustc::rust_begin_unwind
  1069. 46.82 s gammaloop-nextest-docs> 1: core::panicking::panic_fmt
  1070. 46.82 s gammaloop-nextest-docs> 2: core::result::unwrap_failed
  1071. 46.82 s gammaloop-nextest-docs> 3: alphal00p_docs_builder::tests::site_assets_replace_read_only_generated_files
  1072. 46.82 s gammaloop-nextest-docs> 4: <alphal00p_docs_builder::tests::site_assets_replace_read_only_generated_files::{closure#0} as core::ops::function::FnOnce<()>>::call_once
  1073. 46.82 s gammaloop-nextest-docs> note: Some details are omitted, run with `RUST_BACKTRACE=full` for a verbose backtrace.
  1074. 46.82 s gammaloop-nextest-docs> system-out
  1075. 46.82 s gammaloop-nextest-docs> running 1 test
  1076. 46.82 s gammaloop-nextest-docs> test tests::site_assets_replace_read_only_generated_files ... FAILED
  1077. 46.82 s gammaloop-nextest-docs>
  1078. 46.82 s gammaloop-nextest-docs> failures:
  1079. 46.82 s gammaloop-nextest-docs>
  1080. 46.82 s gammaloop-nextest-docs> failures:
  1081. 46.82 s gammaloop-nextest-docs> tests::site_assets_replace_read_only_generated_files
  1082. 46.82 s gammaloop-nextest-docs>
  1083. 46.82 s gammaloop-nextest-docs> test result: FAILED. 0 passed; 1 failed; 0 ignored; 0 measured; 128 filtered out; finished in 0.00s
  1084. 46.82 s gammaloop-nextest-docs> system-err
  1085. 46.82 s gammaloop-nextest-docs> thread 'tests::site_assets_replace_read_only_generated_files' (669) panicked at crates/alphal00p-docs-builder/src/lib.rs:12305:50:
  1086. 46.82 s gammaloop-nextest-docs> called `Result::unwrap()` on an `Err` value: failed to copy documentation asset crates/spynso3/typst/STIXTwoMath-Regular.woff2
  1087. 46.82 s gammaloop-nextest-docs>
  1088. 46.82 s gammaloop-nextest-docs> Caused by:
  1089. 46.82 s gammaloop-nextest-docs> No such file or directory (os error 2)
  1090. 46.82 s gammaloop-nextest-docs>
  1091. 46.82 s gammaloop-nextest-docs> Location:
  1092. 46.82 s gammaloop-nextest-docs> crates/alphal00p-docs-builder/src/lib.rs:2276:18
  1093. 46.82 s gammaloop-nextest-docs> stack backtrace:
  1094. 46.82 s gammaloop-nextest-docs> 0: __rustc::rust_begin_unwind
  1095. 46.82 s gammaloop-nextest-docs> 1: core::panicking::panic_fmt
  1096. 46.82 s gammaloop-nextest-docs> 2: core::result::unwrap_failed
  1097. 46.82 s gammaloop-nextest-docs> 3: alphal00p_docs_builder::tests::site_assets_replace_read_only_generated_files
  1098. 46.82 s gammaloop-nextest-docs> 4: <alphal00p_docs_builder::tests::site_assets_replace_read_only_generated_files::{closure#0} as core::ops::function::FnOnce<()>>::call_once
  1099. 46.82 s gammaloop-nextest-docs> note: Some details are omitted, run with `RUST_BACKTRACE=full` for a verbose backtrace.
  1100. 46.82 s gammaloop-nextest-docs>
  1101. 46.82 s gammaloop-nextest-docs> 8. alphal00p-docs-builder::tests::developer_scope_ranges_ignore_unrelated_edits_and_warn_only_while_watching
  1102. 46.82 s gammaloop-nextest-docs> failure: test failure with exit code 101
  1103. 46.82 s gammaloop-nextest-docs> thread 'tests::developer_scope_ranges_ignore_unrelated_edits_and_warn_only_while_watching' (278) panicked at crates/alphal00p-docs-builder/src/lib.rs:12350:29:
  1104. 46.82 s gammaloop-nextest-docs> called `Result::unwrap()` on an `Err` value: required documentation source is missing: /build/source/crates/spynso3/typst/STIXTwoMath-Regular.woff2
  1105. 46.82 s gammaloop-nextest-docs>
  1106. 46.82 s gammaloop-nextest-docs> Location:
  1107. 46.82 s gammaloop-nextest-docs> crates/alphal00p-docs-builder/src/lib.rs:5103:9
  1108. 46.82 s gammaloop-nextest-docs> stack backtrace:
  1109. 46.82 s gammaloop-nextest-docs> 0: __rustc::rust_begin_unwind
  1110. 46.82 s gammaloop-nextest-docs> 1: core::panicking::panic_fmt
  1111. 46.82 s gammaloop-nextest-docs> 2: core::result::unwrap_failed
  1112. 46.82 s gammaloop-nextest-docs> 3: alphal00p_docs_builder::tests::developer_scope_ranges_ignore_unrelated_edits_and_warn_only_while_watching
  1113. 46.82 s gammaloop-nextest-docs> 4: <alphal00p_docs_builder::tests::developer_scope_ranges_ignore_unrelated_edits_and_warn_only_while_watching::{closure#0} as core::ops::function::FnOnce<()>>::call_once
  1114. 46.82 s gammaloop-nextest-docs> note: Some details are omitted, run with `RUST_BACKTRACE=full` for a verbose backtrace.
  1115. 46.82 s gammaloop-nextest-docs> system-out
  1116. 46.82 s gammaloop-nextest-docs> running 1 test
  1117. 46.82 s gammaloop-nextest-docs> test tests::developer_scope_ranges_ignore_unrelated_edits_and_warn_only_while_watching ... FAILED
  1118. 46.82 s gammaloop-nextest-docs>
  1119. 46.82 s gammaloop-nextest-docs> failures:
  1120. 46.82 s gammaloop-nextest-docs>
  1121. 46.82 s gammaloop-nextest-docs> failures:
  1122. 46.82 s gammaloop-nextest-docs> tests::developer_scope_ranges_ignore_unrelated_edits_and_warn_only_while_watching
  1123. 46.82 s gammaloop-nextest-docs>
  1124. 46.82 s gammaloop-nextest-docs> test result: FAILED. 0 passed; 1 failed; 0 ignored; 0 measured; 128 filtered out; finished in 0.11s
  1125. 46.82 s gammaloop-nextest-docs> system-err
  1126. 46.82 s gammaloop-nextest-docs> thread 'tests::developer_scope_ranges_ignore_unrelated_edits_and_warn_only_while_watching' (278) panicked at crates/alphal00p-docs-builder/src/lib.rs:12350:29:
  1127. 46.82 s gammaloop-nextest-docs> called `Result::unwrap()` on an `Err` value: required documentation source is missing: /build/source/crates/spynso3/typst/STIXTwoMath-Regular.woff2
  1128. 46.82 s gammaloop-nextest-docs>
  1129. 46.82 s gammaloop-nextest-docs> Location:
  1130. 46.82 s gammaloop-nextest-docs> crates/alphal00p-docs-builder/src/lib.rs:5103:9
  1131. 46.82 s gammaloop-nextest-docs> stack backtrace:
  1132. 46.82 s gammaloop-nextest-docs> 0: __rustc::rust_begin_unwind
  1133. 46.82 s gammaloop-nextest-docs> 1: core::panicking::panic_fmt
  1134. 46.82 s gammaloop-nextest-docs> 2: core::result::unwrap_failed
  1135. 46.82 s gammaloop-nextest-docs> 3: alphal00p_docs_builder::tests::developer_scope_ranges_ignore_unrelated_edits_and_warn_only_while_watching
  1136. 46.82 s gammaloop-nextest-docs> 4: <alphal00p_docs_builder::tests::developer_scope_ranges_ignore_unrelated_edits_and_warn_only_while_watching::{closure#0} as core::ops::function::FnOnce<()>>::call_once
  1137. 46.82 s gammaloop-nextest-docs> note: Some details are omitted, run with `RUST_BACKTRACE=full` for a verbose backtrace.
  1138. 46.82 s gammaloop-nextest-docs>
  1139. 46.82 s gammaloop-nextest-docs> 9. alphal00p-docs-builder::provenance_tests::each_build_captures_one_revision_before_rendering
  1140. 46.82 s gammaloop-nextest-docs> failure: test failure with exit code 101
  1141. 46.82 s gammaloop-nextest-docs> thread 'provenance_tests::each_build_captures_one_revision_before_rendering' (218) panicked at crates/alphal00p-docs-builder/src/provenance_tests.rs:274:9:
  1142. 46.82 s gammaloop-nextest-docs> assertion failed: command.status().unwrap().success()
  1143. 46.82 s gammaloop-nextest-docs> stack backtrace:
  1144. 46.82 s gammaloop-nextest-docs> 0: __rustc::rust_begin_unwind
  1145. 46.82 s gammaloop-nextest-docs> 1: core::panicking::panic_fmt
  1146. 46.82 s gammaloop-nextest-docs> 2: core::panicking::panic
  1147. 46.82 s gammaloop-nextest-docs> 3: alphal00p_docs_builder::provenance_tests::each_build_captures_one_revision_before_rendering
  1148. 46.82 s gammaloop-nextest-docs> 4: <alphal00p_docs_builder::provenance_tests::each_build_captures_one_revision_before_rendering::{closure#0} as core::ops::function::FnOnce<()>>::call_once
  1149. 46.82 s gammaloop-nextest-docs> note: Some details are omitted, run with `RUST_BACKTRACE=full` for a verbose backtrace.
  1150. 46.82 s gammaloop-nextest-docs> system-out
  1151. 46.82 s gammaloop-nextest-docs> running 1 test
  1152. 46.82 s gammaloop-nextest-docs>
  1153. 46.82 s gammaloop-nextest-docs> running 1 test
  1154. 46.82 s gammaloop-nextest-docs> test provenance_tests::each_build_captures_one_revision_before_rendering ... FAILED
  1155. 46.82 s gammaloop-nextest-docs>
  1156. 46.82 s gammaloop-nextest-docs> failures:
  1157. 46.82 s gammaloop-nextest-docs>
  1158. 46.82 s gammaloop-nextest-docs> failures:
  1159. 46.82 s gammaloop-nextest-docs> provenance_tests::each_build_captures_one_revision_before_rendering
  1160. 46.82 s gammaloop-nextest-docs>
  1161. 46.82 s gammaloop-nextest-docs> test result: FAILED. 0 passed; 1 failed; 0 ignored; 0 measured; 128 filtered out; finished in 0.11s
  1162. 46.82 s gammaloop-nextest-docs>
  1163. 46.82 s gammaloop-nextest-docs> test provenance_tests::each_build_captures_one_revision_before_rendering ... FAILED
  1164. 46.82 s gammaloop-nextest-docs>
  1165. 46.82 s gammaloop-nextest-docs> failures:
  1166. 46.82 s gammaloop-nextest-docs>
  1167. 46.82 s gammaloop-nextest-docs> failures:
  1168. 46.82 s gammaloop-nextest-docs> provenance_tests::each_build_captures_one_revision_before_rendering
  1169. 46.82 s gammaloop-nextest-docs>
  1170. 46.82 s gammaloop-nextest-docs> test result: FAILED. 0 passed; 1 failed; 0 ignored; 0 measured; 128 filtered out; finished in 0.13s
  1171. 46.82 s gammaloop-nextest-docs> system-err
  1172. 46.82 s gammaloop-nextest-docs> thread 'provenance_tests::each_build_captures_one_revision_before_rendering' (284) panicked at crates/alphal00p-docs-builder/src/provenance_tests.rs:297:14:
  1173. 46.82 s gammaloop-nextest-docs> called `Result::unwrap()` on an `Err` value: required documentation source is missing: /build/source/target/nix-ci-tmp/.tmpAH3uti/checkout/crates/spynso3/typst/STIXTwoMath-Regular.woff2
  1174. 46.82 s gammaloop-nextest-docs>
  1175. 46.82 s gammaloop-nextest-docs> Location:
  1176. 46.82 s gammaloop-nextest-docs> crates/alphal00p-docs-builder/src/lib.rs:5103:9
  1177. 46.82 s gammaloop-nextest-docs> stack backtrace:
  1178. 46.82 s gammaloop-nextest-docs> 0: __rustc::rust_begin_unwind
  1179. 46.82 s gammaloop-nextest-docs> 1: core::panicking::panic_fmt
  1180. 46.82 s gammaloop-nextest-docs> 2: core::result::unwrap_failed
  1181. 46.82 s gammaloop-nextest-docs> 3: alphal00p_docs_builder::provenance_tests::each_build_captures_one_revision_before_rendering
  1182. 46.82 s gammaloop-nextest-docs> 4: <alphal00p_docs_builder::provenance_tests::each_build_captures_one_revision_before_rendering::{closure#0} as core::ops::function::FnOnce<()>>::call_once
  1183. 46.82 s gammaloop-nextest-docs> note: Some details are omitted, run with `RUST_BACKTRACE=full` for a verbose backtrace.
  1184. 46.82 s gammaloop-nextest-docs>
  1185. 46.82 s gammaloop-nextest-docs> thread 'provenance_tests::each_build_captures_one_revision_before_rendering' (218) panicked at crates/alphal00p-docs-builder/src/provenance_tests.rs:274:9:
  1186. 46.82 s gammaloop-nextest-docs> assertion failed: command.status().unwrap().success()
  1187. 46.82 s gammaloop-nextest-docs> stack backtrace:
  1188. 46.82 s gammaloop-nextest-docs> 0: __rustc::rust_begin_unwind
  1189. 46.82 s gammaloop-nextest-docs> 1: core::panicking::panic_fmt
  1190. 46.82 s gammaloop-nextest-docs> 2: core::panicking::panic
  1191. 46.82 s gammaloop-nextest-docs> 3: alphal00p_docs_builder::provenance_tests::each_build_captures_one_revision_before_rendering
  1192. 46.82 s gammaloop-nextest-docs> 4: <alphal00p_docs_builder::provenance_tests::each_build_captures_one_revision_before_rendering::{closure#0} as core::ops::function::FnOnce<()>>::call_once
  1193. 46.82 s gammaloop-nextest-docs> note: Some details are omitted, run with `RUST_BACKTRACE=full` for a verbose backtrace.
  1194. 46.82 s gammaloop-nextest-docs>
  1195. 46.82 s gammaloop-nextest-docs> 10. alphal00p-docs-builder::tests::every_product_requires_a_task_chooser_and_each_supported_interface
  1196. 46.82 s gammaloop-nextest-docs> failure: test failure with exit code 101
  1197. 46.82 s gammaloop-nextest-docs> thread 'tests::every_product_requires_a_task_chooser_and_each_supported_interface' (312) panicked at crates/alphal00p-docs-builder/src/lib.rs:12274:9:
  1198. 46.82 s gammaloop-nextest-docs> assertion failed: format!("{error:#}").contains("has no quickstart page")
  1199. 46.82 s gammaloop-nextest-docs> stack backtrace:
  1200. 46.82 s gammaloop-nextest-docs> 0: __rustc::rust_begin_unwind
  1201. 46.82 s gammaloop-nextest-docs> 1: core::panicking::panic_fmt
  1202. 46.82 s gammaloop-nextest-docs> 2: core::panicking::panic
  1203. 46.82 s gammaloop-nextest-docs> 3: alphal00p_docs_builder::tests::every_product_requires_a_task_chooser_and_each_supported_interface
  1204. 46.82 s gammaloop-nextest-docs> 4: <alphal00p_docs_builder::tests::every_product_requires_a_task_chooser_and_each_supported_interface::{closure#0} as core::ops::function::FnOnce<()>>::call_once
  1205. 46.82 s gammaloop-nextest-docs> note: Some details are omitted, run with `RUST_BACKTRACE=full` for a verbose backtrace.
  1206. 46.82 s gammaloop-nextest-docs> system-out
  1207. 46.82 s gammaloop-nextest-docs> running 1 test
  1208. 46.82 s gammaloop-nextest-docs> test tests::every_product_requires_a_task_chooser_and_each_supported_interface ... FAILED
  1209. 46.82 s gammaloop-nextest-docs>
  1210. 46.82 s gammaloop-nextest-docs> failures:
  1211. 46.82 s gammaloop-nextest-docs>
  1212. 46.82 s gammaloop-nextest-docs> failures:
  1213. 46.82 s gammaloop-nextest-docs> tests::every_product_requires_a_task_chooser_and_each_supported_interface
  1214. 46.82 s gammaloop-nextest-docs>
  1215. 46.82 s gammaloop-nextest-docs> test result: FAILED. 0 passed; 1 failed; 0 ignored; 0 measured; 128 filtered out; finished in 0.12s
  1216. 46.82 s gammaloop-nextest-docs> system-err
  1217. 46.82 s gammaloop-nextest-docs> thread 'tests::every_product_requires_a_task_chooser_and_each_supported_interface' (312) panicked at crates/alphal00p-docs-builder/src/lib.rs:12274:9:
  1218. 46.82 s gammaloop-nextest-docs> assertion failed: format!("{error:#}").contains("has no quickstart page")
  1219. 46.82 s gammaloop-nextest-docs> stack backtrace:
  1220. 46.82 s gammaloop-nextest-docs> 0: __rustc::rust_begin_unwind
  1221. 46.82 s gammaloop-nextest-docs> 1: core::panicking::panic_fmt
  1222. 46.82 s gammaloop-nextest-docs> 2: core::panicking::panic
  1223. 46.82 s gammaloop-nextest-docs> 3: alphal00p_docs_builder::tests::every_product_requires_a_task_chooser_and_each_supported_interface
  1224. 46.82 s gammaloop-nextest-docs> 4: <alphal00p_docs_builder::tests::every_product_requires_a_task_chooser_and_each_supported_interface::{closure#0} as core::ops::function::FnOnce<()>>::call_once
  1225. 46.82 s gammaloop-nextest-docs> note: Some details are omitted, run with `RUST_BACKTRACE=full` for a verbose backtrace.
  1226. 46.82 s gammaloop-nextest-docs>
  1227. 46.82 s gammaloop-nextest-docs> 11. alphal00p-docs-builder::tests::pdf_manual_chapter_order_must_match_the_page_registry
  1228. 46.82 s gammaloop-nextest-docs> failure: test failure with exit code 101
  1229. 46.82 s gammaloop-nextest-docs> thread 'tests::pdf_manual_chapter_order_must_match_the_page_registry' (397) panicked at crates/alphal00p-docs-builder/src/lib.rs:12330:9:
  1230. 46.82 s gammaloop-nextest-docs> assertion failed: format!("{error:#}").contains("PDF manual chapter order differs")
  1231. 46.82 s gammaloop-nextest-docs> stack backtrace:
  1232. 46.82 s gammaloop-nextest-docs> 0: __rustc::rust_begin_unwind
  1233. 46.82 s gammaloop-nextest-docs> 1: core::panicking::panic_fmt
  1234. 46.82 s gammaloop-nextest-docs> 2: core::panicking::panic
  1235. 46.82 s gammaloop-nextest-docs> 3: alphal00p_docs_builder::tests::pdf_manual_chapter_order_must_match_the_page_registry
  1236. 46.82 s gammaloop-nextest-docs> 4: <alphal00p_docs_builder::tests::pdf_manual_chapter_order_must_match_the_page_registry::{closure#0} as core::ops::function::FnOnce<()>>::call_once
  1237. 46.82 s gammaloop-nextest-docs> note: Some details are omitted, run with `RUST_BACKTRACE=full` for a verbose backtrace.
  1238. 46.82 s gammaloop-nextest-docs> system-out
  1239. 46.82 s gammaloop-nextest-docs> running 1 test
  1240. 46.82 s gammaloop-nextest-docs> test tests::pdf_manual_chapter_order_must_match_the_page_registry ... FAILED
  1241. 46.82 s gammaloop-nextest-docs>
  1242. 46.82 s gammaloop-nextest-docs> failures:
  1243. 46.82 s gammaloop-nextest-docs>
  1244. 46.82 s gammaloop-nextest-docs> failures:
  1245. 46.82 s gammaloop-nextest-docs> tests::pdf_manual_chapter_order_must_match_the_page_registry
  1246. 46.82 s gammaloop-nextest-docs>
  1247. 46.82 s gammaloop-nextest-docs> test result: FAILED. 0 passed; 1 failed; 0 ignored; 0 measured; 128 filtered out; finished in 0.11s
  1248. 46.82 s gammaloop-nextest-docs> system-err
  1249. 46.82 s gammaloop-nextest-docs> thread 'tests::pdf_manual_chapter_order_must_match_the_page_registry' (397) panicked at crates/alphal00p-docs-builder/src/lib.rs:12330:9:
  1250. 46.82 s gammaloop-nextest-docs> assertion failed: format!("{error:#}").contains("PDF manual chapter order differs")
  1251. 46.82 s gammaloop-nextest-docs> stack backtrace:
  1252. 46.82 s gammaloop-nextest-docs> 0: __rustc::rust_begin_unwind
  1253. 46.82 s gammaloop-nextest-docs> 1: core::panicking::panic_fmt
  1254. 46.82 s gammaloop-nextest-docs> 2: core::panicking::panic
  1255. 46.82 s gammaloop-nextest-docs> 3: alphal00p_docs_builder::tests::pdf_manual_chapter_order_must_match_the_page_registry
  1256. 46.82 s gammaloop-nextest-docs> 4: <alphal00p_docs_builder::tests::pdf_manual_chapter_order_must_match_the_page_registry::{closure#0} as core::ops::function::FnOnce<()>>::call_once
  1257. 46.82 s gammaloop-nextest-docs> note: Some details are omitted, run with `RUST_BACKTRACE=full` for a verbose backtrace.
  1258. 46.82 s gammaloop-nextest-docs> =========================================
  1259. 46.83 s gammaloop-nextest-docs> Extracting 2 binaries to /build/source
  1260. 46.87 s gammaloop-nextest-docs> Extracted 5 files to /build/source in 0.04s
  1261. 46.88 s gammaloop-nextest-docs> ------------
  1262. 46.88 s gammaloop-nextest-docs> Nextest run ID cc6692dc-2123-4448-be1f-d87456592287 with nextest profile: ci_gammaloop
  1263. 46.88 s gammaloop-nextest-docs> Starting 22 tests across 2 binaries
  1264. 46.90 s gammaloop-nextest-docs> ------------
  1265. 46.90 s gammaloop-nextest-docs> Summary [ 0.018s] 22 tests run: 22 passed, 0 skipped
  1266. 46.93 s gammaloop-nextest-docs>
  1267. 46.93 s gammaloop-nextest-docs> ========== nextest test summary ==========
  1268. 46.93 s gammaloop-nextest-docs> report: target/nextest/ci_gammaloop/junit.xml
  1269. 46.93 s gammaloop-nextest-docs> tests: 22, failures: 0, errors: 0
  1270. 46.93 s gammaloop-nextest-docs> No failing testcases found.
  1271. 46.93 s gammaloop-nextest-docs> =========================================
  1272. 46.94 s gammaloop-nextest-docs> Extracting 3 binaries (including 2 non-test binaries), 1 build script output directory, and 2 linked paths to /build/source
  1273. 47.21 s gammaloop-nextest-docs> Extracted 22 files to /build/source in 0.27s
  1274. 47.22 s gammaloop-nextest-docs> ------------
  1275. 47.22 s gammaloop-nextest-docs> Nextest run ID 0876bde2-8b11-4b7a-b730-1866a64edca0 with nextest profile: ci_gammaloop
  1276. 47.22 s gammaloop-nextest-docs> Starting 89 tests across 1 binary
  1277. 47.26 s gammaloop-nextest-docs> ------------
  1278. 47.26 s gammaloop-nextest-docs> Summary [ 0.038s] 89 tests run: 89 passed, 0 skipped
  1279. 47.29 s gammaloop-nextest-docs>
  1280. 47.29 s gammaloop-nextest-docs> ========== nextest test summary ==========
  1281. 47.29 s gammaloop-nextest-docs> report: target/nextest/ci_gammaloop/junit.xml
  1282. 47.29 s gammaloop-nextest-docs> tests: 89, failures: 0, errors: 0
  1283. 47.29 s gammaloop-nextest-docs> No failing testcases found.
  1284. 47.29 s gammaloop-nextest-docs> =========================================
  1285. 47.30 s gammaloop-nextest-docs> Extracting 2 binaries to /build/source
  1286. 47.34 s gammaloop-nextest-docs> Extracted 5 files to /build/source in 0.04s
  1287. 47.35 s gammaloop-nextest-docs> ------------
  1288. 47.35 s gammaloop-nextest-docs> Nextest run ID 620f1710-85a5-4d7d-af32-5d3fb6680747 with nextest profile: ci_gammaloop
  1289. 47.35 s gammaloop-nextest-docs> Starting 10 tests across 2 binaries
  1290. 59.58 s gammaloop-nextest-docs> ------------
  1291. 59.58 s gammaloop-nextest-docs> Summary [ 12.227s] 10 tests run: 10 passed, 0 skipped
  1292. 59.61 s gammaloop-nextest-docs>
  1293. 59.61 s gammaloop-nextest-docs> ========== nextest test summary ==========
  1294. 59.61 s gammaloop-nextest-docs> report: target/nextest/ci_gammaloop/junit.xml
  1295. 59.61 s gammaloop-nextest-docs> tests: 10, failures: 0, errors: 0
  1296. 59.61 s gammaloop-nextest-docs> No failing testcases found.
  1297. 59.61 s gammaloop-nextest-docs> =========================================
  1298. 59.63 s gammaloop-nextest-docs> Extracting 1 binary to /build/source
  1299. 59.66 s gammaloop-nextest-docs> Extracted 4 files to /build/source in 0.04s
  1300. 59.67 s gammaloop-nextest-docs> ------------
  1301. 59.67 s gammaloop-nextest-docs> Nextest run ID 554cdea1-98e0-4eb0-abed-7931a71a921a with nextest profile: ci_gammaloop
  1302. 59.67 s gammaloop-nextest-docs> Starting 0 tests across 1 binary
  1303. 59.67 s gammaloop-nextest-docs> ------------
  1304. 59.67 s gammaloop-nextest-docs> Summary [ 0.000s] 0 tests run: 0 passed, 0 skipped
  1305. 59.70 s gammaloop-nextest-docs>
  1306. 59.70 s gammaloop-nextest-docs> ========== nextest test summary ==========
  1307. 59.70 s gammaloop-nextest-docs> report: target/nextest/ci_gammaloop/junit.xml
  1308. 59.70 s gammaloop-nextest-docs> tests: 0, failures: 0, errors: 0
  1309. 59.70 s gammaloop-nextest-docs> No failing testcases found.
  1310. 59.70 s gammaloop-nextest-docs> =========================================
  1311. 59.71 s gammaloop-nextest-docs> Extracting 1 binary to /build/source
  1312. 59.75 s gammaloop-nextest-docs> Extracted 4 files to /build/source in 0.04s
  1313. 59.76 s gammaloop-nextest-docs> ------------
  1314. 59.76 s gammaloop-nextest-docs> Nextest run ID 0e523ab5-b874-44f9-9ff4-56a920af0668 with nextest profile: ci_gammaloop
  1315. 59.76 s gammaloop-nextest-docs> Starting 5 tests across 1 binary
  1316. 59.76 s gammaloop-nextest-docs> ------------
  1317. 59.76 s gammaloop-nextest-docs> Summary [ 0.006s] 5 tests run: 5 passed, 0 skipped
  1318. 59.79 s gammaloop-nextest-docs>
  1319. 59.79 s gammaloop-nextest-docs> ========== nextest test summary ==========
  1320. 59.79 s gammaloop-nextest-docs> report: target/nextest/ci_gammaloop/junit.xml
  1321. 59.79 s gammaloop-nextest-docs> tests: 5, failures: 0, errors: 0
  1322. 59.79 s gammaloop-nextest-docs> No failing testcases found.
  1323. 59.79 s gammaloop-nextest-docs> =========================================
  1324. 59.99 s error: Cannot build '/nix/store/yhcpczfzd32fj8slcs1lsa10nlfs6yzl-gammaloop-nextest-docs.drv'.
  1325. 59.99 s Reason: builder failed with exit code 100.
  1326. 59.99 s Output paths:
  1327. 59.99 s /nix/store/j1nkfs263f0lyg41i99f3f56r6b8p9mh-gammaloop-nextest-docs
  1328. 59.99 s Last 1232 log lines:
  1329. 59.99 s > Extracting 2 binaries to /build/source
  1330. 59.99 s > Extracted 5 files to /build/source in 0.04s
  1331. 59.99 s > ------------
  1332. 59.99 s > Nextest run ID 66408cd5-4292-4ece-98d1-c63d8bc8a919 with nextest profile: ci_gammaloop
  1333. 59.99 s > Starting 129 tests across 2 binaries
  1334. 59.99 s > FAIL [ 0.012s] ( 22/129) alphal00p-docs-builder tests::developer_architecture_is_classified_searchable_and_source_backed
  1335. 59.99 s > stdout ---
  1336. 59.99 s >
  1337. 59.99 s > running 1 test
  1338. 59.99 s > test tests::developer_architecture_is_classified_searchable_and_source_backed ... FAILED
  1339. 59.99 s >
  1340. 59.99 s > failures:
  1341. 59.99 s >
  1342. 59.99 s > failures:
  1343. 59.99 s > tests::developer_architecture_is_classified_searchable_and_source_backed
  1344. 59.99 s >
  1345. 59.99 s > test result: FAILED. 0 passed; 1 failed; 0 ignored; 0 measured; 128 filtered out; finished in 0.01s
  1346. 59.99 s >
  1347. 59.99 s > stderr ---
  1348. 59.99 s >
  1349. 59.99 s > thread 'tests::developer_architecture_is_classified_searchable_and_source_backed' (273) panicked at crates/alphal00p-docs-builder/src/lib.rs:12751:14:
  1350. 59.99 s > called `Result::unwrap()` on an `Err` value: failed to copy documentation asset crates/spynso3/typst/STIXTwoMath-Regular.woff2
  1351. 59.99 s >
  1352. 59.99 s > Caused by:
  1353. 59.99 s > No such file or directory (os error 2)
  1354. 59.99 s >
  1355. 59.99 s > Location:
  1356. 59.99 s > crates/alphal00p-docs-builder/src/lib.rs:2276:18
  1357. 59.99 s > stack backtrace:
  1358. 59.99 s > 0: __rustc::rust_begin_unwind
  1359. 59.99 s > 1: core::panicking::panic_fmt
  1360. 59.99 s > 2: core::result::unwrap_failed
  1361. 59.99 s > 3: alphal00p_docs_builder::tests::developer_architecture_is_classified_searchable_and_source_backed
  1362. 59.99 s > 4: <alphal00p_docs_builder::tests::developer_architecture_is_classified_searchable_and_source_backed::{closure#0} as core::ops::function::FnOnce<()>>::call_once
  1363. 59.99 s > note: Some details are omitted, run with `RUST_BACKTRACE=full` for a verbose backtrace.
  1364. 59.99 s >
  1365. 59.99 s > FAIL [ 0.011s] ( 29/129) alphal00p-docs-builder tests::every_product_orients_rust_to_native_rustdoc_and_keeps_legacy_redirects
  1366. 59.99 s > stdout ---
  1367. 59.99 s >
  1368. 59.99 s > running 1 test
  1369. 59.99 s > test tests::every_product_orients_rust_to_native_rustdoc_and_keeps_legacy_redirects ... FAILED
  1370. 59.99 s >
  1371. 59.99 s > failures:
  1372. 59.99 s >
  1373. 59.99 s > failures:
  1374. 59.99 s > tests::every_product_orients_rust_to_native_rustdoc_and_keeps_legacy_redirects
  1375. 59.99 s >
  1376. 59.99 s > test result: FAILED. 0 passed; 1 failed; 0 ignored; 0 measured; 128 filtered out; finished in 0.01s
  1377. 59.99 s >
  1378. 59.99 s > stderr ---
  1379. 59.99 s >
  1380. 59.99 s > thread 'tests::every_product_orients_rust_to_native_rustdoc_and_keeps_legacy_redirects' (301) panicked at crates/alphal00p-docs-builder/src/lib.rs:12555:46:
  1381. 59.99 s > called `Result::unwrap()` on an `Err` value: failed to copy documentation asset crates/spynso3/typst/STIXTwoMath-Regular.woff2
  1382. 59.99 s >
  1383. 59.99 s > Caused by:
  1384. 59.99 s > No such file or directory (os error 2)
  1385. 59.99 s >
  1386. 59.99 s > Location:
  1387. 59.99 s > crates/alphal00p-docs-builder/src/lib.rs:2276:18
  1388. 59.99 s > stack backtrace:
  1389. 59.99 s > 0: __rustc::rust_begin_unwind
  1390. 59.99 s > 1: core::panicking::panic_fmt
  1391. 59.99 s > 2: core::result::unwrap_failed
  1392. 59.99 s > 3: alphal00p_docs_builder::tests::every_product_orients_rust_to_native_rustdoc_and_keeps_legacy_redirects
  1393. 59.99 s > 4: <alphal00p_docs_builder::tests::every_product_orients_rust_to_native_rustdoc_and_keeps_legacy_redirects::{closure#0} as core::ops::function::FnOnce<()>>::call_once
  1394. 59.99 s > note: Some details are omitted, run with `RUST_BACKTRACE=full` for a verbose backtrace.
  1395. 59.99 s >
  1396. 59.99 s > FAIL [ 0.010s] ( 53/129) alphal00p-docs-builder tests::portal_emits_routes_and_valid_assets
  1397. 59.99 s > stdout ---
  1398. 59.99 s >
  1399. 59.99 s > running 1 test
  1400. 59.99 s > test tests::portal_emits_routes_and_valid_assets ... FAILED
  1401. 59.99 s >
  1402. 59.99 s > failures:
  1403. 59.99 s >
  1404. 59.99 s > failures:
  1405. 59.99 s > tests::portal_emits_routes_and_valid_assets
  1406. 59.99 s >
  1407. 59.99 s > test result: FAILED. 0 passed; 1 failed; 0 ignored; 0 measured; 128 filtered out; finished in 0.00s
  1408. 59.99 s >
  1409. 59.99 s > stderr ---
  1410. 59.99 s >
  1411. 59.99 s > thread 'tests::portal_emits_routes_and_valid_assets' (429) panicked at crates/alphal00p-docs-builder/src/lib.rs:9684:14:
  1412. 59.99 s > called `Result::unwrap()` on an `Err` value: failed to copy documentation asset crates/spynso3/typst/STIXTwoMath-Regular.woff2
  1413. 59.99 s >
  1414. 59.99 s > Caused by:
  1415. 59.99 s > No such file or directory (os error 2)
  1416. 59.99 s >
  1417. 59.99 s > Location:
  1418. 59.99 s > crates/alphal00p-docs-builder/src/lib.rs:2276:18
  1419. 59.99 s > stack backtrace:
  1420. 59.99 s > 0: __rustc::rust_begin_unwind
  1421. 59.99 s > 1: core::panicking::panic_fmt
  1422. 59.99 s > 2: core::result::unwrap_failed
  1423. 59.99 s > 3: alphal00p_docs_builder::tests::write_test_portal
  1424. 59.99 s > 4: alphal00p_docs_builder::tests::portal_emits_routes_and_valid_assets
  1425. 59.99 s > 5: <alphal00p_docs_builder::tests::portal_emits_routes_and_valid_assets::{closure#0} as core::ops::function::FnOnce<()>>::call_once
  1426. 59.99 s > note: Some details are omitted, run with `RUST_BACKTRACE=full` for a verbose backtrace.
  1427. 59.99 s >
  1428. 59.99 s > FAIL [ 0.011s] ( 54/129) alphal00p-docs-builder tests::portal_and_developer_pages_use_federated_search_and_feedback
  1429. 59.99 s > stdout ---
  1430. 59.99 s >
  1431. 59.99 s > running 1 test
  1432. 59.99 s > test tests::portal_and_developer_pages_use_federated_search_and_feedback ... FAILED
  1433. 59.99 s >
  1434. 59.99 s > failures:
  1435. 59.99 s >
  1436. 59.99 s > failures:
  1437. 59.99 s > tests::portal_and_developer_pages_use_federated_search_and_feedback
  1438. 59.99 s >
  1439. 59.99 s > test result: FAILED. 0 passed; 1 failed; 0 ignored; 0 measured; 128 filtered out; finished in 0.01s
  1440. 59.99 s >
  1441. 59.99 s > stderr ---
  1442. 59.99 s >
  1443. 59.99 s > thread 'tests::portal_and_developer_pages_use_federated_search_and_feedback' (430) panicked at crates/alphal00p-docs-builder/src/lib.rs:9684:14:
  1444. 59.99 s > called `Result::unwrap()` on an `Err` value: failed to copy documentation asset crates/spynso3/typst/STIXTwoMath-Regular.woff2
  1445. 59.99 s >
  1446. 59.99 s > Caused by:
  1447. 59.99 s > No such file or directory (os error 2)
  1448. 59.99 s >
  1449. 59.99 s > Location:
  1450. 59.99 s > crates/alphal00p-docs-builder/src/lib.rs:2276:18
  1451. 59.99 s > stack backtrace:
  1452. 59.99 s > 0: __rustc::rust_begin_unwind
  1453. 59.99 s > 1: core::panicking::panic_fmt
  1454. 59.99 s > 2: core::result::unwrap_failed
  1455. 59.99 s > 3: alphal00p_docs_builder::tests::write_test_portal
  1456. 59.99 s > 4: alphal00p_docs_builder::tests::portal_and_developer_pages_use_federated_search_and_feedback
  1457. 59.99 s > 5: <alphal00p_docs_builder::tests::portal_and_developer_pages_use_federated_search_and_feedback::{closure#0} as core::ops::function::FnOnce<()>>::call_once
  1458. 59.99 s > note: Some details are omitted, run with `RUST_BACKTRACE=full` for a verbose backtrace.
  1459. 59.99 s >
  1460. 59.99 s > FAIL [ 0.009s] ( 55/129) alphal00p-docs-builder tests::portal_task_chooser_routes_each_goal_to_the_registered_quickstart
  1461. 59.99 s > stdout ---
  1462. 59.99 s >
  1463. 59.99 s > running 1 test
  1464. 59.99 s > test tests::portal_task_chooser_routes_each_goal_to_the_registered_quickstart ... FAILED
  1465. 59.99 s >
  1466. 59.99 s > failures:
  1467. 59.99 s >
  1468. 59.99 s > failures:
  1469. 59.99 s > tests::portal_task_chooser_routes_each_goal_to_the_registered_quickstart
  1470. 59.99 s >
  1471. 59.99 s > test result: FAILED. 0 passed; 1 failed; 0 ignored; 0 measured; 128 filtered out; finished in 0.00s
  1472. 59.99 s >
  1473. 59.99 s > stderr ---
  1474. 59.99 s >
  1475. 59.99 s > thread 'tests::portal_task_chooser_routes_each_goal_to_the_registered_quickstart' (443) panicked at crates/alphal00p-docs-builder/src/lib.rs:9684:14:
  1476. 59.99 s > called `Result::unwrap()` on an `Err` value: failed to copy documentation asset crates/spynso3/typst/STIXTwoMath-Regular.woff2
  1477. 59.99 s >
  1478. 59.99 s > Caused by:
  1479. 59.99 s > No such file or directory (os error 2)
  1480. 59.99 s >
  1481. 59.99 s > Location:
  1482. 59.99 s > crates/alphal00p-docs-builder/src/lib.rs:2276:18
  1483. 59.99 s > stack backtrace:
  1484. 59.99 s > 0: __rustc::rust_begin_unwind
  1485. 59.99 s > 1: core::panicking::panic_fmt
  1486. 59.99 s > 2: core::result::unwrap_failed
  1487. 59.99 s > 3: alphal00p_docs_builder::tests::write_test_portal
  1488. 59.99 s > 4: alphal00p_docs_builder::tests::portal_task_chooser_routes_each_goal_to_the_registered_quickstart
  1489. 59.99 s > 5: <alphal00p_docs_builder::tests::portal_task_chooser_routes_each_goal_to_the_registered_quickstart::{closure#0} as core::ops::function::FnOnce<()>>::call_once
  1490. 59.99 s > note: Some details are omitted, run with `RUST_BACKTRACE=full` for a verbose backtrace.
  1491. 59.99 s >
  1492. 59.99 s > FAIL [ 0.123s] ( 83/129) alphal00p-docs-builder tests::checked_in_registry_is_valid
  1493. 59.99 s > stdout ---
  1494. 59.99 s >
  1495. 59.99 s > running 1 test
  1496. 59.99 s > test tests::checked_in_registry_is_valid ... FAILED
  1497. 59.99 s >
  1498. 59.99 s > failures:
  1499. 59.99 s >
  1500. 59.99 s > failures:
  1501. 59.99 s > tests::checked_in_registry_is_valid
  1502. 59.99 s >
  1503. 59.99 s > test result: FAILED. 0 passed; 1 failed; 0 ignored; 0 measured; 128 filtered out; finished in 0.11s
  1504. 59.99 s >
  1505. 59.99 s > stderr ---
  1506. 59.99 s >
  1507. 59.99 s > thread 'tests::checked_in_registry_is_valid' (214) panicked at crates/alphal00p-docs-builder/src/lib.rs:12260:50:
  1508. 59.99 s > called `Result::unwrap()` on an `Err` value: required documentation source is missing: /build/source/crates/spynso3/typst/STIXTwoMath-Regular.woff2
  1509. 59.99 s >
  1510. 59.99 s > Location:
  1511. 59.99 s > crates/alphal00p-docs-builder/src/lib.rs:5103:9
  1512. 59.99 s > stack backtrace:
  1513. 59.99 s > 0: __rustc::rust_begin_unwind
  1514. 59.99 s > 1: core::panicking::panic_fmt
  1515. 59.99 s > 2: core::result::unwrap_failed
  1516. 59.99 s > 3: alphal00p_docs_builder::tests::checked_in_registry_is_valid
  1517. 59.99 s > 4: <alphal00p_docs_builder::tests::checked_in_registry_is_valid::{closure#0} as core::ops::function::FnOnce<()>>::call_once
  1518. 59.99 s > note: Some details are omitted, run with `RUST_BACKTRACE=full` for a verbose backtrace.
  1519. 59.99 s >
  1520. 59.99 s > FAIL [ 0.009s] ( 87/129) alphal00p-docs-builder tests::site_assets_replace_read_only_generated_files
  1521. 59.99 s > stdout ---
  1522. 59.99 s >
  1523. 59.99 s > running 1 test
  1524. 59.99 s > test tests::site_assets_replace_read_only_generated_files ... FAILED
  1525. 59.99 s >
  1526. 59.99 s > failures:
  1527. 59.99 s >
  1528. 59.99 s > failures:
  1529. 59.99 s > tests::site_assets_replace_read_only_generated_files
  1530. 59.99 s >
  1531. 59.99 s > test result: FAILED. 0 passed; 1 failed; 0 ignored; 0 measured; 128 filtered out; finished in 0.00s
  1532. 59.99 s >
  1533. 59.99 s > stderr ---
  1534. 59.99 s >
  1535. 59.99 s > thread 'tests::site_assets_replace_read_only_generated_files' (669) panicked at crates/alphal00p-docs-builder/src/lib.rs:12305:50:
  1536. 59.99 s > called `Result::unwrap()` on an `Err` value: failed to copy documentation asset crates/spynso3/typst/STIXTwoMath-Regular.woff2
  1537. 59.99 s >
  1538. 59.99 s > Caused by:
  1539. 59.99 s > No such file or directory (os error 2)
  1540. 59.99 s >
  1541. 59.99 s > Location:
  1542. 59.99 s > crates/alphal00p-docs-builder/src/lib.rs:2276:18
  1543. 59.99 s > stack backtrace:
  1544. 59.99 s > 0: __rustc::rust_begin_unwind
  1545. 59.99 s > 1: core::panicking::panic_fmt
  1546. 59.99 s > 2: core::result::unwrap_failed
  1547. 59.99 s > 3: alphal00p_docs_builder::tests::site_assets_replace_read_only_generated_files
  1548. 59.99 s > 4: <alphal00p_docs_builder::tests::site_assets_replace_read_only_generated_files::{closure#0} as core::ops::function::FnOnce<()>>::call_once
  1549. 59.99 s > note: Some details are omitted, run with `RUST_BACKTRACE=full` for a verbose backtrace.
  1550. 59.99 s >
  1551. 59.99 s > FAIL [ 0.114s] ( 89/129) alphal00p-docs-builder tests::developer_scope_ranges_ignore_unrelated_edits_and_warn_only_while_watching
  1552. 59.99 s > stdout ---
  1553. 59.99 s >
  1554. 59.99 s > running 1 test
  1555. 59.99 s > test tests::developer_scope_ranges_ignore_unrelated_edits_and_warn_only_while_watching ... FAILED
  1556. 59.99 s >
  1557. 59.99 s > failures:
  1558. 59.99 s >
  1559. 59.99 s > failures:
  1560. 59.99 s > tests::developer_scope_ranges_ignore_unrelated_edits_and_warn_only_while_watching
  1561. 59.99 s >
  1562. 59.99 s > test result: FAILED. 0 passed; 1 failed; 0 ignored; 0 measured; 128 filtered out; finished in 0.11s
  1563. 59.99 s >
  1564. 59.99 s > stderr ---
  1565. 59.99 s >
  1566. 59.99 s > thread 'tests::developer_scope_ranges_ignore_unrelated_edits_and_warn_only_while_watching' (278) panicked at crates/alphal00p-docs-builder/src/lib.rs:12350:29:
  1567. 59.99 s > called `Result::unwrap()` on an `Err` value: required documentation source is missing: /build/source/crates/spynso3/typst/STIXTwoMath-Regular.woff2
  1568. 59.99 s >
  1569. 59.99 s > Location:
  1570. 59.99 s > crates/alphal00p-docs-builder/src/lib.rs:5103:9
  1571. 59.99 s > stack backtrace:
  1572. 59.99 s > 0: __rustc::rust_begin_unwind
  1573. 59.99 s > 1: core::panicking::panic_fmt
  1574. 59.99 s > 2: core::result::unwrap_failed
  1575. 59.99 s > 3: alphal00p_docs_builder::tests::developer_scope_ranges_ignore_unrelated_edits_and_warn_only_while_watching
  1576. 59.99 s > 4: <alphal00p_docs_builder::tests::developer_scope_ranges_ignore_unrelated_edits_and_warn_only_while_watching::{closure#0} as core::ops::function::FnOnce<()>>::call_once
  1577. 59.99 s > note: Some details are omitted, run with `RUST_BACKTRACE=full` for a verbose backtrace.
  1578. 59.99 s >
  1579. 59.99 s > FAIL [ 0.142s] ( 96/129) alphal00p-docs-builder provenance_tests::each_build_captures_one_revision_before_rendering
  1580. 59.99 s > stdout ---
  1581. 59.99 s >
  1582. 59.99 s > running 1 test
  1583. 59.99 s >
  1584. 59.99 s > running 1 test
  1585. 59.99 s > test provenance_tests::each_build_captures_one_revision_before_rendering ... FAILED
  1586. 59.99 s >
  1587. 59.99 s > failures:
  1588. 59.99 s >
  1589. 59.99 s > failures:
  1590. 59.99 s > provenance_tests::each_build_captures_one_revision_before_rendering
  1591. 59.99 s >
  1592. 59.99 s > test result: FAILED. 0 passed; 1 failed; 0 ignored; 0 measured; 128 filtered out; finished in 0.11s
  1593. 59.99 s >
  1594. 59.99 s > test provenance_tests::each_build_captures_one_revision_before_rendering ... FAILED
  1595. 59.99 s >
  1596. 59.99 s > failures:
  1597. 59.99 s >
  1598. 59.99 s > failures:
  1599. 59.99 s > provenance_tests::each_build_captures_one_revision_before_rendering
  1600. 59.99 s >
  1601. 59.99 s > test result: FAILED. 0 passed; 1 failed; 0 ignored; 0 measured; 128 filtered out; finished in 0.13s
  1602. 59.99 s >
  1603. 59.99 s > stderr ---
  1604. 59.99 s >
  1605. 59.99 s > thread 'provenance_tests::each_build_captures_one_revision_before_rendering' (284) panicked at crates/alphal00p-docs-builder/src/provenance_tests.rs:297:14:
  1606. 59.99 s > called `Result::unwrap()` on an `Err` value: required documentation source is missing: /build/source/target/nix-ci-tmp/.tmpAH3uti/checkout/crates/spynso3/typst/STIXTwoMath-Regular.woff2
  1607. 59.99 s >
  1608. 59.99 s > Location:
  1609. 59.99 s > crates/alphal00p-docs-builder/src/lib.rs:5103:9
  1610. 59.99 s > stack backtrace:
  1611. 59.99 s > 0: __rustc::rust_begin_unwind
  1612. 59.99 s > 1: core::panicking::panic_fmt
  1613. 59.99 s > 2: core::result::unwrap_failed
  1614. 59.99 s > 3: alphal00p_docs_builder::provenance_tests::each_build_captures_one_revision_before_rendering
  1615. 59.99 s > 4: <alphal00p_docs_builder::provenance_tests::each_build_captures_one_revision_before_rendering::{closure#0} as core::ops::function::FnOnce<()>>::call_once
  1616. 59.99 s > note: Some details are omitted, run with `RUST_BACKTRACE=full` for a verbose backtrace.
  1617. 59.99 s >
  1618. 59.99 s > thread 'provenance_tests::each_build_captures_one_revision_before_rendering' (218) panicked at crates/alphal00p-docs-builder/src/provenance_tests.rs:274:9:
  1619. 59.99 s > assertion failed: command.status().unwrap().success()
  1620. 59.99 s > stack backtrace:
  1621. 59.99 s > 0: __rustc::rust_begin_unwind
  1622. 59.99 s > 1: core::panicking::panic_fmt
  1623. 59.99 s > 2: core::panicking::panic
  1624. 59.99 s > 3: alphal00p_docs_builder::provenance_tests::each_build_captures_one_revision_before_rendering
  1625. 59.99 s > 4: <alphal00p_docs_builder::provenance_tests::each_build_captures_one_revision_before_rendering::{closure#0} as core::ops::function::FnOnce<()>>::call_once
  1626. 59.99 s > note: Some details are omitted, run with `RUST_BACKTRACE=full` for a verbose backtrace.
  1627. 59.99 s >
  1628. 59.99 s > FAIL [ 0.123s] (106/129) alphal00p-docs-builder tests::every_product_requires_a_task_chooser_and_each_supported_interface
  1629. 59.99 s > stdout ---
  1630. 59.99 s >
  1631. 59.99 s > running 1 test
  1632. 59.99 s > test tests::every_product_requires_a_task_chooser_and_each_supported_interface ... FAILED
  1633. 59.99 s >
  1634. 59.99 s > failures:
  1635. 59.99 s >
  1636. 59.99 s > failures:
  1637. 59.99 s > tests::every_product_requires_a_task_chooser_and_each_supported_interface
  1638. 59.99 s >
  1639. 59.99 s > test result: FAILED. 0 passed; 1 failed; 0 ignored; 0 measured; 128 filtered out; finished in 0.12s
  1640. 59.99 s >
  1641. 59.99 s > stderr ---
  1642. 59.99 s >
  1643. 59.99 s > thread 'tests::every_product_requires_a_task_chooser_and_each_supported_interface' (312) panicked at crates/alphal00p-docs-builder/src/lib.rs:12274:9:
  1644. 59.99 s > assertion failed: format!("{error:#}").contains("has no quickstart page")
  1645. 59.99 s > stack backtrace:
  1646. 59.99 s > 0: __rustc::rust_begin_unwind
  1647. 59.99 s > 1: core::panicking::panic_fmt
  1648. 59.99 s > 2: core::panicking::panic
  1649. 59.99 s > 3: alphal00p_docs_builder::tests::every_product_requires_a_task_chooser_and_each_supported_interface
  1650. 59.99 s > 4: <alphal00p_docs_builder::tests::every_product_requires_a_task_chooser_and_each_supported_interface::{closure#0} as core::ops::function::FnOnce<()>>::call_once
  1651. 59.99 s > note: Some details are omitted, run with `RUST_BACKTRACE=full` for a verbose backtrace.
  1652. 59.99 s >
  1653. 59.99 s > FAIL [ 0.118s] (122/129) alphal00p-docs-builder tests::pdf_manual_chapter_order_must_match_the_page_registry
  1654. 59.99 s > stdout ---
  1655. 59.99 s >
  1656. 59.99 s > running 1 test
  1657. 59.99 s > test tests::pdf_manual_chapter_order_must_match_the_page_registry ... FAILED
  1658. 59.99 s >
  1659. 59.99 s > failures:
  1660. 59.99 s >
  1661. 59.99 s > failures:
  1662. 59.99 s > tests::pdf_manual_chapter_order_must_match_the_page_registry
  1663. 59.99 s >
  1664. 59.99 s > test result: FAILED. 0 passed; 1 failed; 0 ignored; 0 measured; 128 filtered out; finished in 0.11s
  1665. 59.99 s >
  1666. 59.99 s > stderr ---
  1667. 59.99 s >
  1668. 59.99 s > thread 'tests::pdf_manual_chapter_order_must_match_the_page_registry' (397) panicked at crates/alphal00p-docs-builder/src/lib.rs:12330:9:
  1669. 59.99 s > assertion failed: format!("{error:#}").contains("PDF manual chapter order differs")
  1670. 59.99 s > stack backtrace:
  1671. 59.99 s > 0: __rustc::rust_begin_unwind
  1672. 59.99 s > 1: core::panicking::panic_fmt
  1673. 59.99 s > 2: core::panicking::panic
  1674. 59.99 s > 3: alphal00p_docs_builder::tests::pdf_manual_chapter_order_must_match_the_page_registry
  1675. 59.99 s > 4: <alphal00p_docs_builder::tests::pdf_manual_chapter_order_must_match_the_page_registry::{closure#0} as core::ops::function::FnOnce<()>>::call_once
  1676. 59.99 s > note: Some details are omitted, run with `RUST_BACKTRACE=full` for a verbose backtrace.
  1677. 59.99 s >
  1678. 59.99 s > ------------
  1679. 59.99 s > Summary [ 11.214s] 129 tests run: 118 passed, 11 failed, 0 skipped
  1680. 59.99 s > FAIL [ 0.012s] ( 22/129) alphal00p-docs-builder tests::developer_architecture_is_classified_searchable_and_source_backed
  1681. 59.99 s > stdout ---
  1682. 59.99 s >
  1683. 59.99 s > running 1 test
  1684. 59.99 s > test tests::developer_architecture_is_classified_searchable_and_source_backed ... FAILED
  1685. 59.99 s >
  1686. 59.99 s > failures:
  1687. 59.99 s >
  1688. 59.99 s > failures:
  1689. 59.99 s > tests::developer_architecture_is_classified_searchable_and_source_backed
  1690. 59.99 s >
  1691. 59.99 s > test result: FAILED. 0 passed; 1 failed; 0 ignored; 0 measured; 128 filtered out; finished in 0.01s
  1692. 59.99 s >
  1693. 59.99 s > stderr ---
  1694. 59.99 s >
  1695. 59.99 s > thread 'tests::developer_architecture_is_classified_searchable_and_source_backed' (273) panicked at crates/alphal00p-docs-builder/src/lib.rs:12751:14:
  1696. 59.99 s > called `Result::unwrap()` on an `Err` value: failed to copy documentation asset crates/spynso3/typst/STIXTwoMath-Regular.woff2
  1697. 59.99 s >
  1698. 59.99 s > Caused by:
  1699. 59.99 s > No such file or directory (os error 2)
  1700. 59.99 s >
  1701. 59.99 s > Location:
  1702. 59.99 s > crates/alphal00p-docs-builder/src/lib.rs:2276:18
  1703. 59.99 s > stack backtrace:
  1704. 59.99 s > 0: __rustc::rust_begin_unwind
  1705. 59.99 s > 1: core::panicking::panic_fmt
  1706. 59.99 s > 2: core::result::unwrap_failed
  1707. 59.99 s > 3: alphal00p_docs_builder::tests::developer_architecture_is_classified_searchable_and_source_backed
  1708. 59.99 s > 4: <alphal00p_docs_builder::tests::developer_architecture_is_classified_searchable_and_source_backed::{closure#0} as core::ops::function::FnOnce<()>>::call_once
  1709. 59.99 s > note: Some details are omitted, run with `RUST_BACKTRACE=full` for a verbose backtrace.
  1710. 59.99 s >
  1711. 59.99 s > FAIL [ 0.011s] ( 29/129) alphal00p-docs-builder tests::every_product_orients_rust_to_native_rustdoc_and_keeps_legacy_redirects
  1712. 59.99 s > stdout ---
  1713. 59.99 s >
  1714. 59.99 s > running 1 test
  1715. 59.99 s > test tests::every_product_orients_rust_to_native_rustdoc_and_keeps_legacy_redirects ... FAILED
  1716. 59.99 s >
  1717. 59.99 s > failures:
  1718. 59.99 s >
  1719. 59.99 s > failures:
  1720. 59.99 s > tests::every_product_orients_rust_to_native_rustdoc_and_keeps_legacy_redirects
  1721. 59.99 s >
  1722. 59.99 s > test result: FAILED. 0 passed; 1 failed; 0 ignored; 0 measured; 128 filtered out; finished in 0.01s
  1723. 59.99 s >
  1724. 59.99 s > stderr ---
  1725. 59.99 s >
  1726. 59.99 s > thread 'tests::every_product_orients_rust_to_native_rustdoc_and_keeps_legacy_redirects' (301) panicked at crates/alphal00p-docs-builder/src/lib.rs:12555:46:
  1727. 59.99 s > called `Result::unwrap()` on an `Err` value: failed to copy documentation asset crates/spynso3/typst/STIXTwoMath-Regular.woff2
  1728. 59.99 s >
  1729. 59.99 s > Caused by:
  1730. 59.99 s > No such file or directory (os error 2)
  1731. 59.99 s >
  1732. 59.99 s > Location:
  1733. 59.99 s > crates/alphal00p-docs-builder/src/lib.rs:2276:18
  1734. 59.99 s > stack backtrace:
  1735. 59.99 s > 0: __rustc::rust_begin_unwind
  1736. 59.99 s > 1: core::panicking::panic_fmt
  1737. 59.99 s > 2: core::result::unwrap_failed
  1738. 59.99 s > 3: alphal00p_docs_builder::tests::every_product_orients_rust_to_native_rustdoc_and_keeps_legacy_redirects
  1739. 59.99 s > 4: <alphal00p_docs_builder::tests::every_product_orients_rust_to_native_rustdoc_and_keeps_legacy_redirects::{closure#0} as core::ops::function::FnOnce<()>>::call_once
  1740. 59.99 s > note: Some details are omitted, run with `RUST_BACKTRACE=full` for a verbose backtrace.
  1741. 59.99 s >
  1742. 59.99 s > FAIL [ 0.010s] ( 53/129) alphal00p-docs-builder tests::portal_emits_routes_and_valid_assets
  1743. 59.99 s > stdout ---
  1744. 59.99 s >
  1745. 59.99 s > running 1 test
  1746. 59.99 s > test tests::portal_emits_routes_and_valid_assets ... FAILED
  1747. 59.99 s >
  1748. 59.99 s > failures:
  1749. 59.99 s >
  1750. 59.99 s > failures:
  1751. 59.99 s > tests::portal_emits_routes_and_valid_assets
  1752. 59.99 s >
  1753. 59.99 s > test result: FAILED. 0 passed; 1 failed; 0 ignored; 0 measured; 128 filtered out; finished in 0.00s
  1754. 59.99 s >
  1755. 59.99 s > stderr ---
  1756. 59.99 s >
  1757. 59.99 s > thread 'tests::portal_emits_routes_and_valid_assets' (429) panicked at crates/alphal00p-docs-builder/src/lib.rs:9684:14:
  1758. 59.99 s > called `Result::unwrap()` on an `Err` value: failed to copy documentation asset crates/spynso3/typst/STIXTwoMath-Regular.woff2
  1759. 59.99 s >
  1760. 59.99 s > Caused by:
  1761. 59.99 s > No such file or directory (os error 2)
  1762. 59.99 s >
  1763. 59.99 s > Location:
  1764. 59.99 s > crates/alphal00p-docs-builder/src/lib.rs:2276:18
  1765. 59.99 s > stack backtrace:
  1766. 59.99 s > 0: __rustc::rust_begin_unwind
  1767. 59.99 s > 1: core::panicking::panic_fmt
  1768. 59.99 s > 2: core::result::unwrap_failed
  1769. 59.99 s > 3: alphal00p_docs_builder::tests::write_test_portal
  1770. 59.99 s > 4: alphal00p_docs_builder::tests::portal_emits_routes_and_valid_assets
  1771. 59.99 s > 5: <alphal00p_docs_builder::tests::portal_emits_routes_and_valid_assets::{closure#0} as core::ops::function::FnOnce<()>>::call_once
  1772. 59.99 s > note: Some details are omitted, run with `RUST_BACKTRACE=full` for a verbose backtrace.
  1773. 59.99 s >
  1774. 59.99 s > FAIL [ 0.011s] ( 54/129) alphal00p-docs-builder tests::portal_and_developer_pages_use_federated_search_and_feedback
  1775. 59.99 s > stdout ---
  1776. 59.99 s >
  1777. 59.99 s > running 1 test
  1778. 59.99 s > test tests::portal_and_developer_pages_use_federated_search_and_feedback ... FAILED
  1779. 59.99 s >
  1780. 59.99 s > failures:
  1781. 59.99 s >
  1782. 59.99 s > failures:
  1783. 59.99 s > tests::portal_and_developer_pages_use_federated_search_and_feedback
  1784. 59.99 s >
  1785. 59.99 s > test result: FAILED. 0 passed; 1 failed; 0 ignored; 0 measured; 128 filtered out; finished in 0.01s
  1786. 59.99 s >
  1787. 59.99 s > stderr ---
  1788. 59.99 s >
  1789. 59.99 s > thread 'tests::portal_and_developer_pages_use_federated_search_and_feedback' (430) panicked at crates/alphal00p-docs-builder/src/lib.rs:9684:14:
  1790. 59.99 s > called `Result::unwrap()` on an `Err` value: failed to copy documentation asset crates/spynso3/typst/STIXTwoMath-Regular.woff2
  1791. 59.99 s >
  1792. 59.99 s > Caused by:
  1793. 59.99 s > No such file or directory (os error 2)
  1794. 59.99 s >
  1795. 59.99 s > Location:
  1796. 59.99 s > crates/alphal00p-docs-builder/src/lib.rs:2276:18
  1797. 59.99 s > stack backtrace:
  1798. 59.99 s > 0: __rustc::rust_begin_unwind
  1799. 59.99 s > 1: core::panicking::panic_fmt
  1800. 59.99 s > 2: core::result::unwrap_failed
  1801. 59.99 s > 3: alphal00p_docs_builder::tests::write_test_portal
  1802. 59.99 s > 4: alphal00p_docs_builder::tests::portal_and_developer_pages_use_federated_search_and_feedback
  1803. 59.99 s > 5: <alphal00p_docs_builder::tests::portal_and_developer_pages_use_federated_search_and_feedback::{closure#0} as core::ops::function::FnOnce<()>>::call_once
  1804. 59.99 s > note: Some details are omitted, run with `RUST_BACKTRACE=full` for a verbose backtrace.
  1805. 59.99 s >
  1806. 59.99 s > FAIL [ 0.009s] ( 55/129) alphal00p-docs-builder tests::portal_task_chooser_routes_each_goal_to_the_registered_quickstart
  1807. 59.99 s > stdout ---
  1808. 59.99 s >
  1809. 59.99 s > running 1 test
  1810. 59.99 s > test tests::portal_task_chooser_routes_each_goal_to_the_registered_quickstart ... FAILED
  1811. 59.99 s >
  1812. 59.99 s > failures:
  1813. 59.99 s >
  1814. 59.99 s > failures:
  1815. 59.99 s > tests::portal_task_chooser_routes_each_goal_to_the_registered_quickstart
  1816. 59.99 s >
  1817. 59.99 s > test result: FAILED. 0 passed; 1 failed; 0 ignored; 0 measured; 128 filtered out; finished in 0.00s
  1818. 59.99 s >
  1819. 59.99 s > stderr ---
  1820. 59.99 s >
  1821. 59.99 s > thread 'tests::portal_task_chooser_routes_each_goal_to_the_registered_quickstart' (443) panicked at crates/alphal00p-docs-builder/src/lib.rs:9684:14:
  1822. 59.99 s > called `Result::unwrap()` on an `Err` value: failed to copy documentation asset crates/spynso3/typst/STIXTwoMath-Regular.woff2
  1823. 59.99 s >
  1824. 59.99 s > Caused by:
  1825. 59.99 s > No such file or directory (os error 2)
  1826. 59.99 s >
  1827. 59.99 s > Location:
  1828. 59.99 s > crates/alphal00p-docs-builder/src/lib.rs:2276:18
  1829. 59.99 s > stack backtrace:
  1830. 59.99 s > 0: __rustc::rust_begin_unwind
  1831. 59.99 s > 1: core::panicking::panic_fmt
  1832. 59.99 s > 2: core::result::unwrap_failed
  1833. 59.99 s > 3: alphal00p_docs_builder::tests::write_test_portal
  1834. 59.99 s > 4: alphal00p_docs_builder::tests::portal_task_chooser_routes_each_goal_to_the_registered_quickstart
  1835. 59.99 s > 5: <alphal00p_docs_builder::tests::portal_task_chooser_routes_each_goal_to_the_registered_quickstart::{closure#0} as core::ops::function::FnOnce<()>>::call_once
  1836. 59.99 s > note: Some details are omitted, run with `RUST_BACKTRACE=full` for a verbose backtrace.
  1837. 59.99 s >
  1838. 59.99 s > FAIL [ 0.123s] ( 83/129) alphal00p-docs-builder tests::checked_in_registry_is_valid
  1839. 59.99 s > stdout ---
  1840. 59.99 s >
  1841. 59.99 s > running 1 test
  1842. 59.99 s > test tests::checked_in_registry_is_valid ... FAILED
  1843. 59.99 s >
  1844. 59.99 s > failures:
  1845. 59.99 s >
  1846. 59.99 s > failures:
  1847. 59.99 s > tests::checked_in_registry_is_valid
  1848. 59.99 s >
  1849. 59.99 s > test result: FAILED. 0 passed; 1 failed; 0 ignored; 0 measured; 128 filtered out; finished in 0.11s
  1850. 59.99 s >
  1851. 59.99 s > stderr ---
  1852. 59.99 s >
  1853. 59.99 s > thread 'tests::checked_in_registry_is_valid' (214) panicked at crates/alphal00p-docs-builder/src/lib.rs:12260:50:
  1854. 59.99 s > called `Result::unwrap()` on an `Err` value: required documentation source is missing: /build/source/crates/spynso3/typst/STIXTwoMath-Regular.woff2
  1855. 59.99 s >
  1856. 59.99 s > Location:
  1857. 59.99 s > crates/alphal00p-docs-builder/src/lib.rs:5103:9
  1858. 59.99 s > stack backtrace:
  1859. 59.99 s > 0: __rustc::rust_begin_unwind
  1860. 59.99 s > 1: core::panicking::panic_fmt
  1861. 59.99 s > 2: core::result::unwrap_failed
  1862. 59.99 s > 3: alphal00p_docs_builder::tests::checked_in_registry_is_valid
  1863. 59.99 s > 4: <alphal00p_docs_builder::tests::checked_in_registry_is_valid::{closure#0} as core::ops::function::FnOnce<()>>::call_once
  1864. 59.99 s > note: Some details are omitted, run with `RUST_BACKTRACE=full` for a verbose backtrace.
  1865. 59.99 s >
  1866. 59.99 s > FAIL [ 0.009s] ( 87/129) alphal00p-docs-builder tests::site_assets_replace_read_only_generated_files
  1867. 59.99 s > stdout ---
  1868. 59.99 s >
  1869. 59.99 s > running 1 test
  1870. 59.99 s > test tests::site_assets_replace_read_only_generated_files ... FAILED
  1871. 59.99 s >
  1872. 59.99 s > failures:
  1873. 59.99 s >
  1874. 59.99 s > failures:
  1875. 59.99 s > tests::site_assets_replace_read_only_generated_files
  1876. 59.99 s >
  1877. 59.99 s > test result: FAILED. 0 passed; 1 failed; 0 ignored; 0 measured; 128 filtered out; finished in 0.00s
  1878. 59.99 s >
  1879. 59.99 s > stderr ---
  1880. 59.99 s >
  1881. 59.99 s > thread 'tests::site_assets_replace_read_only_generated_files' (669) panicked at crates/alphal00p-docs-builder/src/lib.rs:12305:50:
  1882. 59.99 s > called `Result::unwrap()` on an `Err` value: failed to copy documentation asset crates/spynso3/typst/STIXTwoMath-Regular.woff2
  1883. 59.99 s >
  1884. 59.99 s > Caused by:
  1885. 59.99 s > No such file or directory (os error 2)
  1886. 59.99 s >
  1887. 59.99 s > Location:
  1888. 59.99 s > crates/alphal00p-docs-builder/src/lib.rs:2276:18
  1889. 59.99 s > stack backtrace:
  1890. 59.99 s > 0: __rustc::rust_begin_unwind
  1891. 59.99 s > 1: core::panicking::panic_fmt
  1892. 59.99 s > 2: core::result::unwrap_failed
  1893. 59.99 s > 3: alphal00p_docs_builder::tests::site_assets_replace_read_only_generated_files
  1894. 59.99 s > 4: <alphal00p_docs_builder::tests::site_assets_replace_read_only_generated_files::{closure#0} as core::ops::function::FnOnce<()>>::call_once
  1895. 59.99 s > note: Some details are omitted, run with `RUST_BACKTRACE=full` for a verbose backtrace.
  1896. 59.99 s >
  1897. 59.99 s > FAIL [ 0.114s] ( 89/129) alphal00p-docs-builder tests::developer_scope_ranges_ignore_unrelated_edits_and_warn_only_while_watching
  1898. 59.99 s > stdout ---
  1899. 59.99 s >
  1900. 59.99 s > running 1 test
  1901. 59.99 s > test tests::developer_scope_ranges_ignore_unrelated_edits_and_warn_only_while_watching ... FAILED
  1902. 59.99 s >
  1903. 59.99 s > failures:
  1904. 59.99 s >
  1905. 59.99 s > failures:
  1906. 59.99 s > tests::developer_scope_ranges_ignore_unrelated_edits_and_warn_only_while_watching
  1907. 59.99 s >
  1908. 59.99 s > test result: FAILED. 0 passed; 1 failed; 0 ignored; 0 measured; 128 filtered out; finished in 0.11s
  1909. 59.99 s >
  1910. 59.99 s > stderr ---
  1911. 59.99 s >
  1912. 59.99 s > thread 'tests::developer_scope_ranges_ignore_unrelated_edits_and_warn_only_while_watching' (278) panicked at crates/alphal00p-docs-builder/src/lib.rs:12350:29:
  1913. 59.99 s > called `Result::unwrap()` on an `Err` value: required documentation source is missing: /build/source/crates/spynso3/typst/STIXTwoMath-Regular.woff2
  1914. 59.99 s >
  1915. 59.99 s > Location:
  1916. 59.99 s > crates/alphal00p-docs-builder/src/lib.rs:5103:9
  1917. 59.99 s > stack backtrace:
  1918. 59.99 s > 0: __rustc::rust_begin_unwind
  1919. 59.99 s > 1: core::panicking::panic_fmt
  1920. 59.99 s > 2: core::result::unwrap_failed
  1921. 59.99 s > 3: alphal00p_docs_builder::tests::developer_scope_ranges_ignore_unrelated_edits_and_warn_only_while_watching
  1922. 59.99 s > 4: <alphal00p_docs_builder::tests::developer_scope_ranges_ignore_unrelated_edits_and_warn_only_while_watching::{closure#0} as core::ops::function::FnOnce<()>>::call_once
  1923. 59.99 s > note: Some details are omitted, run with `RUST_BACKTRACE=full` for a verbose backtrace.
  1924. 59.99 s >
  1925. 59.99 s > FAIL [ 0.142s] ( 96/129) alphal00p-docs-builder provenance_tests::each_build_captures_one_revision_before_rendering
  1926. 59.99 s > stdout ---
  1927. 59.99 s >
  1928. 59.99 s > running 1 test
  1929. 59.99 s >
  1930. 59.99 s > running 1 test
  1931. 59.99 s > test provenance_tests::each_build_captures_one_revision_before_rendering ... FAILED
  1932. 59.99 s >
  1933. 59.99 s > failures:
  1934. 59.99 s >
  1935. 59.99 s > failures:
  1936. 59.99 s > provenance_tests::each_build_captures_one_revision_before_rendering
  1937. 59.99 s >
  1938. 59.99 s > test result: FAILED. 0 passed; 1 failed; 0 ignored; 0 measured; 128 filtered out; finished in 0.11s
  1939. 59.99 s >
  1940. 59.99 s > test provenance_tests::each_build_captures_one_revision_before_rendering ... FAILED
  1941. 59.99 s >
  1942. 59.99 s > failures:
  1943. 59.99 s >
  1944. 59.99 s > failures:
  1945. 59.99 s > provenance_tests::each_build_captures_one_revision_before_rendering
  1946. 59.99 s >
  1947. 59.99 s > test result: FAILED. 0 passed; 1 failed; 0 ignored; 0 measured; 128 filtered out; finished in 0.13s
  1948. 59.99 s >
  1949. 59.99 s > stderr ---
  1950. 59.99 s >
  1951. 59.99 s > thread 'provenance_tests::each_build_captures_one_revision_before_rendering' (284) panicked at crates/alphal00p-docs-builder/src/provenance_tests.rs:297:14:
  1952. 59.99 s > called `Result::unwrap()` on an `Err` value: required documentation source is missing: /build/source/target/nix-ci-tmp/.tmpAH3uti/checkout/crates/spynso3/typst/STIXTwoMath-Regular.woff2
  1953. 59.99 s >
  1954. 59.99 s > Location:
  1955. 59.99 s > crates/alphal00p-docs-builder/src/lib.rs:5103:9
  1956. 59.99 s > stack backtrace:
  1957. 59.99 s > 0: __rustc::rust_begin_unwind
  1958. 59.99 s > 1: core::panicking::panic_fmt
  1959. 59.99 s > 2: core::result::unwrap_failed
  1960. 59.99 s > 3: alphal00p_docs_builder::provenance_tests::each_build_captures_one_revision_before_rendering
  1961. 59.99 s > 4: <alphal00p_docs_builder::provenance_tests::each_build_captures_one_revision_before_rendering::{closure#0} as core::ops::function::FnOnce<()>>::call_once
  1962. 59.99 s > note: Some details are omitted, run with `RUST_BACKTRACE=full` for a verbose backtrace.
  1963. 59.99 s >
  1964. 59.99 s > thread 'provenance_tests::each_build_captures_one_revision_before_rendering' (218) panicked at crates/alphal00p-docs-builder/src/provenance_tests.rs:274:9:
  1965. 59.99 s > assertion failed: command.status().unwrap().success()
  1966. 59.99 s > stack backtrace:
  1967. 59.99 s > 0: __rustc::rust_begin_unwind
  1968. 59.99 s > 1: core::panicking::panic_fmt
  1969. 59.99 s > 2: core::panicking::panic
  1970. 59.99 s > 3: alphal00p_docs_builder::provenance_tests::each_build_captures_one_revision_before_rendering
  1971. 59.99 s > 4: <alphal00p_docs_builder::provenance_tests::each_build_captures_one_revision_before_rendering::{closure#0} as core::ops::function::FnOnce<()>>::call_once
  1972. 59.99 s > note: Some details are omitted, run with `RUST_BACKTRACE=full` for a verbose backtrace.
  1973. 59.99 s >
  1974. 59.99 s > FAIL [ 0.123s] (106/129) alphal00p-docs-builder tests::every_product_requires_a_task_chooser_and_each_supported_interface
  1975. 59.99 s > stdout ---
  1976. 59.99 s >
  1977. 59.99 s > running 1 test
  1978. 59.99 s > test tests::every_product_requires_a_task_chooser_and_each_supported_interface ... FAILED
  1979. 59.99 s >
  1980. 59.99 s > failures:
  1981. 59.99 s >
  1982. 59.99 s > failures:
  1983. 59.99 s > tests::every_product_requires_a_task_chooser_and_each_supported_interface
  1984. 59.99 s >
  1985. 59.99 s > test result: FAILED. 0 passed; 1 failed; 0 ignored; 0 measured; 128 filtered out; finished in 0.12s
  1986. 59.99 s >
  1987. 59.99 s > stderr ---
  1988. 59.99 s >
  1989. 59.99 s > thread 'tests::every_product_requires_a_task_chooser_and_each_supported_interface' (312) panicked at crates/alphal00p-docs-builder/src/lib.rs:12274:9:
  1990. 59.99 s > assertion failed: format!("{error:#}").contains("has no quickstart page")
  1991. 59.99 s > stack backtrace:
  1992. 59.99 s > 0: __rustc::rust_begin_unwind
  1993. 59.99 s > 1: core::panicking::panic_fmt
  1994. 59.99 s > 2: core::panicking::panic
  1995. 59.99 s > 3: alphal00p_docs_builder::tests::every_product_requires_a_task_chooser_and_each_supported_interface
  1996. 59.99 s > 4: <alphal00p_docs_builder::tests::every_product_requires_a_task_chooser_and_each_supported_interface::{closure#0} as core::ops::function::FnOnce<()>>::call_once
  1997. 59.99 s > note: Some details are omitted, run with `RUST_BACKTRACE=full` for a verbose backtrace.
  1998. 59.99 s >
  1999. 59.99 s > FAIL [ 0.118s] (122/129) alphal00p-docs-builder tests::pdf_manual_chapter_order_must_match_the_page_registry
  2000. 59.99 s > stdout ---
  2001. 59.99 s >
  2002. 59.99 s > running 1 test
  2003. 59.99 s > test tests::pdf_manual_chapter_order_must_match_the_page_registry ... FAILED
  2004. 59.99 s >
  2005. 59.99 s > failures:
  2006. 59.99 s >
  2007. 59.99 s > failures:
  2008. 59.99 s > tests::pdf_manual_chapter_order_must_match_the_page_registry
  2009. 59.99 s >
  2010. 59.99 s > test result: FAILED. 0 passed; 1 failed; 0 ignored; 0 measured; 128 filtered out; finished in 0.11s
  2011. 59.99 s >
  2012. 59.99 s > stderr ---
  2013. 59.99 s >
  2014. 59.99 s > thread 'tests::pdf_manual_chapter_order_must_match_the_page_registry' (397) panicked at crates/alphal00p-docs-builder/src/lib.rs:12330:9:
  2015. 59.99 s > assertion failed: format!("{error:#}").contains("PDF manual chapter order differs")
  2016. 59.99 s > stack backtrace:
  2017. 59.99 s > 0: __rustc::rust_begin_unwind
  2018. 59.99 s > 1: core::panicking::panic_fmt
  2019. 59.99 s > 2: core::panicking::panic
  2020. 59.99 s > 3: alphal00p_docs_builder::tests::pdf_manual_chapter_order_must_match_the_page_registry
  2021. 59.99 s > 4: <alphal00p_docs_builder::tests::pdf_manual_chapter_order_must_match_the_page_registry::{closure#0} as core::ops::function::FnOnce<()>>::call_once
  2022. 59.99 s > note: Some details are omitted, run with `RUST_BACKTRACE=full` for a verbose backtrace.
  2023. 59.99 s >
  2024. 59.99 s > error: test run failed
  2025. 59.99 s >
  2026. 59.99 s > ========== nextest test summary ==========
  2027. 59.99 s > report: target/nextest/ci_gammaloop/junit.xml
  2028. 59.99 s > tests: 129, failures: 11, errors: 0
  2029. 59.99 s >
  2030. 59.99 s > 1. alphal00p-docs-builder::tests::developer_architecture_is_classified_searchable_and_source_backed
  2031. 59.99 s > failure: test failure with exit code 101
  2032. 59.99 s > thread 'tests::developer_architecture_is_classified_searchable_and_source_backed' (273) panicked at crates/alphal00p-docs-builder/src/lib.rs:12751:14:
  2033. 59.99 s > called `Result::unwrap()` on an `Err` value: failed to copy documentation asset crates/spynso3/typst/STIXTwoMath-Regular.woff2
  2034. 59.99 s >
  2035. 59.99 s > Caused by:
  2036. 59.99 s > No such file or directory (os error 2)
  2037. 59.99 s >
  2038. 59.99 s > Location:
  2039. 59.99 s > crates/alphal00p-docs-builder/src/lib.rs:2276:18
  2040. 59.99 s > stack backtrace:
  2041. 59.99 s > 0: __rustc::rust_begin_unwind
  2042. 59.99 s > 1: core::panicking::panic_fmt
  2043. 59.99 s > 2: core::result::unwrap_failed
  2044. 59.99 s > 3: alphal00p_docs_builder::tests::developer_architecture_is_classified_searchable_and_source_backed
  2045. 59.99 s > 4: <alphal00p_docs_builder::tests::developer_architecture_is_classified_searchable_and_source_backed::{closure#0} as core::ops::function::FnOnce<()>>::call_once
  2046. 59.99 s > note: Some details are omitted, run with `RUST_BACKTRACE=full` for a verbose backtrace.
  2047. 59.99 s > system-out
  2048. 59.99 s > running 1 test
  2049. 59.99 s > test tests::developer_architecture_is_classified_searchable_and_source_backed ... FAILED
  2050. 59.99 s >
  2051. 59.99 s > failures:
  2052. 59.99 s >
  2053. 59.99 s > failures:
  2054. 59.99 s > tests::developer_architecture_is_classified_searchable_and_source_backed
  2055. 59.99 s >
  2056. 59.99 s > test result: FAILED. 0 passed; 1 failed; 0 ignored; 0 measured; 128 filtered out; finished in 0.01s
  2057. 59.99 s > system-err
  2058. 59.99 s > thread 'tests::developer_architecture_is_classified_searchable_and_source_backed' (273) panicked at crates/alphal00p-docs-builder/src/lib.rs:12751:14:
  2059. 59.99 s > called `Result::unwrap()` on an `Err` value: failed to copy documentation asset crates/spynso3/typst/STIXTwoMath-Regular.woff2
  2060. 59.99 s >
  2061. 59.99 s > Caused by:
  2062. 59.99 s > No such file or directory (os error 2)
  2063. 59.99 s >
  2064. 59.99 s > Location:
  2065. 59.99 s > crates/alphal00p-docs-builder/src/lib.rs:2276:18
  2066. 59.99 s > stack backtrace:
  2067. 59.99 s > 0: __rustc::rust_begin_unwind
  2068. 59.99 s > 1: core::panicking::panic_fmt
  2069. 59.99 s > 2: core::result::unwrap_failed
  2070. 59.99 s > 3: alphal00p_docs_builder::tests::developer_architecture_is_classified_searchable_and_source_backed
  2071. 59.99 s > 4: <alphal00p_docs_builder::tests::developer_architecture_is_classified_searchable_and_source_backed::{closure#0} as core::ops::function::FnOnce<()>>::call_once
  2072. 59.99 s > note: Some details are omitted, run with `RUST_BACKTRACE=full` for a verbose backtrace.
  2073. 59.99 s >
  2074. 59.99 s > 2. alphal00p-docs-builder::tests::every_product_orients_rust_to_native_rustdoc_and_keeps_legacy_redirects
  2075. 59.99 s > failure: test failure with exit code 101
  2076. 59.99 s > thread 'tests::every_product_orients_rust_to_native_rustdoc_and_keeps_legacy_redirects' (301) panicked at crates/alphal00p-docs-builder/src/lib.rs:12555:46:
  2077. 59.99 s > called `Result::unwrap()` on an `Err` value: failed to copy documentation asset crates/spynso3/typst/STIXTwoMath-Regular.woff2
  2078. 59.99 s >
  2079. 59.99 s > Caused by:
  2080. 59.99 s > No such file or directory (os error 2)
  2081. 59.99 s >
  2082. 59.99 s > Location:
  2083. 59.99 s > crates/alphal00p-docs-builder/src/lib.rs:2276:18
  2084. 59.99 s > stack backtrace:
  2085. 59.99 s > 0: __rustc::rust_begin_unwind
  2086. 59.99 s > 1: core::panicking::panic_fmt
  2087. 59.99 s > 2: core::result::unwrap_failed
  2088. 59.99 s > 3: alphal00p_docs_builder::tests::every_product_orients_rust_to_native_rustdoc_and_keeps_legacy_redirects
  2089. 59.99 s > 4: <alphal00p_docs_builder::tests::every_product_orients_rust_to_native_rustdoc_and_keeps_legacy_redirects::{closure#0} as core::ops::function::FnOnce<()>>::call_once
  2090. 59.99 s > note: Some details are omitted, run with `RUST_BACKTRACE=full` for a verbose backtrace.
  2091. 59.99 s > system-out
  2092. 59.99 s > running 1 test
  2093. 59.99 s > test tests::every_product_orients_rust_to_native_rustdoc_and_keeps_legacy_redirects ... FAILED
  2094. 59.99 s >
  2095. 59.99 s > failures:
  2096. 59.99 s >
  2097. 59.99 s > failures:
  2098. 59.99 s > tests::every_product_orients_rust_to_native_rustdoc_and_keeps_legacy_redirects
  2099. 59.99 s >
  2100. 59.99 s > test result: FAILED. 0 passed; 1 failed; 0 ignored; 0 measured; 128 filtered out; finished in 0.01s
  2101. 59.99 s > system-err
  2102. 59.99 s > thread 'tests::every_product_orients_rust_to_native_rustdoc_and_keeps_legacy_redirects' (301) panicked at crates/alphal00p-docs-builder/src/lib.rs:12555:46:
  2103. 59.99 s > called `Result::unwrap()` on an `Err` value: failed to copy documentation asset crates/spynso3/typst/STIXTwoMath-Regular.woff2
  2104. 59.99 s >
  2105. 59.99 s > Caused by:
  2106. 59.99 s > No such file or directory (os error 2)
  2107. 59.99 s >
  2108. 59.99 s > Location:
  2109. 59.99 s > crates/alphal00p-docs-builder/src/lib.rs:2276:18
  2110. 59.99 s > stack backtrace:
  2111. 59.99 s > 0: __rustc::rust_begin_unwind
  2112. 59.99 s > 1: core::panicking::panic_fmt
  2113. 59.99 s > 2: core::result::unwrap_failed
  2114. 59.99 s > 3: alphal00p_docs_builder::tests::every_product_orients_rust_to_native_rustdoc_and_keeps_legacy_redirects
  2115. 59.99 s > 4: <alphal00p_docs_builder::tests::every_product_orients_rust_to_native_rustdoc_and_keeps_legacy_redirects::{closure#0} as core::ops::function::FnOnce<()>>::call_once
  2116. 59.99 s > note: Some details are omitted, run with `RUST_BACKTRACE=full` for a verbose backtrace.
  2117. 59.99 s >
  2118. 59.99 s > 3. alphal00p-docs-builder::tests::portal_emits_routes_and_valid_assets
  2119. 59.99 s > failure: test failure with exit code 101
  2120. 59.99 s > thread 'tests::portal_emits_routes_and_valid_assets' (429) panicked at crates/alphal00p-docs-builder/src/lib.rs:9684:14:
  2121. 59.99 s > called `Result::unwrap()` on an `Err` value: failed to copy documentation asset crates/spynso3/typst/STIXTwoMath-Regular.woff2
  2122. 59.99 s >
  2123. 59.99 s > Caused by:
  2124. 59.99 s > No such file or directory (os error 2)
  2125. 59.99 s >
  2126. 59.99 s > Location:
  2127. 59.99 s > crates/alphal00p-docs-builder/src/lib.rs:2276:18
  2128. 59.99 s > stack backtrace:
  2129. 59.99 s > 0: __rustc::rust_begin_unwind
  2130. 59.99 s > 1: core::panicking::panic_fmt
  2131. 59.99 s > 2: core::result::unwrap_failed
  2132. 59.99 s > 3: alphal00p_docs_builder::tests::write_test_portal
  2133. 59.99 s > 4: alphal00p_docs_builder::tests::portal_emits_routes_and_valid_assets
  2134. 59.99 s > 5: <alphal00p_docs_builder::tests::portal_emits_routes_and_valid_assets::{closure#0} as core::ops::function::FnOnce<()>>::call_once
  2135. 60.00 s > note: Some details are omitted, run with `RUST_BACKTRACE=full` for a verbose backtrace.
  2136. 60.00 s > system-out
  2137. 60.00 s > running 1 test
  2138. 60.00 s > test tests::portal_emits_routes_and_valid_assets ... FAILED
  2139. 60.00 s >
  2140. 60.00 s > failures:
  2141. 60.00 s >
  2142. 60.00 s > failures:
  2143. 60.00 s > tests::portal_emits_routes_and_valid_assets
  2144. 60.00 s >
  2145. 60.00 s > test result: FAILED. 0 passed; 1 failed; 0 ignored; 0 measured; 128 filtered out; finished in 0.00s
  2146. 60.00 s > system-err
  2147. 60.00 s > thread 'tests::portal_emits_routes_and_valid_assets' (429) panicked at crates/alphal00p-docs-builder/src/lib.rs:9684:14:
  2148. 60.00 s > called `Result::unwrap()` on an `Err` value: failed to copy documentation asset crates/spynso3/typst/STIXTwoMath-Regular.woff2
  2149. 60.00 s >
  2150. 60.00 s > Caused by:
  2151. 60.00 s > No such file or directory (os error 2)
  2152. 60.00 s >
  2153. 60.00 s > Location:
  2154. 60.00 s > crates/alphal00p-docs-builder/src/lib.rs:2276:18
  2155. 60.00 s > stack backtrace:
  2156. 60.00 s > 0: __rustc::rust_begin_unwind
  2157. 60.00 s > 1: core::panicking::panic_fmt
  2158. 60.00 s > 2: core::result::unwrap_failed
  2159. 60.00 s > 3: alphal00p_docs_builder::tests::write_test_portal
  2160. 60.00 s > 4: alphal00p_docs_builder::tests::portal_emits_routes_and_valid_assets
  2161. 60.00 s > 5: <alphal00p_docs_builder::tests::portal_emits_routes_and_valid_assets::{closure#0} as core::ops::function::FnOnce<()>>::call_once
  2162. 60.00 s > note: Some details are omitted, run with `RUST_BACKTRACE=full` for a verbose backtrace.
  2163. 60.00 s >
  2164. 60.00 s > 4. alphal00p-docs-builder::tests::portal_and_developer_pages_use_federated_search_and_feedback
  2165. 60.00 s > failure: test failure with exit code 101
  2166. 60.00 s > thread 'tests::portal_and_developer_pages_use_federated_search_and_feedback' (430) panicked at crates/alphal00p-docs-builder/src/lib.rs:9684:14:
  2167. 60.00 s > called `Result::unwrap()` on an `Err` value: failed to copy documentation asset crates/spynso3/typst/STIXTwoMath-Regular.woff2
  2168. 60.00 s >
  2169. 60.00 s > Caused by:
  2170. 60.00 s > No such file or directory (os error 2)
  2171. 60.00 s >
  2172. 60.00 s > Location:
  2173. 60.00 s > crates/alphal00p-docs-builder/src/lib.rs:2276:18
  2174. 60.00 s > stack backtrace:
  2175. 60.00 s > 0: __rustc::rust_begin_unwind
  2176. 60.00 s > 1: core::panicking::panic_fmt
  2177. 60.00 s > 2: core::result::unwrap_failed
  2178. 60.00 s > 3: alphal00p_docs_builder::tests::write_test_portal
  2179. 60.00 s > 4: alphal00p_docs_builder::tests::portal_and_developer_pages_use_federated_search_and_feedback
  2180. 60.00 s > 5: <alphal00p_docs_builder::tests::portal_and_developer_pages_use_federated_search_and_feedback::{closure#0} as core::ops::function::FnOnce<()>>::call_once
  2181. 60.00 s > note: Some details are omitted, run with `RUST_BACKTRACE=full` for a verbose backtrace.
  2182. 60.00 s > system-out
  2183. 60.00 s > running 1 test
  2184. 60.00 s > test tests::portal_and_developer_pages_use_federated_search_and_feedback ... FAILED
  2185. 60.00 s >
  2186. 60.00 s > failures:
  2187. 60.00 s >
  2188. 60.00 s > failures:
  2189. 60.00 s > tests::portal_and_developer_pages_use_federated_search_and_feedback
  2190. 60.00 s >
  2191. 60.00 s > test result: FAILED. 0 passed; 1 failed; 0 ignored; 0 measured; 128 filtered out; finished in 0.01s
  2192. 60.00 s > system-err
  2193. 60.00 s > thread 'tests::portal_and_developer_pages_use_federated_search_and_feedback' (430) panicked at crates/alphal00p-docs-builder/src/lib.rs:9684:14:
  2194. 60.00 s > called `Result::unwrap()` on an `Err` value: failed to copy documentation asset crates/spynso3/typst/STIXTwoMath-Regular.woff2
  2195. 60.00 s >
  2196. 60.00 s > Caused by:
  2197. 60.00 s > No such file or directory (os error 2)
  2198. 60.00 s >
  2199. 60.00 s > Location:
  2200. 60.00 s > crates/alphal00p-docs-builder/src/lib.rs:2276:18
  2201. 60.00 s > stack backtrace:
  2202. 60.00 s > 0: __rustc::rust_begin_unwind
  2203. 60.00 s > 1: core::panicking::panic_fmt
  2204. 60.00 s > 2: core::result::unwrap_failed
  2205. 60.00 s > 3: alphal00p_docs_builder::tests::write_test_portal
  2206. 60.00 s > 4: alphal00p_docs_builder::tests::portal_and_developer_pages_use_federated_search_and_feedback
  2207. 60.00 s > 5: <alphal00p_docs_builder::tests::portal_and_developer_pages_use_federated_search_and_feedback::{closure#0} as core::ops::function::FnOnce<()>>::call_once
  2208. 60.00 s > note: Some details are omitted, run with `RUST_BACKTRACE=full` for a verbose backtrace.
  2209. 60.00 s >
  2210. 60.00 s > 5. alphal00p-docs-builder::tests::portal_task_chooser_routes_each_goal_to_the_registered_quickstart
  2211. 60.00 s > failure: test failure with exit code 101
  2212. 60.00 s > thread 'tests::portal_task_chooser_routes_each_goal_to_the_registered_quickstart' (443) panicked at crates/alphal00p-docs-builder/src/lib.rs:9684:14:
  2213. 60.00 s > called `Result::unwrap()` on an `Err` value: failed to copy documentation asset crates/spynso3/typst/STIXTwoMath-Regular.woff2
  2214. 60.00 s >
  2215. 60.00 s > Caused by:
  2216. 60.00 s > No such file or directory (os error 2)
  2217. 60.00 s >
  2218. 60.00 s > Location:
  2219. 60.00 s > crates/alphal00p-docs-builder/src/lib.rs:2276:18
  2220. 60.00 s > stack backtrace:
  2221. 60.00 s > 0: __rustc::rust_begin_unwind
  2222. 60.00 s > 1: core::panicking::panic_fmt
  2223. 60.00 s > 2: core::result::unwrap_failed
  2224. 60.00 s > 3: alphal00p_docs_builder::tests::write_test_portal
  2225. 60.00 s > 4: alphal00p_docs_builder::tests::portal_task_chooser_routes_each_goal_to_the_registered_quickstart
  2226. 60.00 s > 5: <alphal00p_docs_builder::tests::portal_task_chooser_routes_each_goal_to_the_registered_quickstart::{closure#0} as core::ops::function::FnOnce<()>>::call_once
  2227. 60.00 s > note: Some details are omitted, run with `RUST_BACKTRACE=full` for a verbose backtrace.
  2228. 60.00 s > system-out
  2229. 60.00 s > running 1 test
  2230. 60.00 s > test tests::portal_task_chooser_routes_each_goal_to_the_registered_quickstart ... FAILED
  2231. 60.00 s >
  2232. 60.00 s > failures:
  2233. 60.00 s >
  2234. 60.00 s > failures:
  2235. 60.00 s > tests::portal_task_chooser_routes_each_goal_to_the_registered_quickstart
  2236. 60.00 s >
  2237. 60.00 s > test result: FAILED. 0 passed; 1 failed; 0 ignored; 0 measured; 128 filtered out; finished in 0.00s
  2238. 60.00 s > system-err
  2239. 60.00 s > thread 'tests::portal_task_chooser_routes_each_goal_to_the_registered_quickstart' (443) panicked at crates/alphal00p-docs-builder/src/lib.rs:9684:14:
  2240. 60.00 s > called `Result::unwrap()` on an `Err` value: failed to copy documentation asset crates/spynso3/typst/STIXTwoMath-Regular.woff2
  2241. 60.00 s >
  2242. 60.00 s > Caused by:
  2243. 60.00 s > No such file or directory (os error 2)
  2244. 60.00 s >
  2245. 60.00 s > Location:
  2246. 60.00 s > crates/alphal00p-docs-builder/src/lib.rs:2276:18
  2247. 60.00 s > stack backtrace:
  2248. 60.00 s > 0: __rustc::rust_begin_unwind
  2249. 60.00 s > 1: core::panicking::panic_fmt
  2250. 60.00 s > 2: core::result::unwrap_failed
  2251. 60.00 s > 3: alphal00p_docs_builder::tests::write_test_portal
  2252. 60.00 s > 4: alphal00p_docs_builder::tests::portal_task_chooser_routes_each_goal_to_the_registered_quickstart
  2253. 60.00 s > 5: <alphal00p_docs_builder::tests::portal_task_chooser_routes_each_goal_to_the_registered_quickstart::{closure#0} as core::ops::function::FnOnce<()>>::call_once
  2254. 60.00 s > note: Some details are omitted, run with `RUST_BACKTRACE=full` for a verbose backtrace.
  2255. 60.00 s >
  2256. 60.00 s > 6. alphal00p-docs-builder::tests::checked_in_registry_is_valid
  2257. 60.00 s > failure: test failure with exit code 101
  2258. 60.00 s > thread 'tests::checked_in_registry_is_valid' (214) panicked at crates/alphal00p-docs-builder/src/lib.rs:12260:50:
  2259. 60.00 s > called `Result::unwrap()` on an `Err` value: required documentation source is missing: /build/source/crates/spynso3/typst/STIXTwoMath-Regular.woff2
  2260. 60.00 s >
  2261. 60.00 s > Location:
  2262. 60.00 s > crates/alphal00p-docs-builder/src/lib.rs:5103:9
  2263. 60.00 s > stack backtrace:
  2264. 60.00 s > 0: __rustc::rust_begin_unwind
  2265. 60.00 s > 1: core::panicking::panic_fmt
  2266. 60.00 s > 2: core::result::unwrap_failed
  2267. 60.00 s > 3: alphal00p_docs_builder::tests::checked_in_registry_is_valid
  2268. 60.00 s > 4: <alphal00p_docs_builder::tests::checked_in_registry_is_valid::{closure#0} as core::ops::function::FnOnce<()>>::call_once
  2269. 60.00 s > note: Some details are omitted, run with `RUST_BACKTRACE=full` for a verbose backtrace.
  2270. 60.00 s > system-out
  2271. 60.00 s > running 1 test
  2272. 60.00 s > test tests::checked_in_registry_is_valid ... FAILED
  2273. 60.00 s >
  2274. 60.00 s > failures:
  2275. 60.00 s >
  2276. 60.00 s > failures:
  2277. 60.00 s > tests::checked_in_registry_is_valid
  2278. 60.00 s >
  2279. 60.00 s > test result: FAILED. 0 passed; 1 failed; 0 ignored; 0 measured; 128 filtered out; finished in 0.11s
  2280. 60.00 s > system-err
  2281. 60.00 s > thread 'tests::checked_in_registry_is_valid' (214) panicked at crates/alphal00p-docs-builder/src/lib.rs:12260:50:
  2282. 60.00 s > called `Result::unwrap()` on an `Err` value: required documentation source is missing: /build/source/crates/spynso3/typst/STIXTwoMath-Regular.woff2
  2283. 60.00 s >
  2284. 60.00 s > Location:
  2285. 60.00 s > crates/alphal00p-docs-builder/src/lib.rs:5103:9
  2286. 60.00 s > stack backtrace:
  2287. 60.00 s > 0: __rustc::rust_begin_unwind
  2288. 60.00 s > 1: core::panicking::panic_fmt
  2289. 60.00 s > 2: core::result::unwrap_failed
  2290. 60.00 s > 3: alphal00p_docs_builder::tests::checked_in_registry_is_valid
  2291. 60.00 s > 4: <alphal00p_docs_builder::tests::checked_in_registry_is_valid::{closure#0} as core::ops::function::FnOnce<()>>::call_once
  2292. 60.00 s > note: Some details are omitted, run with `RUST_BACKTRACE=full` for a verbose backtrace.
  2293. 60.00 s >
  2294. 60.00 s > 7. alphal00p-docs-builder::tests::site_assets_replace_read_only_generated_files
  2295. 60.00 s > failure: test failure with exit code 101
  2296. 60.00 s > thread 'tests::site_assets_replace_read_only_generated_files' (669) panicked at crates/alphal00p-docs-builder/src/lib.rs:12305:50:
  2297. 60.00 s > called `Result::unwrap()` on an `Err` value: failed to copy documentation asset crates/spynso3/typst/STIXTwoMath-Regular.woff2
  2298. 60.00 s >
  2299. 60.00 s > Caused by:
  2300. 60.00 s > No such file or directory (os error 2)
  2301. 60.00 s >
  2302. 60.00 s > Location:
  2303. 60.00 s > crates/alphal00p-docs-builder/src/lib.rs:2276:18
  2304. 60.00 s > stack backtrace:
  2305. 60.00 s > 0: __rustc::rust_begin_unwind
  2306. 60.00 s > 1: core::panicking::panic_fmt
  2307. 60.00 s > 2: core::result::unwrap_failed
  2308. 60.00 s > 3: alphal00p_docs_builder::tests::site_assets_replace_read_only_generated_files
  2309. 60.00 s > 4: <alphal00p_docs_builder::tests::site_assets_replace_read_only_generated_files::{closure#0} as core::ops::function::FnOnce<()>>::call_once
  2310. 60.00 s > note: Some details are omitted, run with `RUST_BACKTRACE=full` for a verbose backtrace.
  2311. 60.00 s > system-out
  2312. 60.00 s > running 1 test
  2313. 60.00 s > test tests::site_assets_replace_read_only_generated_files ... FAILED
  2314. 60.00 s >
  2315. 60.00 s > failures:
  2316. 60.00 s >
  2317. 60.00 s > failures:
  2318. 60.00 s > tests::site_assets_replace_read_only_generated_files
  2319. 60.00 s >
  2320. 60.00 s > test result: FAILED. 0 passed; 1 failed; 0 ignored; 0 measured; 128 filtered out; finished in 0.00s
  2321. 60.00 s > system-err
  2322. 60.00 s > thread 'tests::site_assets_replace_read_only_generated_files' (669) panicked at crates/alphal00p-docs-builder/src/lib.rs:12305:50:
  2323. 60.00 s > called `Result::unwrap()` on an `Err` value: failed to copy documentation asset crates/spynso3/typst/STIXTwoMath-Regular.woff2
  2324. 60.00 s >
  2325. 60.00 s > Caused by:
  2326. 60.00 s > No such file or directory (os error 2)
  2327. 60.00 s >
  2328. 60.00 s > Location:
  2329. 60.00 s > crates/alphal00p-docs-builder/src/lib.rs:2276:18
  2330. 60.00 s > stack backtrace:
  2331. 60.00 s > 0: __rustc::rust_begin_unwind
  2332. 60.00 s > 1: core::panicking::panic_fmt
  2333. 60.00 s > 2: core::result::unwrap_failed
  2334. 60.00 s > 3: alphal00p_docs_builder::tests::site_assets_replace_read_only_generated_files
  2335. 60.00 s > 4: <alphal00p_docs_builder::tests::site_assets_replace_read_only_generated_files::{closure#0} as core::ops::function::FnOnce<()>>::call_once
  2336. 60.00 s > note: Some details are omitted, run with `RUST_BACKTRACE=full` for a verbose backtrace.
  2337. 60.00 s >
  2338. 60.00 s > 8. alphal00p-docs-builder::tests::developer_scope_ranges_ignore_unrelated_edits_and_warn_only_while_watching
  2339. 60.00 s > failure: test failure with exit code 101
  2340. 60.00 s > thread 'tests::developer_scope_ranges_ignore_unrelated_edits_and_warn_only_while_watching' (278) panicked at crates/alphal00p-docs-builder/src/lib.rs:12350:29:
  2341. 60.00 s > called `Result::unwrap()` on an `Err` value: required documentation source is missing: /build/source/crates/spynso3/typst/STIXTwoMath-Regular.woff2
  2342. 60.00 s >
  2343. 60.00 s > Location:
  2344. 60.00 s > crates/alphal00p-docs-builder/src/lib.rs:5103:9
  2345. 60.00 s > stack backtrace:
  2346. 60.00 s > 0: __rustc::rust_begin_unwind
  2347. 60.00 s > 1: core::panicking::panic_fmt
  2348. 60.00 s > 2: core::result::unwrap_failed
  2349. 60.00 s > 3: alphal00p_docs_builder::tests::developer_scope_ranges_ignore_unrelated_edits_and_warn_only_while_watching
  2350. 60.00 s > 4: <alphal00p_docs_builder::tests::developer_scope_ranges_ignore_unrelated_edits_and_warn_only_while_watching::{closure#0} as core::ops::function::FnOnce<()>>::call_once
  2351. 60.00 s > note: Some details are omitted, run with `RUST_BACKTRACE=full` for a verbose backtrace.
  2352. 60.00 s > system-out
  2353. 60.00 s > running 1 test
  2354. 60.00 s > test tests::developer_scope_ranges_ignore_unrelated_edits_and_warn_only_while_watching ... FAILED
  2355. 60.00 s >
  2356. 60.00 s > failures:
  2357. 60.00 s >
  2358. 60.00 s > failures:
  2359. 60.00 s > tests::developer_scope_ranges_ignore_unrelated_edits_and_warn_only_while_watching
  2360. 60.00 s >
  2361. 60.00 s > test result: FAILED. 0 passed; 1 failed; 0 ignored; 0 measured; 128 filtered out; finished in 0.11s
  2362. 60.00 s > system-err
  2363. 60.00 s > thread 'tests::developer_scope_ranges_ignore_unrelated_edits_and_warn_only_while_watching' (278) panicked at crates/alphal00p-docs-builder/src/lib.rs:12350:29:
  2364. 60.00 s > called `Result::unwrap()` on an `Err` value: required documentation source is missing: /build/source/crates/spynso3/typst/STIXTwoMath-Regular.woff2
  2365. 60.00 s >
  2366. 60.00 s > Location:
  2367. 60.00 s > crates/alphal00p-docs-builder/src/lib.rs:5103:9
  2368. 60.00 s > stack backtrace:
  2369. 60.00 s > 0: __rustc::rust_begin_unwind
  2370. 60.00 s > 1: core::panicking::panic_fmt
  2371. 60.00 s > 2: core::result::unwrap_failed
  2372. 60.00 s > 3: alphal00p_docs_builder::tests::developer_scope_ranges_ignore_unrelated_edits_and_warn_only_while_watching
  2373. 60.00 s > 4: <alphal00p_docs_builder::tests::developer_scope_ranges_ignore_unrelated_edits_and_warn_only_while_watching::{closure#0} as core::ops::function::FnOnce<()>>::call_once
  2374. 60.00 s > note: Some details are omitted, run with `RUST_BACKTRACE=full` for a verbose backtrace.
  2375. 60.00 s >
  2376. 60.00 s > 9. alphal00p-docs-builder::provenance_tests::each_build_captures_one_revision_before_rendering
  2377. 60.00 s > failure: test failure with exit code 101
  2378. 60.00 s > thread 'provenance_tests::each_build_captures_one_revision_before_rendering' (218) panicked at crates/alphal00p-docs-builder/src/provenance_tests.rs:274:9:
  2379. 60.00 s > assertion failed: command.status().unwrap().success()
  2380. 60.00 s > stack backtrace:
  2381. 60.00 s > 0: __rustc::rust_begin_unwind
  2382. 60.00 s > 1: core::panicking::panic_fmt
  2383. 60.00 s > 2: core::panicking::panic
  2384. 60.00 s > 3: alphal00p_docs_builder::provenance_tests::each_build_captures_one_revision_before_rendering
  2385. 60.00 s > 4: <alphal00p_docs_builder::provenance_tests::each_build_captures_one_revision_before_rendering::{closure#0} as core::ops::function::FnOnce<()>>::call_once
  2386. 60.00 s > note: Some details are omitted, run with `RUST_BACKTRACE=full` for a verbose backtrace.
  2387. 60.00 s > system-out
  2388. 60.00 s > running 1 test
  2389. 60.00 s >
  2390. 60.00 s > running 1 test
  2391. 60.00 s > test provenance_tests::each_build_captures_one_revision_before_rendering ... FAILED
  2392. 60.00 s >
  2393. 60.00 s > failures:
  2394. 60.00 s >
  2395. 60.00 s > failures:
  2396. 60.00 s > provenance_tests::each_build_captures_one_revision_before_rendering
  2397. 60.00 s >
  2398. 60.00 s > test result: FAILED. 0 passed; 1 failed; 0 ignored; 0 measured; 128 filtered out; finished in 0.11s
  2399. 60.00 s >
  2400. 60.00 s > test provenance_tests::each_build_captures_one_revision_before_rendering ... FAILED
  2401. 60.00 s >
  2402. 60.00 s > failures:
  2403. 60.00 s >
  2404. 60.00 s > failures:
  2405. 60.00 s > provenance_tests::each_build_captures_one_revision_before_rendering
  2406. 60.00 s >
  2407. 60.00 s > test result: FAILED. 0 passed; 1 failed; 0 ignored; 0 measured; 128 filtered out; finished in 0.13s
  2408. 60.00 s > system-err
  2409. 60.00 s > thread 'provenance_tests::each_build_captures_one_revision_before_rendering' (284) panicked at crates/alphal00p-docs-builder/src/provenance_tests.rs:297:14:
  2410. 60.00 s > called `Result::unwrap()` on an `Err` value: required documentation source is missing: /build/source/target/nix-ci-tmp/.tmpAH3uti/checkout/crates/spynso3/typst/STIXTwoMath-Regular.woff2
  2411. 60.00 s >
  2412. 60.00 s > Location:
  2413. 60.00 s > crates/alphal00p-docs-builder/src/lib.rs:5103:9
  2414. 60.00 s > stack backtrace:
  2415. 60.00 s > 0: __rustc::rust_begin_unwind
  2416. 60.00 s > 1: core::panicking::panic_fmt
  2417. 60.00 s > 2: core::result::unwrap_failed
  2418. 60.00 s > 3: alphal00p_docs_builder::provenance_tests::each_build_captures_one_revision_before_rendering
  2419. 60.00 s > 4: <alphal00p_docs_builder::provenance_tests::each_build_captures_one_revision_before_rendering::{closure#0} as core::ops::function::FnOnce<()>>::call_once
  2420. 60.00 s > note: Some details are omitted, run with `RUST_BACKTRACE=full` for a verbose backtrace.
  2421. 60.00 s >
  2422. 60.00 s > thread 'provenance_tests::each_build_captures_one_revision_before_rendering' (218) panicked at crates/alphal00p-docs-builder/src/provenance_tests.rs:274:9:
  2423. 60.00 s > assertion failed: command.status().unwrap().success()
  2424. 60.00 s > stack backtrace:
  2425. 60.00 s > 0: __rustc::rust_begin_unwind
  2426. 60.00 s > 1: core::panicking::panic_fmt
  2427. 60.00 s > 2: core::panicking::panic
  2428. 60.00 s > 3: alphal00p_docs_builder::provenance_tests::each_build_captures_one_revision_before_rendering
  2429. 60.00 s > 4: <alphal00p_docs_builder::provenance_tests::each_build_captures_one_revision_before_rendering::{closure#0} as core::ops::function::FnOnce<()>>::call_once
  2430. 60.00 s > note: Some details are omitted, run with `RUST_BACKTRACE=full` for a verbose backtrace.
  2431. 60.00 s >
  2432. 60.00 s > 10. alphal00p-docs-builder::tests::every_product_requires_a_task_chooser_and_each_supported_interface
  2433. 60.00 s > failure: test failure with exit code 101
  2434. 60.00 s > thread 'tests::every_product_requires_a_task_chooser_and_each_supported_interface' (312) panicked at crates/alphal00p-docs-builder/src/lib.rs:12274:9:
  2435. 60.00 s > assertion failed: format!("{error:#}").contains("has no quickstart page")
  2436. 60.00 s > stack backtrace:
  2437. 60.00 s > 0: __rustc::rust_begin_unwind
  2438. 60.00 s > 1: core::panicking::panic_fmt
  2439. 60.00 s > 2: core::panicking::panic
  2440. 60.00 s > 3: alphal00p_docs_builder::tests::every_product_requires_a_task_chooser_and_each_supported_interface
  2441. 60.00 s > 4: <alphal00p_docs_builder::tests::every_product_requires_a_task_chooser_and_each_supported_interface::{closure#0} as core::ops::function::FnOnce<()>>::call_once
  2442. 60.00 s > note: Some details are omitted, run with `RUST_BACKTRACE=full` for a verbose backtrace.
  2443. 60.00 s > system-out
  2444. 60.00 s > running 1 test
  2445. 60.00 s > test tests::every_product_requires_a_task_chooser_and_each_supported_interface ... FAILED
  2446. 60.00 s >
  2447. 60.00 s > failures:
  2448. 60.00 s >
  2449. 60.00 s > failures:
  2450. 60.00 s > tests::every_product_requires_a_task_chooser_and_each_supported_interface
  2451. 60.00 s >
  2452. 60.00 s > test result: FAILED. 0 passed; 1 failed; 0 ignored; 0 measured; 128 filtered out; finished in 0.12s
  2453. 60.00 s > system-err
  2454. 60.00 s > thread 'tests::every_product_requires_a_task_chooser_and_each_supported_interface' (312) panicked at crates/alphal00p-docs-builder/src/lib.rs:12274:9:
  2455. 60.00 s > assertion failed: format!("{error:#}").contains("has no quickstart page")
  2456. 60.00 s > stack backtrace:
  2457. 60.00 s > 0: __rustc::rust_begin_unwind
  2458. 60.00 s > 1: core::panicking::panic_fmt
  2459. 60.00 s > 2: core::panicking::panic
  2460. 60.00 s > 3: alphal00p_docs_builder::tests::every_product_requires_a_task_chooser_and_each_supported_interface
  2461. 60.00 s > 4: <alphal00p_docs_builder::tests::every_product_requires_a_task_chooser_and_each_supported_interface::{closure#0} as core::ops::function::FnOnce<()>>::call_once
  2462. 60.00 s > note: Some details are omitted, run with `RUST_BACKTRACE=full` for a verbose backtrace.
  2463. 60.00 s >
  2464. 60.00 s > 11. alphal00p-docs-builder::tests::pdf_manual_chapter_order_must_match_the_page_registry
  2465. 60.00 s > failure: test failure with exit code 101
  2466. 60.00 s > thread 'tests::pdf_manual_chapter_order_must_match_the_page_registry' (397) panicked at crates/alphal00p-docs-builder/src/lib.rs:12330:9:
  2467. 60.00 s > assertion failed: format!("{error:#}").contains("PDF manual chapter order differs")
  2468. 60.00 s > stack backtrace:
  2469. 60.00 s > 0: __rustc::rust_begin_unwind
  2470. 60.00 s > 1: core::panicking::panic_fmt
  2471. 60.00 s > 2: core::panicking::panic
  2472. 60.00 s > 3: alphal00p_docs_builder::tests::pdf_manual_chapter_order_must_match_the_page_registry
  2473. 60.00 s > 4: <alphal00p_docs_builder::tests::pdf_manual_chapter_order_must_match_the_page_registry::{closure#0} as core::ops::function::FnOnce<()>>::call_once
  2474. 60.00 s > note: Some details are omitted, run with `RUST_BACKTRACE=full` for a verbose backtrace.
  2475. 60.00 s > system-out
  2476. 60.00 s > running 1 test
  2477. 60.00 s > test tests::pdf_manual_chapter_order_must_match_the_page_registry ... FAILED
  2478. 60.00 s >
  2479. 60.00 s > failures:
  2480. 60.00 s >
  2481. 60.00 s > failures:
  2482. 60.00 s > tests::pdf_manual_chapter_order_must_match_the_page_registry
  2483. 60.00 s >
  2484. 60.00 s > test result: FAILED. 0 passed; 1 failed; 0 ignored; 0 measured; 128 filtered out; finished in 0.11s
  2485. 60.00 s > system-err
  2486. 60.00 s > thread 'tests::pdf_manual_chapter_order_must_match_the_page_registry' (397) panicked at crates/alphal00p-docs-builder/src/lib.rs:12330:9:
  2487. 60.00 s > assertion failed: format!("{error:#}").contains("PDF manual chapter order differs")
  2488. 60.00 s > stack backtrace:
  2489. 60.00 s > 0: __rustc::rust_begin_unwind
  2490. 60.00 s > 1: core::panicking::panic_fmt
  2491. 60.00 s > 2: core::panicking::panic
  2492. 60.00 s > 3: alphal00p_docs_builder::tests::pdf_manual_chapter_order_must_match_the_page_registry
  2493. 60.00 s > 4: <alphal00p_docs_builder::tests::pdf_manual_chapter_order_must_match_the_page_registry::{closure#0} as core::ops::function::FnOnce<()>>::call_once
  2494. 60.00 s > note: Some details are omitted, run with `RUST_BACKTRACE=full` for a verbose backtrace.
  2495. 60.00 s > =========================================
  2496. 60.00 s > Extracting 2 binaries to /build/source
  2497. 60.00 s > Extracted 5 files to /build/source in 0.04s
  2498. 60.00 s > ------------
  2499. 60.00 s > Nextest run ID cc6692dc-2123-4448-be1f-d87456592287 with nextest profile: ci_gammaloop
  2500. 60.00 s > Starting 22 tests across 2 binaries
  2501. 60.00 s > ------------
  2502. 60.00 s > Summary [ 0.018s] 22 tests run: 22 passed, 0 skipped
  2503. 60.00 s >
  2504. 60.00 s > ========== nextest test summary ==========
  2505. 60.00 s > report: target/nextest/ci_gammaloop/junit.xml
  2506. 60.00 s > tests: 22, failures: 0, errors: 0
  2507. 60.00 s > No failing testcases found.
  2508. 60.00 s > =========================================
  2509. 60.00 s > Extracting 3 binaries (including 2 non-test binaries), 1 build script output directory, and 2 linked paths to /build/source
  2510. 60.00 s > Extracted 22 files to /build/source in 0.27s
  2511. 60.00 s > ------------
  2512. 60.00 s > Nextest run ID 0876bde2-8b11-4b7a-b730-1866a64edca0 with nextest profile: ci_gammaloop
  2513. 60.00 s > Starting 89 tests across 1 binary
  2514. 60.00 s > ------------
  2515. 60.00 s > Summary [ 0.038s] 89 tests run: 89 passed, 0 skipped
  2516. 60.00 s >
  2517. 60.00 s > ========== nextest test summary ==========
  2518. 60.00 s > report: target/nextest/ci_gammaloop/junit.xml
  2519. 60.00 s > tests: 89, failures: 0, errors: 0
  2520. 60.00 s > No failing testcases found.
  2521. 60.00 s > =========================================
  2522. 60.00 s > Extracting 2 binaries to /build/source
  2523. 60.00 s > Extracted 5 files to /build/source in 0.04s
  2524. 60.00 s > ------------
  2525. 60.00 s > Nextest run ID 620f1710-85a5-4d7d-af32-5d3fb6680747 with nextest profile: ci_gammaloop
  2526. 60.00 s > Starting 10 tests across 2 binaries
  2527. 60.00 s > ------------
  2528. 60.00 s > Summary [ 12.227s] 10 tests run: 10 passed, 0 skipped
  2529. 60.00 s >
  2530. 60.00 s > ========== nextest test summary ==========
  2531. 60.00 s > report: target/nextest/ci_gammaloop/junit.xml
  2532. 60.00 s > tests: 10, failures: 0, errors: 0
  2533. 60.00 s > No failing testcases found.
  2534. 60.00 s > =========================================
  2535. 60.00 s > Extracting 1 binary to /build/source
  2536. 60.00 s > Extracted 4 files to /build/source in 0.04s
  2537. 60.00 s > ------------
  2538. 60.00 s > Nextest run ID 554cdea1-98e0-4eb0-abed-7931a71a921a with nextest profile: ci_gammaloop
  2539. 60.00 s > Starting 0 tests across 1 binary
  2540. 60.00 s > ------------
  2541. 60.00 s > Summary [ 0.000s] 0 tests run: 0 passed, 0 skipped
  2542. 60.00 s >
  2543. 60.00 s > ========== nextest test summary ==========
  2544. 60.00 s > report: target/nextest/ci_gammaloop/junit.xml
  2545. 60.00 s > tests: 0, failures: 0, errors: 0
  2546. 60.00 s > No failing testcases found.
  2547. 60.00 s > =========================================
  2548. 60.00 s > Extracting 1 binary to /build/source
  2549. 60.00 s > Extracted 4 files to /build/source in 0.04s
  2550. 60.00 s > ------------
  2551. 60.00 s > Nextest run ID 0e523ab5-b874-44f9-9ff4-56a920af0668 with nextest profile: ci_gammaloop
  2552. 60.00 s > Starting 5 tests across 1 binary
  2553. 60.00 s > ------------
  2554. 60.00 s > Summary [ 0.006s] 5 tests run: 5 passed, 0 skipped
  2555. 60.00 s >
  2556. 60.00 s > ========== nextest test summary ==========
  2557. 60.00 s > report: target/nextest/ci_gammaloop/junit.xml
  2558. 60.00 s > tests: 5, failures: 0, errors: 0
  2559. 60.00 s > No failing testcases found.
  2560. 60.00 s > =========================================
  2561. 60.00 s For full logs, run:
  2562. 60.00 s nix log /nix/store/yhcpczfzd32fj8slcs1lsa10nlfs6yzl-gammaloop-nextest-docs.drv
  2563. 60.20 s [5 built (1 failed), 120Run failed.