test packages.x86_64-linux.nix-ci-check-gammaloop-nextest-docs
0.00 s
$ /nix/store/61685rbaxmpigwi3z23i33sv3jyfl70q-coreutils-9.11/bin/timeout --kill-after=15s 7200s /nix/store/wknkybkzrc16r11vk5vrykh4wmw7a353-nix-2.34.8/bin/nix --extra-experimental-features nix-command --extra-experimental-features flakes flake clone git+https://github.com/alphal00p/gammaloop --dest /tmp/nix-ci-worker/stable-pwd/repo/
0.07 s
Cloning into '/tmp/nix-ci-worker/stable-pwd/repo'...
0.80 s
remote: Enumerating objects: 103784, done.
0.96 s
remote: Counting objects: 0% (1/9421)
remote: Counting objects: 1% (95/9421)
remote: Counting objects: 2% (189/9421)
remote: Counting objects: 3% (283/9421)
remote: Counting objects: 4% (377/9421)
remote: Counting objects: 5% (472/9421)
remote: Counting objects: 6% (566/9421)
remote: Counting objects: 7% (660/9421)
remote: Counting objects: 8% (754/9421)
remote: Counting objects: 9% (848/9421)
remote: Counting objects: 10% (943/9421)
remote: Counting objects: 11% (1037/9421)
remote: Counting objects: 12% (1131/9421)
remote: Counting objects: 13% (1225/9421)
remote: Counting objects: 14% (1319/9421)
remote: Counting objects: 15% (1414/9421)
remote: Counting objects: 16% (1508/9421)
remote: Counting objects: 17% (1602/9421)
remote: Counting objects: 18% (1696/9421)
remote: Counting objects: 19% (1790/9421)
remote: Counting objects: 20% (1885/9421)
remote: Counting objects: 21% (1979/9421)
remote: Counting objects: 22% (2073/9421)
remote: Counting objects: 23% (2167/9421)
remote: Counting objects: 24% (2262/9421)
remote: Counting objects: 25% (2356/9421)
remote: Counting objects: 26% (2450/9421)
remote: Counting objects: 27% (2544/9421)
remote: Counting objects: 28% (2638/9421)
remote: Counting objects: 29% (2733/9421)
remote: Counting objects: 30% (2827/9421)
remote: Counting objects: 31% (2921/9421)
remote: Counting objects: 32% (3015/9421)
remote: Counting objects: 33% (3109/9421)
remote: Counting objects: 34% (3204/9421)
remote: Counting objects: 35% (3298/9421)
remote: Counting objects: 36% (3392/9421)
remote: Counting objects: 37% (3486/9421)
remote: Counting objects: 38% (3580/9421)
remote: Counting objects: 39% (3675/9421)
remote: Counting objects: 40% (3769/9421)
remote: Counting objects: 41% (3863/9421)
remote: Counting objects: 42% (3957/9421)
remote: Counting objects: 43% (4052/9421)
remote: Counting objects: 44% (4146/9421)
remote: Counting objects: 45% (4240/9421)
remote: Counting objects: 46% (4334/9421)
remote: Counting objects: 47% (4428/9421)
remote: Counting objects: 48% (4523/9421)
remote: Counting objects: 49% (4617/9421)
remote: Counting objects: 50% (4711/9421)
remote: Counting objects: 51% (4805/9421)
remote: Counting objects: 52% (4899/9421)
remote: Counting objects: 53% (4994/9421)
remote: Counting objects: 54% (5088/9421)
remote: Counting objects: 55% (5182/9421)
remote: Counting objects: 56% (5276/9421)
remote: Counting objects: 57% (5370/9421)
remote: Counting objects: 58% (5465/9421)
remote: Counting objects: 59% (5559/9421)
remote: Counting objects: 60% (5653/9421)
remote: Counting objects: 61% (5747/9421)
remote: Counting objects: 62% (5842/9421)
remote: Counting objects: 63% (5936/9421)
remote: Counting objects: 64% (6030/9421)
remote: Counting objects: 65% (6124/9421)
remote: Counting objects: 66% (6218/9421)
remote: Counting objects: 67% (6313/9421)
remote: Counting objects: 68% (6407/9421)
remote: Counting objects: 69% (6501/9421)
remote: Counting objects: 70% (6595/9421)
remote: Counting objects: 71% (6689/9421)
remote: Counting objects: 72% (6784/9421)
remote: Counting objects: 73% (6878/9421)
remote: Counting objects: 74% (6972/9421)
remote: Counting objects: 75% (7066/9421)
remote: Counting objects: 76% (7160/9421)
remote: Counting objects: 77% (7255/9421)
remote: Counting objects: 78% (7349/9421)
remote: Counting objects: 79% (7443/9421)
remote: Counting objects: 80% (7537/9421)
remote: Counting objects: 81% (7632/9421)
remote: Counting objects: 82% (7726/9421)
remote: Counting objects: 83% (7820/9421)
remote: Counting objects: 84% (7914/9421)
remote: Counting objects: 85% (8008/9421)
remote: Counting objects: 86% (8103/9421)
remote: Counting objects: 87% (8197/9421)
remote: Counting objects: 88% (8291/9421)
remote: Counting objects: 89% (8385/9421)
remote: Counting objects: 90% (8479/9421)
remote: Counting objects: 91% (8574/9421)
remote: Counting objects: 92% (8668/9421)
remote: Counting objects: 93% (8762/9421)
remote: Counting objects: 94% (8856/9421)
remote: Counting objects: 95% (8950/9421)
remote: Counting objects: 96% (9045/9421)
remote: Counting objects: 97% (9139/9421)
remote: Counting objects: 98% (9233/9421)
remote: Counting objects: 99% (9327/9421)
remote: Counting objects: 100% (9421/9421)
remote: Counting objects: 100% (9421/9421), done.
2.88 s
remote: Compressing objects: 0% (1/2027)
remote: Compressing objects: 1% (21/2027)
remote: Compressing objects: 2% (41/2027)
remote: Compressing objects: 3% (61/2027)
remote: Compressing objects: 4% (82/2027)
remote: Compressing objects: 5% (102/2027)
remote: Compressing objects: 6% (122/2027)
remote: Compressing objects: 7% (142/2027)
remote: Compressing objects: 8% (163/2027)
remote: Compressing objects: 9% (183/2027)
remote: Compressing objects: 10% (203/2027)
remote: Compressing objects: 10% (219/2027)
remote: Compressing objects: 11% (223/2027)
remote: Compressing objects: 12% (244/2027)
remote: Compressing objects: 13% (264/2027)
remote: Compressing objects: 14% (284/2027)
remote: Compressing objects: 15% (305/2027)
remote: Compressing objects: 16% (325/2027)
remote: Compressing objects: 17% (345/2027)
remote: Compressing objects: 18% (365/2027)
remote: Compressing objects: 19% (386/2027)
remote: Compressing objects: 20% (406/2027)
remote: Compressing objects: 21% (426/2027)
remote: Compressing objects: 22% (446/2027)
remote: Compressing objects: 23% (467/2027)
remote: Compressing objects: 24% (487/2027)
remote: Compressing objects: 25% (507/2027)
remote: Compressing objects: 26% (528/2027)
remote: Compressing objects: 27% (548/2027)
remote: Compressing objects: 28% (568/2027)
remote: Compressing objects: 29% (588/2027)
remote: Compressing objects: 30% (609/2027)
remote: Compressing objects: 31% (629/2027)
remote: Compressing objects: 32% (649/2027)
remote: Compressing objects: 33% (669/2027)
remote: Compressing objects: 34% (690/2027)
remote: Compressing objects: 34% (705/2027)
remote: Compressing objects: 35% (710/2027)
remote: Compressing objects: 36% (730/2027)
remote: Compressing objects: 37% (750/2027)
remote: Compressing objects: 38% (771/2027)
remote: Compressing objects: 39% (791/2027)
remote: Compressing objects: 40% (811/2027)
remote: Compressing objects: 41% (832/2027)
remote: Compressing objects: 42% (852/2027)
remote: Compressing objects: 43% (872/2027)
remote: Compressing objects: 44% (892/2027)
remote: Compressing objects: 45% (913/2027)
remote: Compressing objects: 46% (933/2027)
remote: Compressing objects: 47% (953/2027)
remote: Compressing objects: 48% (973/2027)
remote: Compressing objects: 49% (994/2027)
remote: Compressing objects: 50% (1014/2027)
remote: Compressing objects: 51% (1034/2027)
remote: Compressing objects: 52% (1055/2027)
remote: Compressing objects: 53% (1075/2027)
remote: Compressing objects: 54% (1095/2027)
remote: Compressing objects: 55% (1115/2027)
remote: Compressing objects: 56% (1136/2027)
remote: Compressing objects: 57% (1156/2027)
remote: Compressing objects: 58% (1176/2027)
remote: Compressing objects: 59% (1196/2027)
remote: Compressing objects: 60% (1217/2027)
remote: Compressing objects: 61% (1237/2027)
remote: Compressing objects: 62% (1257/2027)
remote: Compressing objects: 63% (1278/2027)
remote: Compressing objects: 64% (1298/2027)
remote: Compressing objects: 65% (1318/2027)
remote: Compressing objects: 66% (1338/2027)
remote: Compressing objects: 67% (1359/2027)
remote: Compressing objects: 68% (1379/2027)
remote: Compressing objects: 69% (1399/2027)
remote: Compressing objects: 70% (1419/2027)
remote: Compressing objects: 71% (1440/2027)
remote: Compressing objects: 72% (1460/2027)
remote: Compressing objects: 73% (1480/2027)
remote: Compressing objects: 74% (1500/2027)
remote: Compressing objects: 75% (1521/2027)
remote: Compressing objects: 76% (1541/2027)
remote: Compressing objects: 77% (1561/2027)
remote: Compressing objects: 78% (1582/2027)
remote: Compressing objects: 79% (1602/2027)
remote: Compressing objects: 80% (1622/2027)
remote: Compressing objects: 81% (1642/2027)
remote: Compressing objects: 82% (1663/2027)
remote: Compressing objects: 83% (1683/2027)
remote: Compressing objects: 84% (1703/2027)
remote: Compressing objects: 85% (1723/2027)
remote: Compressing objects: 86% (1744/2027)
remote: Compressing objects: 87% (1764/2027)
remote: Compressing objects: 88% (1784/2027)
remote: Compressing objects: 89% (1805/2027)
remote: Compressing objects: 90% (1825/2027)
remote: Compressing objects: 91% (1845/2027)
remote: Compressing objects: 92% (1865/2027)
remote: Compressing objects: 93% (1886/2027)
remote: Compressing objects: 94% (1906/2027)
remote: Compressing objects: 95% (1926/2027)
remote: Compressing objects: 96% (1946/2027)
remote: Compressing objects: 97% (1967/2027)
remote: Compressing objects: 98% (1987/2027)
remote: Compressing objects: 99% (2007/2027)
remote: Compressing objects: 100% (2027/2027)
remote: Compressing objects: 100% (2027/2027), done.
15.49 s
Receiving objects: 0% (1/103784)
Receiving objects: 1% (1038/103784)
Receiving objects: 2% (2076/103784)
Receiving objects: 3% (3114/103784)
Receiving objects: 4% (4152/103784)
Receiving objects: 5% (5190/103784)
Receiving objects: 6% (6228/103784)
Receiving objects: 7% (7265/103784), 16.36 MiB | 32.69 MiB/s
Receiving objects: 8% (8303/103784), 16.36 MiB | 32.69 MiB/s
Receiving objects: 9% (9341/103784), 16.36 MiB | 32.69 MiB/s
Receiving objects: 10% (10379/103784), 16.36 MiB | 32.69 MiB/s
Receiving objects: 11% (11417/103784), 16.36 MiB | 32.69 MiB/s
Receiving objects: 12% (12455/103784), 16.36 MiB | 32.69 MiB/s
Receiving objects: 13% (13492/103784), 16.36 MiB | 32.69 MiB/s
Receiving objects: 14% (14530/103784), 16.36 MiB | 32.69 MiB/s
Receiving objects: 15% (15568/103784), 16.36 MiB | 32.69 MiB/s
Receiving objects: 16% (16606/103784), 16.36 MiB | 32.69 MiB/s
Receiving objects: 17% (17644/103784), 16.36 MiB | 32.69 MiB/s
Receiving objects: 18% (18682/103784), 16.36 MiB | 32.69 MiB/s
Receiving objects: 19% (19719/103784), 16.36 MiB | 32.69 MiB/s
Receiving objects: 20% (20757/103784), 16.36 MiB | 32.69 MiB/s
Receiving objects: 21% (21795/103784), 16.36 MiB | 32.69 MiB/s
Receiving objects: 22% (22833/103784), 16.36 MiB | 32.69 MiB/s
Receiving objects: 23% (23871/103784), 16.36 MiB | 32.69 MiB/s
Receiving objects: 24% (24909/103784), 16.36 MiB | 32.69 MiB/s
Receiving objects: 25% (25946/103784), 16.36 MiB | 32.69 MiB/s
Receiving objects: 26% (26984/103784), 16.36 MiB | 32.69 MiB/s
Receiving objects: 27% (28022/103784), 16.36 MiB | 32.69 MiB/s
Receiving objects: 28% (29060/103784), 16.36 MiB | 32.69 MiB/s
Receiving objects: 29% (30098/103784), 16.36 MiB | 32.69 MiB/s
Receiving objects: 30% (31136/103784), 16.36 MiB | 32.69 MiB/s
Receiving objects: 31% (32174/103784), 16.36 MiB | 32.69 MiB/s
Receiving objects: 32% (33211/103784), 16.36 MiB | 32.69 MiB/s
Receiving objects: 33% (34249/103784), 16.36 MiB | 32.69 MiB/s
Receiving objects: 33% (34896/103784), 34.69 MiB | 34.68 MiB/s
Receiving objects: 34% (35287/103784), 34.69 MiB | 34.68 MiB/s
Receiving objects: 35% (36325/103784), 34.69 MiB | 34.68 MiB/s
Receiving objects: 36% (37363/103784), 34.69 MiB | 34.68 MiB/s
Receiving objects: 37% (38401/103784), 34.69 MiB | 34.68 MiB/s
Receiving objects: 38% (39438/103784), 34.69 MiB | 34.68 MiB/s
Receiving objects: 39% (40476/103784), 34.69 MiB | 34.68 MiB/s
Receiving objects: 40% (41514/103784), 34.69 MiB | 34.68 MiB/s
Receiving objects: 41% (42552/103784), 34.69 MiB | 34.68 MiB/s
Receiving objects: 42% (43590/103784), 34.69 MiB | 34.68 MiB/s
Receiving objects: 43% (44628/103784), 53.02 MiB | 34.25 MiB/s
Receiving objects: 44% (45665/103784), 53.02 MiB | 34.25 MiB/s
Receiving objects: 45% (46703/103784), 53.02 MiB | 34.25 MiB/s
Receiving objects: 46% (47741/103784), 53.02 MiB | 34.25 MiB/s
Receiving objects: 47% (48779/103784), 53.02 MiB | 34.25 MiB/s
Receiving objects: 47% (49667/103784), 53.02 MiB | 34.25 MiB/s
Receiving objects: 48% (49817/103784), 53.02 MiB | 34.25 MiB/s
Receiving objects: 49% (50855/103784), 53.02 MiB | 34.25 MiB/s
Receiving objects: 50% (51892/103784), 71.80 MiB | 35.06 MiB/s
Receiving objects: 51% (52930/103784), 71.80 MiB | 35.06 MiB/s
Receiving objects: 52% (53968/103784), 71.80 MiB | 35.06 MiB/s
Receiving objects: 53% (55006/103784), 71.80 MiB | 35.06 MiB/s
Receiving objects: 54% (56044/103784), 71.80 MiB | 35.06 MiB/s
Receiving objects: 54% (57048/103784), 87.87 MiB | 34.48 MiB/s
Receiving objects: 55% (57082/103784), 122.70 MiB | 34.58 MiB/s
Receiving objects: 55% (58051/103784), 141.00 MiB | 34.83 MiB/s
Receiving objects: 56% (58120/103784), 157.34 MiB | 34.59 MiB/s
Receiving objects: 56% (58121/103784), 157.34 MiB | 34.59 MiB/s
Receiving objects: 56% (58333/103784), 192.23 MiB | 34.62 MiB/s
Receiving objects: 57% (59157/103784), 227.19 MiB | 34.51 MiB/s
Receiving objects: 58% (60195/103784), 227.19 MiB | 34.51 MiB/s
Receiving objects: 59% (61233/103784), 227.19 MiB | 34.51 MiB/s
Receiving objects: 60% (62271/103784), 227.19 MiB | 34.51 MiB/s
Receiving objects: 61% (63309/103784), 227.19 MiB | 34.51 MiB/s
Receiving objects: 62% (64347/103784), 227.19 MiB | 34.51 MiB/s
Receiving objects: 62% (64488/103784), 246.05 MiB | 34.80 MiB/s
Receiving objects: 63% (65384/103784), 246.05 MiB | 34.80 MiB/s
Receiving objects: 64% (66422/103784), 246.05 MiB | 34.80 MiB/s
Receiving objects: 65% (67460/103784), 246.05 MiB | 34.80 MiB/s
Receiving objects: 66% (68498/103784), 246.05 MiB | 34.80 MiB/s
Receiving objects: 67% (69536/103784), 246.05 MiB | 34.80 MiB/s
Receiving objects: 68% (70574/103784), 246.05 MiB | 34.80 MiB/s
Receiving objects: 69% (71611/103784), 246.05 MiB | 34.80 MiB/s
Receiving objects: 70% (72649/103784), 246.05 MiB | 34.80 MiB/s
Receiving objects: 71% (73687/103784), 246.05 MiB | 34.80 MiB/s
Receiving objects: 72% (74725/103784), 264.54 MiB | 34.71 MiB/s
Receiving objects: 73% (75763/103784), 264.54 MiB | 34.71 MiB/s
Receiving objects: 73% (76766/103784), 264.54 MiB | 34.71 MiB/s
Receiving objects: 74% (76801/103784), 264.54 MiB | 34.71 MiB/s
Receiving objects: 75% (77838/103784), 280.73 MiB | 34.77 MiB/s
Receiving objects: 76% (78876/103784), 299.35 MiB | 34.84 MiB/s
Receiving objects: 77% (79914/103784), 299.35 MiB | 34.84 MiB/s
Receiving objects: 78% (80952/103784), 299.35 MiB | 34.84 MiB/s
Receiving objects: 79% (81990/103784), 299.35 MiB | 34.84 MiB/s
Receiving objects: 80% (83028/103784), 299.35 MiB | 34.84 MiB/s
Receiving objects: 80% (83509/103784), 299.35 MiB | 34.84 MiB/s
Receiving objects: 81% (84066/103784), 299.35 MiB | 34.84 MiB/s
Receiving objects: 82% (85103/103784), 315.81 MiB | 34.87 MiB/s
Receiving objects: 82% (85496/103784), 334.02 MiB | 34.90 MiB/s
Receiving objects: 83% (86141/103784), 350.76 MiB | 34.90 MiB/s
Receiving objects: 84% (87179/103784), 368.91 MiB | 34.86 MiB/s
Receiving objects: 85% (88217/103784), 368.91 MiB | 34.86 MiB/s
Receiving objects: 85% (88955/103784), 368.91 MiB | 34.86 MiB/s
Receiving objects: 86% (89255/103784), 368.91 MiB | 34.86 MiB/s
Receiving objects: 87% (90293/103784), 385.57 MiB | 34.86 MiB/s
Receiving objects: 88% (91330/103784), 385.57 MiB | 34.86 MiB/s
Receiving objects: 89% (92368/103784), 385.57 MiB | 34.86 MiB/s
Receiving objects: 89% (92484/103784), 404.37 MiB | 35.19 MiB/s
Receiving objects: 90% (93406/103784), 420.54 MiB | 34.68 MiB/s
Receiving objects: 91% (94444/103784), 420.54 MiB | 34.68 MiB/s
Receiving objects: 92% (95482/103784), 420.54 MiB | 34.68 MiB/s
Receiving objects: 93% (96520/103784), 420.54 MiB | 34.68 MiB/s
Receiving objects: 94% (97557/103784), 420.54 MiB | 34.68 MiB/s
Receiving objects: 95% (98595/103784), 420.54 MiB | 34.68 MiB/s
Receiving objects: 96% (99633/103784), 420.54 MiB | 34.68 MiB/s
Receiving objects: 97% (100671/103784), 420.54 MiB | 34.68 MiB/s
Receiving objects: 98% (101709/103784), 420.54 MiB | 34.68 MiB/s
Receiving objects: 99% (102747/103784), 420.54 MiB | 34.68 MiB/s
remote: Total 103784 (delta 8150), reused 7457 (delta 7388), pack-reused 94363 (from 4)
15.49 s
Receiving objects: 100% (103784/103784), 438.93 MiB | 35.16 MiB/s
Receiving objects: 100% (103784/103784), 439.18 MiB | 34.84 MiB/s, done.
16.67 s
Resolving deltas: 0% (0/67929)
Resolving deltas: 1% (681/67929)
Resolving deltas: 2% (1359/67929)
Resolving deltas: 3% (2038/67929)
Resolving deltas: 4% (2719/67929)
Resolving deltas: 5% (3397/67929)
Resolving deltas: 6% (4077/67929)
Resolving deltas: 7% (4757/67929)
Resolving deltas: 8% (5435/67929)
Resolving deltas: 9% (6115/67929)
Resolving deltas: 10% (6793/67929)
Resolving deltas: 11% (7473/67929)
Resolving deltas: 12% (8152/67929)
Resolving deltas: 13% (8831/67929)
Resolving deltas: 14% (9512/67929)
Resolving deltas: 15% (10190/67929)
Resolving deltas: 16% (10870/67929)
Resolving deltas: 17% (11548/67929)
Resolving deltas: 18% (12228/67929)
Resolving deltas: 19% (12910/67929)
Resolving deltas: 20% (13586/67929)
Resolving deltas: 21% (14266/67929)
Resolving deltas: 22% (14946/67929)
Resolving deltas: 23% (15624/67929)
Resolving deltas: 24% (16303/67929)
Resolving deltas: 25% (16983/67929)
Resolving deltas: 26% (17662/67929)
Resolving deltas: 27% (18342/67929)
Resolving deltas: 28% (19021/67929)
Resolving deltas: 29% (19701/67929)
Resolving deltas: 30% (20379/67929)
Resolving deltas: 31% (21058/67929)
Resolving deltas: 32% (21739/67929)
Resolving deltas: 33% (22417/67929)
Resolving deltas: 34% (23096/67929)
Resolving deltas: 35% (23778/67929)
Resolving deltas: 36% (24455/67929)
Resolving deltas: 37% (25134/67929)
Resolving deltas: 38% (25814/67929)
Resolving deltas: 39% (26493/67929)
Resolving deltas: 40% (27172/67929)
Resolving deltas: 41% (27851/67929)
Resolving deltas: 42% (28531/67929)
Resolving deltas: 43% (29210/67929)
Resolving deltas: 44% (29890/67929)
Resolving deltas: 45% (30569/67929)
Resolving deltas: 46% (31248/67929)
Resolving deltas: 47% (31927/67929)
Resolving deltas: 48% (32607/67929)
Resolving deltas: 49% (33286/67929)
Resolving deltas: 50% (33965/67929)
Resolving deltas: 51% (34644/67929)
Resolving deltas: 52% (35324/67929)
Resolving deltas: 53% (36003/67929)
Resolving deltas: 54% (36682/67929)
Resolving deltas: 55% (37361/67929)
Resolving deltas: 56% (38041/67929)
Resolving deltas: 57% (38720/67929)
Resolving deltas: 58% (39399/67929)
Resolving deltas: 59% (40079/67929)
Resolving deltas: 60% (40758/67929)
Resolving deltas: 61% (41437/67929)
Resolving deltas: 62% (42116/67929)
Resolving deltas: 63% (42796/67929)
Resolving deltas: 64% (43475/67929)
Resolving deltas: 65% (44155/67929)
Resolving deltas: 66% (44834/67929)
Resolving deltas: 67% (45513/67929)
Resolving deltas: 68% (46193/67929)
Resolving deltas: 69% (46872/67929)
Resolving deltas: 70% (47554/67929)
Resolving deltas: 71% (48233/67929)
Resolving deltas: 72% (48909/67929)
Resolving deltas: 73% (49589/67929)
Resolving deltas: 74% (50268/67929)
Resolving deltas: 75% (50947/67929)
Resolving deltas: 76% (51627/67929)
Resolving deltas: 77% (52306/67929)
Resolving deltas: 78% (52985/67929)
Resolving deltas: 79% (53664/67929)
Resolving deltas: 80% (54344/67929)
Resolving deltas: 81% (55023/67929)
Resolving deltas: 82% (55703/67929)
Resolving deltas: 83% (56382/67929)
Resolving deltas: 83% (56593/67929)
Resolving deltas: 84% (57061/67929)
Resolving deltas: 85% (57740/67929)
Resolving deltas: 86% (58419/67929)
Resolving deltas: 87% (59099/67929)
Resolving deltas: 88% (59778/67929)
Resolving deltas: 89% (60457/67929)
Resolving deltas: 90% (61138/67929)
Resolving deltas: 91% (61816/67929)
Resolving deltas: 92% (62495/67929)
Resolving deltas: 93% (63174/67929)
Resolving deltas: 94% (63854/67929)
Resolving deltas: 95% (64534/67929)
Resolving deltas: 96% (65212/67929)
Resolving deltas: 97% (65892/67929)
Resolving deltas: 98% (66571/67929)
Resolving deltas: 99% (67250/67929)
Resolving deltas: 100% (67929/67929)
Resolving deltas: 100% (67929/67929), done.
17.32 s
Fetching commit 58aaf5380023d118a91aa4083c01395586246f14 for feynkit ...
17.32 s
$ /nix/store/5vpcfsdx1lcnlb2y4k7xyc74shp5qwbh-git-2.54.0/bin/git fetch origin 58aaf5380023d118a91aa4083c01395586246f14
17.75 s
From https://github.com/alphal00p/gammaloop
17.75 s
* branch 58aaf5380023d118a91aa4083c01395586246f14 -> FETCH_HEAD
17.76 s
$ /nix/store/61685rbaxmpigwi3z23i33sv3jyfl70q-coreutils-9.11/bin/timeout --kill-after=15s 7200s /nix/store/5vpcfsdx1lcnlb2y4k7xyc74shp5qwbh-git-2.54.0/bin/git -c advice.detachedHead=false checkout 58aaf5380023d118a91aa4083c01395586246f14
17.99 s
HEAD is now at 58aaf5380 share physics layout across graph renderers
18.00 s
$ /nix/store/61685rbaxmpigwi3z23i33sv3jyfl70q-coreutils-9.11/bin/timeout --kill-after=15s 7200s /nix/store/wknkybkzrc16r11vk5vrykh4wmw7a353-nix-2.34.8/bin/nix --extra-experimental-features nix-command --extra-experimental-features flakes --log-format internal-json run .#packages.x86_64-linux.nix-ci-check-gammaloop-nextest-docs --print-build-logs
18.11 s
warning: ignoring untrusted flake configuration setting 'extra-substituters'.
18.11 s
Pass '--accept-flake-config' to trust it
18.11 s
warning: ignoring untrusted flake configuration setting 'extra-trusted-public-keys'.
18.11 s
Pass '--accept-flake-config' to trust it
23.21 s
23.39 s
Building /nix/store/kh6i5plwn7icsqrhd1m3zlwyf46nl6vh-nix-ci-check-gammaloop-nextest-docs.drv
23.39 s
[nix-ci-check-gammaloop-nextest-docs] structuredAttrs is enabled
23.43 s
[nix-ci-check-gammaloop-nextest-docs:post-build] Uploading to the NixCI cache: /nix/store/n2ihcws0cs2avlarm0ag3pxj3q2zq3d4-nix-ci-check-gammaloop-nextest-docs
23.47 s
[nix-ci-check-gammaloop-nextest-docs:post-build] warning: 'warn-short-path-literals' is deprecated, use 'lint-short-path-literals = ignore' instead
23.48 s
[nix-ci-check-gammaloop-nextest-docs:post-build] copying 1 paths...
23.48 s
[nix-ci-check-gammaloop-nextest-docs:post-build] copying path '/nix/store/n2ihcws0cs2avlarm0ag3pxj3q2zq3d4-nix-ci-check-gammaloop-nextest-docs' to 'https://cache.nix-ci.com'...
23.65 s
[nix-ci-check-gammaloop-nextest-docs:post-build] warning: 'warn-short-path-literals' is deprecated, use 'lint-short-path-literals = ignore' instead
23.77 s
[nix-ci-check-gammaloop-nextest-docs:post-build] copying 0 paths...
23.78 s
Uploaded nix-ci-check-gammaloop-nextest-docs in 357ms
23.78 s
Progress: 1 of 2 built
23.78 s
Built nix-ci-check-gammaloop-nextest-docs in 393ms
23.78 s
Progress: 2 of 2 built
23.91 s
evaluating derivation 'gdo you want to allow configuration setting 'extra-substituters' to be set to 'https://cache.nix-ci.com ' (y/N)? do you want to permanently mark this value as untrusted (y/N)? warning: ignoring untrusted flake configuration setting 'extra-substituters'.
23.91 s
Pass '--accept-flake-config' to trust it
23.91 s
do you want to allow configuration setting 'extra-trusted-public-keys' to be set to 'nix-ci:g3xV5BDTLtIBZr/A00IU1x0EtKKlb7YLgBN2SgYgM6A= ' (y/N)? do you want to permanently mark this value as untrusted (y/N)? warning: ignoring untrusted flake configuration setting 'extra-trusted-public-keys'.
23.91 s
Pass '--accept-flake-config' to trust it
31.18 s
copying '/nix/store/566x
evaluating derivation 'g
copying '/nix/store/566x
evaluating derivation 'g
copying '/nix/store/566x
evaluating derivation 'g
copying '/nix/store/566x
evaluating derivation 'g
copying '/nix/store/566x
evaluating derivation 'g
copying '/nix/store/566x
evaluating derivation 'g
copying '/nix/store/566x
evaluating derivation 'g
copying '/nix/store/566x
evaluating derivation 'g
copying '/nix/store/566x
evaluating derivation 'g
querying gammaloop-nexte
[20.9 KiB DL] querying g
[67.9 KiB DL] querying p
[0 /27 built, 16 /0 /86 copbuilder.pl> structuredAttrs is enabled
31.20 s
[1 /0 /27 built, 16 /14 /120builder.pl> Running phase: patchPhase
31.20 s
builder.pl> Running phase: updateAutotoolsGnuConfigScriptsPhase
31.21 s
[1 /0 /27 built, 16 /15 /120builder.pl> Running phase: configurePhase
31.22 s
[1 /0 /26 built, 16 /17 /120builder.pl> no configure script, doing nothing
31.22 s
[1 /0 /26 built, 16 /20 /120builder.pl> Running phase: buildPhase
31.23 s
builder.pl> Running phase: checkPhase
31.23 s
builder.pl> Running phase: installPhase
31.23 s
builder.pl> no Makefile or custom installPhase, doing nothing
31.24 s
builder.pl> Running phase: fixupPhase
31.24 s
builder.pl> shrinking RPATHs of ELF executables and libraries in /nix/store/8l4s0n61pskzsgr2ccdfj70fd3vcz0gv-builder.pl
31.25 s
builder.pl> checking for references to /build/ in /nix/store/8l4s0n61pskzsgr2ccdfj70fd3vcz0gv-builder.pl...
31.26 s
builder.pl> patching script interpreter paths in /nix/store/8l4s0n61pskzsgr2ccdfj70fd3vcz0gv-builder.pl
31.29 s
[1 /0 /25 built, 16 /22 /120
[1 /0 /25 built, 16 /23 /120builder.pl (post)> Uploading to the NixCI cache: /nix/store/8l4s0n61pskzsgr2ccdfj70fd3vcz0gv-builder.pl
31.35 s
builder.pl (post)> warning: 'warn-short-path-literals' is deprecated, use 'lint-short-path-literals = ignore' instead
31.38 s
builder.pl (post)> copying 0 paths...
31.46 s
builder.pl (post)> warning: 'warn-short-path-literals' is deprecated, use 'lint-short-path-literals = ignore' instead
31.50 s
builder.pl (post)> copying 0 paths...
31.69 s
[1 /19 built, 16 /37 /120 c
[1 /1 /18 built, 16 /38 /120
[1 /1 /17 built, 16 /39 /120gammaloop-nextest-binaries-docs (post)> Uploading to the NixCI cache: /nix/store/lgdv2gzcb5mil429jvj3jjx85cg6w64z-gammaloop-nextest-binaries-docs
31.73 s
gammaloop-nextest-binaries-docs (post)> warning: 'warn-short-path-literals' is deprecated, use 'lint-short-path-literals = ignore' instead
31.73 s
gammaloop-nextest-binaries-docs (post)> copying 1 paths...
31.74 s
gammaloop-nextest-binaries-docs (post)> copying path '/nix/store/lgdv2gzcb5mil429jvj3jjx85cg6w64z-gammaloop-nextest-binaries-docs' to 'https://cache.nix-ci.com'...
31.82 s
gammaloop-nextest-binaries-docs (post)> warning: 'warn-short-path-literals' is deprecated, use 'lint-short-path-literals = ignore' instead
31.99 s
gammaloop-nextest-binaries-docs (post)> copying 0 paths...
32.87 s
[2 /14 built, 13 /52 /120 c
[2 /13 built, 6 /61 /120 co
[2 /13 built, 5 /66 /120 co
[2 /13 built, 5 /69 /120 co
[2 /13 built, 4 /70 /120 co
[2 /13 built, 4 /72 /120 co
[2 /13 built, 3 /74 /120 co
[2 /13 built, 16 /75 /120 c
[2 /12 built, 16 /86 /120 c
[2 /12 built, 12 /93 /120 c
[2 /12 built, 5 /101 /120 c
[2 /12 built, 7 /103 /120 c
[2 /12 built, 6 /106 /120 c
[2 /12 built, 8 /107 /120 c
[2 /12 built, 7 /109 /120 c
[1 /2 /10 built, 5 /111 /120python3> structuredAttrs is enabled
32.91 s
[2 /2 /10 built, 5 /111 /120builder.pl> Running phase: patchPhase
32.91 s
builder.pl> Running phase: updateAutotoolsGnuConfigScriptsPhase
32.91 s
python3> created 227 symlinks in user environment
32.92 s
builder.pl> Running phase: configurePhase
32.93 s
builder.pl> no configure script, doing nothing
32.93 s
builder.pl> Running phase: buildPhase
32.94 s
builder.pl> Running phase: checkPhase
32.94 s
builder.pl> Running phase: installPhase
32.94 s
builder.pl> no Makefile or custom installPhase, doing nothing
32.95 s
builder.pl> Running phase: fixupPhase
32.96 s
builder.pl> shrinking RPATHs of ELF executables and libraries in /nix/store/zzmspl8wdn2a3ancrz8dg3kci887nw6d-builder.pl
32.96 s
builder.pl> checking for references to /build/ in /nix/store/zzmspl8wdn2a3ancrz8dg3kci887nw6d-builder.pl...
32.97 s
builder.pl> patching script interpreter paths in /nix/store/zzmspl8wdn2a3ancrz8dg3kci887nw6d-builder.pl
33.00 s
builder.pl (post)> Uploading to the NixCI cache: /nix/store/zzmspl8wdn2a3ancrz8dg3kci887nw6d-builder.pl
33.04 s
builder.pl (post)> warning: 'warn-short-path-literals' is deprecated, use 'lint-short-path-literals = ignore' instead
33.07 s
builder.pl (post)> copying 0 paths...
33.13 s
builder.pl (post)> warning: 'warn-short-path-literals' is deprecated, use 'lint-short-path-literals = ignore' instead
33.56 s
builder.pl (post)> copying 0 paths...
33.85 s
[1 /3 /8 built, 3 /114 /120
[1 /3 /8 built, 2 /115 /120
[1 /3 /8 built, 2 /116 /120 python3 (post)> Uploading to the NixCI cache: /nix/store/f6fan92527vlpn6frzipn50020yw45nw-python3-3.13.15-env
33.89 s
python3 (post)> warning: 'warn-short-path-literals' is deprecated, use 'lint-short-path-literals = ignore' instead
33.92 s
python3 (post)> copying 0 paths...
33.97 s
python3 (post)> warning: 'warn-short-path-literals' is deprecated, use 'lint-short-path-literals = ignore' instead
34.11 s
python3 (post)> copying 0 paths...
34.39 s
[4 /7 built, 1 /117 /120 co
[4 /7 built, 1 /118 /120 cotypst> structuredAttrs is enabled
34.44 s
[1 /4 /6 built, 120 copiedtypst> created 4 symlinks in user environment
34.54 s
typst (post)> Uploading to the NixCI cache: /nix/store/yc93gbspdkf53nwjsf1mbydbsaq9snxl-typst-0.15.1-env
34.57 s
typst (post)> warning: 'warn-short-path-literals' is deprecated, use 'lint-short-path-literals = ignore' instead
34.60 s
typst (post)> copying 0 paths...
34.65 s
typst (post)> warning: 'warn-short-path-literals' is deprecated, use 'lint-short-path-literals = ignore' instead
35.09 s
typst (post)> copying 0 paths...
35.52 s
[5 /7 built, 120 copied (
[1 /5 /6 built, 120 copiedgammaloop-nextest-docs> Extracting 2 binaries to /build/source
35.56 s
gammaloop-nextest-docs> Extracted 5 files to /build/source in 0.04s
35.57 s
gammaloop-nextest-docs> ------------
35.57 s
gammaloop-nextest-docs> Nextest run ID 66408cd5-4292-4ece-98d1-c63d8bc8a919 with nextest profile: ci_gammaloop
35.57 s
gammaloop-nextest-docs> Starting 129 tests across 2 binaries
35.60 s
gammaloop-nextest-docs> FAIL [ 0.012s] ( 22/129) alphal00p-docs-builder tests :: developer_architecture_is_classified_searchable_and_source_backed
35.60 s
gammaloop-nextest-docs> stdout ---
35.60 s
gammaloop-nextest-docs>
35.60 s
gammaloop-nextest-docs> running 1 test
35.60 s
gammaloop-nextest-docs> test tests::developer_architecture_is_classified_searchable_and_source_backed ... FAILED
35.60 s
gammaloop-nextest-docs>
35.60 s
gammaloop-nextest-docs> failures:
35.60 s
gammaloop-nextest-docs>
35.60 s
gammaloop-nextest-docs> failures:
35.60 s
gammaloop-nextest-docs> tests::developer_architecture_is_classified_searchable_and_source_backed
35.60 s
gammaloop-nextest-docs>
35.60 s
gammaloop-nextest-docs> test result: FAILED. 0 passed; 1 failed; 0 ignored; 0 measured; 128 filtered out; finished in 0.01s
35.60 s
gammaloop-nextest-docs>
35.60 s
gammaloop-nextest-docs> stderr ---
35.60 s
gammaloop-nextest-docs>
35.60 s
gammaloop-nextest-docs> thread 'tests::developer_architecture_is_classified_searchable_and_source_backed' (273) panicked at crates/alphal00p-docs-builder/src/lib.rs:12751:14:
35.60 s
gammaloop-nextest-docs> called `Result::unwrap()` on an `Err` value: failed to copy documentation asset crates/spynso3/typst/STIXTwoMath-Regular.woff2
35.60 s
gammaloop-nextest-docs>
35.60 s
gammaloop-nextest-docs> Caused by:
35.60 s
gammaloop-nextest-docs> No such file or directory (os error 2)
35.60 s
gammaloop-nextest-docs>
35.60 s
gammaloop-nextest-docs> Location:
35.60 s
gammaloop-nextest-docs> crates/alphal00p-docs-builder/src/lib.rs:2276:18
35.60 s
gammaloop-nextest-docs> stack backtrace:
35.60 s
gammaloop-nextest-docs> 0: __rustc::rust_begin_unwind
35.60 s
gammaloop-nextest-docs> 1: core::panicking::panic_fmt
35.60 s
gammaloop-nextest-docs> 2: core::result::unwrap_failed
35.60 s
gammaloop-nextest-docs> 3: alphal00p_docs_builder::tests::developer_architecture_is_classified_searchable_and_source_backed
35.60 s
gammaloop-nextest-docs> 4: <alphal00p_docs_builder::tests::developer_architecture_is_classified_searchable_and_source_backed::{closure#0} as core::ops::function::FnOnce<()>>::call_once
35.60 s
gammaloop-nextest-docs> note: Some details are omitted, run with `RUST_BACKTRACE=full` for a verbose backtrace.
35.60 s
gammaloop-nextest-docs>
35.61 s
gammaloop-nextest-docs> FAIL [ 0.011s] ( 29/129) alphal00p-docs-builder tests :: every_product_orients_rust_to_native_rustdoc_and_keeps_legacy_redirects
35.61 s
gammaloop-nextest-docs> stdout ---
35.61 s
gammaloop-nextest-docs>
35.61 s
gammaloop-nextest-docs> running 1 test
35.61 s
gammaloop-nextest-docs> test tests::every_product_orients_rust_to_native_rustdoc_and_keeps_legacy_redirects ... FAILED
35.61 s
gammaloop-nextest-docs>
35.61 s
gammaloop-nextest-docs> failures:
35.61 s
gammaloop-nextest-docs>
35.61 s
gammaloop-nextest-docs> failures:
35.61 s
gammaloop-nextest-docs> tests::every_product_orients_rust_to_native_rustdoc_and_keeps_legacy_redirects
35.61 s
gammaloop-nextest-docs>
35.61 s
gammaloop-nextest-docs> test result: FAILED. 0 passed; 1 failed; 0 ignored; 0 measured; 128 filtered out; finished in 0.01s
35.61 s
gammaloop-nextest-docs>
35.61 s
gammaloop-nextest-docs> stderr ---
35.61 s
gammaloop-nextest-docs>
35.61 s
gammaloop-nextest-docs> thread 'tests::every_product_orients_rust_to_native_rustdoc_and_keeps_legacy_redirects' (301) panicked at crates/alphal00p-docs-builder/src/lib.rs:12555:46:
35.61 s
gammaloop-nextest-docs> called `Result::unwrap()` on an `Err` value: failed to copy documentation asset crates/spynso3/typst/STIXTwoMath-Regular.woff2
35.61 s
gammaloop-nextest-docs>
35.61 s
gammaloop-nextest-docs> Caused by:
35.61 s
gammaloop-nextest-docs> No such file or directory (os error 2)
35.61 s
gammaloop-nextest-docs>
35.61 s
gammaloop-nextest-docs> Location:
35.61 s
gammaloop-nextest-docs> crates/alphal00p-docs-builder/src/lib.rs:2276:18
35.61 s
gammaloop-nextest-docs> stack backtrace:
35.61 s
gammaloop-nextest-docs> 0: __rustc::rust_begin_unwind
35.61 s
gammaloop-nextest-docs> 1: core::panicking::panic_fmt
35.61 s
gammaloop-nextest-docs> 2: core::result::unwrap_failed
35.61 s
gammaloop-nextest-docs> 3: alphal00p_docs_builder::tests::every_product_orients_rust_to_native_rustdoc_and_keeps_legacy_redirects
35.61 s
gammaloop-nextest-docs> 4: <alphal00p_docs_builder::tests::every_product_orients_rust_to_native_rustdoc_and_keeps_legacy_redirects::{closure#0} as core::ops::function::FnOnce<()>>::call_once
35.61 s
gammaloop-nextest-docs> note: Some details are omitted, run with `RUST_BACKTRACE=full` for a verbose backtrace.
35.61 s
gammaloop-nextest-docs>
35.65 s
gammaloop-nextest-docs> FAIL [ 0.010s] ( 53/129) alphal00p-docs-builder tests :: portal_emits_routes_and_valid_assets
35.65 s
gammaloop-nextest-docs> stdout ---
35.65 s
gammaloop-nextest-docs>
35.65 s
gammaloop-nextest-docs> running 1 test
35.65 s
gammaloop-nextest-docs> test tests::portal_emits_routes_and_valid_assets ... FAILED
35.65 s
gammaloop-nextest-docs>
35.65 s
gammaloop-nextest-docs> failures:
35.65 s
gammaloop-nextest-docs>
35.65 s
gammaloop-nextest-docs> failures:
35.65 s
gammaloop-nextest-docs> tests::portal_emits_routes_and_valid_assets
35.65 s
gammaloop-nextest-docs>
35.65 s
gammaloop-nextest-docs> test result: FAILED. 0 passed; 1 failed; 0 ignored; 0 measured; 128 filtered out; finished in 0.00s
35.65 s
gammaloop-nextest-docs>
35.65 s
gammaloop-nextest-docs> stderr ---
35.65 s
gammaloop-nextest-docs>
35.65 s
gammaloop-nextest-docs> thread 'tests::portal_emits_routes_and_valid_assets' (429) panicked at crates/alphal00p-docs-builder/src/lib.rs:9684:14:
35.65 s
gammaloop-nextest-docs> called `Result::unwrap()` on an `Err` value: failed to copy documentation asset crates/spynso3/typst/STIXTwoMath-Regular.woff2
35.65 s
gammaloop-nextest-docs>
35.65 s
gammaloop-nextest-docs> Caused by:
35.65 s
gammaloop-nextest-docs> No such file or directory (os error 2)
35.65 s
gammaloop-nextest-docs>
35.65 s
gammaloop-nextest-docs> Location:
35.65 s
gammaloop-nextest-docs> crates/alphal00p-docs-builder/src/lib.rs:2276:18
35.65 s
gammaloop-nextest-docs> stack backtrace:
35.65 s
gammaloop-nextest-docs> 0: __rustc::rust_begin_unwind
35.65 s
gammaloop-nextest-docs> 1: core::panicking::panic_fmt
35.65 s
gammaloop-nextest-docs> 2: core::result::unwrap_failed
35.65 s
gammaloop-nextest-docs> 3: alphal00p_docs_builder::tests::write_test_portal
35.65 s
gammaloop-nextest-docs> 4: alphal00p_docs_builder::tests::portal_emits_routes_and_valid_assets
35.65 s
gammaloop-nextest-docs> 5: <alphal00p_docs_builder::tests::portal_emits_routes_and_valid_assets::{closure#0} as core::ops::function::FnOnce<()>>::call_once
35.65 s
gammaloop-nextest-docs> note: Some details are omitted, run with `RUST_BACKTRACE=full` for a verbose backtrace.
35.65 s
gammaloop-nextest-docs>
35.65 s
gammaloop-nextest-docs> FAIL [ 0.011s] ( 54/129) alphal00p-docs-builder tests :: portal_and_developer_pages_use_federated_search_and_feedback
35.65 s
gammaloop-nextest-docs> stdout ---
35.65 s
gammaloop-nextest-docs>
35.65 s
gammaloop-nextest-docs> running 1 test
35.65 s
gammaloop-nextest-docs> test tests::portal_and_developer_pages_use_federated_search_and_feedback ... FAILED
35.65 s
gammaloop-nextest-docs>
35.65 s
gammaloop-nextest-docs> failures:
35.65 s
gammaloop-nextest-docs>
35.65 s
gammaloop-nextest-docs> failures:
35.65 s
gammaloop-nextest-docs> tests::portal_and_developer_pages_use_federated_search_and_feedback
35.65 s
gammaloop-nextest-docs>
35.65 s
gammaloop-nextest-docs> test result: FAILED. 0 passed; 1 failed; 0 ignored; 0 measured; 128 filtered out; finished in 0.01s
35.65 s
gammaloop-nextest-docs>
35.65 s
gammaloop-nextest-docs> stderr ---
35.65 s
gammaloop-nextest-docs>
35.65 s
gammaloop-nextest-docs> thread 'tests::portal_and_developer_pages_use_federated_search_and_feedback' (430) panicked at crates/alphal00p-docs-builder/src/lib.rs:9684:14:
35.65 s
gammaloop-nextest-docs> called `Result::unwrap()` on an `Err` value: failed to copy documentation asset crates/spynso3/typst/STIXTwoMath-Regular.woff2
35.65 s
gammaloop-nextest-docs>
35.65 s
gammaloop-nextest-docs> Caused by:
35.65 s
gammaloop-nextest-docs> No such file or directory (os error 2)
35.65 s
gammaloop-nextest-docs>
35.65 s
gammaloop-nextest-docs> Location:
35.65 s
gammaloop-nextest-docs> crates/alphal00p-docs-builder/src/lib.rs:2276:18
35.65 s
gammaloop-nextest-docs> stack backtrace:
35.65 s
gammaloop-nextest-docs> 0: __rustc::rust_begin_unwind
35.65 s
gammaloop-nextest-docs> 1: core::panicking::panic_fmt
35.65 s
gammaloop-nextest-docs> 2: core::result::unwrap_failed
35.65 s
gammaloop-nextest-docs> 3: alphal00p_docs_builder::tests::write_test_portal
35.65 s
gammaloop-nextest-docs> 4: alphal00p_docs_builder::tests::portal_and_developer_pages_use_federated_search_and_feedback
35.65 s
gammaloop-nextest-docs> 5: <alphal00p_docs_builder::tests::portal_and_developer_pages_use_federated_search_and_feedback::{closure#0} as core::ops::function::FnOnce<()>>::call_once
35.65 s
gammaloop-nextest-docs> note: Some details are omitted, run with `RUST_BACKTRACE=full` for a verbose backtrace.
35.65 s
gammaloop-nextest-docs>
35.65 s
gammaloop-nextest-docs> FAIL [ 0.009s] ( 55/129) alphal00p-docs-builder tests :: portal_task_chooser_routes_each_goal_to_the_registered_quickstart
35.65 s
gammaloop-nextest-docs> stdout ---
35.65 s
gammaloop-nextest-docs>
35.65 s
gammaloop-nextest-docs> running 1 test
35.65 s
gammaloop-nextest-docs> test tests::portal_task_chooser_routes_each_goal_to_the_registered_quickstart ... FAILED
35.65 s
gammaloop-nextest-docs>
35.65 s
gammaloop-nextest-docs> failures:
35.65 s
gammaloop-nextest-docs>
35.65 s
gammaloop-nextest-docs> failures:
35.65 s
gammaloop-nextest-docs> tests::portal_task_chooser_routes_each_goal_to_the_registered_quickstart
35.65 s
gammaloop-nextest-docs>
35.65 s
gammaloop-nextest-docs> test result: FAILED. 0 passed; 1 failed; 0 ignored; 0 measured; 128 filtered out; finished in 0.00s
35.65 s
gammaloop-nextest-docs>
35.65 s
gammaloop-nextest-docs> stderr ---
35.65 s
gammaloop-nextest-docs>
35.65 s
gammaloop-nextest-docs> thread 'tests::portal_task_chooser_routes_each_goal_to_the_registered_quickstart' (443) panicked at crates/alphal00p-docs-builder/src/lib.rs:9684:14:
35.65 s
gammaloop-nextest-docs> called `Result::unwrap()` on an `Err` value: failed to copy documentation asset crates/spynso3/typst/STIXTwoMath-Regular.woff2
35.65 s
gammaloop-nextest-docs>
35.65 s
gammaloop-nextest-docs> Caused by:
35.65 s
gammaloop-nextest-docs> No such file or directory (os error 2)
35.65 s
gammaloop-nextest-docs>
35.65 s
gammaloop-nextest-docs> Location:
35.65 s
gammaloop-nextest-docs> crates/alphal00p-docs-builder/src/lib.rs:2276:18
35.65 s
gammaloop-nextest-docs> stack backtrace:
35.65 s
gammaloop-nextest-docs> 0: __rustc::rust_begin_unwind
35.65 s
gammaloop-nextest-docs> 1: core::panicking::panic_fmt
35.65 s
gammaloop-nextest-docs> 2: core::result::unwrap_failed
35.65 s
gammaloop-nextest-docs> 3: alphal00p_docs_builder::tests::write_test_portal
35.65 s
gammaloop-nextest-docs> 4: alphal00p_docs_builder::tests::portal_task_chooser_routes_each_goal_to_the_registered_quickstart
35.65 s
gammaloop-nextest-docs> 5: <alphal00p_docs_builder::tests::portal_task_chooser_routes_each_goal_to_the_registered_quickstart::{closure#0} as core::ops::function::FnOnce<()>>::call_once
35.65 s
gammaloop-nextest-docs> note: Some details are omitted, run with `RUST_BACKTRACE=full` for a verbose backtrace.
35.65 s
gammaloop-nextest-docs>
35.70 s
gammaloop-nextest-docs> FAIL [ 0.123s] ( 83/129) alphal00p-docs-builder tests :: checked_in_registry_is_valid
35.70 s
gammaloop-nextest-docs> stdout ---
35.70 s
gammaloop-nextest-docs>
35.70 s
gammaloop-nextest-docs> running 1 test
35.70 s
gammaloop-nextest-docs> test tests::checked_in_registry_is_valid ... FAILED
35.70 s
gammaloop-nextest-docs>
35.70 s
gammaloop-nextest-docs> failures:
35.70 s
gammaloop-nextest-docs>
35.70 s
gammaloop-nextest-docs> failures:
35.70 s
gammaloop-nextest-docs> tests::checked_in_registry_is_valid
35.70 s
gammaloop-nextest-docs>
35.70 s
gammaloop-nextest-docs> test result: FAILED. 0 passed; 1 failed; 0 ignored; 0 measured; 128 filtered out; finished in 0.11s
35.70 s
gammaloop-nextest-docs>
35.70 s
gammaloop-nextest-docs> stderr ---
35.70 s
gammaloop-nextest-docs>
35.70 s
gammaloop-nextest-docs> thread 'tests::checked_in_registry_is_valid' (214) panicked at crates/alphal00p-docs-builder/src/lib.rs:12260:50:
35.70 s
gammaloop-nextest-docs> called `Result::unwrap()` on an `Err` value: required documentation source is missing: /build/source/crates/spynso3/typst/STIXTwoMath-Regular.woff2
35.70 s
gammaloop-nextest-docs>
35.70 s
gammaloop-nextest-docs> Location:
35.70 s
gammaloop-nextest-docs> crates/alphal00p-docs-builder/src/lib.rs:5103:9
35.70 s
gammaloop-nextest-docs> stack backtrace:
35.70 s
gammaloop-nextest-docs> 0: __rustc::rust_begin_unwind
35.70 s
gammaloop-nextest-docs> 1: core::panicking::panic_fmt
35.70 s
gammaloop-nextest-docs> 2: core::result::unwrap_failed
35.70 s
gammaloop-nextest-docs> 3: alphal00p_docs_builder::tests::checked_in_registry_is_valid
35.70 s
gammaloop-nextest-docs> 4: <alphal00p_docs_builder::tests::checked_in_registry_is_valid::{closure#0} as core::ops::function::FnOnce<()>>::call_once
35.70 s
gammaloop-nextest-docs> note: Some details are omitted, run with `RUST_BACKTRACE=full` for a verbose backtrace.
35.70 s
gammaloop-nextest-docs>
35.70 s
gammaloop-nextest-docs> FAIL [ 0.009s] ( 87/129) alphal00p-docs-builder tests :: site_assets_replace_read_only_generated_files
35.70 s
gammaloop-nextest-docs> stdout ---
35.71 s
gammaloop-nextest-docs>
35.71 s
gammaloop-nextest-docs> running 1 test
35.71 s
gammaloop-nextest-docs> test tests::site_assets_replace_read_only_generated_files ... FAILED
35.71 s
gammaloop-nextest-docs>
35.71 s
gammaloop-nextest-docs> failures:
35.71 s
gammaloop-nextest-docs>
35.71 s
gammaloop-nextest-docs> failures:
35.71 s
gammaloop-nextest-docs> tests::site_assets_replace_read_only_generated_files
35.71 s
gammaloop-nextest-docs>
35.71 s
gammaloop-nextest-docs> test result: FAILED. 0 passed; 1 failed; 0 ignored; 0 measured; 128 filtered out; finished in 0.00s
35.71 s
gammaloop-nextest-docs>
35.71 s
gammaloop-nextest-docs> stderr ---
35.71 s
gammaloop-nextest-docs>
35.71 s
gammaloop-nextest-docs> thread 'tests::site_assets_replace_read_only_generated_files' (669) panicked at crates/alphal00p-docs-builder/src/lib.rs:12305:50:
35.71 s
gammaloop-nextest-docs> called `Result::unwrap()` on an `Err` value: failed to copy documentation asset crates/spynso3/typst/STIXTwoMath-Regular.woff2
35.71 s
gammaloop-nextest-docs>
35.71 s
gammaloop-nextest-docs> Caused by:
35.71 s
gammaloop-nextest-docs> No such file or directory (os error 2)
35.71 s
gammaloop-nextest-docs>
35.71 s
gammaloop-nextest-docs> Location:
35.71 s
gammaloop-nextest-docs> crates/alphal00p-docs-builder/src/lib.rs:2276:18
35.71 s
gammaloop-nextest-docs> stack backtrace:
35.71 s
gammaloop-nextest-docs> 0: __rustc::rust_begin_unwind
35.71 s
gammaloop-nextest-docs> 1: core::panicking::panic_fmt
35.71 s
gammaloop-nextest-docs> 2: core::result::unwrap_failed
35.71 s
gammaloop-nextest-docs> 3: alphal00p_docs_builder::tests::site_assets_replace_read_only_generated_files
35.71 s
gammaloop-nextest-docs> 4: <alphal00p_docs_builder::tests::site_assets_replace_read_only_generated_files::{closure#0} as core::ops::function::FnOnce<()>>::call_once
35.71 s
gammaloop-nextest-docs> note: Some details are omitted, run with `RUST_BACKTRACE=full` for a verbose backtrace.
35.71 s
gammaloop-nextest-docs>
35.71 s
gammaloop-nextest-docs> FAIL [ 0.114s] ( 89/129) alphal00p-docs-builder tests :: developer_scope_ranges_ignore_unrelated_edits_and_warn_only_while_watching
35.71 s
gammaloop-nextest-docs> stdout ---
35.71 s
gammaloop-nextest-docs>
35.71 s
gammaloop-nextest-docs> running 1 test
35.71 s
gammaloop-nextest-docs> test tests::developer_scope_ranges_ignore_unrelated_edits_and_warn_only_while_watching ... FAILED
35.71 s
gammaloop-nextest-docs>
35.71 s
gammaloop-nextest-docs> failures:
35.71 s
gammaloop-nextest-docs>
35.71 s
gammaloop-nextest-docs> failures:
35.71 s
gammaloop-nextest-docs> tests::developer_scope_ranges_ignore_unrelated_edits_and_warn_only_while_watching
35.71 s
gammaloop-nextest-docs>
35.71 s
gammaloop-nextest-docs> test result: FAILED. 0 passed; 1 failed; 0 ignored; 0 measured; 128 filtered out; finished in 0.11s
35.71 s
gammaloop-nextest-docs>
35.71 s
gammaloop-nextest-docs> stderr ---
35.71 s
gammaloop-nextest-docs>
35.71 s
gammaloop-nextest-docs> thread 'tests::developer_scope_ranges_ignore_unrelated_edits_and_warn_only_while_watching' (278) panicked at crates/alphal00p-docs-builder/src/lib.rs:12350:29:
35.71 s
gammaloop-nextest-docs> called `Result::unwrap()` on an `Err` value: required documentation source is missing: /build/source/crates/spynso3/typst/STIXTwoMath-Regular.woff2
35.71 s
gammaloop-nextest-docs>
35.71 s
gammaloop-nextest-docs> Location:
35.71 s
gammaloop-nextest-docs> crates/alphal00p-docs-builder/src/lib.rs:5103:9
35.71 s
gammaloop-nextest-docs> stack backtrace:
35.71 s
gammaloop-nextest-docs> 0: __rustc::rust_begin_unwind
35.71 s
gammaloop-nextest-docs> 1: core::panicking::panic_fmt
35.71 s
gammaloop-nextest-docs> 2: core::result::unwrap_failed
35.71 s
gammaloop-nextest-docs> 3: alphal00p_docs_builder::tests::developer_scope_ranges_ignore_unrelated_edits_and_warn_only_while_watching
35.71 s
gammaloop-nextest-docs> 4: <alphal00p_docs_builder::tests::developer_scope_ranges_ignore_unrelated_edits_and_warn_only_while_watching::{closure#0} as core::ops::function::FnOnce<()>>::call_once
35.71 s
gammaloop-nextest-docs> note: Some details are omitted, run with `RUST_BACKTRACE=full` for a verbose backtrace.
35.71 s
gammaloop-nextest-docs>
35.72 s
gammaloop-nextest-docs> FAIL [ 0.142s] ( 96/129) alphal00p-docs-builder provenance_tests :: each_build_captures_one_revision_before_rendering
35.72 s
gammaloop-nextest-docs> stdout ---
35.72 s
gammaloop-nextest-docs>
35.72 s
gammaloop-nextest-docs> running 1 test
35.72 s
gammaloop-nextest-docs>
35.72 s
gammaloop-nextest-docs> running 1 test
35.72 s
gammaloop-nextest-docs> test provenance_tests::each_build_captures_one_revision_before_rendering ... FAILED
35.72 s
gammaloop-nextest-docs>
35.72 s
gammaloop-nextest-docs> failures:
35.72 s
gammaloop-nextest-docs>
35.72 s
gammaloop-nextest-docs> failures:
35.72 s
gammaloop-nextest-docs> provenance_tests::each_build_captures_one_revision_before_rendering
35.72 s
gammaloop-nextest-docs>
35.72 s
gammaloop-nextest-docs> test result: FAILED. 0 passed; 1 failed; 0 ignored; 0 measured; 128 filtered out; finished in 0.11s
35.72 s
gammaloop-nextest-docs>
35.72 s
gammaloop-nextest-docs> test provenance_tests::each_build_captures_one_revision_before_rendering ... FAILED
35.72 s
gammaloop-nextest-docs>
35.72 s
gammaloop-nextest-docs> failures:
35.72 s
gammaloop-nextest-docs>
35.72 s
gammaloop-nextest-docs> failures:
35.72 s
gammaloop-nextest-docs> provenance_tests::each_build_captures_one_revision_before_rendering
35.72 s
gammaloop-nextest-docs>
35.72 s
gammaloop-nextest-docs> test result: FAILED. 0 passed; 1 failed; 0 ignored; 0 measured; 128 filtered out; finished in 0.13s
35.72 s
gammaloop-nextest-docs>
35.72 s
gammaloop-nextest-docs> stderr ---
35.72 s
gammaloop-nextest-docs>
35.72 s
gammaloop-nextest-docs> thread 'provenance_tests::each_build_captures_one_revision_before_rendering' (284) panicked at crates/alphal00p-docs-builder/src/provenance_tests.rs:297:14:
35.72 s
gammaloop-nextest-docs> called `Result::unwrap()` on an `Err` value: required documentation source is missing: /build/source/target/nix-ci-tmp/.tmpAH3uti/checkout/crates/spynso3/typst/STIXTwoMath-Regular.woff2
35.72 s
gammaloop-nextest-docs>
35.72 s
gammaloop-nextest-docs> Location:
35.72 s
gammaloop-nextest-docs> crates/alphal00p-docs-builder/src/lib.rs:5103:9
35.72 s
gammaloop-nextest-docs> stack backtrace:
35.72 s
gammaloop-nextest-docs> 0: __rustc::rust_begin_unwind
35.72 s
gammaloop-nextest-docs> 1: core::panicking::panic_fmt
35.72 s
gammaloop-nextest-docs> 2: core::result::unwrap_failed
35.72 s
gammaloop-nextest-docs> 3: alphal00p_docs_builder::provenance_tests::each_build_captures_one_revision_before_rendering
35.72 s
gammaloop-nextest-docs> 4: <alphal00p_docs_builder::provenance_tests::each_build_captures_one_revision_before_rendering::{closure#0} as core::ops::function::FnOnce<()>>::call_once
35.72 s
gammaloop-nextest-docs> note: Some details are omitted, run with `RUST_BACKTRACE=full` for a verbose backtrace.
35.72 s
gammaloop-nextest-docs>
35.72 s
gammaloop-nextest-docs> thread 'provenance_tests::each_build_captures_one_revision_before_rendering' (218) panicked at crates/alphal00p-docs-builder/src/provenance_tests.rs:274:9:
35.72 s
gammaloop-nextest-docs> assertion failed: command.status().unwrap().success()
35.72 s
gammaloop-nextest-docs> stack backtrace:
35.72 s
gammaloop-nextest-docs> 0: __rustc::rust_begin_unwind
35.72 s
gammaloop-nextest-docs> 1: core::panicking::panic_fmt
35.72 s
gammaloop-nextest-docs> 2: core::panicking::panic
35.72 s
gammaloop-nextest-docs> 3: alphal00p_docs_builder::provenance_tests::each_build_captures_one_revision_before_rendering
35.72 s
gammaloop-nextest-docs> 4: <alphal00p_docs_builder::provenance_tests::each_build_captures_one_revision_before_rendering::{closure#0} as core::ops::function::FnOnce<()>>::call_once
35.72 s
gammaloop-nextest-docs> note: Some details are omitted, run with `RUST_BACKTRACE=full` for a verbose backtrace.
35.72 s
gammaloop-nextest-docs>
35.72 s
gammaloop-nextest-docs> FAIL [ 0.123s] (106/129) alphal00p-docs-builder tests :: every_product_requires_a_task_chooser_and_each_supported_interface
35.72 s
gammaloop-nextest-docs> stdout ---
35.72 s
gammaloop-nextest-docs>
35.72 s
gammaloop-nextest-docs> running 1 test
35.72 s
gammaloop-nextest-docs> test tests::every_product_requires_a_task_chooser_and_each_supported_interface ... FAILED
35.72 s
gammaloop-nextest-docs>
35.72 s
gammaloop-nextest-docs> failures:
35.72 s
gammaloop-nextest-docs>
35.72 s
gammaloop-nextest-docs> failures:
35.72 s
gammaloop-nextest-docs> tests::every_product_requires_a_task_chooser_and_each_supported_interface
35.72 s
gammaloop-nextest-docs>
35.72 s
gammaloop-nextest-docs> test result: FAILED. 0 passed; 1 failed; 0 ignored; 0 measured; 128 filtered out; finished in 0.12s
35.72 s
gammaloop-nextest-docs>
35.72 s
gammaloop-nextest-docs> stderr ---
35.72 s
gammaloop-nextest-docs>
35.72 s
gammaloop-nextest-docs> thread 'tests::every_product_requires_a_task_chooser_and_each_supported_interface' (312) panicked at crates/alphal00p-docs-builder/src/lib.rs:12274:9:
35.72 s
gammaloop-nextest-docs> assertion failed: format!("{error:#}").contains("has no quickstart page")
35.72 s
gammaloop-nextest-docs> stack backtrace:
35.72 s
gammaloop-nextest-docs> 0: __rustc::rust_begin_unwind
35.72 s
gammaloop-nextest-docs> 1: core::panicking::panic_fmt
35.72 s
gammaloop-nextest-docs> 2: core::panicking::panic
35.72 s
gammaloop-nextest-docs> 3: alphal00p_docs_builder::tests::every_product_requires_a_task_chooser_and_each_supported_interface
35.72 s
gammaloop-nextest-docs> 4: <alphal00p_docs_builder::tests::every_product_requires_a_task_chooser_and_each_supported_interface::{closure#0} as core::ops::function::FnOnce<()>>::call_once
35.72 s
gammaloop-nextest-docs> note: Some details are omitted, run with `RUST_BACKTRACE=full` for a verbose backtrace.
35.72 s
gammaloop-nextest-docs>
35.75 s
gammaloop-nextest-docs> FAIL [ 0.118s] (122/129) alphal00p-docs-builder tests :: pdf_manual_chapter_order_must_match_the_page_registry
35.75 s
gammaloop-nextest-docs> stdout ---
35.75 s
gammaloop-nextest-docs>
35.75 s
gammaloop-nextest-docs> running 1 test
35.75 s
gammaloop-nextest-docs> test tests::pdf_manual_chapter_order_must_match_the_page_registry ... FAILED
35.75 s
gammaloop-nextest-docs>
35.75 s
gammaloop-nextest-docs> failures:
35.75 s
gammaloop-nextest-docs>
35.75 s
gammaloop-nextest-docs> failures:
35.75 s
gammaloop-nextest-docs> tests::pdf_manual_chapter_order_must_match_the_page_registry
35.75 s
gammaloop-nextest-docs>
35.75 s
gammaloop-nextest-docs> test result: FAILED. 0 passed; 1 failed; 0 ignored; 0 measured; 128 filtered out; finished in 0.11s
35.75 s
gammaloop-nextest-docs>
35.75 s
gammaloop-nextest-docs> stderr ---
35.75 s
gammaloop-nextest-docs>
35.75 s
gammaloop-nextest-docs> thread 'tests::pdf_manual_chapter_order_must_match_the_page_registry' (397) panicked at crates/alphal00p-docs-builder/src/lib.rs:12330:9:
35.75 s
gammaloop-nextest-docs> assertion failed: format!("{error:#}").contains("PDF manual chapter order differs")
35.75 s
gammaloop-nextest-docs> stack backtrace:
35.75 s
gammaloop-nextest-docs> 0: __rustc::rust_begin_unwind
35.75 s
gammaloop-nextest-docs> 1: core::panicking::panic_fmt
35.75 s
gammaloop-nextest-docs> 2: core::panicking::panic
35.75 s
gammaloop-nextest-docs> 3: alphal00p_docs_builder::tests::pdf_manual_chapter_order_must_match_the_page_registry
35.75 s
gammaloop-nextest-docs> 4: <alphal00p_docs_builder::tests::pdf_manual_chapter_order_must_match_the_page_registry::{closure#0} as core::ops::function::FnOnce<()>>::call_once
35.75 s
gammaloop-nextest-docs> note: Some details are omitted, run with `RUST_BACKTRACE=full` for a verbose backtrace.
35.75 s
gammaloop-nextest-docs>
46.78 s
gammaloop-nextest-docs> ------------
46.78 s
gammaloop-nextest-docs> Summary [ 11.214s] 129 tests run: 118 passed , 11 failed , 0 skipped
46.78 s
gammaloop-nextest-docs> FAIL [ 0.012s] ( 22/129) alphal00p-docs-builder tests :: developer_architecture_is_classified_searchable_and_source_backed
46.78 s
gammaloop-nextest-docs> stdout ---
46.78 s
gammaloop-nextest-docs>
46.78 s
gammaloop-nextest-docs> running 1 test
46.78 s
gammaloop-nextest-docs> test tests::developer_architecture_is_classified_searchable_and_source_backed ... FAILED
46.78 s
gammaloop-nextest-docs>
46.78 s
gammaloop-nextest-docs> failures:
46.78 s
gammaloop-nextest-docs>
46.78 s
gammaloop-nextest-docs> failures:
46.78 s
gammaloop-nextest-docs> tests::developer_architecture_is_classified_searchable_and_source_backed
46.78 s
gammaloop-nextest-docs>
46.78 s
gammaloop-nextest-docs> test result: FAILED. 0 passed; 1 failed; 0 ignored; 0 measured; 128 filtered out; finished in 0.01s
46.78 s
gammaloop-nextest-docs>
46.78 s
gammaloop-nextest-docs> stderr ---
46.78 s
gammaloop-nextest-docs>
46.78 s
gammaloop-nextest-docs> thread 'tests::developer_architecture_is_classified_searchable_and_source_backed' (273) panicked at crates/alphal00p-docs-builder/src/lib.rs:12751:14:
46.78 s
gammaloop-nextest-docs> called `Result::unwrap()` on an `Err` value: failed to copy documentation asset crates/spynso3/typst/STIXTwoMath-Regular.woff2
46.78 s
gammaloop-nextest-docs>
46.78 s
gammaloop-nextest-docs> Caused by:
46.78 s
gammaloop-nextest-docs> No such file or directory (os error 2)
46.78 s
gammaloop-nextest-docs>
46.78 s
gammaloop-nextest-docs> Location:
46.78 s
gammaloop-nextest-docs> crates/alphal00p-docs-builder/src/lib.rs:2276:18
46.79 s
gammaloop-nextest-docs> stack backtrace:
46.79 s
gammaloop-nextest-docs> 0: __rustc::rust_begin_unwind
46.79 s
gammaloop-nextest-docs> 1: core::panicking::panic_fmt
46.79 s
gammaloop-nextest-docs> 2: core::result::unwrap_failed
46.79 s
gammaloop-nextest-docs> 3: alphal00p_docs_builder::tests::developer_architecture_is_classified_searchable_and_source_backed
46.79 s
gammaloop-nextest-docs> 4: <alphal00p_docs_builder::tests::developer_architecture_is_classified_searchable_and_source_backed::{closure#0} as core::ops::function::FnOnce<()>>::call_once
46.79 s
gammaloop-nextest-docs> note: Some details are omitted, run with `RUST_BACKTRACE=full` for a verbose backtrace.
46.79 s
gammaloop-nextest-docs>
46.79 s
gammaloop-nextest-docs> FAIL [ 0.011s] ( 29/129) alphal00p-docs-builder tests :: every_product_orients_rust_to_native_rustdoc_and_keeps_legacy_redirects
46.79 s
gammaloop-nextest-docs> stdout ---
46.79 s
gammaloop-nextest-docs>
46.79 s
gammaloop-nextest-docs> running 1 test
46.79 s
gammaloop-nextest-docs> test tests::every_product_orients_rust_to_native_rustdoc_and_keeps_legacy_redirects ... FAILED
46.79 s
gammaloop-nextest-docs>
46.79 s
gammaloop-nextest-docs> failures:
46.79 s
gammaloop-nextest-docs>
46.79 s
gammaloop-nextest-docs> failures:
46.79 s
gammaloop-nextest-docs> tests::every_product_orients_rust_to_native_rustdoc_and_keeps_legacy_redirects
46.79 s
gammaloop-nextest-docs>
46.79 s
gammaloop-nextest-docs> test result: FAILED. 0 passed; 1 failed; 0 ignored; 0 measured; 128 filtered out; finished in 0.01s
46.79 s
gammaloop-nextest-docs>
46.79 s
gammaloop-nextest-docs> stderr ---
46.79 s
gammaloop-nextest-docs>
46.79 s
gammaloop-nextest-docs> thread 'tests::every_product_orients_rust_to_native_rustdoc_and_keeps_legacy_redirects' (301) panicked at crates/alphal00p-docs-builder/src/lib.rs:12555:46:
46.79 s
gammaloop-nextest-docs> called `Result::unwrap()` on an `Err` value: failed to copy documentation asset crates/spynso3/typst/STIXTwoMath-Regular.woff2
46.79 s
gammaloop-nextest-docs>
46.79 s
gammaloop-nextest-docs> Caused by:
46.79 s
gammaloop-nextest-docs> No such file or directory (os error 2)
46.79 s
gammaloop-nextest-docs>
46.79 s
gammaloop-nextest-docs> Location:
46.79 s
gammaloop-nextest-docs> crates/alphal00p-docs-builder/src/lib.rs:2276:18
46.79 s
gammaloop-nextest-docs> stack backtrace:
46.79 s
gammaloop-nextest-docs> 0: __rustc::rust_begin_unwind
46.79 s
gammaloop-nextest-docs> 1: core::panicking::panic_fmt
46.79 s
gammaloop-nextest-docs> 2: core::result::unwrap_failed
46.79 s
gammaloop-nextest-docs> 3: alphal00p_docs_builder::tests::every_product_orients_rust_to_native_rustdoc_and_keeps_legacy_redirects
46.79 s
gammaloop-nextest-docs> 4: <alphal00p_docs_builder::tests::every_product_orients_rust_to_native_rustdoc_and_keeps_legacy_redirects::{closure#0} as core::ops::function::FnOnce<()>>::call_once
46.79 s
gammaloop-nextest-docs> note: Some details are omitted, run with `RUST_BACKTRACE=full` for a verbose backtrace.
46.79 s
gammaloop-nextest-docs>
46.79 s
gammaloop-nextest-docs> FAIL [ 0.010s] ( 53/129) alphal00p-docs-builder tests :: portal_emits_routes_and_valid_assets
46.79 s
gammaloop-nextest-docs> stdout ---
46.79 s
gammaloop-nextest-docs>
46.79 s
gammaloop-nextest-docs> running 1 test
46.79 s
gammaloop-nextest-docs> test tests::portal_emits_routes_and_valid_assets ... FAILED
46.79 s
gammaloop-nextest-docs>
46.79 s
gammaloop-nextest-docs> failures:
46.79 s
gammaloop-nextest-docs>
46.79 s
gammaloop-nextest-docs> failures:
46.79 s
gammaloop-nextest-docs> tests::portal_emits_routes_and_valid_assets
46.79 s
gammaloop-nextest-docs>
46.79 s
gammaloop-nextest-docs> test result: FAILED. 0 passed; 1 failed; 0 ignored; 0 measured; 128 filtered out; finished in 0.00s
46.79 s
gammaloop-nextest-docs>
46.79 s
gammaloop-nextest-docs> stderr ---
46.79 s
gammaloop-nextest-docs>
46.79 s
gammaloop-nextest-docs> thread 'tests::portal_emits_routes_and_valid_assets' (429) panicked at crates/alphal00p-docs-builder/src/lib.rs:9684:14:
46.79 s
gammaloop-nextest-docs> called `Result::unwrap()` on an `Err` value: failed to copy documentation asset crates/spynso3/typst/STIXTwoMath-Regular.woff2
46.79 s
gammaloop-nextest-docs>
46.79 s
gammaloop-nextest-docs> Caused by:
46.79 s
gammaloop-nextest-docs> No such file or directory (os error 2)
46.79 s
gammaloop-nextest-docs>
46.79 s
gammaloop-nextest-docs> Location:
46.79 s
gammaloop-nextest-docs> crates/alphal00p-docs-builder/src/lib.rs:2276:18
46.79 s
gammaloop-nextest-docs> stack backtrace:
46.79 s
gammaloop-nextest-docs> 0: __rustc::rust_begin_unwind
46.79 s
gammaloop-nextest-docs> 1: core::panicking::panic_fmt
46.79 s
gammaloop-nextest-docs> 2: core::result::unwrap_failed
46.79 s
gammaloop-nextest-docs> 3: alphal00p_docs_builder::tests::write_test_portal
46.79 s
gammaloop-nextest-docs> 4: alphal00p_docs_builder::tests::portal_emits_routes_and_valid_assets
46.79 s
gammaloop-nextest-docs> 5: <alphal00p_docs_builder::tests::portal_emits_routes_and_valid_assets::{closure#0} as core::ops::function::FnOnce<()>>::call_once
46.79 s
gammaloop-nextest-docs> note: Some details are omitted, run with `RUST_BACKTRACE=full` for a verbose backtrace.
46.79 s
gammaloop-nextest-docs>
46.79 s
gammaloop-nextest-docs> FAIL [ 0.011s] ( 54/129) alphal00p-docs-builder tests :: portal_and_developer_pages_use_federated_search_and_feedback
46.79 s
gammaloop-nextest-docs> stdout ---
46.79 s
gammaloop-nextest-docs>
46.79 s
gammaloop-nextest-docs> running 1 test
46.79 s
gammaloop-nextest-docs> test tests::portal_and_developer_pages_use_federated_search_and_feedback ... FAILED
46.79 s
gammaloop-nextest-docs>
46.79 s
gammaloop-nextest-docs> failures:
46.79 s
gammaloop-nextest-docs>
46.79 s
gammaloop-nextest-docs> failures:
46.79 s
gammaloop-nextest-docs> tests::portal_and_developer_pages_use_federated_search_and_feedback
46.79 s
gammaloop-nextest-docs>
46.79 s
gammaloop-nextest-docs> test result: FAILED. 0 passed; 1 failed; 0 ignored; 0 measured; 128 filtered out; finished in 0.01s
46.79 s
gammaloop-nextest-docs>
46.79 s
gammaloop-nextest-docs> stderr ---
46.79 s
gammaloop-nextest-docs>
46.79 s
gammaloop-nextest-docs> thread 'tests::portal_and_developer_pages_use_federated_search_and_feedback' (430) panicked at crates/alphal00p-docs-builder/src/lib.rs:9684:14:
46.79 s
gammaloop-nextest-docs> called `Result::unwrap()` on an `Err` value: failed to copy documentation asset crates/spynso3/typst/STIXTwoMath-Regular.woff2
46.79 s
gammaloop-nextest-docs>
46.79 s
gammaloop-nextest-docs> Caused by:
46.79 s
gammaloop-nextest-docs> No such file or directory (os error 2)
46.79 s
gammaloop-nextest-docs>
46.79 s
gammaloop-nextest-docs> Location:
46.79 s
gammaloop-nextest-docs> crates/alphal00p-docs-builder/src/lib.rs:2276:18
46.79 s
gammaloop-nextest-docs> stack backtrace:
46.79 s
gammaloop-nextest-docs> 0: __rustc::rust_begin_unwind
46.79 s
gammaloop-nextest-docs> 1: core::panicking::panic_fmt
46.79 s
gammaloop-nextest-docs> 2: core::result::unwrap_failed
46.79 s
gammaloop-nextest-docs> 3: alphal00p_docs_builder::tests::write_test_portal
46.79 s
gammaloop-nextest-docs> 4: alphal00p_docs_builder::tests::portal_and_developer_pages_use_federated_search_and_feedback
46.79 s
gammaloop-nextest-docs> 5: <alphal00p_docs_builder::tests::portal_and_developer_pages_use_federated_search_and_feedback::{closure#0} as core::ops::function::FnOnce<()>>::call_once
46.79 s
gammaloop-nextest-docs> note: Some details are omitted, run with `RUST_BACKTRACE=full` for a verbose backtrace.
46.79 s
gammaloop-nextest-docs>
46.79 s
gammaloop-nextest-docs> FAIL [ 0.009s] ( 55/129) alphal00p-docs-builder tests :: portal_task_chooser_routes_each_goal_to_the_registered_quickstart
46.79 s
gammaloop-nextest-docs> stdout ---
46.79 s
gammaloop-nextest-docs>
46.79 s
gammaloop-nextest-docs> running 1 test
46.79 s
gammaloop-nextest-docs> test tests::portal_task_chooser_routes_each_goal_to_the_registered_quickstart ... FAILED
46.79 s
gammaloop-nextest-docs>
46.79 s
gammaloop-nextest-docs> failures:
46.79 s
gammaloop-nextest-docs>
46.79 s
gammaloop-nextest-docs> failures:
46.79 s
gammaloop-nextest-docs> tests::portal_task_chooser_routes_each_goal_to_the_registered_quickstart
46.79 s
gammaloop-nextest-docs>
46.79 s
gammaloop-nextest-docs> test result: FAILED. 0 passed; 1 failed; 0 ignored; 0 measured; 128 filtered out; finished in 0.00s
46.79 s
gammaloop-nextest-docs>
46.79 s
gammaloop-nextest-docs> stderr ---
46.79 s
gammaloop-nextest-docs>
46.79 s
gammaloop-nextest-docs> thread 'tests::portal_task_chooser_routes_each_goal_to_the_registered_quickstart' (443) panicked at crates/alphal00p-docs-builder/src/lib.rs:9684:14:
46.79 s
gammaloop-nextest-docs> called `Result::unwrap()` on an `Err` value: failed to copy documentation asset crates/spynso3/typst/STIXTwoMath-Regular.woff2
46.79 s
gammaloop-nextest-docs>
46.79 s
gammaloop-nextest-docs> Caused by:
46.79 s
gammaloop-nextest-docs> No such file or directory (os error 2)
46.79 s
gammaloop-nextest-docs>
46.79 s
gammaloop-nextest-docs> Location:
46.79 s
gammaloop-nextest-docs> crates/alphal00p-docs-builder/src/lib.rs:2276:18
46.79 s
gammaloop-nextest-docs> stack backtrace:
46.79 s
gammaloop-nextest-docs> 0: __rustc::rust_begin_unwind
46.79 s
gammaloop-nextest-docs> 1: core::panicking::panic_fmt
46.79 s
gammaloop-nextest-docs> 2: core::result::unwrap_failed
46.79 s
gammaloop-nextest-docs> 3: alphal00p_docs_builder::tests::write_test_portal
46.79 s
gammaloop-nextest-docs> 4: alphal00p_docs_builder::tests::portal_task_chooser_routes_each_goal_to_the_registered_quickstart
46.79 s
gammaloop-nextest-docs> 5: <alphal00p_docs_builder::tests::portal_task_chooser_routes_each_goal_to_the_registered_quickstart::{closure#0} as core::ops::function::FnOnce<()>>::call_once
46.79 s
gammaloop-nextest-docs> note: Some details are omitted, run with `RUST_BACKTRACE=full` for a verbose backtrace.
46.79 s
gammaloop-nextest-docs>
46.79 s
gammaloop-nextest-docs> FAIL [ 0.123s] ( 83/129) alphal00p-docs-builder tests :: checked_in_registry_is_valid
46.79 s
gammaloop-nextest-docs> stdout ---
46.79 s
gammaloop-nextest-docs>
46.79 s
gammaloop-nextest-docs> running 1 test
46.79 s
gammaloop-nextest-docs> test tests::checked_in_registry_is_valid ... FAILED
46.79 s
gammaloop-nextest-docs>
46.79 s
gammaloop-nextest-docs> failures:
46.79 s
gammaloop-nextest-docs>
46.79 s
gammaloop-nextest-docs> failures:
46.79 s
gammaloop-nextest-docs> tests::checked_in_registry_is_valid
46.79 s
gammaloop-nextest-docs>
46.79 s
gammaloop-nextest-docs> test result: FAILED. 0 passed; 1 failed; 0 ignored; 0 measured; 128 filtered out; finished in 0.11s
46.79 s
gammaloop-nextest-docs>
46.79 s
gammaloop-nextest-docs> stderr ---
46.79 s
gammaloop-nextest-docs>
46.79 s
gammaloop-nextest-docs> thread 'tests::checked_in_registry_is_valid' (214) panicked at crates/alphal00p-docs-builder/src/lib.rs:12260:50:
46.79 s
gammaloop-nextest-docs> called `Result::unwrap()` on an `Err` value: required documentation source is missing: /build/source/crates/spynso3/typst/STIXTwoMath-Regular.woff2
46.79 s
gammaloop-nextest-docs>
46.79 s
gammaloop-nextest-docs> Location:
46.79 s
gammaloop-nextest-docs> crates/alphal00p-docs-builder/src/lib.rs:5103:9
46.79 s
gammaloop-nextest-docs> stack backtrace:
46.79 s
gammaloop-nextest-docs> 0: __rustc::rust_begin_unwind
46.79 s
gammaloop-nextest-docs> 1: core::panicking::panic_fmt
46.79 s
gammaloop-nextest-docs> 2: core::result::unwrap_failed
46.79 s
gammaloop-nextest-docs> 3: alphal00p_docs_builder::tests::checked_in_registry_is_valid
46.79 s
gammaloop-nextest-docs> 4: <alphal00p_docs_builder::tests::checked_in_registry_is_valid::{closure#0} as core::ops::function::FnOnce<()>>::call_once
46.79 s
gammaloop-nextest-docs> note: Some details are omitted, run with `RUST_BACKTRACE=full` for a verbose backtrace.
46.79 s
gammaloop-nextest-docs>
46.79 s
gammaloop-nextest-docs> FAIL [ 0.009s] ( 87/129) alphal00p-docs-builder tests :: site_assets_replace_read_only_generated_files
46.79 s
gammaloop-nextest-docs> stdout ---
46.79 s
gammaloop-nextest-docs>
46.79 s
gammaloop-nextest-docs> running 1 test
46.79 s
gammaloop-nextest-docs> test tests::site_assets_replace_read_only_generated_files ... FAILED
46.79 s
gammaloop-nextest-docs>
46.79 s
gammaloop-nextest-docs> failures:
46.79 s
gammaloop-nextest-docs>
46.79 s
gammaloop-nextest-docs> failures:
46.79 s
gammaloop-nextest-docs> tests::site_assets_replace_read_only_generated_files
46.79 s
gammaloop-nextest-docs>
46.79 s
gammaloop-nextest-docs> test result: FAILED. 0 passed; 1 failed; 0 ignored; 0 measured; 128 filtered out; finished in 0.00s
46.79 s
gammaloop-nextest-docs>
46.79 s
gammaloop-nextest-docs> stderr ---
46.79 s
gammaloop-nextest-docs>
46.79 s
gammaloop-nextest-docs> thread 'tests::site_assets_replace_read_only_generated_files' (669) panicked at crates/alphal00p-docs-builder/src/lib.rs:12305:50:
46.79 s
gammaloop-nextest-docs> called `Result::unwrap()` on an `Err` value: failed to copy documentation asset crates/spynso3/typst/STIXTwoMath-Regular.woff2
46.79 s
gammaloop-nextest-docs>
46.79 s
gammaloop-nextest-docs> Caused by:
46.79 s
gammaloop-nextest-docs> No such file or directory (os error 2)
46.79 s
gammaloop-nextest-docs>
46.79 s
gammaloop-nextest-docs> Location:
46.79 s
gammaloop-nextest-docs> crates/alphal00p-docs-builder/src/lib.rs:2276:18
46.79 s
gammaloop-nextest-docs> stack backtrace:
46.79 s
gammaloop-nextest-docs> 0: __rustc::rust_begin_unwind
46.79 s
gammaloop-nextest-docs> 1: core::panicking::panic_fmt
46.79 s
gammaloop-nextest-docs> 2: core::result::unwrap_failed
46.79 s
gammaloop-nextest-docs> 3: alphal00p_docs_builder::tests::site_assets_replace_read_only_generated_files
46.79 s
gammaloop-nextest-docs> 4: <alphal00p_docs_builder::tests::site_assets_replace_read_only_generated_files::{closure#0} as core::ops::function::FnOnce<()>>::call_once
46.79 s
gammaloop-nextest-docs> note: Some details are omitted, run with `RUST_BACKTRACE=full` for a verbose backtrace.
46.79 s
gammaloop-nextest-docs>
46.79 s
gammaloop-nextest-docs> FAIL [ 0.114s] ( 89/129) alphal00p-docs-builder tests :: developer_scope_ranges_ignore_unrelated_edits_and_warn_only_while_watching
46.79 s
gammaloop-nextest-docs> stdout ---
46.79 s
gammaloop-nextest-docs>
46.79 s
gammaloop-nextest-docs> running 1 test
46.79 s
gammaloop-nextest-docs> test tests::developer_scope_ranges_ignore_unrelated_edits_and_warn_only_while_watching ... FAILED
46.79 s
gammaloop-nextest-docs>
46.79 s
gammaloop-nextest-docs> failures:
46.79 s
gammaloop-nextest-docs>
46.79 s
gammaloop-nextest-docs> failures:
46.79 s
gammaloop-nextest-docs> tests::developer_scope_ranges_ignore_unrelated_edits_and_warn_only_while_watching
46.79 s
gammaloop-nextest-docs>
46.79 s
gammaloop-nextest-docs> test result: FAILED. 0 passed; 1 failed; 0 ignored; 0 measured; 128 filtered out; finished in 0.11s
46.79 s
gammaloop-nextest-docs>
46.79 s
gammaloop-nextest-docs> stderr ---
46.79 s
gammaloop-nextest-docs>
46.79 s
gammaloop-nextest-docs> thread 'tests::developer_scope_ranges_ignore_unrelated_edits_and_warn_only_while_watching' (278) panicked at crates/alphal00p-docs-builder/src/lib.rs:12350:29:
46.79 s
gammaloop-nextest-docs> called `Result::unwrap()` on an `Err` value: required documentation source is missing: /build/source/crates/spynso3/typst/STIXTwoMath-Regular.woff2
46.79 s
gammaloop-nextest-docs>
46.79 s
gammaloop-nextest-docs> Location:
46.79 s
gammaloop-nextest-docs> crates/alphal00p-docs-builder/src/lib.rs:5103:9
46.79 s
gammaloop-nextest-docs> stack backtrace:
46.79 s
gammaloop-nextest-docs> 0: __rustc::rust_begin_unwind
46.79 s
gammaloop-nextest-docs> 1: core::panicking::panic_fmt
46.79 s
gammaloop-nextest-docs> 2: core::result::unwrap_failed
46.79 s
gammaloop-nextest-docs> 3: alphal00p_docs_builder::tests::developer_scope_ranges_ignore_unrelated_edits_and_warn_only_while_watching
46.79 s
gammaloop-nextest-docs> 4: <alphal00p_docs_builder::tests::developer_scope_ranges_ignore_unrelated_edits_and_warn_only_while_watching::{closure#0} as core::ops::function::FnOnce<()>>::call_once
46.79 s
gammaloop-nextest-docs> note: Some details are omitted, run with `RUST_BACKTRACE=full` for a verbose backtrace.
46.79 s
gammaloop-nextest-docs>
46.79 s
gammaloop-nextest-docs> FAIL [ 0.142s] ( 96/129) alphal00p-docs-builder provenance_tests :: each_build_captures_one_revision_before_rendering
46.79 s
gammaloop-nextest-docs> stdout ---
46.79 s
gammaloop-nextest-docs>
46.79 s
gammaloop-nextest-docs> running 1 test
46.79 s
gammaloop-nextest-docs>
46.79 s
gammaloop-nextest-docs> running 1 test
46.79 s
gammaloop-nextest-docs> test provenance_tests::each_build_captures_one_revision_before_rendering ... FAILED
46.79 s
gammaloop-nextest-docs>
46.79 s
gammaloop-nextest-docs> failures:
46.79 s
gammaloop-nextest-docs>
46.79 s
gammaloop-nextest-docs> failures:
46.79 s
gammaloop-nextest-docs> provenance_tests::each_build_captures_one_revision_before_rendering
46.79 s
gammaloop-nextest-docs>
46.79 s
gammaloop-nextest-docs> test result: FAILED. 0 passed; 1 failed; 0 ignored; 0 measured; 128 filtered out; finished in 0.11s
46.79 s
gammaloop-nextest-docs>
46.79 s
gammaloop-nextest-docs> test provenance_tests::each_build_captures_one_revision_before_rendering ... FAILED
46.79 s
gammaloop-nextest-docs>
46.79 s
gammaloop-nextest-docs> failures:
46.79 s
gammaloop-nextest-docs>
46.79 s
gammaloop-nextest-docs> failures:
46.79 s
gammaloop-nextest-docs> provenance_tests::each_build_captures_one_revision_before_rendering
46.79 s
gammaloop-nextest-docs>
46.79 s
gammaloop-nextest-docs> test result: FAILED. 0 passed; 1 failed; 0 ignored; 0 measured; 128 filtered out; finished in 0.13s
46.79 s
gammaloop-nextest-docs>
46.79 s
gammaloop-nextest-docs> stderr ---
46.79 s
gammaloop-nextest-docs>
46.79 s
gammaloop-nextest-docs> thread 'provenance_tests::each_build_captures_one_revision_before_rendering' (284) panicked at crates/alphal00p-docs-builder/src/provenance_tests.rs:297:14:
46.79 s
gammaloop-nextest-docs> called `Result::unwrap()` on an `Err` value: required documentation source is missing: /build/source/target/nix-ci-tmp/.tmpAH3uti/checkout/crates/spynso3/typst/STIXTwoMath-Regular.woff2
46.79 s
gammaloop-nextest-docs>
46.79 s
gammaloop-nextest-docs> Location:
46.79 s
gammaloop-nextest-docs> crates/alphal00p-docs-builder/src/lib.rs:5103:9
46.79 s
gammaloop-nextest-docs> stack backtrace:
46.79 s
gammaloop-nextest-docs> 0: __rustc::rust_begin_unwind
46.79 s
gammaloop-nextest-docs> 1: core::panicking::panic_fmt
46.79 s
gammaloop-nextest-docs> 2: core::result::unwrap_failed
46.79 s
gammaloop-nextest-docs> 3: alphal00p_docs_builder::provenance_tests::each_build_captures_one_revision_before_rendering
46.79 s
gammaloop-nextest-docs> 4: <alphal00p_docs_builder::provenance_tests::each_build_captures_one_revision_before_rendering::{closure#0} as core::ops::function::FnOnce<()>>::call_once
46.79 s
gammaloop-nextest-docs> note: Some details are omitted, run with `RUST_BACKTRACE=full` for a verbose backtrace.
46.79 s
gammaloop-nextest-docs>
46.79 s
gammaloop-nextest-docs> thread 'provenance_tests::each_build_captures_one_revision_before_rendering' (218) panicked at crates/alphal00p-docs-builder/src/provenance_tests.rs:274:9:
46.79 s
gammaloop-nextest-docs> assertion failed: command.status().unwrap().success()
46.79 s
gammaloop-nextest-docs> stack backtrace:
46.79 s
gammaloop-nextest-docs> 0: __rustc::rust_begin_unwind
46.79 s
gammaloop-nextest-docs> 1: core::panicking::panic_fmt
46.79 s
gammaloop-nextest-docs> 2: core::panicking::panic
46.79 s
gammaloop-nextest-docs> 3: alphal00p_docs_builder::provenance_tests::each_build_captures_one_revision_before_rendering
46.79 s
gammaloop-nextest-docs> 4: <alphal00p_docs_builder::provenance_tests::each_build_captures_one_revision_before_rendering::{closure#0} as core::ops::function::FnOnce<()>>::call_once
46.79 s
gammaloop-nextest-docs> note: Some details are omitted, run with `RUST_BACKTRACE=full` for a verbose backtrace.
46.79 s
gammaloop-nextest-docs>
46.79 s
gammaloop-nextest-docs> FAIL [ 0.123s] (106/129) alphal00p-docs-builder tests :: every_product_requires_a_task_chooser_and_each_supported_interface
46.79 s
gammaloop-nextest-docs> stdout ---
46.79 s
gammaloop-nextest-docs>
46.79 s
gammaloop-nextest-docs> running 1 test
46.79 s
gammaloop-nextest-docs> test tests::every_product_requires_a_task_chooser_and_each_supported_interface ... FAILED
46.79 s
gammaloop-nextest-docs>
46.79 s
gammaloop-nextest-docs> failures:
46.79 s
gammaloop-nextest-docs>
46.79 s
gammaloop-nextest-docs> failures:
46.79 s
gammaloop-nextest-docs> tests::every_product_requires_a_task_chooser_and_each_supported_interface
46.79 s
gammaloop-nextest-docs>
46.79 s
gammaloop-nextest-docs> test result: FAILED. 0 passed; 1 failed; 0 ignored; 0 measured; 128 filtered out; finished in 0.12s
46.79 s
gammaloop-nextest-docs>
46.79 s
gammaloop-nextest-docs> stderr ---
46.79 s
gammaloop-nextest-docs>
46.79 s
gammaloop-nextest-docs> thread 'tests::every_product_requires_a_task_chooser_and_each_supported_interface' (312) panicked at crates/alphal00p-docs-builder/src/lib.rs:12274:9:
46.79 s
gammaloop-nextest-docs> assertion failed: format!("{error:#}").contains("has no quickstart page")
46.79 s
gammaloop-nextest-docs> stack backtrace:
46.79 s
gammaloop-nextest-docs> 0: __rustc::rust_begin_unwind
46.79 s
gammaloop-nextest-docs> 1: core::panicking::panic_fmt
46.79 s
gammaloop-nextest-docs> 2: core::panicking::panic
46.79 s
gammaloop-nextest-docs> 3: alphal00p_docs_builder::tests::every_product_requires_a_task_chooser_and_each_supported_interface
46.79 s
gammaloop-nextest-docs> 4: <alphal00p_docs_builder::tests::every_product_requires_a_task_chooser_and_each_supported_interface::{closure#0} as core::ops::function::FnOnce<()>>::call_once
46.79 s
gammaloop-nextest-docs> note: Some details are omitted, run with `RUST_BACKTRACE=full` for a verbose backtrace.
46.79 s
gammaloop-nextest-docs>
46.79 s
gammaloop-nextest-docs> FAIL [ 0.118s] (122/129) alphal00p-docs-builder tests :: pdf_manual_chapter_order_must_match_the_page_registry
46.79 s
gammaloop-nextest-docs> stdout ---
46.79 s
gammaloop-nextest-docs>
46.79 s
gammaloop-nextest-docs> running 1 test
46.79 s
gammaloop-nextest-docs> test tests::pdf_manual_chapter_order_must_match_the_page_registry ... FAILED
46.79 s
gammaloop-nextest-docs>
46.79 s
gammaloop-nextest-docs> failures:
46.79 s
gammaloop-nextest-docs>
46.79 s
gammaloop-nextest-docs> failures:
46.79 s
gammaloop-nextest-docs> tests::pdf_manual_chapter_order_must_match_the_page_registry
46.79 s
gammaloop-nextest-docs>
46.79 s
gammaloop-nextest-docs> test result: FAILED. 0 passed; 1 failed; 0 ignored; 0 measured; 128 filtered out; finished in 0.11s
46.79 s
gammaloop-nextest-docs>
46.79 s
gammaloop-nextest-docs> stderr ---
46.79 s
gammaloop-nextest-docs>
46.79 s
gammaloop-nextest-docs> thread 'tests::pdf_manual_chapter_order_must_match_the_page_registry' (397) panicked at crates/alphal00p-docs-builder/src/lib.rs:12330:9:
46.79 s
gammaloop-nextest-docs> assertion failed: format!("{error:#}").contains("PDF manual chapter order differs")
46.79 s
gammaloop-nextest-docs> stack backtrace:
46.79 s
gammaloop-nextest-docs> 0: __rustc::rust_begin_unwind
46.79 s
gammaloop-nextest-docs> 1: core::panicking::panic_fmt
46.79 s
gammaloop-nextest-docs> 2: core::panicking::panic
46.79 s
gammaloop-nextest-docs> 3: alphal00p_docs_builder::tests::pdf_manual_chapter_order_must_match_the_page_registry
46.79 s
gammaloop-nextest-docs> 4: <alphal00p_docs_builder::tests::pdf_manual_chapter_order_must_match_the_page_registry::{closure#0} as core::ops::function::FnOnce<()>>::call_once
46.79 s
gammaloop-nextest-docs> note: Some details are omitted, run with `RUST_BACKTRACE=full` for a verbose backtrace.
46.79 s
gammaloop-nextest-docs>
46.79 s
gammaloop-nextest-docs> error : test run failed
46.82 s
gammaloop-nextest-docs>
46.82 s
gammaloop-nextest-docs> ========== nextest test summary ==========
46.82 s
gammaloop-nextest-docs> report: target/nextest/ci_gammaloop/junit.xml
46.82 s
gammaloop-nextest-docs> tests: 129, failures: 11, errors: 0
46.82 s
gammaloop-nextest-docs>
46.82 s
gammaloop-nextest-docs> 1. alphal00p-docs-builder::tests::developer_architecture_is_classified_searchable_and_source_backed
46.82 s
gammaloop-nextest-docs> failure: test failure with exit code 101
46.82 s
gammaloop-nextest-docs> thread 'tests::developer_architecture_is_classified_searchable_and_source_backed' (273) panicked at crates/alphal00p-docs-builder/src/lib.rs:12751:14:
46.82 s
gammaloop-nextest-docs> called `Result::unwrap()` on an `Err` value: failed to copy documentation asset crates/spynso3/typst/STIXTwoMath-Regular.woff2
46.82 s
gammaloop-nextest-docs>
46.82 s
gammaloop-nextest-docs> Caused by:
46.82 s
gammaloop-nextest-docs> No such file or directory (os error 2)
46.82 s
gammaloop-nextest-docs>
46.82 s
gammaloop-nextest-docs> Location:
46.82 s
gammaloop-nextest-docs> crates/alphal00p-docs-builder/src/lib.rs:2276:18
46.82 s
gammaloop-nextest-docs> stack backtrace:
46.82 s
gammaloop-nextest-docs> 0: __rustc::rust_begin_unwind
46.82 s
gammaloop-nextest-docs> 1: core::panicking::panic_fmt
46.82 s
gammaloop-nextest-docs> 2: core::result::unwrap_failed
46.82 s
gammaloop-nextest-docs> 3: alphal00p_docs_builder::tests::developer_architecture_is_classified_searchable_and_source_backed
46.82 s
gammaloop-nextest-docs> 4: <alphal00p_docs_builder::tests::developer_architecture_is_classified_searchable_and_source_backed::{closure#0} as core::ops::function::FnOnce<()>>::call_once
46.82 s
gammaloop-nextest-docs> note: Some details are omitted, run with `RUST_BACKTRACE=full` for a verbose backtrace.
46.82 s
gammaloop-nextest-docs> system-out
46.82 s
gammaloop-nextest-docs> running 1 test
46.82 s
gammaloop-nextest-docs> test tests::developer_architecture_is_classified_searchable_and_source_backed ... FAILED
46.82 s
gammaloop-nextest-docs>
46.82 s
gammaloop-nextest-docs> failures:
46.82 s
gammaloop-nextest-docs>
46.82 s
gammaloop-nextest-docs> failures:
46.82 s
gammaloop-nextest-docs> tests::developer_architecture_is_classified_searchable_and_source_backed
46.82 s
gammaloop-nextest-docs>
46.82 s
gammaloop-nextest-docs> test result: FAILED. 0 passed; 1 failed; 0 ignored; 0 measured; 128 filtered out; finished in 0.01s
46.82 s
gammaloop-nextest-docs> system-err
46.82 s
gammaloop-nextest-docs> thread 'tests::developer_architecture_is_classified_searchable_and_source_backed' (273) panicked at crates/alphal00p-docs-builder/src/lib.rs:12751:14:
46.82 s
gammaloop-nextest-docs> called `Result::unwrap()` on an `Err` value: failed to copy documentation asset crates/spynso3/typst/STIXTwoMath-Regular.woff2
46.82 s
gammaloop-nextest-docs>
46.82 s
gammaloop-nextest-docs> Caused by:
46.82 s
gammaloop-nextest-docs> No such file or directory (os error 2)
46.82 s
gammaloop-nextest-docs>
46.82 s
gammaloop-nextest-docs> Location:
46.82 s
gammaloop-nextest-docs> crates/alphal00p-docs-builder/src/lib.rs:2276:18
46.82 s
gammaloop-nextest-docs> stack backtrace:
46.82 s
gammaloop-nextest-docs> 0: __rustc::rust_begin_unwind
46.82 s
gammaloop-nextest-docs> 1: core::panicking::panic_fmt
46.82 s
gammaloop-nextest-docs> 2: core::result::unwrap_failed
46.82 s
gammaloop-nextest-docs> 3: alphal00p_docs_builder::tests::developer_architecture_is_classified_searchable_and_source_backed
46.82 s
gammaloop-nextest-docs> 4: <alphal00p_docs_builder::tests::developer_architecture_is_classified_searchable_and_source_backed::{closure#0} as core::ops::function::FnOnce<()>>::call_once
46.82 s
gammaloop-nextest-docs> note: Some details are omitted, run with `RUST_BACKTRACE=full` for a verbose backtrace.
46.82 s
gammaloop-nextest-docs>
46.82 s
gammaloop-nextest-docs> 2. alphal00p-docs-builder::tests::every_product_orients_rust_to_native_rustdoc_and_keeps_legacy_redirects
46.82 s
gammaloop-nextest-docs> failure: test failure with exit code 101
46.82 s
gammaloop-nextest-docs> thread 'tests::every_product_orients_rust_to_native_rustdoc_and_keeps_legacy_redirects' (301) panicked at crates/alphal00p-docs-builder/src/lib.rs:12555:46:
46.82 s
gammaloop-nextest-docs> called `Result::unwrap()` on an `Err` value: failed to copy documentation asset crates/spynso3/typst/STIXTwoMath-Regular.woff2
46.82 s
gammaloop-nextest-docs>
46.82 s
gammaloop-nextest-docs> Caused by:
46.82 s
gammaloop-nextest-docs> No such file or directory (os error 2)
46.82 s
gammaloop-nextest-docs>
46.82 s
gammaloop-nextest-docs> Location:
46.82 s
gammaloop-nextest-docs> crates/alphal00p-docs-builder/src/lib.rs:2276:18
46.82 s
gammaloop-nextest-docs> stack backtrace:
46.82 s
gammaloop-nextest-docs> 0: __rustc::rust_begin_unwind
46.82 s
gammaloop-nextest-docs> 1: core::panicking::panic_fmt
46.82 s
gammaloop-nextest-docs> 2: core::result::unwrap_failed
46.82 s
gammaloop-nextest-docs> 3: alphal00p_docs_builder::tests::every_product_orients_rust_to_native_rustdoc_and_keeps_legacy_redirects
46.82 s
gammaloop-nextest-docs> 4: <alphal00p_docs_builder::tests::every_product_orients_rust_to_native_rustdoc_and_keeps_legacy_redirects::{closure#0} as core::ops::function::FnOnce<()>>::call_once
46.82 s
gammaloop-nextest-docs> note: Some details are omitted, run with `RUST_BACKTRACE=full` for a verbose backtrace.
46.82 s
gammaloop-nextest-docs> system-out
46.82 s
gammaloop-nextest-docs> running 1 test
46.82 s
gammaloop-nextest-docs> test tests::every_product_orients_rust_to_native_rustdoc_and_keeps_legacy_redirects ... FAILED
46.82 s
gammaloop-nextest-docs>
46.82 s
gammaloop-nextest-docs> failures:
46.82 s
gammaloop-nextest-docs>
46.82 s
gammaloop-nextest-docs> failures:
46.82 s
gammaloop-nextest-docs> tests::every_product_orients_rust_to_native_rustdoc_and_keeps_legacy_redirects
46.82 s
gammaloop-nextest-docs>
46.82 s
gammaloop-nextest-docs> test result: FAILED. 0 passed; 1 failed; 0 ignored; 0 measured; 128 filtered out; finished in 0.01s
46.82 s
gammaloop-nextest-docs> system-err
46.82 s
gammaloop-nextest-docs> thread 'tests::every_product_orients_rust_to_native_rustdoc_and_keeps_legacy_redirects' (301) panicked at crates/alphal00p-docs-builder/src/lib.rs:12555:46:
46.82 s
gammaloop-nextest-docs> called `Result::unwrap()` on an `Err` value: failed to copy documentation asset crates/spynso3/typst/STIXTwoMath-Regular.woff2
46.82 s
gammaloop-nextest-docs>
46.82 s
gammaloop-nextest-docs> Caused by:
46.82 s
gammaloop-nextest-docs> No such file or directory (os error 2)
46.82 s
gammaloop-nextest-docs>
46.82 s
gammaloop-nextest-docs> Location:
46.82 s
gammaloop-nextest-docs> crates/alphal00p-docs-builder/src/lib.rs:2276:18
46.82 s
gammaloop-nextest-docs> stack backtrace:
46.82 s
gammaloop-nextest-docs> 0: __rustc::rust_begin_unwind
46.82 s
gammaloop-nextest-docs> 1: core::panicking::panic_fmt
46.82 s
gammaloop-nextest-docs> 2: core::result::unwrap_failed
46.82 s
gammaloop-nextest-docs> 3: alphal00p_docs_builder::tests::every_product_orients_rust_to_native_rustdoc_and_keeps_legacy_redirects
46.82 s
gammaloop-nextest-docs> 4: <alphal00p_docs_builder::tests::every_product_orients_rust_to_native_rustdoc_and_keeps_legacy_redirects::{closure#0} as core::ops::function::FnOnce<()>>::call_once
46.82 s
gammaloop-nextest-docs> note: Some details are omitted, run with `RUST_BACKTRACE=full` for a verbose backtrace.
46.82 s
gammaloop-nextest-docs>
46.82 s
gammaloop-nextest-docs> 3. alphal00p-docs-builder::tests::portal_emits_routes_and_valid_assets
46.82 s
gammaloop-nextest-docs> failure: test failure with exit code 101
46.82 s
gammaloop-nextest-docs> thread 'tests::portal_emits_routes_and_valid_assets' (429) panicked at crates/alphal00p-docs-builder/src/lib.rs:9684:14:
46.82 s
gammaloop-nextest-docs> called `Result::unwrap()` on an `Err` value: failed to copy documentation asset crates/spynso3/typst/STIXTwoMath-Regular.woff2
46.82 s
gammaloop-nextest-docs>
46.82 s
gammaloop-nextest-docs> Caused by:
46.82 s
gammaloop-nextest-docs> No such file or directory (os error 2)
46.82 s
gammaloop-nextest-docs>
46.82 s
gammaloop-nextest-docs> Location:
46.82 s
gammaloop-nextest-docs> crates/alphal00p-docs-builder/src/lib.rs:2276:18
46.82 s
gammaloop-nextest-docs> stack backtrace:
46.82 s
gammaloop-nextest-docs> 0: __rustc::rust_begin_unwind
46.82 s
gammaloop-nextest-docs> 1: core::panicking::panic_fmt
46.82 s
gammaloop-nextest-docs> 2: core::result::unwrap_failed
46.82 s
gammaloop-nextest-docs> 3: alphal00p_docs_builder::tests::write_test_portal
46.82 s
gammaloop-nextest-docs> 4: alphal00p_docs_builder::tests::portal_emits_routes_and_valid_assets
46.82 s
gammaloop-nextest-docs> 5: <alphal00p_docs_builder::tests::portal_emits_routes_and_valid_assets::{closure#0} as core::ops::function::FnOnce<()>>::call_once
46.82 s
gammaloop-nextest-docs> note: Some details are omitted, run with `RUST_BACKTRACE=full` for a verbose backtrace.
46.82 s
gammaloop-nextest-docs> system-out
46.82 s
gammaloop-nextest-docs> running 1 test
46.82 s
gammaloop-nextest-docs> test tests::portal_emits_routes_and_valid_assets ... FAILED
46.82 s
gammaloop-nextest-docs>
46.82 s
gammaloop-nextest-docs> failures:
46.82 s
gammaloop-nextest-docs>
46.82 s
gammaloop-nextest-docs> failures:
46.82 s
gammaloop-nextest-docs> tests::portal_emits_routes_and_valid_assets
46.82 s
gammaloop-nextest-docs>
46.82 s
gammaloop-nextest-docs> test result: FAILED. 0 passed; 1 failed; 0 ignored; 0 measured; 128 filtered out; finished in 0.00s
46.82 s
gammaloop-nextest-docs> system-err
46.82 s
gammaloop-nextest-docs> thread 'tests::portal_emits_routes_and_valid_assets' (429) panicked at crates/alphal00p-docs-builder/src/lib.rs:9684:14:
46.82 s
gammaloop-nextest-docs> called `Result::unwrap()` on an `Err` value: failed to copy documentation asset crates/spynso3/typst/STIXTwoMath-Regular.woff2
46.82 s
gammaloop-nextest-docs>
46.82 s
gammaloop-nextest-docs> Caused by:
46.82 s
gammaloop-nextest-docs> No such file or directory (os error 2)
46.82 s
gammaloop-nextest-docs>
46.82 s
gammaloop-nextest-docs> Location:
46.82 s
gammaloop-nextest-docs> crates/alphal00p-docs-builder/src/lib.rs:2276:18
46.82 s
gammaloop-nextest-docs> stack backtrace:
46.82 s
gammaloop-nextest-docs> 0: __rustc::rust_begin_unwind
46.82 s
gammaloop-nextest-docs> 1: core::panicking::panic_fmt
46.82 s
gammaloop-nextest-docs> 2: core::result::unwrap_failed
46.82 s
gammaloop-nextest-docs> 3: alphal00p_docs_builder::tests::write_test_portal
46.82 s
gammaloop-nextest-docs> 4: alphal00p_docs_builder::tests::portal_emits_routes_and_valid_assets
46.82 s
gammaloop-nextest-docs> 5: <alphal00p_docs_builder::tests::portal_emits_routes_and_valid_assets::{closure#0} as core::ops::function::FnOnce<()>>::call_once
46.82 s
gammaloop-nextest-docs> note: Some details are omitted, run with `RUST_BACKTRACE=full` for a verbose backtrace.
46.82 s
gammaloop-nextest-docs>
46.82 s
gammaloop-nextest-docs> 4. alphal00p-docs-builder::tests::portal_and_developer_pages_use_federated_search_and_feedback
46.82 s
gammaloop-nextest-docs> failure: test failure with exit code 101
46.82 s
gammaloop-nextest-docs> thread 'tests::portal_and_developer_pages_use_federated_search_and_feedback' (430) panicked at crates/alphal00p-docs-builder/src/lib.rs:9684:14:
46.82 s
gammaloop-nextest-docs> called `Result::unwrap()` on an `Err` value: failed to copy documentation asset crates/spynso3/typst/STIXTwoMath-Regular.woff2
46.82 s
gammaloop-nextest-docs>
46.82 s
gammaloop-nextest-docs> Caused by:
46.82 s
gammaloop-nextest-docs> No such file or directory (os error 2)
46.82 s
gammaloop-nextest-docs>
46.82 s
gammaloop-nextest-docs> Location:
46.82 s
gammaloop-nextest-docs> crates/alphal00p-docs-builder/src/lib.rs:2276:18
46.82 s
gammaloop-nextest-docs> stack backtrace:
46.82 s
gammaloop-nextest-docs> 0: __rustc::rust_begin_unwind
46.82 s
gammaloop-nextest-docs> 1: core::panicking::panic_fmt
46.82 s
gammaloop-nextest-docs> 2: core::result::unwrap_failed
46.82 s
gammaloop-nextest-docs> 3: alphal00p_docs_builder::tests::write_test_portal
46.82 s
gammaloop-nextest-docs> 4: alphal00p_docs_builder::tests::portal_and_developer_pages_use_federated_search_and_feedback
46.82 s
gammaloop-nextest-docs> 5: <alphal00p_docs_builder::tests::portal_and_developer_pages_use_federated_search_and_feedback::{closure#0} as core::ops::function::FnOnce<()>>::call_once
46.82 s
gammaloop-nextest-docs> note: Some details are omitted, run with `RUST_BACKTRACE=full` for a verbose backtrace.
46.82 s
gammaloop-nextest-docs> system-out
46.82 s
gammaloop-nextest-docs> running 1 test
46.82 s
gammaloop-nextest-docs> test tests::portal_and_developer_pages_use_federated_search_and_feedback ... FAILED
46.82 s
gammaloop-nextest-docs>
46.82 s
gammaloop-nextest-docs> failures:
46.82 s
gammaloop-nextest-docs>
46.82 s
gammaloop-nextest-docs> failures:
46.82 s
gammaloop-nextest-docs> tests::portal_and_developer_pages_use_federated_search_and_feedback
46.82 s
gammaloop-nextest-docs>
46.82 s
gammaloop-nextest-docs> test result: FAILED. 0 passed; 1 failed; 0 ignored; 0 measured; 128 filtered out; finished in 0.01s
46.82 s
gammaloop-nextest-docs> system-err
46.82 s
gammaloop-nextest-docs> thread 'tests::portal_and_developer_pages_use_federated_search_and_feedback' (430) panicked at crates/alphal00p-docs-builder/src/lib.rs:9684:14:
46.82 s
gammaloop-nextest-docs> called `Result::unwrap()` on an `Err` value: failed to copy documentation asset crates/spynso3/typst/STIXTwoMath-Regular.woff2
46.82 s
gammaloop-nextest-docs>
46.82 s
gammaloop-nextest-docs> Caused by:
46.82 s
gammaloop-nextest-docs> No such file or directory (os error 2)
46.82 s
gammaloop-nextest-docs>
46.82 s
gammaloop-nextest-docs> Location:
46.82 s
gammaloop-nextest-docs> crates/alphal00p-docs-builder/src/lib.rs:2276:18
46.82 s
gammaloop-nextest-docs> stack backtrace:
46.82 s
gammaloop-nextest-docs> 0: __rustc::rust_begin_unwind
46.82 s
gammaloop-nextest-docs> 1: core::panicking::panic_fmt
46.82 s
gammaloop-nextest-docs> 2: core::result::unwrap_failed
46.82 s
gammaloop-nextest-docs> 3: alphal00p_docs_builder::tests::write_test_portal
46.82 s
gammaloop-nextest-docs> 4: alphal00p_docs_builder::tests::portal_and_developer_pages_use_federated_search_and_feedback
46.82 s
gammaloop-nextest-docs> 5: <alphal00p_docs_builder::tests::portal_and_developer_pages_use_federated_search_and_feedback::{closure#0} as core::ops::function::FnOnce<()>>::call_once
46.82 s
gammaloop-nextest-docs> note: Some details are omitted, run with `RUST_BACKTRACE=full` for a verbose backtrace.
46.82 s
gammaloop-nextest-docs>
46.82 s
gammaloop-nextest-docs> 5. alphal00p-docs-builder::tests::portal_task_chooser_routes_each_goal_to_the_registered_quickstart
46.82 s
gammaloop-nextest-docs> failure: test failure with exit code 101
46.82 s
gammaloop-nextest-docs> thread 'tests::portal_task_chooser_routes_each_goal_to_the_registered_quickstart' (443) panicked at crates/alphal00p-docs-builder/src/lib.rs:9684:14:
46.82 s
gammaloop-nextest-docs> called `Result::unwrap()` on an `Err` value: failed to copy documentation asset crates/spynso3/typst/STIXTwoMath-Regular.woff2
46.82 s
gammaloop-nextest-docs>
46.82 s
gammaloop-nextest-docs> Caused by:
46.82 s
gammaloop-nextest-docs> No such file or directory (os error 2)
46.82 s
gammaloop-nextest-docs>
46.82 s
gammaloop-nextest-docs> Location:
46.82 s
gammaloop-nextest-docs> crates/alphal00p-docs-builder/src/lib.rs:2276:18
46.82 s
gammaloop-nextest-docs> stack backtrace:
46.82 s
gammaloop-nextest-docs> 0: __rustc::rust_begin_unwind
46.82 s
gammaloop-nextest-docs> 1: core::panicking::panic_fmt
46.82 s
gammaloop-nextest-docs> 2: core::result::unwrap_failed
46.82 s
gammaloop-nextest-docs> 3: alphal00p_docs_builder::tests::write_test_portal
46.82 s
gammaloop-nextest-docs> 4: alphal00p_docs_builder::tests::portal_task_chooser_routes_each_goal_to_the_registered_quickstart
46.82 s
gammaloop-nextest-docs> 5: <alphal00p_docs_builder::tests::portal_task_chooser_routes_each_goal_to_the_registered_quickstart::{closure#0} as core::ops::function::FnOnce<()>>::call_once
46.82 s
gammaloop-nextest-docs> note: Some details are omitted, run with `RUST_BACKTRACE=full` for a verbose backtrace.
46.82 s
gammaloop-nextest-docs> system-out
46.82 s
gammaloop-nextest-docs> running 1 test
46.82 s
gammaloop-nextest-docs> test tests::portal_task_chooser_routes_each_goal_to_the_registered_quickstart ... FAILED
46.82 s
gammaloop-nextest-docs>
46.82 s
gammaloop-nextest-docs> failures:
46.82 s
gammaloop-nextest-docs>
46.82 s
gammaloop-nextest-docs> failures:
46.82 s
gammaloop-nextest-docs> tests::portal_task_chooser_routes_each_goal_to_the_registered_quickstart
46.82 s
gammaloop-nextest-docs>
46.82 s
gammaloop-nextest-docs> test result: FAILED. 0 passed; 1 failed; 0 ignored; 0 measured; 128 filtered out; finished in 0.00s
46.82 s
gammaloop-nextest-docs> system-err
46.82 s
gammaloop-nextest-docs> thread 'tests::portal_task_chooser_routes_each_goal_to_the_registered_quickstart' (443) panicked at crates/alphal00p-docs-builder/src/lib.rs:9684:14:
46.82 s
gammaloop-nextest-docs> called `Result::unwrap()` on an `Err` value: failed to copy documentation asset crates/spynso3/typst/STIXTwoMath-Regular.woff2
46.82 s
gammaloop-nextest-docs>
46.82 s
gammaloop-nextest-docs> Caused by:
46.82 s
gammaloop-nextest-docs> No such file or directory (os error 2)
46.82 s
gammaloop-nextest-docs>
46.82 s
gammaloop-nextest-docs> Location:
46.82 s
gammaloop-nextest-docs> crates/alphal00p-docs-builder/src/lib.rs:2276:18
46.82 s
gammaloop-nextest-docs> stack backtrace:
46.82 s
gammaloop-nextest-docs> 0: __rustc::rust_begin_unwind
46.82 s
gammaloop-nextest-docs> 1: core::panicking::panic_fmt
46.82 s
gammaloop-nextest-docs> 2: core::result::unwrap_failed
46.82 s
gammaloop-nextest-docs> 3: alphal00p_docs_builder::tests::write_test_portal
46.82 s
gammaloop-nextest-docs> 4: alphal00p_docs_builder::tests::portal_task_chooser_routes_each_goal_to_the_registered_quickstart
46.82 s
gammaloop-nextest-docs> 5: <alphal00p_docs_builder::tests::portal_task_chooser_routes_each_goal_to_the_registered_quickstart::{closure#0} as core::ops::function::FnOnce<()>>::call_once
46.82 s
gammaloop-nextest-docs> note: Some details are omitted, run with `RUST_BACKTRACE=full` for a verbose backtrace.
46.82 s
gammaloop-nextest-docs>
46.82 s
gammaloop-nextest-docs> 6. alphal00p-docs-builder::tests::checked_in_registry_is_valid
46.82 s
gammaloop-nextest-docs> failure: test failure with exit code 101
46.82 s
gammaloop-nextest-docs> thread 'tests::checked_in_registry_is_valid' (214) panicked at crates/alphal00p-docs-builder/src/lib.rs:12260:50:
46.82 s
gammaloop-nextest-docs> called `Result::unwrap()` on an `Err` value: required documentation source is missing: /build/source/crates/spynso3/typst/STIXTwoMath-Regular.woff2
46.82 s
gammaloop-nextest-docs>
46.82 s
gammaloop-nextest-docs> Location:
46.82 s
gammaloop-nextest-docs> crates/alphal00p-docs-builder/src/lib.rs:5103:9
46.82 s
gammaloop-nextest-docs> stack backtrace:
46.82 s
gammaloop-nextest-docs> 0: __rustc::rust_begin_unwind
46.82 s
gammaloop-nextest-docs> 1: core::panicking::panic_fmt
46.82 s
gammaloop-nextest-docs> 2: core::result::unwrap_failed
46.82 s
gammaloop-nextest-docs> 3: alphal00p_docs_builder::tests::checked_in_registry_is_valid
46.82 s
gammaloop-nextest-docs> 4: <alphal00p_docs_builder::tests::checked_in_registry_is_valid::{closure#0} as core::ops::function::FnOnce<()>>::call_once
46.82 s
gammaloop-nextest-docs> note: Some details are omitted, run with `RUST_BACKTRACE=full` for a verbose backtrace.
46.82 s
gammaloop-nextest-docs> system-out
46.82 s
gammaloop-nextest-docs> running 1 test
46.82 s
gammaloop-nextest-docs> test tests::checked_in_registry_is_valid ... FAILED
46.82 s
gammaloop-nextest-docs>
46.82 s
gammaloop-nextest-docs> failures:
46.82 s
gammaloop-nextest-docs>
46.82 s
gammaloop-nextest-docs> failures:
46.82 s
gammaloop-nextest-docs> tests::checked_in_registry_is_valid
46.82 s
gammaloop-nextest-docs>
46.82 s
gammaloop-nextest-docs> test result: FAILED. 0 passed; 1 failed; 0 ignored; 0 measured; 128 filtered out; finished in 0.11s
46.82 s
gammaloop-nextest-docs> system-err
46.82 s
gammaloop-nextest-docs> thread 'tests::checked_in_registry_is_valid' (214) panicked at crates/alphal00p-docs-builder/src/lib.rs:12260:50:
46.82 s
gammaloop-nextest-docs> called `Result::unwrap()` on an `Err` value: required documentation source is missing: /build/source/crates/spynso3/typst/STIXTwoMath-Regular.woff2
46.82 s
gammaloop-nextest-docs>
46.82 s
gammaloop-nextest-docs> Location:
46.82 s
gammaloop-nextest-docs> crates/alphal00p-docs-builder/src/lib.rs:5103:9
46.82 s
gammaloop-nextest-docs> stack backtrace:
46.82 s
gammaloop-nextest-docs> 0: __rustc::rust_begin_unwind
46.82 s
gammaloop-nextest-docs> 1: core::panicking::panic_fmt
46.82 s
gammaloop-nextest-docs> 2: core::result::unwrap_failed
46.82 s
gammaloop-nextest-docs> 3: alphal00p_docs_builder::tests::checked_in_registry_is_valid
46.82 s
gammaloop-nextest-docs> 4: <alphal00p_docs_builder::tests::checked_in_registry_is_valid::{closure#0} as core::ops::function::FnOnce<()>>::call_once
46.82 s
gammaloop-nextest-docs> note: Some details are omitted, run with `RUST_BACKTRACE=full` for a verbose backtrace.
46.82 s
gammaloop-nextest-docs>
46.82 s
gammaloop-nextest-docs> 7. alphal00p-docs-builder::tests::site_assets_replace_read_only_generated_files
46.82 s
gammaloop-nextest-docs> failure: test failure with exit code 101
46.82 s
gammaloop-nextest-docs> thread 'tests::site_assets_replace_read_only_generated_files' (669) panicked at crates/alphal00p-docs-builder/src/lib.rs:12305:50:
46.82 s
gammaloop-nextest-docs> called `Result::unwrap()` on an `Err` value: failed to copy documentation asset crates/spynso3/typst/STIXTwoMath-Regular.woff2
46.82 s
gammaloop-nextest-docs>
46.82 s
gammaloop-nextest-docs> Caused by:
46.82 s
gammaloop-nextest-docs> No such file or directory (os error 2)
46.82 s
gammaloop-nextest-docs>
46.82 s
gammaloop-nextest-docs> Location:
46.82 s
gammaloop-nextest-docs> crates/alphal00p-docs-builder/src/lib.rs:2276:18
46.82 s
gammaloop-nextest-docs> stack backtrace:
46.82 s
gammaloop-nextest-docs> 0: __rustc::rust_begin_unwind
46.82 s
gammaloop-nextest-docs> 1: core::panicking::panic_fmt
46.82 s
gammaloop-nextest-docs> 2: core::result::unwrap_failed
46.82 s
gammaloop-nextest-docs> 3: alphal00p_docs_builder::tests::site_assets_replace_read_only_generated_files
46.82 s
gammaloop-nextest-docs> 4: <alphal00p_docs_builder::tests::site_assets_replace_read_only_generated_files::{closure#0} as core::ops::function::FnOnce<()>>::call_once
46.82 s
gammaloop-nextest-docs> note: Some details are omitted, run with `RUST_BACKTRACE=full` for a verbose backtrace.
46.82 s
gammaloop-nextest-docs> system-out
46.82 s
gammaloop-nextest-docs> running 1 test
46.82 s
gammaloop-nextest-docs> test tests::site_assets_replace_read_only_generated_files ... FAILED
46.82 s
gammaloop-nextest-docs>
46.82 s
gammaloop-nextest-docs> failures:
46.82 s
gammaloop-nextest-docs>
46.82 s
gammaloop-nextest-docs> failures:
46.82 s
gammaloop-nextest-docs> tests::site_assets_replace_read_only_generated_files
46.82 s
gammaloop-nextest-docs>
46.82 s
gammaloop-nextest-docs> test result: FAILED. 0 passed; 1 failed; 0 ignored; 0 measured; 128 filtered out; finished in 0.00s
46.82 s
gammaloop-nextest-docs> system-err
46.82 s
gammaloop-nextest-docs> thread 'tests::site_assets_replace_read_only_generated_files' (669) panicked at crates/alphal00p-docs-builder/src/lib.rs:12305:50:
46.82 s
gammaloop-nextest-docs> called `Result::unwrap()` on an `Err` value: failed to copy documentation asset crates/spynso3/typst/STIXTwoMath-Regular.woff2
46.82 s
gammaloop-nextest-docs>
46.82 s
gammaloop-nextest-docs> Caused by:
46.82 s
gammaloop-nextest-docs> No such file or directory (os error 2)
46.82 s
gammaloop-nextest-docs>
46.82 s
gammaloop-nextest-docs> Location:
46.82 s
gammaloop-nextest-docs> crates/alphal00p-docs-builder/src/lib.rs:2276:18
46.82 s
gammaloop-nextest-docs> stack backtrace:
46.82 s
gammaloop-nextest-docs> 0: __rustc::rust_begin_unwind
46.82 s
gammaloop-nextest-docs> 1: core::panicking::panic_fmt
46.82 s
gammaloop-nextest-docs> 2: core::result::unwrap_failed
46.82 s
gammaloop-nextest-docs> 3: alphal00p_docs_builder::tests::site_assets_replace_read_only_generated_files
46.82 s
gammaloop-nextest-docs> 4: <alphal00p_docs_builder::tests::site_assets_replace_read_only_generated_files::{closure#0} as core::ops::function::FnOnce<()>>::call_once
46.82 s
gammaloop-nextest-docs> note: Some details are omitted, run with `RUST_BACKTRACE=full` for a verbose backtrace.
46.82 s
gammaloop-nextest-docs>
46.82 s
gammaloop-nextest-docs> 8. alphal00p-docs-builder::tests::developer_scope_ranges_ignore_unrelated_edits_and_warn_only_while_watching
46.82 s
gammaloop-nextest-docs> failure: test failure with exit code 101
46.82 s
gammaloop-nextest-docs> thread 'tests::developer_scope_ranges_ignore_unrelated_edits_and_warn_only_while_watching' (278) panicked at crates/alphal00p-docs-builder/src/lib.rs:12350:29:
46.82 s
gammaloop-nextest-docs> called `Result::unwrap()` on an `Err` value: required documentation source is missing: /build/source/crates/spynso3/typst/STIXTwoMath-Regular.woff2
46.82 s
gammaloop-nextest-docs>
46.82 s
gammaloop-nextest-docs> Location:
46.82 s
gammaloop-nextest-docs> crates/alphal00p-docs-builder/src/lib.rs:5103:9
46.82 s
gammaloop-nextest-docs> stack backtrace:
46.82 s
gammaloop-nextest-docs> 0: __rustc::rust_begin_unwind
46.82 s
gammaloop-nextest-docs> 1: core::panicking::panic_fmt
46.82 s
gammaloop-nextest-docs> 2: core::result::unwrap_failed
46.82 s
gammaloop-nextest-docs> 3: alphal00p_docs_builder::tests::developer_scope_ranges_ignore_unrelated_edits_and_warn_only_while_watching
46.82 s
gammaloop-nextest-docs> 4: <alphal00p_docs_builder::tests::developer_scope_ranges_ignore_unrelated_edits_and_warn_only_while_watching::{closure#0} as core::ops::function::FnOnce<()>>::call_once
46.82 s
gammaloop-nextest-docs> note: Some details are omitted, run with `RUST_BACKTRACE=full` for a verbose backtrace.
46.82 s
gammaloop-nextest-docs> system-out
46.82 s
gammaloop-nextest-docs> running 1 test
46.82 s
gammaloop-nextest-docs> test tests::developer_scope_ranges_ignore_unrelated_edits_and_warn_only_while_watching ... FAILED
46.82 s
gammaloop-nextest-docs>
46.82 s
gammaloop-nextest-docs> failures:
46.82 s
gammaloop-nextest-docs>
46.82 s
gammaloop-nextest-docs> failures:
46.82 s
gammaloop-nextest-docs> tests::developer_scope_ranges_ignore_unrelated_edits_and_warn_only_while_watching
46.82 s
gammaloop-nextest-docs>
46.82 s
gammaloop-nextest-docs> test result: FAILED. 0 passed; 1 failed; 0 ignored; 0 measured; 128 filtered out; finished in 0.11s
46.82 s
gammaloop-nextest-docs> system-err
46.82 s
gammaloop-nextest-docs> thread 'tests::developer_scope_ranges_ignore_unrelated_edits_and_warn_only_while_watching' (278) panicked at crates/alphal00p-docs-builder/src/lib.rs:12350:29:
46.82 s
gammaloop-nextest-docs> called `Result::unwrap()` on an `Err` value: required documentation source is missing: /build/source/crates/spynso3/typst/STIXTwoMath-Regular.woff2
46.82 s
gammaloop-nextest-docs>
46.82 s
gammaloop-nextest-docs> Location:
46.82 s
gammaloop-nextest-docs> crates/alphal00p-docs-builder/src/lib.rs:5103:9
46.82 s
gammaloop-nextest-docs> stack backtrace:
46.82 s
gammaloop-nextest-docs> 0: __rustc::rust_begin_unwind
46.82 s
gammaloop-nextest-docs> 1: core::panicking::panic_fmt
46.82 s
gammaloop-nextest-docs> 2: core::result::unwrap_failed
46.82 s
gammaloop-nextest-docs> 3: alphal00p_docs_builder::tests::developer_scope_ranges_ignore_unrelated_edits_and_warn_only_while_watching
46.82 s
gammaloop-nextest-docs> 4: <alphal00p_docs_builder::tests::developer_scope_ranges_ignore_unrelated_edits_and_warn_only_while_watching::{closure#0} as core::ops::function::FnOnce<()>>::call_once
46.82 s
gammaloop-nextest-docs> note: Some details are omitted, run with `RUST_BACKTRACE=full` for a verbose backtrace.
46.82 s
gammaloop-nextest-docs>
46.82 s
gammaloop-nextest-docs> 9. alphal00p-docs-builder::provenance_tests::each_build_captures_one_revision_before_rendering
46.82 s
gammaloop-nextest-docs> failure: test failure with exit code 101
46.82 s
gammaloop-nextest-docs> thread 'provenance_tests::each_build_captures_one_revision_before_rendering' (218) panicked at crates/alphal00p-docs-builder/src/provenance_tests.rs:274:9:
46.82 s
gammaloop-nextest-docs> assertion failed: command.status().unwrap().success()
46.82 s
gammaloop-nextest-docs> stack backtrace:
46.82 s
gammaloop-nextest-docs> 0: __rustc::rust_begin_unwind
46.82 s
gammaloop-nextest-docs> 1: core::panicking::panic_fmt
46.82 s
gammaloop-nextest-docs> 2: core::panicking::panic
46.82 s
gammaloop-nextest-docs> 3: alphal00p_docs_builder::provenance_tests::each_build_captures_one_revision_before_rendering
46.82 s
gammaloop-nextest-docs> 4: <alphal00p_docs_builder::provenance_tests::each_build_captures_one_revision_before_rendering::{closure#0} as core::ops::function::FnOnce<()>>::call_once
46.82 s
gammaloop-nextest-docs> note: Some details are omitted, run with `RUST_BACKTRACE=full` for a verbose backtrace.
46.82 s
gammaloop-nextest-docs> system-out
46.82 s
gammaloop-nextest-docs> running 1 test
46.82 s
gammaloop-nextest-docs>
46.82 s
gammaloop-nextest-docs> running 1 test
46.82 s
gammaloop-nextest-docs> test provenance_tests::each_build_captures_one_revision_before_rendering ... FAILED
46.82 s
gammaloop-nextest-docs>
46.82 s
gammaloop-nextest-docs> failures:
46.82 s
gammaloop-nextest-docs>
46.82 s
gammaloop-nextest-docs> failures:
46.82 s
gammaloop-nextest-docs> provenance_tests::each_build_captures_one_revision_before_rendering
46.82 s
gammaloop-nextest-docs>
46.82 s
gammaloop-nextest-docs> test result: FAILED. 0 passed; 1 failed; 0 ignored; 0 measured; 128 filtered out; finished in 0.11s
46.82 s
gammaloop-nextest-docs>
46.82 s
gammaloop-nextest-docs> test provenance_tests::each_build_captures_one_revision_before_rendering ... FAILED
46.82 s
gammaloop-nextest-docs>
46.82 s
gammaloop-nextest-docs> failures:
46.82 s
gammaloop-nextest-docs>
46.82 s
gammaloop-nextest-docs> failures:
46.82 s
gammaloop-nextest-docs> provenance_tests::each_build_captures_one_revision_before_rendering
46.82 s
gammaloop-nextest-docs>
46.82 s
gammaloop-nextest-docs> test result: FAILED. 0 passed; 1 failed; 0 ignored; 0 measured; 128 filtered out; finished in 0.13s
46.82 s
gammaloop-nextest-docs> system-err
46.82 s
gammaloop-nextest-docs> thread 'provenance_tests::each_build_captures_one_revision_before_rendering' (284) panicked at crates/alphal00p-docs-builder/src/provenance_tests.rs:297:14:
46.82 s
gammaloop-nextest-docs> called `Result::unwrap()` on an `Err` value: required documentation source is missing: /build/source/target/nix-ci-tmp/.tmpAH3uti/checkout/crates/spynso3/typst/STIXTwoMath-Regular.woff2
46.82 s
gammaloop-nextest-docs>
46.82 s
gammaloop-nextest-docs> Location:
46.82 s
gammaloop-nextest-docs> crates/alphal00p-docs-builder/src/lib.rs:5103:9
46.82 s
gammaloop-nextest-docs> stack backtrace:
46.82 s
gammaloop-nextest-docs> 0: __rustc::rust_begin_unwind
46.82 s
gammaloop-nextest-docs> 1: core::panicking::panic_fmt
46.82 s
gammaloop-nextest-docs> 2: core::result::unwrap_failed
46.82 s
gammaloop-nextest-docs> 3: alphal00p_docs_builder::provenance_tests::each_build_captures_one_revision_before_rendering
46.82 s
gammaloop-nextest-docs> 4: <alphal00p_docs_builder::provenance_tests::each_build_captures_one_revision_before_rendering::{closure#0} as core::ops::function::FnOnce<()>>::call_once
46.82 s
gammaloop-nextest-docs> note: Some details are omitted, run with `RUST_BACKTRACE=full` for a verbose backtrace.
46.82 s
gammaloop-nextest-docs>
46.82 s
gammaloop-nextest-docs> thread 'provenance_tests::each_build_captures_one_revision_before_rendering' (218) panicked at crates/alphal00p-docs-builder/src/provenance_tests.rs:274:9:
46.82 s
gammaloop-nextest-docs> assertion failed: command.status().unwrap().success()
46.82 s
gammaloop-nextest-docs> stack backtrace:
46.82 s
gammaloop-nextest-docs> 0: __rustc::rust_begin_unwind
46.82 s
gammaloop-nextest-docs> 1: core::panicking::panic_fmt
46.82 s
gammaloop-nextest-docs> 2: core::panicking::panic
46.82 s
gammaloop-nextest-docs> 3: alphal00p_docs_builder::provenance_tests::each_build_captures_one_revision_before_rendering
46.82 s
gammaloop-nextest-docs> 4: <alphal00p_docs_builder::provenance_tests::each_build_captures_one_revision_before_rendering::{closure#0} as core::ops::function::FnOnce<()>>::call_once
46.82 s
gammaloop-nextest-docs> note: Some details are omitted, run with `RUST_BACKTRACE=full` for a verbose backtrace.
46.82 s
gammaloop-nextest-docs>
46.82 s
gammaloop-nextest-docs> 10. alphal00p-docs-builder::tests::every_product_requires_a_task_chooser_and_each_supported_interface
46.82 s
gammaloop-nextest-docs> failure: test failure with exit code 101
46.82 s
gammaloop-nextest-docs> thread 'tests::every_product_requires_a_task_chooser_and_each_supported_interface' (312) panicked at crates/alphal00p-docs-builder/src/lib.rs:12274:9:
46.82 s
gammaloop-nextest-docs> assertion failed: format!("{error:#}").contains("has no quickstart page")
46.82 s
gammaloop-nextest-docs> stack backtrace:
46.82 s
gammaloop-nextest-docs> 0: __rustc::rust_begin_unwind
46.82 s
gammaloop-nextest-docs> 1: core::panicking::panic_fmt
46.82 s
gammaloop-nextest-docs> 2: core::panicking::panic
46.82 s
gammaloop-nextest-docs> 3: alphal00p_docs_builder::tests::every_product_requires_a_task_chooser_and_each_supported_interface
46.82 s
gammaloop-nextest-docs> 4: <alphal00p_docs_builder::tests::every_product_requires_a_task_chooser_and_each_supported_interface::{closure#0} as core::ops::function::FnOnce<()>>::call_once
46.82 s
gammaloop-nextest-docs> note: Some details are omitted, run with `RUST_BACKTRACE=full` for a verbose backtrace.
46.82 s
gammaloop-nextest-docs> system-out
46.82 s
gammaloop-nextest-docs> running 1 test
46.82 s
gammaloop-nextest-docs> test tests::every_product_requires_a_task_chooser_and_each_supported_interface ... FAILED
46.82 s
gammaloop-nextest-docs>
46.82 s
gammaloop-nextest-docs> failures:
46.82 s
gammaloop-nextest-docs>
46.82 s
gammaloop-nextest-docs> failures:
46.82 s
gammaloop-nextest-docs> tests::every_product_requires_a_task_chooser_and_each_supported_interface
46.82 s
gammaloop-nextest-docs>
46.82 s
gammaloop-nextest-docs> test result: FAILED. 0 passed; 1 failed; 0 ignored; 0 measured; 128 filtered out; finished in 0.12s
46.82 s
gammaloop-nextest-docs> system-err
46.82 s
gammaloop-nextest-docs> thread 'tests::every_product_requires_a_task_chooser_and_each_supported_interface' (312) panicked at crates/alphal00p-docs-builder/src/lib.rs:12274:9:
46.82 s
gammaloop-nextest-docs> assertion failed: format!("{error:#}").contains("has no quickstart page")
46.82 s
gammaloop-nextest-docs> stack backtrace:
46.82 s
gammaloop-nextest-docs> 0: __rustc::rust_begin_unwind
46.82 s
gammaloop-nextest-docs> 1: core::panicking::panic_fmt
46.82 s
gammaloop-nextest-docs> 2: core::panicking::panic
46.82 s
gammaloop-nextest-docs> 3: alphal00p_docs_builder::tests::every_product_requires_a_task_chooser_and_each_supported_interface
46.82 s
gammaloop-nextest-docs> 4: <alphal00p_docs_builder::tests::every_product_requires_a_task_chooser_and_each_supported_interface::{closure#0} as core::ops::function::FnOnce<()>>::call_once
46.82 s
gammaloop-nextest-docs> note: Some details are omitted, run with `RUST_BACKTRACE=full` for a verbose backtrace.
46.82 s
gammaloop-nextest-docs>
46.82 s
gammaloop-nextest-docs> 11. alphal00p-docs-builder::tests::pdf_manual_chapter_order_must_match_the_page_registry
46.82 s
gammaloop-nextest-docs> failure: test failure with exit code 101
46.82 s
gammaloop-nextest-docs> thread 'tests::pdf_manual_chapter_order_must_match_the_page_registry' (397) panicked at crates/alphal00p-docs-builder/src/lib.rs:12330:9:
46.82 s
gammaloop-nextest-docs> assertion failed: format!("{error:#}").contains("PDF manual chapter order differs")
46.82 s
gammaloop-nextest-docs> stack backtrace:
46.82 s
gammaloop-nextest-docs> 0: __rustc::rust_begin_unwind
46.82 s
gammaloop-nextest-docs> 1: core::panicking::panic_fmt
46.82 s
gammaloop-nextest-docs> 2: core::panicking::panic
46.82 s
gammaloop-nextest-docs> 3: alphal00p_docs_builder::tests::pdf_manual_chapter_order_must_match_the_page_registry
46.82 s
gammaloop-nextest-docs> 4: <alphal00p_docs_builder::tests::pdf_manual_chapter_order_must_match_the_page_registry::{closure#0} as core::ops::function::FnOnce<()>>::call_once
46.82 s
gammaloop-nextest-docs> note: Some details are omitted, run with `RUST_BACKTRACE=full` for a verbose backtrace.
46.82 s
gammaloop-nextest-docs> system-out
46.82 s
gammaloop-nextest-docs> running 1 test
46.82 s
gammaloop-nextest-docs> test tests::pdf_manual_chapter_order_must_match_the_page_registry ... FAILED
46.82 s
gammaloop-nextest-docs>
46.82 s
gammaloop-nextest-docs> failures:
46.82 s
gammaloop-nextest-docs>
46.82 s
gammaloop-nextest-docs> failures:
46.82 s
gammaloop-nextest-docs> tests::pdf_manual_chapter_order_must_match_the_page_registry
46.82 s
gammaloop-nextest-docs>
46.82 s
gammaloop-nextest-docs> test result: FAILED. 0 passed; 1 failed; 0 ignored; 0 measured; 128 filtered out; finished in 0.11s
46.82 s
gammaloop-nextest-docs> system-err
46.82 s
gammaloop-nextest-docs> thread 'tests::pdf_manual_chapter_order_must_match_the_page_registry' (397) panicked at crates/alphal00p-docs-builder/src/lib.rs:12330:9:
46.82 s
gammaloop-nextest-docs> assertion failed: format!("{error:#}").contains("PDF manual chapter order differs")
46.82 s
gammaloop-nextest-docs> stack backtrace:
46.82 s
gammaloop-nextest-docs> 0: __rustc::rust_begin_unwind
46.82 s
gammaloop-nextest-docs> 1: core::panicking::panic_fmt
46.82 s
gammaloop-nextest-docs> 2: core::panicking::panic
46.82 s
gammaloop-nextest-docs> 3: alphal00p_docs_builder::tests::pdf_manual_chapter_order_must_match_the_page_registry
46.82 s
gammaloop-nextest-docs> 4: <alphal00p_docs_builder::tests::pdf_manual_chapter_order_must_match_the_page_registry::{closure#0} as core::ops::function::FnOnce<()>>::call_once
46.82 s
gammaloop-nextest-docs> note: Some details are omitted, run with `RUST_BACKTRACE=full` for a verbose backtrace.
46.82 s
gammaloop-nextest-docs> =========================================
46.83 s
gammaloop-nextest-docs> Extracting 2 binaries to /build/source
46.87 s
gammaloop-nextest-docs> Extracted 5 files to /build/source in 0.04s
46.88 s
gammaloop-nextest-docs> ------------
46.88 s
gammaloop-nextest-docs> Nextest run ID cc6692dc-2123-4448-be1f-d87456592287 with nextest profile: ci_gammaloop
46.88 s
gammaloop-nextest-docs> Starting 22 tests across 2 binaries
46.90 s
gammaloop-nextest-docs> ------------
46.90 s
gammaloop-nextest-docs> Summary [ 0.018s] 22 tests run: 22 passed , 0 skipped
46.93 s
gammaloop-nextest-docs>
46.93 s
gammaloop-nextest-docs> ========== nextest test summary ==========
46.93 s
gammaloop-nextest-docs> report: target/nextest/ci_gammaloop/junit.xml
46.93 s
gammaloop-nextest-docs> tests: 22, failures: 0, errors: 0
46.93 s
gammaloop-nextest-docs> No failing testcases found.
46.93 s
gammaloop-nextest-docs> =========================================
46.94 s
gammaloop-nextest-docs> Extracting 3 binaries (including 2 non-test binaries), 1 build script output directory, and 2 linked paths to /build/source
47.21 s
gammaloop-nextest-docs> Extracted 22 files to /build/source in 0.27s
47.22 s
gammaloop-nextest-docs> ------------
47.22 s
gammaloop-nextest-docs> Nextest run ID 0876bde2-8b11-4b7a-b730-1866a64edca0 with nextest profile: ci_gammaloop
47.22 s
gammaloop-nextest-docs> Starting 89 tests across 1 binary
47.26 s
gammaloop-nextest-docs> ------------
47.26 s
gammaloop-nextest-docs> Summary [ 0.038s] 89 tests run: 89 passed , 0 skipped
47.29 s
gammaloop-nextest-docs>
47.29 s
gammaloop-nextest-docs> ========== nextest test summary ==========
47.29 s
gammaloop-nextest-docs> report: target/nextest/ci_gammaloop/junit.xml
47.29 s
gammaloop-nextest-docs> tests: 89, failures: 0, errors: 0
47.29 s
gammaloop-nextest-docs> No failing testcases found.
47.29 s
gammaloop-nextest-docs> =========================================
47.30 s
gammaloop-nextest-docs> Extracting 2 binaries to /build/source
47.34 s
gammaloop-nextest-docs> Extracted 5 files to /build/source in 0.04s
47.35 s
gammaloop-nextest-docs> ------------
47.35 s
gammaloop-nextest-docs> Nextest run ID 620f1710-85a5-4d7d-af32-5d3fb6680747 with nextest profile: ci_gammaloop
47.35 s
gammaloop-nextest-docs> Starting 10 tests across 2 binaries
59.58 s
gammaloop-nextest-docs> ------------
59.58 s
gammaloop-nextest-docs> Summary [ 12.227s] 10 tests run: 10 passed , 0 skipped
59.61 s
gammaloop-nextest-docs>
59.61 s
gammaloop-nextest-docs> ========== nextest test summary ==========
59.61 s
gammaloop-nextest-docs> report: target/nextest/ci_gammaloop/junit.xml
59.61 s
gammaloop-nextest-docs> tests: 10, failures: 0, errors: 0
59.61 s
gammaloop-nextest-docs> No failing testcases found.
59.61 s
gammaloop-nextest-docs> =========================================
59.63 s
gammaloop-nextest-docs> Extracting 1 binary to /build/source
59.66 s
gammaloop-nextest-docs> Extracted 4 files to /build/source in 0.04s
59.67 s
gammaloop-nextest-docs> ------------
59.67 s
gammaloop-nextest-docs> Nextest run ID 554cdea1-98e0-4eb0-abed-7931a71a921a with nextest profile: ci_gammaloop
59.67 s
gammaloop-nextest-docs> Starting 0 tests across 1 binary
59.67 s
gammaloop-nextest-docs> ------------
59.67 s
gammaloop-nextest-docs> Summary [ 0.000s] 0 tests run: 0 passed , 0 skipped
59.70 s
gammaloop-nextest-docs>
59.70 s
gammaloop-nextest-docs> ========== nextest test summary ==========
59.70 s
gammaloop-nextest-docs> report: target/nextest/ci_gammaloop/junit.xml
59.70 s
gammaloop-nextest-docs> tests: 0, failures: 0, errors: 0
59.70 s
gammaloop-nextest-docs> No failing testcases found.
59.70 s
gammaloop-nextest-docs> =========================================
59.71 s
gammaloop-nextest-docs> Extracting 1 binary to /build/source
59.75 s
gammaloop-nextest-docs> Extracted 4 files to /build/source in 0.04s
59.76 s
gammaloop-nextest-docs> ------------
59.76 s
gammaloop-nextest-docs> Nextest run ID 0e523ab5-b874-44f9-9ff4-56a920af0668 with nextest profile: ci_gammaloop
59.76 s
gammaloop-nextest-docs> Starting 5 tests across 1 binary
59.76 s
gammaloop-nextest-docs> ------------
59.76 s
gammaloop-nextest-docs> Summary [ 0.006s] 5 tests run: 5 passed , 0 skipped
59.79 s
gammaloop-nextest-docs>
59.79 s
gammaloop-nextest-docs> ========== nextest test summary ==========
59.79 s
gammaloop-nextest-docs> report: target/nextest/ci_gammaloop/junit.xml
59.79 s
gammaloop-nextest-docs> tests: 5, failures: 0, errors: 0
59.79 s
gammaloop-nextest-docs> No failing testcases found.
59.79 s
gammaloop-nextest-docs> =========================================
59.99 s
error: Cannot build '/nix/store/yhcpczfzd32fj8slcs1lsa10nlfs6yzl-gammaloop-nextest-docs.drv '.
59.99 s
Reason: builder failed with exit code 100 .
59.99 s
Output paths:
59.99 s
/nix/store/j1nkfs263f0lyg41i99f3f56r6b8p9mh-gammaloop-nextest-docs
59.99 s
Last 1232 log lines:
59.99 s
> Extracting 2 binaries to /build/source
59.99 s
> Extracted 5 files to /build/source in 0.04s
59.99 s
> ------------
59.99 s
> Nextest run ID 66408cd5-4292-4ece-98d1-c63d8bc8a919 with nextest profile: ci_gammaloop
59.99 s
> Starting 129 tests across 2 binaries
59.99 s
> FAIL [ 0.012s] ( 22/129) alphal00p-docs-builder tests :: developer_architecture_is_classified_searchable_and_source_backed
59.99 s
> stdout ---
59.99 s
>
59.99 s
> running 1 test
59.99 s
> test tests::developer_architecture_is_classified_searchable_and_source_backed ... FAILED
59.99 s
>
59.99 s
> failures:
59.99 s
>
59.99 s
> failures:
59.99 s
> tests::developer_architecture_is_classified_searchable_and_source_backed
59.99 s
>
59.99 s
> test result: FAILED. 0 passed; 1 failed; 0 ignored; 0 measured; 128 filtered out; finished in 0.01s
59.99 s
>
59.99 s
> stderr ---
59.99 s
>
59.99 s
> thread 'tests::developer_architecture_is_classified_searchable_and_source_backed' (273) panicked at crates/alphal00p-docs-builder/src/lib.rs:12751:14:
59.99 s
> called `Result::unwrap()` on an `Err` value: failed to copy documentation asset crates/spynso3/typst/STIXTwoMath-Regular.woff2
59.99 s
>
59.99 s
> Caused by:
59.99 s
> No such file or directory (os error 2)
59.99 s
>
59.99 s
> Location:
59.99 s
> crates/alphal00p-docs-builder/src/lib.rs:2276:18
59.99 s
> stack backtrace:
59.99 s
> 0: __rustc::rust_begin_unwind
59.99 s
> 1: core::panicking::panic_fmt
59.99 s
> 2: core::result::unwrap_failed
59.99 s
> 3: alphal00p_docs_builder::tests::developer_architecture_is_classified_searchable_and_source_backed
59.99 s
> 4: <alphal00p_docs_builder::tests::developer_architecture_is_classified_searchable_and_source_backed::{closure#0} as core::ops::function::FnOnce<()>>::call_once
59.99 s
> note: Some details are omitted, run with `RUST_BACKTRACE=full` for a verbose backtrace.
59.99 s
>
59.99 s
> FAIL [ 0.011s] ( 29/129) alphal00p-docs-builder tests :: every_product_orients_rust_to_native_rustdoc_and_keeps_legacy_redirects
59.99 s
> stdout ---
59.99 s
>
59.99 s
> running 1 test
59.99 s
> test tests::every_product_orients_rust_to_native_rustdoc_and_keeps_legacy_redirects ... FAILED
59.99 s
>
59.99 s
> failures:
59.99 s
>
59.99 s
> failures:
59.99 s
> tests::every_product_orients_rust_to_native_rustdoc_and_keeps_legacy_redirects
59.99 s
>
59.99 s
> test result: FAILED. 0 passed; 1 failed; 0 ignored; 0 measured; 128 filtered out; finished in 0.01s
59.99 s
>
59.99 s
> stderr ---
59.99 s
>
59.99 s
> thread 'tests::every_product_orients_rust_to_native_rustdoc_and_keeps_legacy_redirects' (301) panicked at crates/alphal00p-docs-builder/src/lib.rs:12555:46:
59.99 s
> called `Result::unwrap()` on an `Err` value: failed to copy documentation asset crates/spynso3/typst/STIXTwoMath-Regular.woff2
59.99 s
>
59.99 s
> Caused by:
59.99 s
> No such file or directory (os error 2)
59.99 s
>
59.99 s
> Location:
59.99 s
> crates/alphal00p-docs-builder/src/lib.rs:2276:18
59.99 s
> stack backtrace:
59.99 s
> 0: __rustc::rust_begin_unwind
59.99 s
> 1: core::panicking::panic_fmt
59.99 s
> 2: core::result::unwrap_failed
59.99 s
> 3: alphal00p_docs_builder::tests::every_product_orients_rust_to_native_rustdoc_and_keeps_legacy_redirects
59.99 s
> 4: <alphal00p_docs_builder::tests::every_product_orients_rust_to_native_rustdoc_and_keeps_legacy_redirects::{closure#0} as core::ops::function::FnOnce<()>>::call_once
59.99 s
> note: Some details are omitted, run with `RUST_BACKTRACE=full` for a verbose backtrace.
59.99 s
>
59.99 s
> FAIL [ 0.010s] ( 53/129) alphal00p-docs-builder tests :: portal_emits_routes_and_valid_assets
59.99 s
> stdout ---
59.99 s
>
59.99 s
> running 1 test
59.99 s
> test tests::portal_emits_routes_and_valid_assets ... FAILED
59.99 s
>
59.99 s
> failures:
59.99 s
>
59.99 s
> failures:
59.99 s
> tests::portal_emits_routes_and_valid_assets
59.99 s
>
59.99 s
> test result: FAILED. 0 passed; 1 failed; 0 ignored; 0 measured; 128 filtered out; finished in 0.00s
59.99 s
>
59.99 s
> stderr ---
59.99 s
>
59.99 s
> thread 'tests::portal_emits_routes_and_valid_assets' (429) panicked at crates/alphal00p-docs-builder/src/lib.rs:9684:14:
59.99 s
> called `Result::unwrap()` on an `Err` value: failed to copy documentation asset crates/spynso3/typst/STIXTwoMath-Regular.woff2
59.99 s
>
59.99 s
> Caused by:
59.99 s
> No such file or directory (os error 2)
59.99 s
>
59.99 s
> Location:
59.99 s
> crates/alphal00p-docs-builder/src/lib.rs:2276:18
59.99 s
> stack backtrace:
59.99 s
> 0: __rustc::rust_begin_unwind
59.99 s
> 1: core::panicking::panic_fmt
59.99 s
> 2: core::result::unwrap_failed
59.99 s
> 3: alphal00p_docs_builder::tests::write_test_portal
59.99 s
> 4: alphal00p_docs_builder::tests::portal_emits_routes_and_valid_assets
59.99 s
> 5: <alphal00p_docs_builder::tests::portal_emits_routes_and_valid_assets::{closure#0} as core::ops::function::FnOnce<()>>::call_once
59.99 s
> note: Some details are omitted, run with `RUST_BACKTRACE=full` for a verbose backtrace.
59.99 s
>
59.99 s
> FAIL [ 0.011s] ( 54/129) alphal00p-docs-builder tests :: portal_and_developer_pages_use_federated_search_and_feedback
59.99 s
> stdout ---
59.99 s
>
59.99 s
> running 1 test
59.99 s
> test tests::portal_and_developer_pages_use_federated_search_and_feedback ... FAILED
59.99 s
>
59.99 s
> failures:
59.99 s
>
59.99 s
> failures:
59.99 s
> tests::portal_and_developer_pages_use_federated_search_and_feedback
59.99 s
>
59.99 s
> test result: FAILED. 0 passed; 1 failed; 0 ignored; 0 measured; 128 filtered out; finished in 0.01s
59.99 s
>
59.99 s
> stderr ---
59.99 s
>
59.99 s
> thread 'tests::portal_and_developer_pages_use_federated_search_and_feedback' (430) panicked at crates/alphal00p-docs-builder/src/lib.rs:9684:14:
59.99 s
> called `Result::unwrap()` on an `Err` value: failed to copy documentation asset crates/spynso3/typst/STIXTwoMath-Regular.woff2
59.99 s
>
59.99 s
> Caused by:
59.99 s
> No such file or directory (os error 2)
59.99 s
>
59.99 s
> Location:
59.99 s
> crates/alphal00p-docs-builder/src/lib.rs:2276:18
59.99 s
> stack backtrace:
59.99 s
> 0: __rustc::rust_begin_unwind
59.99 s
> 1: core::panicking::panic_fmt
59.99 s
> 2: core::result::unwrap_failed
59.99 s
> 3: alphal00p_docs_builder::tests::write_test_portal
59.99 s
> 4: alphal00p_docs_builder::tests::portal_and_developer_pages_use_federated_search_and_feedback
59.99 s
> 5: <alphal00p_docs_builder::tests::portal_and_developer_pages_use_federated_search_and_feedback::{closure#0} as core::ops::function::FnOnce<()>>::call_once
59.99 s
> note: Some details are omitted, run with `RUST_BACKTRACE=full` for a verbose backtrace.
59.99 s
>
59.99 s
> FAIL [ 0.009s] ( 55/129) alphal00p-docs-builder tests :: portal_task_chooser_routes_each_goal_to_the_registered_quickstart
59.99 s
> stdout ---
59.99 s
>
59.99 s
> running 1 test
59.99 s
> test tests::portal_task_chooser_routes_each_goal_to_the_registered_quickstart ... FAILED
59.99 s
>
59.99 s
> failures:
59.99 s
>
59.99 s
> failures:
59.99 s
> tests::portal_task_chooser_routes_each_goal_to_the_registered_quickstart
59.99 s
>
59.99 s
> test result: FAILED. 0 passed; 1 failed; 0 ignored; 0 measured; 128 filtered out; finished in 0.00s
59.99 s
>
59.99 s
> stderr ---
59.99 s
>
59.99 s
> thread 'tests::portal_task_chooser_routes_each_goal_to_the_registered_quickstart' (443) panicked at crates/alphal00p-docs-builder/src/lib.rs:9684:14:
59.99 s
> called `Result::unwrap()` on an `Err` value: failed to copy documentation asset crates/spynso3/typst/STIXTwoMath-Regular.woff2
59.99 s
>
59.99 s
> Caused by:
59.99 s
> No such file or directory (os error 2)
59.99 s
>
59.99 s
> Location:
59.99 s
> crates/alphal00p-docs-builder/src/lib.rs:2276:18
59.99 s
> stack backtrace:
59.99 s
> 0: __rustc::rust_begin_unwind
59.99 s
> 1: core::panicking::panic_fmt
59.99 s
> 2: core::result::unwrap_failed
59.99 s
> 3: alphal00p_docs_builder::tests::write_test_portal
59.99 s
> 4: alphal00p_docs_builder::tests::portal_task_chooser_routes_each_goal_to_the_registered_quickstart
59.99 s
> 5: <alphal00p_docs_builder::tests::portal_task_chooser_routes_each_goal_to_the_registered_quickstart::{closure#0} as core::ops::function::FnOnce<()>>::call_once
59.99 s
> note: Some details are omitted, run with `RUST_BACKTRACE=full` for a verbose backtrace.
59.99 s
>
59.99 s
> FAIL [ 0.123s] ( 83/129) alphal00p-docs-builder tests :: checked_in_registry_is_valid
59.99 s
> stdout ---
59.99 s
>
59.99 s
> running 1 test
59.99 s
> test tests::checked_in_registry_is_valid ... FAILED
59.99 s
>
59.99 s
> failures:
59.99 s
>
59.99 s
> failures:
59.99 s
> tests::checked_in_registry_is_valid
59.99 s
>
59.99 s
> test result: FAILED. 0 passed; 1 failed; 0 ignored; 0 measured; 128 filtered out; finished in 0.11s
59.99 s
>
59.99 s
> stderr ---
59.99 s
>
59.99 s
> thread 'tests::checked_in_registry_is_valid' (214) panicked at crates/alphal00p-docs-builder/src/lib.rs:12260:50:
59.99 s
> called `Result::unwrap()` on an `Err` value: required documentation source is missing: /build/source/crates/spynso3/typst/STIXTwoMath-Regular.woff2
59.99 s
>
59.99 s
> Location:
59.99 s
> crates/alphal00p-docs-builder/src/lib.rs:5103:9
59.99 s
> stack backtrace:
59.99 s
> 0: __rustc::rust_begin_unwind
59.99 s
> 1: core::panicking::panic_fmt
59.99 s
> 2: core::result::unwrap_failed
59.99 s
> 3: alphal00p_docs_builder::tests::checked_in_registry_is_valid
59.99 s
> 4: <alphal00p_docs_builder::tests::checked_in_registry_is_valid::{closure#0} as core::ops::function::FnOnce<()>>::call_once
59.99 s
> note: Some details are omitted, run with `RUST_BACKTRACE=full` for a verbose backtrace.
59.99 s
>
59.99 s
> FAIL [ 0.009s] ( 87/129) alphal00p-docs-builder tests :: site_assets_replace_read_only_generated_files
59.99 s
> stdout ---
59.99 s
>
59.99 s
> running 1 test
59.99 s
> test tests::site_assets_replace_read_only_generated_files ... FAILED
59.99 s
>
59.99 s
> failures:
59.99 s
>
59.99 s
> failures:
59.99 s
> tests::site_assets_replace_read_only_generated_files
59.99 s
>
59.99 s
> test result: FAILED. 0 passed; 1 failed; 0 ignored; 0 measured; 128 filtered out; finished in 0.00s
59.99 s
>
59.99 s
> stderr ---
59.99 s
>
59.99 s
> thread 'tests::site_assets_replace_read_only_generated_files' (669) panicked at crates/alphal00p-docs-builder/src/lib.rs:12305:50:
59.99 s
> called `Result::unwrap()` on an `Err` value: failed to copy documentation asset crates/spynso3/typst/STIXTwoMath-Regular.woff2
59.99 s
>
59.99 s
> Caused by:
59.99 s
> No such file or directory (os error 2)
59.99 s
>
59.99 s
> Location:
59.99 s
> crates/alphal00p-docs-builder/src/lib.rs:2276:18
59.99 s
> stack backtrace:
59.99 s
> 0: __rustc::rust_begin_unwind
59.99 s
> 1: core::panicking::panic_fmt
59.99 s
> 2: core::result::unwrap_failed
59.99 s
> 3: alphal00p_docs_builder::tests::site_assets_replace_read_only_generated_files
59.99 s
> 4: <alphal00p_docs_builder::tests::site_assets_replace_read_only_generated_files::{closure#0} as core::ops::function::FnOnce<()>>::call_once
59.99 s
> note: Some details are omitted, run with `RUST_BACKTRACE=full` for a verbose backtrace.
59.99 s
>
59.99 s
> FAIL [ 0.114s] ( 89/129) alphal00p-docs-builder tests :: developer_scope_ranges_ignore_unrelated_edits_and_warn_only_while_watching
59.99 s
> stdout ---
59.99 s
>
59.99 s
> running 1 test
59.99 s
> test tests::developer_scope_ranges_ignore_unrelated_edits_and_warn_only_while_watching ... FAILED
59.99 s
>
59.99 s
> failures:
59.99 s
>
59.99 s
> failures:
59.99 s
> tests::developer_scope_ranges_ignore_unrelated_edits_and_warn_only_while_watching
59.99 s
>
59.99 s
> test result: FAILED. 0 passed; 1 failed; 0 ignored; 0 measured; 128 filtered out; finished in 0.11s
59.99 s
>
59.99 s
> stderr ---
59.99 s
>
59.99 s
> thread 'tests::developer_scope_ranges_ignore_unrelated_edits_and_warn_only_while_watching' (278) panicked at crates/alphal00p-docs-builder/src/lib.rs:12350:29:
59.99 s
> called `Result::unwrap()` on an `Err` value: required documentation source is missing: /build/source/crates/spynso3/typst/STIXTwoMath-Regular.woff2
59.99 s
>
59.99 s
> Location:
59.99 s
> crates/alphal00p-docs-builder/src/lib.rs:5103:9
59.99 s
> stack backtrace:
59.99 s
> 0: __rustc::rust_begin_unwind
59.99 s
> 1: core::panicking::panic_fmt
59.99 s
> 2: core::result::unwrap_failed
59.99 s
> 3: alphal00p_docs_builder::tests::developer_scope_ranges_ignore_unrelated_edits_and_warn_only_while_watching
59.99 s
> 4: <alphal00p_docs_builder::tests::developer_scope_ranges_ignore_unrelated_edits_and_warn_only_while_watching::{closure#0} as core::ops::function::FnOnce<()>>::call_once
59.99 s
> note: Some details are omitted, run with `RUST_BACKTRACE=full` for a verbose backtrace.
59.99 s
>
59.99 s
> FAIL [ 0.142s] ( 96/129) alphal00p-docs-builder provenance_tests :: each_build_captures_one_revision_before_rendering
59.99 s
> stdout ---
59.99 s
>
59.99 s
> running 1 test
59.99 s
>
59.99 s
> running 1 test
59.99 s
> test provenance_tests::each_build_captures_one_revision_before_rendering ... FAILED
59.99 s
>
59.99 s
> failures:
59.99 s
>
59.99 s
> failures:
59.99 s
> provenance_tests::each_build_captures_one_revision_before_rendering
59.99 s
>
59.99 s
> test result: FAILED. 0 passed; 1 failed; 0 ignored; 0 measured; 128 filtered out; finished in 0.11s
59.99 s
>
59.99 s
> test provenance_tests::each_build_captures_one_revision_before_rendering ... FAILED
59.99 s
>
59.99 s
> failures:
59.99 s
>
59.99 s
> failures:
59.99 s
> provenance_tests::each_build_captures_one_revision_before_rendering
59.99 s
>
59.99 s
> test result: FAILED. 0 passed; 1 failed; 0 ignored; 0 measured; 128 filtered out; finished in 0.13s
59.99 s
>
59.99 s
> stderr ---
59.99 s
>
59.99 s
> thread 'provenance_tests::each_build_captures_one_revision_before_rendering' (284) panicked at crates/alphal00p-docs-builder/src/provenance_tests.rs:297:14:
59.99 s
> called `Result::unwrap()` on an `Err` value: required documentation source is missing: /build/source/target/nix-ci-tmp/.tmpAH3uti/checkout/crates/spynso3/typst/STIXTwoMath-Regular.woff2
59.99 s
>
59.99 s
> Location:
59.99 s
> crates/alphal00p-docs-builder/src/lib.rs:5103:9
59.99 s
> stack backtrace:
59.99 s
> 0: __rustc::rust_begin_unwind
59.99 s
> 1: core::panicking::panic_fmt
59.99 s
> 2: core::result::unwrap_failed
59.99 s
> 3: alphal00p_docs_builder::provenance_tests::each_build_captures_one_revision_before_rendering
59.99 s
> 4: <alphal00p_docs_builder::provenance_tests::each_build_captures_one_revision_before_rendering::{closure#0} as core::ops::function::FnOnce<()>>::call_once
59.99 s
> note: Some details are omitted, run with `RUST_BACKTRACE=full` for a verbose backtrace.
59.99 s
>
59.99 s
> thread 'provenance_tests::each_build_captures_one_revision_before_rendering' (218) panicked at crates/alphal00p-docs-builder/src/provenance_tests.rs:274:9:
59.99 s
> assertion failed: command.status().unwrap().success()
59.99 s
> stack backtrace:
59.99 s
> 0: __rustc::rust_begin_unwind
59.99 s
> 1: core::panicking::panic_fmt
59.99 s
> 2: core::panicking::panic
59.99 s
> 3: alphal00p_docs_builder::provenance_tests::each_build_captures_one_revision_before_rendering
59.99 s
> 4: <alphal00p_docs_builder::provenance_tests::each_build_captures_one_revision_before_rendering::{closure#0} as core::ops::function::FnOnce<()>>::call_once
59.99 s
> note: Some details are omitted, run with `RUST_BACKTRACE=full` for a verbose backtrace.
59.99 s
>
59.99 s
> FAIL [ 0.123s] (106/129) alphal00p-docs-builder tests :: every_product_requires_a_task_chooser_and_each_supported_interface
59.99 s
> stdout ---
59.99 s
>
59.99 s
> running 1 test
59.99 s
> test tests::every_product_requires_a_task_chooser_and_each_supported_interface ... FAILED
59.99 s
>
59.99 s
> failures:
59.99 s
>
59.99 s
> failures:
59.99 s
> tests::every_product_requires_a_task_chooser_and_each_supported_interface
59.99 s
>
59.99 s
> test result: FAILED. 0 passed; 1 failed; 0 ignored; 0 measured; 128 filtered out; finished in 0.12s
59.99 s
>
59.99 s
> stderr ---
59.99 s
>
59.99 s
> thread 'tests::every_product_requires_a_task_chooser_and_each_supported_interface' (312) panicked at crates/alphal00p-docs-builder/src/lib.rs:12274:9:
59.99 s
> assertion failed: format!("{error:#}").contains("has no quickstart page")
59.99 s
> stack backtrace:
59.99 s
> 0: __rustc::rust_begin_unwind
59.99 s
> 1: core::panicking::panic_fmt
59.99 s
> 2: core::panicking::panic
59.99 s
> 3: alphal00p_docs_builder::tests::every_product_requires_a_task_chooser_and_each_supported_interface
59.99 s
> 4: <alphal00p_docs_builder::tests::every_product_requires_a_task_chooser_and_each_supported_interface::{closure#0} as core::ops::function::FnOnce<()>>::call_once
59.99 s
> note: Some details are omitted, run with `RUST_BACKTRACE=full` for a verbose backtrace.
59.99 s
>
59.99 s
> FAIL [ 0.118s] (122/129) alphal00p-docs-builder tests :: pdf_manual_chapter_order_must_match_the_page_registry
59.99 s
> stdout ---
59.99 s
>
59.99 s
> running 1 test
59.99 s
> test tests::pdf_manual_chapter_order_must_match_the_page_registry ... FAILED
59.99 s
>
59.99 s
> failures:
59.99 s
>
59.99 s
> failures:
59.99 s
> tests::pdf_manual_chapter_order_must_match_the_page_registry
59.99 s
>
59.99 s
> test result: FAILED. 0 passed; 1 failed; 0 ignored; 0 measured; 128 filtered out; finished in 0.11s
59.99 s
>
59.99 s
> stderr ---
59.99 s
>
59.99 s
> thread 'tests::pdf_manual_chapter_order_must_match_the_page_registry' (397) panicked at crates/alphal00p-docs-builder/src/lib.rs:12330:9:
59.99 s
> assertion failed: format!("{error:#}").contains("PDF manual chapter order differs")
59.99 s
> stack backtrace:
59.99 s
> 0: __rustc::rust_begin_unwind
59.99 s
> 1: core::panicking::panic_fmt
59.99 s
> 2: core::panicking::panic
59.99 s
> 3: alphal00p_docs_builder::tests::pdf_manual_chapter_order_must_match_the_page_registry
59.99 s
> 4: <alphal00p_docs_builder::tests::pdf_manual_chapter_order_must_match_the_page_registry::{closure#0} as core::ops::function::FnOnce<()>>::call_once
59.99 s
> note: Some details are omitted, run with `RUST_BACKTRACE=full` for a verbose backtrace.
59.99 s
>
59.99 s
> ------------
59.99 s
> Summary [ 11.214s] 129 tests run: 118 passed , 11 failed , 0 skipped
59.99 s
> FAIL [ 0.012s] ( 22/129) alphal00p-docs-builder tests :: developer_architecture_is_classified_searchable_and_source_backed
59.99 s
> stdout ---
59.99 s
>
59.99 s
> running 1 test
59.99 s
> test tests::developer_architecture_is_classified_searchable_and_source_backed ... FAILED
59.99 s
>
59.99 s
> failures:
59.99 s
>
59.99 s
> failures:
59.99 s
> tests::developer_architecture_is_classified_searchable_and_source_backed
59.99 s
>
59.99 s
> test result: FAILED. 0 passed; 1 failed; 0 ignored; 0 measured; 128 filtered out; finished in 0.01s
59.99 s
>
59.99 s
> stderr ---
59.99 s
>
59.99 s
> thread 'tests::developer_architecture_is_classified_searchable_and_source_backed' (273) panicked at crates/alphal00p-docs-builder/src/lib.rs:12751:14:
59.99 s
> called `Result::unwrap()` on an `Err` value: failed to copy documentation asset crates/spynso3/typst/STIXTwoMath-Regular.woff2
59.99 s
>
59.99 s
> Caused by:
59.99 s
> No such file or directory (os error 2)
59.99 s
>
59.99 s
> Location:
59.99 s
> crates/alphal00p-docs-builder/src/lib.rs:2276:18
59.99 s
> stack backtrace:
59.99 s
> 0: __rustc::rust_begin_unwind
59.99 s
> 1: core::panicking::panic_fmt
59.99 s
> 2: core::result::unwrap_failed
59.99 s
> 3: alphal00p_docs_builder::tests::developer_architecture_is_classified_searchable_and_source_backed
59.99 s
> 4: <alphal00p_docs_builder::tests::developer_architecture_is_classified_searchable_and_source_backed::{closure#0} as core::ops::function::FnOnce<()>>::call_once
59.99 s
> note: Some details are omitted, run with `RUST_BACKTRACE=full` for a verbose backtrace.
59.99 s
>
59.99 s
> FAIL [ 0.011s] ( 29/129) alphal00p-docs-builder tests :: every_product_orients_rust_to_native_rustdoc_and_keeps_legacy_redirects
59.99 s
> stdout ---
59.99 s
>
59.99 s
> running 1 test
59.99 s
> test tests::every_product_orients_rust_to_native_rustdoc_and_keeps_legacy_redirects ... FAILED
59.99 s
>
59.99 s
> failures:
59.99 s
>
59.99 s
> failures:
59.99 s
> tests::every_product_orients_rust_to_native_rustdoc_and_keeps_legacy_redirects
59.99 s
>
59.99 s
> test result: FAILED. 0 passed; 1 failed; 0 ignored; 0 measured; 128 filtered out; finished in 0.01s
59.99 s
>
59.99 s
> stderr ---
59.99 s
>
59.99 s
> thread 'tests::every_product_orients_rust_to_native_rustdoc_and_keeps_legacy_redirects' (301) panicked at crates/alphal00p-docs-builder/src/lib.rs:12555:46:
59.99 s
> called `Result::unwrap()` on an `Err` value: failed to copy documentation asset crates/spynso3/typst/STIXTwoMath-Regular.woff2
59.99 s
>
59.99 s
> Caused by:
59.99 s
> No such file or directory (os error 2)
59.99 s
>
59.99 s
> Location:
59.99 s
> crates/alphal00p-docs-builder/src/lib.rs:2276:18
59.99 s
> stack backtrace:
59.99 s
> 0: __rustc::rust_begin_unwind
59.99 s
> 1: core::panicking::panic_fmt
59.99 s
> 2: core::result::unwrap_failed
59.99 s
> 3: alphal00p_docs_builder::tests::every_product_orients_rust_to_native_rustdoc_and_keeps_legacy_redirects
59.99 s
> 4: <alphal00p_docs_builder::tests::every_product_orients_rust_to_native_rustdoc_and_keeps_legacy_redirects::{closure#0} as core::ops::function::FnOnce<()>>::call_once
59.99 s
> note: Some details are omitted, run with `RUST_BACKTRACE=full` for a verbose backtrace.
59.99 s
>
59.99 s
> FAIL [ 0.010s] ( 53/129) alphal00p-docs-builder tests :: portal_emits_routes_and_valid_assets
59.99 s
> stdout ---
59.99 s
>
59.99 s
> running 1 test
59.99 s
> test tests::portal_emits_routes_and_valid_assets ... FAILED
59.99 s
>
59.99 s
> failures:
59.99 s
>
59.99 s
> failures:
59.99 s
> tests::portal_emits_routes_and_valid_assets
59.99 s
>
59.99 s
> test result: FAILED. 0 passed; 1 failed; 0 ignored; 0 measured; 128 filtered out; finished in 0.00s
59.99 s
>
59.99 s
> stderr ---
59.99 s
>
59.99 s
> thread 'tests::portal_emits_routes_and_valid_assets' (429) panicked at crates/alphal00p-docs-builder/src/lib.rs:9684:14:
59.99 s
> called `Result::unwrap()` on an `Err` value: failed to copy documentation asset crates/spynso3/typst/STIXTwoMath-Regular.woff2
59.99 s
>
59.99 s
> Caused by:
59.99 s
> No such file or directory (os error 2)
59.99 s
>
59.99 s
> Location:
59.99 s
> crates/alphal00p-docs-builder/src/lib.rs:2276:18
59.99 s
> stack backtrace:
59.99 s
> 0: __rustc::rust_begin_unwind
59.99 s
> 1: core::panicking::panic_fmt
59.99 s
> 2: core::result::unwrap_failed
59.99 s
> 3: alphal00p_docs_builder::tests::write_test_portal
59.99 s
> 4: alphal00p_docs_builder::tests::portal_emits_routes_and_valid_assets
59.99 s
> 5: <alphal00p_docs_builder::tests::portal_emits_routes_and_valid_assets::{closure#0} as core::ops::function::FnOnce<()>>::call_once
59.99 s
> note: Some details are omitted, run with `RUST_BACKTRACE=full` for a verbose backtrace.
59.99 s
>
59.99 s
> FAIL [ 0.011s] ( 54/129) alphal00p-docs-builder tests :: portal_and_developer_pages_use_federated_search_and_feedback
59.99 s
> stdout ---
59.99 s
>
59.99 s
> running 1 test
59.99 s
> test tests::portal_and_developer_pages_use_federated_search_and_feedback ... FAILED
59.99 s
>
59.99 s
> failures:
59.99 s
>
59.99 s
> failures:
59.99 s
> tests::portal_and_developer_pages_use_federated_search_and_feedback
59.99 s
>
59.99 s
> test result: FAILED. 0 passed; 1 failed; 0 ignored; 0 measured; 128 filtered out; finished in 0.01s
59.99 s
>
59.99 s
> stderr ---
59.99 s
>
59.99 s
> thread 'tests::portal_and_developer_pages_use_federated_search_and_feedback' (430) panicked at crates/alphal00p-docs-builder/src/lib.rs:9684:14:
59.99 s
> called `Result::unwrap()` on an `Err` value: failed to copy documentation asset crates/spynso3/typst/STIXTwoMath-Regular.woff2
59.99 s
>
59.99 s
> Caused by:
59.99 s
> No such file or directory (os error 2)
59.99 s
>
59.99 s
> Location:
59.99 s
> crates/alphal00p-docs-builder/src/lib.rs:2276:18
59.99 s
> stack backtrace:
59.99 s
> 0: __rustc::rust_begin_unwind
59.99 s
> 1: core::panicking::panic_fmt
59.99 s
> 2: core::result::unwrap_failed
59.99 s
> 3: alphal00p_docs_builder::tests::write_test_portal
59.99 s
> 4: alphal00p_docs_builder::tests::portal_and_developer_pages_use_federated_search_and_feedback
59.99 s
> 5: <alphal00p_docs_builder::tests::portal_and_developer_pages_use_federated_search_and_feedback::{closure#0} as core::ops::function::FnOnce<()>>::call_once
59.99 s
> note: Some details are omitted, run with `RUST_BACKTRACE=full` for a verbose backtrace.
59.99 s
>
59.99 s
> FAIL [ 0.009s] ( 55/129) alphal00p-docs-builder tests :: portal_task_chooser_routes_each_goal_to_the_registered_quickstart
59.99 s
> stdout ---
59.99 s
>
59.99 s
> running 1 test
59.99 s
> test tests::portal_task_chooser_routes_each_goal_to_the_registered_quickstart ... FAILED
59.99 s
>
59.99 s
> failures:
59.99 s
>
59.99 s
> failures:
59.99 s
> tests::portal_task_chooser_routes_each_goal_to_the_registered_quickstart
59.99 s
>
59.99 s
> test result: FAILED. 0 passed; 1 failed; 0 ignored; 0 measured; 128 filtered out; finished in 0.00s
59.99 s
>
59.99 s
> stderr ---
59.99 s
>
59.99 s
> thread 'tests::portal_task_chooser_routes_each_goal_to_the_registered_quickstart' (443) panicked at crates/alphal00p-docs-builder/src/lib.rs:9684:14:
59.99 s
> called `Result::unwrap()` on an `Err` value: failed to copy documentation asset crates/spynso3/typst/STIXTwoMath-Regular.woff2
59.99 s
>
59.99 s
> Caused by:
59.99 s
> No such file or directory (os error 2)
59.99 s
>
59.99 s
> Location:
59.99 s
> crates/alphal00p-docs-builder/src/lib.rs:2276:18
59.99 s
> stack backtrace:
59.99 s
> 0: __rustc::rust_begin_unwind
59.99 s
> 1: core::panicking::panic_fmt
59.99 s
> 2: core::result::unwrap_failed
59.99 s
> 3: alphal00p_docs_builder::tests::write_test_portal
59.99 s
> 4: alphal00p_docs_builder::tests::portal_task_chooser_routes_each_goal_to_the_registered_quickstart
59.99 s
> 5: <alphal00p_docs_builder::tests::portal_task_chooser_routes_each_goal_to_the_registered_quickstart::{closure#0} as core::ops::function::FnOnce<()>>::call_once
59.99 s
> note: Some details are omitted, run with `RUST_BACKTRACE=full` for a verbose backtrace.
59.99 s
>
59.99 s
> FAIL [ 0.123s] ( 83/129) alphal00p-docs-builder tests :: checked_in_registry_is_valid
59.99 s
> stdout ---
59.99 s
>
59.99 s
> running 1 test
59.99 s
> test tests::checked_in_registry_is_valid ... FAILED
59.99 s
>
59.99 s
> failures:
59.99 s
>
59.99 s
> failures:
59.99 s
> tests::checked_in_registry_is_valid
59.99 s
>
59.99 s
> test result: FAILED. 0 passed; 1 failed; 0 ignored; 0 measured; 128 filtered out; finished in 0.11s
59.99 s
>
59.99 s
> stderr ---
59.99 s
>
59.99 s
> thread 'tests::checked_in_registry_is_valid' (214) panicked at crates/alphal00p-docs-builder/src/lib.rs:12260:50:
59.99 s
> called `Result::unwrap()` on an `Err` value: required documentation source is missing: /build/source/crates/spynso3/typst/STIXTwoMath-Regular.woff2
59.99 s
>
59.99 s
> Location:
59.99 s
> crates/alphal00p-docs-builder/src/lib.rs:5103:9
59.99 s
> stack backtrace:
59.99 s
> 0: __rustc::rust_begin_unwind
59.99 s
> 1: core::panicking::panic_fmt
59.99 s
> 2: core::result::unwrap_failed
59.99 s
> 3: alphal00p_docs_builder::tests::checked_in_registry_is_valid
59.99 s
> 4: <alphal00p_docs_builder::tests::checked_in_registry_is_valid::{closure#0} as core::ops::function::FnOnce<()>>::call_once
59.99 s
> note: Some details are omitted, run with `RUST_BACKTRACE=full` for a verbose backtrace.
59.99 s
>
59.99 s
> FAIL [ 0.009s] ( 87/129) alphal00p-docs-builder tests :: site_assets_replace_read_only_generated_files
59.99 s
> stdout ---
59.99 s
>
59.99 s
> running 1 test
59.99 s
> test tests::site_assets_replace_read_only_generated_files ... FAILED
59.99 s
>
59.99 s
> failures:
59.99 s
>
59.99 s
> failures:
59.99 s
> tests::site_assets_replace_read_only_generated_files
59.99 s
>
59.99 s
> test result: FAILED. 0 passed; 1 failed; 0 ignored; 0 measured; 128 filtered out; finished in 0.00s
59.99 s
>
59.99 s
> stderr ---
59.99 s
>
59.99 s
> thread 'tests::site_assets_replace_read_only_generated_files' (669) panicked at crates/alphal00p-docs-builder/src/lib.rs:12305:50:
59.99 s
> called `Result::unwrap()` on an `Err` value: failed to copy documentation asset crates/spynso3/typst/STIXTwoMath-Regular.woff2
59.99 s
>
59.99 s
> Caused by:
59.99 s
> No such file or directory (os error 2)
59.99 s
>
59.99 s
> Location:
59.99 s
> crates/alphal00p-docs-builder/src/lib.rs:2276:18
59.99 s
> stack backtrace:
59.99 s
> 0: __rustc::rust_begin_unwind
59.99 s
> 1: core::panicking::panic_fmt
59.99 s
> 2: core::result::unwrap_failed
59.99 s
> 3: alphal00p_docs_builder::tests::site_assets_replace_read_only_generated_files
59.99 s
> 4: <alphal00p_docs_builder::tests::site_assets_replace_read_only_generated_files::{closure#0} as core::ops::function::FnOnce<()>>::call_once
59.99 s
> note: Some details are omitted, run with `RUST_BACKTRACE=full` for a verbose backtrace.
59.99 s
>
59.99 s
> FAIL [ 0.114s] ( 89/129) alphal00p-docs-builder tests :: developer_scope_ranges_ignore_unrelated_edits_and_warn_only_while_watching
59.99 s
> stdout ---
59.99 s
>
59.99 s
> running 1 test
59.99 s
> test tests::developer_scope_ranges_ignore_unrelated_edits_and_warn_only_while_watching ... FAILED
59.99 s
>
59.99 s
> failures:
59.99 s
>
59.99 s
> failures:
59.99 s
> tests::developer_scope_ranges_ignore_unrelated_edits_and_warn_only_while_watching
59.99 s
>
59.99 s
> test result: FAILED. 0 passed; 1 failed; 0 ignored; 0 measured; 128 filtered out; finished in 0.11s
59.99 s
>
59.99 s
> stderr ---
59.99 s
>
59.99 s
> thread 'tests::developer_scope_ranges_ignore_unrelated_edits_and_warn_only_while_watching' (278) panicked at crates/alphal00p-docs-builder/src/lib.rs:12350:29:
59.99 s
> called `Result::unwrap()` on an `Err` value: required documentation source is missing: /build/source/crates/spynso3/typst/STIXTwoMath-Regular.woff2
59.99 s
>
59.99 s
> Location:
59.99 s
> crates/alphal00p-docs-builder/src/lib.rs:5103:9
59.99 s
> stack backtrace:
59.99 s
> 0: __rustc::rust_begin_unwind
59.99 s
> 1: core::panicking::panic_fmt
59.99 s
> 2: core::result::unwrap_failed
59.99 s
> 3: alphal00p_docs_builder::tests::developer_scope_ranges_ignore_unrelated_edits_and_warn_only_while_watching
59.99 s
> 4: <alphal00p_docs_builder::tests::developer_scope_ranges_ignore_unrelated_edits_and_warn_only_while_watching::{closure#0} as core::ops::function::FnOnce<()>>::call_once
59.99 s
> note: Some details are omitted, run with `RUST_BACKTRACE=full` for a verbose backtrace.
59.99 s
>
59.99 s
> FAIL [ 0.142s] ( 96/129) alphal00p-docs-builder provenance_tests :: each_build_captures_one_revision_before_rendering
59.99 s
> stdout ---
59.99 s
>
59.99 s
> running 1 test
59.99 s
>
59.99 s
> running 1 test
59.99 s
> test provenance_tests::each_build_captures_one_revision_before_rendering ... FAILED
59.99 s
>
59.99 s
> failures:
59.99 s
>
59.99 s
> failures:
59.99 s
> provenance_tests::each_build_captures_one_revision_before_rendering
59.99 s
>
59.99 s
> test result: FAILED. 0 passed; 1 failed; 0 ignored; 0 measured; 128 filtered out; finished in 0.11s
59.99 s
>
59.99 s
> test provenance_tests::each_build_captures_one_revision_before_rendering ... FAILED
59.99 s
>
59.99 s
> failures:
59.99 s
>
59.99 s
> failures:
59.99 s
> provenance_tests::each_build_captures_one_revision_before_rendering
59.99 s
>
59.99 s
> test result: FAILED. 0 passed; 1 failed; 0 ignored; 0 measured; 128 filtered out; finished in 0.13s
59.99 s
>
59.99 s
> stderr ---
59.99 s
>
59.99 s
> thread 'provenance_tests::each_build_captures_one_revision_before_rendering' (284) panicked at crates/alphal00p-docs-builder/src/provenance_tests.rs:297:14:
59.99 s
> called `Result::unwrap()` on an `Err` value: required documentation source is missing: /build/source/target/nix-ci-tmp/.tmpAH3uti/checkout/crates/spynso3/typst/STIXTwoMath-Regular.woff2
59.99 s
>
59.99 s
> Location:
59.99 s
> crates/alphal00p-docs-builder/src/lib.rs:5103:9
59.99 s
> stack backtrace:
59.99 s
> 0: __rustc::rust_begin_unwind
59.99 s
> 1: core::panicking::panic_fmt
59.99 s
> 2: core::result::unwrap_failed
59.99 s
> 3: alphal00p_docs_builder::provenance_tests::each_build_captures_one_revision_before_rendering
59.99 s
> 4: <alphal00p_docs_builder::provenance_tests::each_build_captures_one_revision_before_rendering::{closure#0} as core::ops::function::FnOnce<()>>::call_once
59.99 s
> note: Some details are omitted, run with `RUST_BACKTRACE=full` for a verbose backtrace.
59.99 s
>
59.99 s
> thread 'provenance_tests::each_build_captures_one_revision_before_rendering' (218) panicked at crates/alphal00p-docs-builder/src/provenance_tests.rs:274:9:
59.99 s
> assertion failed: command.status().unwrap().success()
59.99 s
> stack backtrace:
59.99 s
> 0: __rustc::rust_begin_unwind
59.99 s
> 1: core::panicking::panic_fmt
59.99 s
> 2: core::panicking::panic
59.99 s
> 3: alphal00p_docs_builder::provenance_tests::each_build_captures_one_revision_before_rendering
59.99 s
> 4: <alphal00p_docs_builder::provenance_tests::each_build_captures_one_revision_before_rendering::{closure#0} as core::ops::function::FnOnce<()>>::call_once
59.99 s
> note: Some details are omitted, run with `RUST_BACKTRACE=full` for a verbose backtrace.
59.99 s
>
59.99 s
> FAIL [ 0.123s] (106/129) alphal00p-docs-builder tests :: every_product_requires_a_task_chooser_and_each_supported_interface
59.99 s
> stdout ---
59.99 s
>
59.99 s
> running 1 test
59.99 s
> test tests::every_product_requires_a_task_chooser_and_each_supported_interface ... FAILED
59.99 s
>
59.99 s
> failures:
59.99 s
>
59.99 s
> failures:
59.99 s
> tests::every_product_requires_a_task_chooser_and_each_supported_interface
59.99 s
>
59.99 s
> test result: FAILED. 0 passed; 1 failed; 0 ignored; 0 measured; 128 filtered out; finished in 0.12s
59.99 s
>
59.99 s
> stderr ---
59.99 s
>
59.99 s
> thread 'tests::every_product_requires_a_task_chooser_and_each_supported_interface' (312) panicked at crates/alphal00p-docs-builder/src/lib.rs:12274:9:
59.99 s
> assertion failed: format!("{error:#}").contains("has no quickstart page")
59.99 s
> stack backtrace:
59.99 s
> 0: __rustc::rust_begin_unwind
59.99 s
> 1: core::panicking::panic_fmt
59.99 s
> 2: core::panicking::panic
59.99 s
> 3: alphal00p_docs_builder::tests::every_product_requires_a_task_chooser_and_each_supported_interface
59.99 s
> 4: <alphal00p_docs_builder::tests::every_product_requires_a_task_chooser_and_each_supported_interface::{closure#0} as core::ops::function::FnOnce<()>>::call_once
59.99 s
> note: Some details are omitted, run with `RUST_BACKTRACE=full` for a verbose backtrace.
59.99 s
>
59.99 s
> FAIL [ 0.118s] (122/129) alphal00p-docs-builder tests :: pdf_manual_chapter_order_must_match_the_page_registry
59.99 s
> stdout ---
59.99 s
>
59.99 s
> running 1 test
59.99 s
> test tests::pdf_manual_chapter_order_must_match_the_page_registry ... FAILED
59.99 s
>
59.99 s
> failures:
59.99 s
>
59.99 s
> failures:
59.99 s
> tests::pdf_manual_chapter_order_must_match_the_page_registry
59.99 s
>
59.99 s
> test result: FAILED. 0 passed; 1 failed; 0 ignored; 0 measured; 128 filtered out; finished in 0.11s
59.99 s
>
59.99 s
> stderr ---
59.99 s
>
59.99 s
> thread 'tests::pdf_manual_chapter_order_must_match_the_page_registry' (397) panicked at crates/alphal00p-docs-builder/src/lib.rs:12330:9:
59.99 s
> assertion failed: format!("{error:#}").contains("PDF manual chapter order differs")
59.99 s
> stack backtrace:
59.99 s
> 0: __rustc::rust_begin_unwind
59.99 s
> 1: core::panicking::panic_fmt
59.99 s
> 2: core::panicking::panic
59.99 s
> 3: alphal00p_docs_builder::tests::pdf_manual_chapter_order_must_match_the_page_registry
59.99 s
> 4: <alphal00p_docs_builder::tests::pdf_manual_chapter_order_must_match_the_page_registry::{closure#0} as core::ops::function::FnOnce<()>>::call_once
59.99 s
> note: Some details are omitted, run with `RUST_BACKTRACE=full` for a verbose backtrace.
59.99 s
>
59.99 s
> error : test run failed
59.99 s
>
59.99 s
> ========== nextest test summary ==========
59.99 s
> report: target/nextest/ci_gammaloop/junit.xml
59.99 s
> tests: 129, failures: 11, errors: 0
59.99 s
>
59.99 s
> 1. alphal00p-docs-builder::tests::developer_architecture_is_classified_searchable_and_source_backed
59.99 s
> failure: test failure with exit code 101
59.99 s
> thread 'tests::developer_architecture_is_classified_searchable_and_source_backed' (273) panicked at crates/alphal00p-docs-builder/src/lib.rs:12751:14:
59.99 s
> called `Result::unwrap()` on an `Err` value: failed to copy documentation asset crates/spynso3/typst/STIXTwoMath-Regular.woff2
59.99 s
>
59.99 s
> Caused by:
59.99 s
> No such file or directory (os error 2)
59.99 s
>
59.99 s
> Location:
59.99 s
> crates/alphal00p-docs-builder/src/lib.rs:2276:18
59.99 s
> stack backtrace:
59.99 s
> 0: __rustc::rust_begin_unwind
59.99 s
> 1: core::panicking::panic_fmt
59.99 s
> 2: core::result::unwrap_failed
59.99 s
> 3: alphal00p_docs_builder::tests::developer_architecture_is_classified_searchable_and_source_backed
59.99 s
> 4: <alphal00p_docs_builder::tests::developer_architecture_is_classified_searchable_and_source_backed::{closure#0} as core::ops::function::FnOnce<()>>::call_once
59.99 s
> note: Some details are omitted, run with `RUST_BACKTRACE=full` for a verbose backtrace.
59.99 s
> system-out
59.99 s
> running 1 test
59.99 s
> test tests::developer_architecture_is_classified_searchable_and_source_backed ... FAILED
59.99 s
>
59.99 s
> failures:
59.99 s
>
59.99 s
> failures:
59.99 s
> tests::developer_architecture_is_classified_searchable_and_source_backed
59.99 s
>
59.99 s
> test result: FAILED. 0 passed; 1 failed; 0 ignored; 0 measured; 128 filtered out; finished in 0.01s
59.99 s
> system-err
59.99 s
> thread 'tests::developer_architecture_is_classified_searchable_and_source_backed' (273) panicked at crates/alphal00p-docs-builder/src/lib.rs:12751:14:
59.99 s
> called `Result::unwrap()` on an `Err` value: failed to copy documentation asset crates/spynso3/typst/STIXTwoMath-Regular.woff2
59.99 s
>
59.99 s
> Caused by:
59.99 s
> No such file or directory (os error 2)
59.99 s
>
59.99 s
> Location:
59.99 s
> crates/alphal00p-docs-builder/src/lib.rs:2276:18
59.99 s
> stack backtrace:
59.99 s
> 0: __rustc::rust_begin_unwind
59.99 s
> 1: core::panicking::panic_fmt
59.99 s
> 2: core::result::unwrap_failed
59.99 s
> 3: alphal00p_docs_builder::tests::developer_architecture_is_classified_searchable_and_source_backed
59.99 s
> 4: <alphal00p_docs_builder::tests::developer_architecture_is_classified_searchable_and_source_backed::{closure#0} as core::ops::function::FnOnce<()>>::call_once
59.99 s
> note: Some details are omitted, run with `RUST_BACKTRACE=full` for a verbose backtrace.
59.99 s
>
59.99 s
> 2. alphal00p-docs-builder::tests::every_product_orients_rust_to_native_rustdoc_and_keeps_legacy_redirects
59.99 s
> failure: test failure with exit code 101
59.99 s
> thread 'tests::every_product_orients_rust_to_native_rustdoc_and_keeps_legacy_redirects' (301) panicked at crates/alphal00p-docs-builder/src/lib.rs:12555:46:
59.99 s
> called `Result::unwrap()` on an `Err` value: failed to copy documentation asset crates/spynso3/typst/STIXTwoMath-Regular.woff2
59.99 s
>
59.99 s
> Caused by:
59.99 s
> No such file or directory (os error 2)
59.99 s
>
59.99 s
> Location:
59.99 s
> crates/alphal00p-docs-builder/src/lib.rs:2276:18
59.99 s
> stack backtrace:
59.99 s
> 0: __rustc::rust_begin_unwind
59.99 s
> 1: core::panicking::panic_fmt
59.99 s
> 2: core::result::unwrap_failed
59.99 s
> 3: alphal00p_docs_builder::tests::every_product_orients_rust_to_native_rustdoc_and_keeps_legacy_redirects
59.99 s
> 4: <alphal00p_docs_builder::tests::every_product_orients_rust_to_native_rustdoc_and_keeps_legacy_redirects::{closure#0} as core::ops::function::FnOnce<()>>::call_once
59.99 s
> note: Some details are omitted, run with `RUST_BACKTRACE=full` for a verbose backtrace.
59.99 s
> system-out
59.99 s
> running 1 test
59.99 s
> test tests::every_product_orients_rust_to_native_rustdoc_and_keeps_legacy_redirects ... FAILED
59.99 s
>
59.99 s
> failures:
59.99 s
>
59.99 s
> failures:
59.99 s
> tests::every_product_orients_rust_to_native_rustdoc_and_keeps_legacy_redirects
59.99 s
>
59.99 s
> test result: FAILED. 0 passed; 1 failed; 0 ignored; 0 measured; 128 filtered out; finished in 0.01s
59.99 s
> system-err
59.99 s
> thread 'tests::every_product_orients_rust_to_native_rustdoc_and_keeps_legacy_redirects' (301) panicked at crates/alphal00p-docs-builder/src/lib.rs:12555:46:
59.99 s
> called `Result::unwrap()` on an `Err` value: failed to copy documentation asset crates/spynso3/typst/STIXTwoMath-Regular.woff2
59.99 s
>
59.99 s
> Caused by:
59.99 s
> No such file or directory (os error 2)
59.99 s
>
59.99 s
> Location:
59.99 s
> crates/alphal00p-docs-builder/src/lib.rs:2276:18
59.99 s
> stack backtrace:
59.99 s
> 0: __rustc::rust_begin_unwind
59.99 s
> 1: core::panicking::panic_fmt
59.99 s
> 2: core::result::unwrap_failed
59.99 s
> 3: alphal00p_docs_builder::tests::every_product_orients_rust_to_native_rustdoc_and_keeps_legacy_redirects
59.99 s
> 4: <alphal00p_docs_builder::tests::every_product_orients_rust_to_native_rustdoc_and_keeps_legacy_redirects::{closure#0} as core::ops::function::FnOnce<()>>::call_once
59.99 s
> note: Some details are omitted, run with `RUST_BACKTRACE=full` for a verbose backtrace.
59.99 s
>
59.99 s
> 3. alphal00p-docs-builder::tests::portal_emits_routes_and_valid_assets
59.99 s
> failure: test failure with exit code 101
59.99 s
> thread 'tests::portal_emits_routes_and_valid_assets' (429) panicked at crates/alphal00p-docs-builder/src/lib.rs:9684:14:
59.99 s
> called `Result::unwrap()` on an `Err` value: failed to copy documentation asset crates/spynso3/typst/STIXTwoMath-Regular.woff2
59.99 s
>
59.99 s
> Caused by:
59.99 s
> No such file or directory (os error 2)
59.99 s
>
59.99 s
> Location:
59.99 s
> crates/alphal00p-docs-builder/src/lib.rs:2276:18
59.99 s
> stack backtrace:
59.99 s
> 0: __rustc::rust_begin_unwind
59.99 s
> 1: core::panicking::panic_fmt
59.99 s
> 2: core::result::unwrap_failed
59.99 s
> 3: alphal00p_docs_builder::tests::write_test_portal
59.99 s
> 4: alphal00p_docs_builder::tests::portal_emits_routes_and_valid_assets
59.99 s
> 5: <alphal00p_docs_builder::tests::portal_emits_routes_and_valid_assets::{closure#0} as core::ops::function::FnOnce<()>>::call_once
60.00 s
> note: Some details are omitted, run with `RUST_BACKTRACE=full` for a verbose backtrace.
60.00 s
> system-out
60.00 s
> running 1 test
60.00 s
> test tests::portal_emits_routes_and_valid_assets ... FAILED
60.00 s
>
60.00 s
> failures:
60.00 s
>
60.00 s
> failures:
60.00 s
> tests::portal_emits_routes_and_valid_assets
60.00 s
>
60.00 s
> test result: FAILED. 0 passed; 1 failed; 0 ignored; 0 measured; 128 filtered out; finished in 0.00s
60.00 s
> system-err
60.00 s
> thread 'tests::portal_emits_routes_and_valid_assets' (429) panicked at crates/alphal00p-docs-builder/src/lib.rs:9684:14:
60.00 s
> called `Result::unwrap()` on an `Err` value: failed to copy documentation asset crates/spynso3/typst/STIXTwoMath-Regular.woff2
60.00 s
>
60.00 s
> Caused by:
60.00 s
> No such file or directory (os error 2)
60.00 s
>
60.00 s
> Location:
60.00 s
> crates/alphal00p-docs-builder/src/lib.rs:2276:18
60.00 s
> stack backtrace:
60.00 s
> 0: __rustc::rust_begin_unwind
60.00 s
> 1: core::panicking::panic_fmt
60.00 s
> 2: core::result::unwrap_failed
60.00 s
> 3: alphal00p_docs_builder::tests::write_test_portal
60.00 s
> 4: alphal00p_docs_builder::tests::portal_emits_routes_and_valid_assets
60.00 s
> 5: <alphal00p_docs_builder::tests::portal_emits_routes_and_valid_assets::{closure#0} as core::ops::function::FnOnce<()>>::call_once
60.00 s
> note: Some details are omitted, run with `RUST_BACKTRACE=full` for a verbose backtrace.
60.00 s
>
60.00 s
> 4. alphal00p-docs-builder::tests::portal_and_developer_pages_use_federated_search_and_feedback
60.00 s
> failure: test failure with exit code 101
60.00 s
> thread 'tests::portal_and_developer_pages_use_federated_search_and_feedback' (430) panicked at crates/alphal00p-docs-builder/src/lib.rs:9684:14:
60.00 s
> called `Result::unwrap()` on an `Err` value: failed to copy documentation asset crates/spynso3/typst/STIXTwoMath-Regular.woff2
60.00 s
>
60.00 s
> Caused by:
60.00 s
> No such file or directory (os error 2)
60.00 s
>
60.00 s
> Location:
60.00 s
> crates/alphal00p-docs-builder/src/lib.rs:2276:18
60.00 s
> stack backtrace:
60.00 s
> 0: __rustc::rust_begin_unwind
60.00 s
> 1: core::panicking::panic_fmt
60.00 s
> 2: core::result::unwrap_failed
60.00 s
> 3: alphal00p_docs_builder::tests::write_test_portal
60.00 s
> 4: alphal00p_docs_builder::tests::portal_and_developer_pages_use_federated_search_and_feedback
60.00 s
> 5: <alphal00p_docs_builder::tests::portal_and_developer_pages_use_federated_search_and_feedback::{closure#0} as core::ops::function::FnOnce<()>>::call_once
60.00 s
> note: Some details are omitted, run with `RUST_BACKTRACE=full` for a verbose backtrace.
60.00 s
> system-out
60.00 s
> running 1 test
60.00 s
> test tests::portal_and_developer_pages_use_federated_search_and_feedback ... FAILED
60.00 s
>
60.00 s
> failures:
60.00 s
>
60.00 s
> failures:
60.00 s
> tests::portal_and_developer_pages_use_federated_search_and_feedback
60.00 s
>
60.00 s
> test result: FAILED. 0 passed; 1 failed; 0 ignored; 0 measured; 128 filtered out; finished in 0.01s
60.00 s
> system-err
60.00 s
> thread 'tests::portal_and_developer_pages_use_federated_search_and_feedback' (430) panicked at crates/alphal00p-docs-builder/src/lib.rs:9684:14:
60.00 s
> called `Result::unwrap()` on an `Err` value: failed to copy documentation asset crates/spynso3/typst/STIXTwoMath-Regular.woff2
60.00 s
>
60.00 s
> Caused by:
60.00 s
> No such file or directory (os error 2)
60.00 s
>
60.00 s
> Location:
60.00 s
> crates/alphal00p-docs-builder/src/lib.rs:2276:18
60.00 s
> stack backtrace:
60.00 s
> 0: __rustc::rust_begin_unwind
60.00 s
> 1: core::panicking::panic_fmt
60.00 s
> 2: core::result::unwrap_failed
60.00 s
> 3: alphal00p_docs_builder::tests::write_test_portal
60.00 s
> 4: alphal00p_docs_builder::tests::portal_and_developer_pages_use_federated_search_and_feedback
60.00 s
> 5: <alphal00p_docs_builder::tests::portal_and_developer_pages_use_federated_search_and_feedback::{closure#0} as core::ops::function::FnOnce<()>>::call_once
60.00 s
> note: Some details are omitted, run with `RUST_BACKTRACE=full` for a verbose backtrace.
60.00 s
>
60.00 s
> 5. alphal00p-docs-builder::tests::portal_task_chooser_routes_each_goal_to_the_registered_quickstart
60.00 s
> failure: test failure with exit code 101
60.00 s
> thread 'tests::portal_task_chooser_routes_each_goal_to_the_registered_quickstart' (443) panicked at crates/alphal00p-docs-builder/src/lib.rs:9684:14:
60.00 s
> called `Result::unwrap()` on an `Err` value: failed to copy documentation asset crates/spynso3/typst/STIXTwoMath-Regular.woff2
60.00 s
>
60.00 s
> Caused by:
60.00 s
> No such file or directory (os error 2)
60.00 s
>
60.00 s
> Location:
60.00 s
> crates/alphal00p-docs-builder/src/lib.rs:2276:18
60.00 s
> stack backtrace:
60.00 s
> 0: __rustc::rust_begin_unwind
60.00 s
> 1: core::panicking::panic_fmt
60.00 s
> 2: core::result::unwrap_failed
60.00 s
> 3: alphal00p_docs_builder::tests::write_test_portal
60.00 s
> 4: alphal00p_docs_builder::tests::portal_task_chooser_routes_each_goal_to_the_registered_quickstart
60.00 s
> 5: <alphal00p_docs_builder::tests::portal_task_chooser_routes_each_goal_to_the_registered_quickstart::{closure#0} as core::ops::function::FnOnce<()>>::call_once
60.00 s
> note: Some details are omitted, run with `RUST_BACKTRACE=full` for a verbose backtrace.
60.00 s
> system-out
60.00 s
> running 1 test
60.00 s
> test tests::portal_task_chooser_routes_each_goal_to_the_registered_quickstart ... FAILED
60.00 s
>
60.00 s
> failures:
60.00 s
>
60.00 s
> failures:
60.00 s
> tests::portal_task_chooser_routes_each_goal_to_the_registered_quickstart
60.00 s
>
60.00 s
> test result: FAILED. 0 passed; 1 failed; 0 ignored; 0 measured; 128 filtered out; finished in 0.00s
60.00 s
> system-err
60.00 s
> thread 'tests::portal_task_chooser_routes_each_goal_to_the_registered_quickstart' (443) panicked at crates/alphal00p-docs-builder/src/lib.rs:9684:14:
60.00 s
> called `Result::unwrap()` on an `Err` value: failed to copy documentation asset crates/spynso3/typst/STIXTwoMath-Regular.woff2
60.00 s
>
60.00 s
> Caused by:
60.00 s
> No such file or directory (os error 2)
60.00 s
>
60.00 s
> Location:
60.00 s
> crates/alphal00p-docs-builder/src/lib.rs:2276:18
60.00 s
> stack backtrace:
60.00 s
> 0: __rustc::rust_begin_unwind
60.00 s
> 1: core::panicking::panic_fmt
60.00 s
> 2: core::result::unwrap_failed
60.00 s
> 3: alphal00p_docs_builder::tests::write_test_portal
60.00 s
> 4: alphal00p_docs_builder::tests::portal_task_chooser_routes_each_goal_to_the_registered_quickstart
60.00 s
> 5: <alphal00p_docs_builder::tests::portal_task_chooser_routes_each_goal_to_the_registered_quickstart::{closure#0} as core::ops::function::FnOnce<()>>::call_once
60.00 s
> note: Some details are omitted, run with `RUST_BACKTRACE=full` for a verbose backtrace.
60.00 s
>
60.00 s
> 6. alphal00p-docs-builder::tests::checked_in_registry_is_valid
60.00 s
> failure: test failure with exit code 101
60.00 s
> thread 'tests::checked_in_registry_is_valid' (214) panicked at crates/alphal00p-docs-builder/src/lib.rs:12260:50:
60.00 s
> called `Result::unwrap()` on an `Err` value: required documentation source is missing: /build/source/crates/spynso3/typst/STIXTwoMath-Regular.woff2
60.00 s
>
60.00 s
> Location:
60.00 s
> crates/alphal00p-docs-builder/src/lib.rs:5103:9
60.00 s
> stack backtrace:
60.00 s
> 0: __rustc::rust_begin_unwind
60.00 s
> 1: core::panicking::panic_fmt
60.00 s
> 2: core::result::unwrap_failed
60.00 s
> 3: alphal00p_docs_builder::tests::checked_in_registry_is_valid
60.00 s
> 4: <alphal00p_docs_builder::tests::checked_in_registry_is_valid::{closure#0} as core::ops::function::FnOnce<()>>::call_once
60.00 s
> note: Some details are omitted, run with `RUST_BACKTRACE=full` for a verbose backtrace.
60.00 s
> system-out
60.00 s
> running 1 test
60.00 s
> test tests::checked_in_registry_is_valid ... FAILED
60.00 s
>
60.00 s
> failures:
60.00 s
>
60.00 s
> failures:
60.00 s
> tests::checked_in_registry_is_valid
60.00 s
>
60.00 s
> test result: FAILED. 0 passed; 1 failed; 0 ignored; 0 measured; 128 filtered out; finished in 0.11s
60.00 s
> system-err
60.00 s
> thread 'tests::checked_in_registry_is_valid' (214) panicked at crates/alphal00p-docs-builder/src/lib.rs:12260:50:
60.00 s
> called `Result::unwrap()` on an `Err` value: required documentation source is missing: /build/source/crates/spynso3/typst/STIXTwoMath-Regular.woff2
60.00 s
>
60.00 s
> Location:
60.00 s
> crates/alphal00p-docs-builder/src/lib.rs:5103:9
60.00 s
> stack backtrace:
60.00 s
> 0: __rustc::rust_begin_unwind
60.00 s
> 1: core::panicking::panic_fmt
60.00 s
> 2: core::result::unwrap_failed
60.00 s
> 3: alphal00p_docs_builder::tests::checked_in_registry_is_valid
60.00 s
> 4: <alphal00p_docs_builder::tests::checked_in_registry_is_valid::{closure#0} as core::ops::function::FnOnce<()>>::call_once
60.00 s
> note: Some details are omitted, run with `RUST_BACKTRACE=full` for a verbose backtrace.
60.00 s
>
60.00 s
> 7. alphal00p-docs-builder::tests::site_assets_replace_read_only_generated_files
60.00 s
> failure: test failure with exit code 101
60.00 s
> thread 'tests::site_assets_replace_read_only_generated_files' (669) panicked at crates/alphal00p-docs-builder/src/lib.rs:12305:50:
60.00 s
> called `Result::unwrap()` on an `Err` value: failed to copy documentation asset crates/spynso3/typst/STIXTwoMath-Regular.woff2
60.00 s
>
60.00 s
> Caused by:
60.00 s
> No such file or directory (os error 2)
60.00 s
>
60.00 s
> Location:
60.00 s
> crates/alphal00p-docs-builder/src/lib.rs:2276:18
60.00 s
> stack backtrace:
60.00 s
> 0: __rustc::rust_begin_unwind
60.00 s
> 1: core::panicking::panic_fmt
60.00 s
> 2: core::result::unwrap_failed
60.00 s
> 3: alphal00p_docs_builder::tests::site_assets_replace_read_only_generated_files
60.00 s
> 4: <alphal00p_docs_builder::tests::site_assets_replace_read_only_generated_files::{closure#0} as core::ops::function::FnOnce<()>>::call_once
60.00 s
> note: Some details are omitted, run with `RUST_BACKTRACE=full` for a verbose backtrace.
60.00 s
> system-out
60.00 s
> running 1 test
60.00 s
> test tests::site_assets_replace_read_only_generated_files ... FAILED
60.00 s
>
60.00 s
> failures:
60.00 s
>
60.00 s
> failures:
60.00 s
> tests::site_assets_replace_read_only_generated_files
60.00 s
>
60.00 s
> test result: FAILED. 0 passed; 1 failed; 0 ignored; 0 measured; 128 filtered out; finished in 0.00s
60.00 s
> system-err
60.00 s
> thread 'tests::site_assets_replace_read_only_generated_files' (669) panicked at crates/alphal00p-docs-builder/src/lib.rs:12305:50:
60.00 s
> called `Result::unwrap()` on an `Err` value: failed to copy documentation asset crates/spynso3/typst/STIXTwoMath-Regular.woff2
60.00 s
>
60.00 s
> Caused by:
60.00 s
> No such file or directory (os error 2)
60.00 s
>
60.00 s
> Location:
60.00 s
> crates/alphal00p-docs-builder/src/lib.rs:2276:18
60.00 s
> stack backtrace:
60.00 s
> 0: __rustc::rust_begin_unwind
60.00 s
> 1: core::panicking::panic_fmt
60.00 s
> 2: core::result::unwrap_failed
60.00 s
> 3: alphal00p_docs_builder::tests::site_assets_replace_read_only_generated_files
60.00 s
> 4: <alphal00p_docs_builder::tests::site_assets_replace_read_only_generated_files::{closure#0} as core::ops::function::FnOnce<()>>::call_once
60.00 s
> note: Some details are omitted, run with `RUST_BACKTRACE=full` for a verbose backtrace.
60.00 s
>
60.00 s
> 8. alphal00p-docs-builder::tests::developer_scope_ranges_ignore_unrelated_edits_and_warn_only_while_watching
60.00 s
> failure: test failure with exit code 101
60.00 s
> thread 'tests::developer_scope_ranges_ignore_unrelated_edits_and_warn_only_while_watching' (278) panicked at crates/alphal00p-docs-builder/src/lib.rs:12350:29:
60.00 s
> called `Result::unwrap()` on an `Err` value: required documentation source is missing: /build/source/crates/spynso3/typst/STIXTwoMath-Regular.woff2
60.00 s
>
60.00 s
> Location:
60.00 s
> crates/alphal00p-docs-builder/src/lib.rs:5103:9
60.00 s
> stack backtrace:
60.00 s
> 0: __rustc::rust_begin_unwind
60.00 s
> 1: core::panicking::panic_fmt
60.00 s
> 2: core::result::unwrap_failed
60.00 s
> 3: alphal00p_docs_builder::tests::developer_scope_ranges_ignore_unrelated_edits_and_warn_only_while_watching
60.00 s
> 4: <alphal00p_docs_builder::tests::developer_scope_ranges_ignore_unrelated_edits_and_warn_only_while_watching::{closure#0} as core::ops::function::FnOnce<()>>::call_once
60.00 s
> note: Some details are omitted, run with `RUST_BACKTRACE=full` for a verbose backtrace.
60.00 s
> system-out
60.00 s
> running 1 test
60.00 s
> test tests::developer_scope_ranges_ignore_unrelated_edits_and_warn_only_while_watching ... FAILED
60.00 s
>
60.00 s
> failures:
60.00 s
>
60.00 s
> failures:
60.00 s
> tests::developer_scope_ranges_ignore_unrelated_edits_and_warn_only_while_watching
60.00 s
>
60.00 s
> test result: FAILED. 0 passed; 1 failed; 0 ignored; 0 measured; 128 filtered out; finished in 0.11s
60.00 s
> system-err
60.00 s
> thread 'tests::developer_scope_ranges_ignore_unrelated_edits_and_warn_only_while_watching' (278) panicked at crates/alphal00p-docs-builder/src/lib.rs:12350:29:
60.00 s
> called `Result::unwrap()` on an `Err` value: required documentation source is missing: /build/source/crates/spynso3/typst/STIXTwoMath-Regular.woff2
60.00 s
>
60.00 s
> Location:
60.00 s
> crates/alphal00p-docs-builder/src/lib.rs:5103:9
60.00 s
> stack backtrace:
60.00 s
> 0: __rustc::rust_begin_unwind
60.00 s
> 1: core::panicking::panic_fmt
60.00 s
> 2: core::result::unwrap_failed
60.00 s
> 3: alphal00p_docs_builder::tests::developer_scope_ranges_ignore_unrelated_edits_and_warn_only_while_watching
60.00 s
> 4: <alphal00p_docs_builder::tests::developer_scope_ranges_ignore_unrelated_edits_and_warn_only_while_watching::{closure#0} as core::ops::function::FnOnce<()>>::call_once
60.00 s
> note: Some details are omitted, run with `RUST_BACKTRACE=full` for a verbose backtrace.
60.00 s
>
60.00 s
> 9. alphal00p-docs-builder::provenance_tests::each_build_captures_one_revision_before_rendering
60.00 s
> failure: test failure with exit code 101
60.00 s
> thread 'provenance_tests::each_build_captures_one_revision_before_rendering' (218) panicked at crates/alphal00p-docs-builder/src/provenance_tests.rs:274:9:
60.00 s
> assertion failed: command.status().unwrap().success()
60.00 s
> stack backtrace:
60.00 s
> 0: __rustc::rust_begin_unwind
60.00 s
> 1: core::panicking::panic_fmt
60.00 s
> 2: core::panicking::panic
60.00 s
> 3: alphal00p_docs_builder::provenance_tests::each_build_captures_one_revision_before_rendering
60.00 s
> 4: <alphal00p_docs_builder::provenance_tests::each_build_captures_one_revision_before_rendering::{closure#0} as core::ops::function::FnOnce<()>>::call_once
60.00 s
> note: Some details are omitted, run with `RUST_BACKTRACE=full` for a verbose backtrace.
60.00 s
> system-out
60.00 s
> running 1 test
60.00 s
>
60.00 s
> running 1 test
60.00 s
> test provenance_tests::each_build_captures_one_revision_before_rendering ... FAILED
60.00 s
>
60.00 s
> failures:
60.00 s
>
60.00 s
> failures:
60.00 s
> provenance_tests::each_build_captures_one_revision_before_rendering
60.00 s
>
60.00 s
> test result: FAILED. 0 passed; 1 failed; 0 ignored; 0 measured; 128 filtered out; finished in 0.11s
60.00 s
>
60.00 s
> test provenance_tests::each_build_captures_one_revision_before_rendering ... FAILED
60.00 s
>
60.00 s
> failures:
60.00 s
>
60.00 s
> failures:
60.00 s
> provenance_tests::each_build_captures_one_revision_before_rendering
60.00 s
>
60.00 s
> test result: FAILED. 0 passed; 1 failed; 0 ignored; 0 measured; 128 filtered out; finished in 0.13s
60.00 s
> system-err
60.00 s
> thread 'provenance_tests::each_build_captures_one_revision_before_rendering' (284) panicked at crates/alphal00p-docs-builder/src/provenance_tests.rs:297:14:
60.00 s
> called `Result::unwrap()` on an `Err` value: required documentation source is missing: /build/source/target/nix-ci-tmp/.tmpAH3uti/checkout/crates/spynso3/typst/STIXTwoMath-Regular.woff2
60.00 s
>
60.00 s
> Location:
60.00 s
> crates/alphal00p-docs-builder/src/lib.rs:5103:9
60.00 s
> stack backtrace:
60.00 s
> 0: __rustc::rust_begin_unwind
60.00 s
> 1: core::panicking::panic_fmt
60.00 s
> 2: core::result::unwrap_failed
60.00 s
> 3: alphal00p_docs_builder::provenance_tests::each_build_captures_one_revision_before_rendering
60.00 s
> 4: <alphal00p_docs_builder::provenance_tests::each_build_captures_one_revision_before_rendering::{closure#0} as core::ops::function::FnOnce<()>>::call_once
60.00 s
> note: Some details are omitted, run with `RUST_BACKTRACE=full` for a verbose backtrace.
60.00 s
>
60.00 s
> thread 'provenance_tests::each_build_captures_one_revision_before_rendering' (218) panicked at crates/alphal00p-docs-builder/src/provenance_tests.rs:274:9:
60.00 s
> assertion failed: command.status().unwrap().success()
60.00 s
> stack backtrace:
60.00 s
> 0: __rustc::rust_begin_unwind
60.00 s
> 1: core::panicking::panic_fmt
60.00 s
> 2: core::panicking::panic
60.00 s
> 3: alphal00p_docs_builder::provenance_tests::each_build_captures_one_revision_before_rendering
60.00 s
> 4: <alphal00p_docs_builder::provenance_tests::each_build_captures_one_revision_before_rendering::{closure#0} as core::ops::function::FnOnce<()>>::call_once
60.00 s
> note: Some details are omitted, run with `RUST_BACKTRACE=full` for a verbose backtrace.
60.00 s
>
60.00 s
> 10. alphal00p-docs-builder::tests::every_product_requires_a_task_chooser_and_each_supported_interface
60.00 s
> failure: test failure with exit code 101
60.00 s
> thread 'tests::every_product_requires_a_task_chooser_and_each_supported_interface' (312) panicked at crates/alphal00p-docs-builder/src/lib.rs:12274:9:
60.00 s
> assertion failed: format!("{error:#}").contains("has no quickstart page")
60.00 s
> stack backtrace:
60.00 s
> 0: __rustc::rust_begin_unwind
60.00 s
> 1: core::panicking::panic_fmt
60.00 s
> 2: core::panicking::panic
60.00 s
> 3: alphal00p_docs_builder::tests::every_product_requires_a_task_chooser_and_each_supported_interface
60.00 s
> 4: <alphal00p_docs_builder::tests::every_product_requires_a_task_chooser_and_each_supported_interface::{closure#0} as core::ops::function::FnOnce<()>>::call_once
60.00 s
> note: Some details are omitted, run with `RUST_BACKTRACE=full` for a verbose backtrace.
60.00 s
> system-out
60.00 s
> running 1 test
60.00 s
> test tests::every_product_requires_a_task_chooser_and_each_supported_interface ... FAILED
60.00 s
>
60.00 s
> failures:
60.00 s
>
60.00 s
> failures:
60.00 s
> tests::every_product_requires_a_task_chooser_and_each_supported_interface
60.00 s
>
60.00 s
> test result: FAILED. 0 passed; 1 failed; 0 ignored; 0 measured; 128 filtered out; finished in 0.12s
60.00 s
> system-err
60.00 s
> thread 'tests::every_product_requires_a_task_chooser_and_each_supported_interface' (312) panicked at crates/alphal00p-docs-builder/src/lib.rs:12274:9:
60.00 s
> assertion failed: format!("{error:#}").contains("has no quickstart page")
60.00 s
> stack backtrace:
60.00 s
> 0: __rustc::rust_begin_unwind
60.00 s
> 1: core::panicking::panic_fmt
60.00 s
> 2: core::panicking::panic
60.00 s
> 3: alphal00p_docs_builder::tests::every_product_requires_a_task_chooser_and_each_supported_interface
60.00 s
> 4: <alphal00p_docs_builder::tests::every_product_requires_a_task_chooser_and_each_supported_interface::{closure#0} as core::ops::function::FnOnce<()>>::call_once
60.00 s
> note: Some details are omitted, run with `RUST_BACKTRACE=full` for a verbose backtrace.
60.00 s
>
60.00 s
> 11. alphal00p-docs-builder::tests::pdf_manual_chapter_order_must_match_the_page_registry
60.00 s
> failure: test failure with exit code 101
60.00 s
> thread 'tests::pdf_manual_chapter_order_must_match_the_page_registry' (397) panicked at crates/alphal00p-docs-builder/src/lib.rs:12330:9:
60.00 s
> assertion failed: format!("{error:#}").contains("PDF manual chapter order differs")
60.00 s
> stack backtrace:
60.00 s
> 0: __rustc::rust_begin_unwind
60.00 s
> 1: core::panicking::panic_fmt
60.00 s
> 2: core::panicking::panic
60.00 s
> 3: alphal00p_docs_builder::tests::pdf_manual_chapter_order_must_match_the_page_registry
60.00 s
> 4: <alphal00p_docs_builder::tests::pdf_manual_chapter_order_must_match_the_page_registry::{closure#0} as core::ops::function::FnOnce<()>>::call_once
60.00 s
> note: Some details are omitted, run with `RUST_BACKTRACE=full` for a verbose backtrace.
60.00 s
> system-out
60.00 s
> running 1 test
60.00 s
> test tests::pdf_manual_chapter_order_must_match_the_page_registry ... FAILED
60.00 s
>
60.00 s
> failures:
60.00 s
>
60.00 s
> failures:
60.00 s
> tests::pdf_manual_chapter_order_must_match_the_page_registry
60.00 s
>
60.00 s
> test result: FAILED. 0 passed; 1 failed; 0 ignored; 0 measured; 128 filtered out; finished in 0.11s
60.00 s
> system-err
60.00 s
> thread 'tests::pdf_manual_chapter_order_must_match_the_page_registry' (397) panicked at crates/alphal00p-docs-builder/src/lib.rs:12330:9:
60.00 s
> assertion failed: format!("{error:#}").contains("PDF manual chapter order differs")
60.00 s
> stack backtrace:
60.00 s
> 0: __rustc::rust_begin_unwind
60.00 s
> 1: core::panicking::panic_fmt
60.00 s
> 2: core::panicking::panic
60.00 s
> 3: alphal00p_docs_builder::tests::pdf_manual_chapter_order_must_match_the_page_registry
60.00 s
> 4: <alphal00p_docs_builder::tests::pdf_manual_chapter_order_must_match_the_page_registry::{closure#0} as core::ops::function::FnOnce<()>>::call_once
60.00 s
> note: Some details are omitted, run with `RUST_BACKTRACE=full` for a verbose backtrace.
60.00 s
> =========================================
60.00 s
> Extracting 2 binaries to /build/source
60.00 s
> Extracted 5 files to /build/source in 0.04s
60.00 s
> ------------
60.00 s
> Nextest run ID cc6692dc-2123-4448-be1f-d87456592287 with nextest profile: ci_gammaloop
60.00 s
> Starting 22 tests across 2 binaries
60.00 s
> ------------
60.00 s
> Summary [ 0.018s] 22 tests run: 22 passed , 0 skipped
60.00 s
>
60.00 s
> ========== nextest test summary ==========
60.00 s
> report: target/nextest/ci_gammaloop/junit.xml
60.00 s
> tests: 22, failures: 0, errors: 0
60.00 s
> No failing testcases found.
60.00 s
> =========================================
60.00 s
> Extracting 3 binaries (including 2 non-test binaries), 1 build script output directory, and 2 linked paths to /build/source
60.00 s
> Extracted 22 files to /build/source in 0.27s
60.00 s
> ------------
60.00 s
> Nextest run ID 0876bde2-8b11-4b7a-b730-1866a64edca0 with nextest profile: ci_gammaloop
60.00 s
> Starting 89 tests across 1 binary
60.00 s
> ------------
60.00 s
> Summary [ 0.038s] 89 tests run: 89 passed , 0 skipped
60.00 s
>
60.00 s
> ========== nextest test summary ==========
60.00 s
> report: target/nextest/ci_gammaloop/junit.xml
60.00 s
> tests: 89, failures: 0, errors: 0
60.00 s
> No failing testcases found.
60.00 s
> =========================================
60.00 s
> Extracting 2 binaries to /build/source
60.00 s
> Extracted 5 files to /build/source in 0.04s
60.00 s
> ------------
60.00 s
> Nextest run ID 620f1710-85a5-4d7d-af32-5d3fb6680747 with nextest profile: ci_gammaloop
60.00 s
> Starting 10 tests across 2 binaries
60.00 s
> ------------
60.00 s
> Summary [ 12.227s] 10 tests run: 10 passed , 0 skipped
60.00 s
>
60.00 s
> ========== nextest test summary ==========
60.00 s
> report: target/nextest/ci_gammaloop/junit.xml
60.00 s
> tests: 10, failures: 0, errors: 0
60.00 s
> No failing testcases found.
60.00 s
> =========================================
60.00 s
> Extracting 1 binary to /build/source
60.00 s
> Extracted 4 files to /build/source in 0.04s
60.00 s
> ------------
60.00 s
> Nextest run ID 554cdea1-98e0-4eb0-abed-7931a71a921a with nextest profile: ci_gammaloop
60.00 s
> Starting 0 tests across 1 binary
60.00 s
> ------------
60.00 s
> Summary [ 0.000s] 0 tests run: 0 passed , 0 skipped
60.00 s
>
60.00 s
> ========== nextest test summary ==========
60.00 s
> report: target/nextest/ci_gammaloop/junit.xml
60.00 s
> tests: 0, failures: 0, errors: 0
60.00 s
> No failing testcases found.
60.00 s
> =========================================
60.00 s
> Extracting 1 binary to /build/source
60.00 s
> Extracted 4 files to /build/source in 0.04s
60.00 s
> ------------
60.00 s
> Nextest run ID 0e523ab5-b874-44f9-9ff4-56a920af0668 with nextest profile: ci_gammaloop
60.00 s
> Starting 5 tests across 1 binary
60.00 s
> ------------
60.00 s
> Summary [ 0.006s] 5 tests run: 5 passed , 0 skipped
60.00 s
>
60.00 s
> ========== nextest test summary ==========
60.00 s
> report: target/nextest/ci_gammaloop/junit.xml
60.00 s
> tests: 5, failures: 0, errors: 0
60.00 s
> No failing testcases found.
60.00 s
> =========================================
60.00 s
For full logs, run:
60.00 s
nix log /nix/store/yhcpczfzd32fj8slcs1lsa10nlfs6yzl-gammaloop-nextest-docs.drv
60.20 s
[5 built (1 failed ), 120 Run failed.