test packages.x86_64-linux.nix-ci-check-gammaloop-doctest

Reproduce this run
Original Run
  1. 0.32 s $ /nix/store/9ypz3flqsrl5xl495mm8h645gadjsxi1-coreutils-9.11/bin/timeout --kill-after=15s 7200s /nix/store/23zk8sgzamrbmj1fday15szf7f2279s8-nix-2.34.7/bin/nix --extra-experimental-features nix-command --extra-experimental-features flakes flake clone git+https://github.com/alphal00p/gammaloop --dest /tmp/nix-ci-worker/stable-pwd/repo/
  2. 0.36 s Cloning into '/tmp/nix-ci-worker/stable-pwd/repo'...
  3. 1.17 s remote: Enumerating objects: 66372, done.
  4. 1.44 s remote: Counting objects: 0% (1/9023) remote: Counting objects: 1% (91/9023) remote: Counting objects: 2% (181/9023) remote: Counting objects: 3% (271/9023) remote: Counting objects: 4% (361/9023) remote: Counting objects: 5% (452/9023) remote: Counting objects: 6% (542/9023) remote: Counting objects: 7% (632/9023) remote: Counting objects: 8% (722/9023) remote: Counting objects: 9% (813/9023) remote: Counting objects: 10% (903/9023) remote: Counting objects: 11% (993/9023) remote: Counting objects: 12% (1083/9023) remote: Counting objects: 13% (1173/9023) remote: Counting objects: 14% (1264/9023) remote: Counting objects: 15% (1354/9023) remote: Counting objects: 16% (1444/9023) remote: Counting objects: 17% (1534/9023) remote: Counting objects: 18% (1625/9023) remote: Counting objects: 19% (1715/9023) remote: Counting objects: 20% (1805/9023) remote: Counting objects: 21% (1895/9023) remote: Counting objects: 22% (1986/9023) remote: Counting objects: 23% (2076/9023) remote: Counting objects: 24% (2166/9023) remote: Counting objects: 25% (2256/9023) remote: Counting objects: 26% (2346/9023) remote: Counting objects: 27% (2437/9023) remote: Counting objects: 28% (2527/9023) remote: Counting objects: 29% (2617/9023) remote: Counting objects: 30% (2707/9023) remote: Counting objects: 31% (2798/9023) remote: Counting objects: 32% (2888/9023) remote: Counting objects: 33% (2978/9023) remote: Counting objects: 34% (3068/9023) remote: Counting objects: 35% (3159/9023) remote: Counting objects: 36% (3249/9023) remote: Counting objects: 37% (3339/9023) remote: Counting objects: 38% (3429/9023) remote: Counting objects: 39% (3519/9023) remote: Counting objects: 40% (3610/9023) remote: Counting objects: 41% (3700/9023) remote: Counting objects: 42% (3790/9023) remote: Counting objects: 43% (3880/9023) remote: Counting objects: 44% (3971/9023) remote: Counting objects: 45% (4061/9023) remote: Counting objects: 46% (4151/9023) remote: Counting objects: 47% (4241/9023) remote: Counting objects: 48% (4332/9023) remote: Counting objects: 49% (4422/9023) remote: Counting objects: 50% (4512/9023) remote: Counting objects: 51% (4602/9023) remote: Counting objects: 52% (4692/9023) remote: Counting objects: 53% (4783/9023) remote: Counting objects: 54% (4873/9023) remote: Counting objects: 55% (4963/9023) remote: Counting objects: 56% (5053/9023) remote: Counting objects: 57% (5144/9023) remote: Counting objects: 58% (5234/9023) remote: Counting objects: 59% (5324/9023) remote: Counting objects: 60% (5414/9023) remote: Counting objects: 61% (5505/9023) remote: Counting objects: 62% (5595/9023) remote: Counting objects: 63% (5685/9023) remote: Counting objects: 64% (5775/9023) remote: Counting objects: 65% (5865/9023) remote: Counting objects: 66% (5956/9023) remote: Counting objects: 67% (6046/9023) remote: Counting objects: 68% (6136/9023) remote: Counting objects: 69% (6226/9023) remote: Counting objects: 70% (6317/9023) remote: Counting objects: 71% (6407/9023) remote: Counting objects: 72% (6497/9023) remote: Counting objects: 73% (6587/9023) remote: Counting objects: 74% (6678/9023) remote: Counting objects: 75% (6768/9023) remote: Counting objects: 76% (6858/9023) remote: Counting objects: 77% (6948/9023) remote: Counting objects: 78% (7038/9023) remote: Counting objects: 79% (7129/9023) remote: Counting objects: 80% (7219/9023) remote: Counting objects: 81% (7309/9023) remote: Counting objects: 82% (7399/9023) remote: Counting objects: 83% (7490/9023) remote: Counting objects: 84% (7580/9023) remote: Counting objects: 85% (7670/9023) remote: Counting objects: 86% (7760/9023) remote: Counting objects: 87% (7851/9023) remote: Counting objects: 88% (7941/9023) remote: Counting objects: 89% (8031/9023) remote: Counting objects: 90% (8121/9023) remote: Counting objects: 91% (8211/9023) remote: Counting objects: 92% (8302/9023) remote: Counting objects: 93% (8392/9023) remote: Counting objects: 94% (8482/9023) remote: Counting objects: 95% (8572/9023) remote: Counting objects: 96% (8663/9023) remote: Counting objects: 97% (8753/9023) remote: Counting objects: 98% (8843/9023) remote: Counting objects: 99% (8933/9023) remote: Counting objects: 100% (9023/9023) remote: Counting objects: 100% (9023/9023), done.
  5. 3.91 s remote: Compressing objects: 0% (1/2128) remote: Compressing objects: 1% (22/2128) remote: Compressing objects: 2% (43/2128) remote: Compressing objects: 3% (64/2128) remote: Compressing objects: 4% (86/2128) remote: Compressing objects: 5% (107/2128) remote: Compressing objects: 6% (128/2128) remote: Compressing objects: 7% (149/2128) remote: Compressing objects: 8% (171/2128) remote: Compressing objects: 9% (192/2128) remote: Compressing objects: 10% (213/2128) remote: Compressing objects: 11% (235/2128) remote: Compressing objects: 12% (256/2128) remote: Compressing objects: 13% (277/2128) remote: Compressing objects: 14% (298/2128) remote: Compressing objects: 15% (320/2128) remote: Compressing objects: 16% (341/2128) remote: Compressing objects: 17% (362/2128) remote: Compressing objects: 18% (384/2128) remote: Compressing objects: 19% (405/2128) remote: Compressing objects: 20% (426/2128) remote: Compressing objects: 20% (443/2128) remote: Compressing objects: 21% (447/2128) remote: Compressing objects: 22% (469/2128) remote: Compressing objects: 23% (490/2128) remote: Compressing objects: 24% (511/2128) remote: Compressing objects: 25% (532/2128) remote: Compressing objects: 26% (554/2128) remote: Compressing objects: 26% (569/2128) remote: Compressing objects: 27% (575/2128) remote: Compressing objects: 28% (596/2128) remote: Compressing objects: 29% (618/2128) remote: Compressing objects: 30% (639/2128) remote: Compressing objects: 31% (660/2128) remote: Compressing objects: 32% (681/2128) remote: Compressing objects: 33% (703/2128) remote: Compressing objects: 34% (724/2128) remote: Compressing objects: 35% (745/2128) remote: Compressing objects: 36% (767/2128) remote: Compressing objects: 37% (788/2128) remote: Compressing objects: 38% (809/2128) remote: Compressing objects: 39% (830/2128) remote: Compressing objects: 40% (852/2128) remote: Compressing objects: 41% (873/2128) remote: Compressing objects: 42% (894/2128) remote: Compressing objects: 43% (916/2128) remote: Compressing objects: 44% (937/2128) remote: Compressing objects: 45% (958/2128) remote: Compressing objects: 46% (979/2128) remote: Compressing objects: 47% (1001/2128) remote: Compressing objects: 48% (1022/2128) remote: Compressing objects: 49% (1043/2128) remote: Compressing objects: 50% (1064/2128) remote: Compressing objects: 51% (1086/2128) remote: Compressing objects: 52% (1107/2128) remote: Compressing objects: 53% (1128/2128) remote: Compressing objects: 54% (1150/2128) remote: Compressing objects: 55% (1171/2128) remote: Compressing objects: 56% (1192/2128) remote: Compressing objects: 57% (1213/2128) remote: Compressing objects: 58% (1235/2128) remote: Compressing objects: 59% (1256/2128) remote: Compressing objects: 60% (1277/2128) remote: Compressing objects: 61% (1299/2128) remote: Compressing objects: 62% (1320/2128) remote: Compressing objects: 63% (1341/2128) remote: Compressing objects: 64% (1362/2128) remote: Compressing objects: 65% (1384/2128) remote: Compressing objects: 66% (1405/2128) remote: Compressing objects: 67% (1426/2128) remote: Compressing objects: 68% (1448/2128) remote: Compressing objects: 69% (1469/2128) remote: Compressing objects: 70% (1490/2128) remote: Compressing objects: 71% (1511/2128) remote: Compressing objects: 72% (1533/2128) remote: Compressing objects: 73% (1554/2128) remote: Compressing objects: 74% (1575/2128) remote: Compressing objects: 75% (1596/2128) remote: Compressing objects: 76% (1618/2128) remote: Compressing objects: 77% (1639/2128) remote: Compressing objects: 78% (1660/2128) remote: Compressing objects: 79% (1682/2128) remote: Compressing objects: 80% (1703/2128) remote: Compressing objects: 81% (1724/2128) remote: Compressing objects: 82% (1745/2128) remote: Compressing objects: 83% (1767/2128) remote: Compressing objects: 84% (1788/2128) remote: Compressing objects: 85% (1809/2128) remote: Compressing objects: 86% (1831/2128) remote: Compressing objects: 87% (1852/2128) remote: Compressing objects: 88% (1873/2128) remote: Compressing objects: 89% (1894/2128) remote: Compressing objects: 90% (1916/2128) remote: Compressing objects: 91% (1937/2128) remote: Compressing objects: 92% (1958/2128) remote: Compressing objects: 93% (1980/2128) remote: Compressing objects: 94% (2001/2128) remote: Compressing objects: 95% (2022/2128) remote: Compressing objects: 96% (2043/2128) remote: Compressing objects: 97% (2065/2128) remote: Compressing objects: 98% (2086/2128) remote: Compressing objects: 99% (2107/2128) remote: Compressing objects: 100% (2128/2128) remote: Compressing objects: 100% (2128/2128), done.
  6. 7.14 s Receiving objects: 0% (1/66372) Receiving objects: 1% (664/66372) Receiving objects: 2% (1328/66372) Receiving objects: 3% (1992/66372) Receiving objects: 4% (2655/66372) Receiving objects: 5% (3319/66372) Receiving objects: 6% (3983/66372) Receiving objects: 7% (4647/66372) Receiving objects: 8% (5310/66372) Receiving objects: 9% (5974/66372) Receiving objects: 10% (6638/66372) Receiving objects: 11% (7301/66372), 10.56 MiB | 21.11 MiB/s Receiving objects: 12% (7965/66372), 10.56 MiB | 21.11 MiB/s Receiving objects: 13% (8629/66372), 10.56 MiB | 21.11 MiB/s Receiving objects: 14% (9293/66372), 10.56 MiB | 21.11 MiB/s Receiving objects: 15% (9956/66372), 10.56 MiB | 21.11 MiB/s Receiving objects: 16% (10620/66372), 10.56 MiB | 21.11 MiB/s Receiving objects: 17% (11284/66372), 10.56 MiB | 21.11 MiB/s Receiving objects: 18% (11947/66372), 10.56 MiB | 21.11 MiB/s Receiving objects: 19% (12611/66372), 10.56 MiB | 21.11 MiB/s Receiving objects: 20% (13275/66372), 10.56 MiB | 21.11 MiB/s Receiving objects: 21% (13939/66372), 10.56 MiB | 21.11 MiB/s Receiving objects: 22% (14602/66372), 10.56 MiB | 21.11 MiB/s Receiving objects: 23% (15266/66372), 10.56 MiB | 21.11 MiB/s Receiving objects: 24% (15930/66372), 10.56 MiB | 21.11 MiB/s Receiving objects: 25% (16593/66372), 10.56 MiB | 21.11 MiB/s Receiving objects: 26% (17257/66372), 10.56 MiB | 21.11 MiB/s Receiving objects: 27% (17921/66372), 10.56 MiB | 21.11 MiB/s Receiving objects: 28% (18585/66372), 10.56 MiB | 21.11 MiB/s Receiving objects: 29% (19248/66372), 10.56 MiB | 21.11 MiB/s Receiving objects: 30% (19912/66372), 10.56 MiB | 21.11 MiB/s Receiving objects: 31% (20576/66372), 10.56 MiB | 21.11 MiB/s Receiving objects: 32% (21240/66372), 10.56 MiB | 21.11 MiB/s Receiving objects: 33% (21903/66372), 10.56 MiB | 21.11 MiB/s Receiving objects: 34% (22567/66372), 10.56 MiB | 21.11 MiB/s Receiving objects: 35% (23231/66372), 10.56 MiB | 21.11 MiB/s Receiving objects: 36% (23894/66372), 10.56 MiB | 21.11 MiB/s Receiving objects: 37% (24558/66372), 10.56 MiB | 21.11 MiB/s Receiving objects: 38% (25222/66372), 10.56 MiB | 21.11 MiB/s Receiving objects: 39% (25886/66372), 10.56 MiB | 21.11 MiB/s Receiving objects: 40% (26549/66372), 10.56 MiB | 21.11 MiB/s Receiving objects: 41% (27213/66372), 10.56 MiB | 21.11 MiB/s Receiving objects: 42% (27877/66372), 10.56 MiB | 21.11 MiB/s Receiving objects: 43% (28540/66372), 10.56 MiB | 21.11 MiB/s Receiving objects: 44% (29204/66372), 10.56 MiB | 21.11 MiB/s Receiving objects: 45% (29868/66372), 10.56 MiB | 21.11 MiB/s Receiving objects: 46% (30532/66372), 10.56 MiB | 21.11 MiB/s Receiving objects: 47% (31195/66372), 10.56 MiB | 21.11 MiB/s Receiving objects: 47% (31549/66372), 28.88 MiB | 28.87 MiB/s Receiving objects: 48% (31859/66372), 28.88 MiB | 28.87 MiB/s Receiving objects: 49% (32523/66372), 28.88 MiB | 28.87 MiB/s Receiving objects: 50% (33186/66372), 28.88 MiB | 28.87 MiB/s Receiving objects: 51% (33850/66372), 28.88 MiB | 28.87 MiB/s Receiving objects: 52% (34514/66372), 28.88 MiB | 28.87 MiB/s Receiving objects: 53% (35178/66372), 28.88 MiB | 28.87 MiB/s Receiving objects: 54% (35841/66372), 28.88 MiB | 28.87 MiB/s Receiving objects: 55% (36505/66372), 28.88 MiB | 28.87 MiB/s Receiving objects: 56% (37169/66372), 28.88 MiB | 28.87 MiB/s Receiving objects: 57% (37833/66372), 28.88 MiB | 28.87 MiB/s Receiving objects: 58% (38496/66372), 28.88 MiB | 28.87 MiB/s Receiving objects: 59% (39160/66372), 44.52 MiB | 29.68 MiB/s Receiving objects: 60% (39824/66372), 44.52 MiB | 29.68 MiB/s Receiving objects: 61% (40487/66372), 44.52 MiB | 29.68 MiB/s Receiving objects: 62% (41151/66372), 44.52 MiB | 29.68 MiB/s Receiving objects: 63% (41815/66372), 44.52 MiB | 29.68 MiB/s Receiving objects: 64% (42479/66372), 44.52 MiB | 29.68 MiB/s Receiving objects: 65% (43142/66372), 44.52 MiB | 29.68 MiB/s Receiving objects: 66% (43806/66372), 44.52 MiB | 29.68 MiB/s Receiving objects: 67% (44470/66372), 44.52 MiB | 29.68 MiB/s Receiving objects: 68% (45133/66372), 44.52 MiB | 29.68 MiB/s Receiving objects: 69% (45797/66372), 44.52 MiB | 29.68 MiB/s Receiving objects: 70% (46461/66372), 44.52 MiB | 29.68 MiB/s Receiving objects: 71% (47125/66372), 44.52 MiB | 29.68 MiB/s Receiving objects: 71% (47292/66372), 59.63 MiB | 29.81 MiB/s Receiving objects: 72% (47788/66372), 59.63 MiB | 29.81 MiB/s Receiving objects: 73% (48452/66372), 59.63 MiB | 29.81 MiB/s Receiving objects: 74% (49116/66372), 59.63 MiB | 29.81 MiB/s Receiving objects: 75% (49779/66372), 59.63 MiB | 29.81 MiB/s Receiving objects: 76% (50443/66372), 59.63 MiB | 29.81 MiB/s Receiving objects: 77% (51107/66372), 59.63 MiB | 29.81 MiB/s Receiving objects: 78% (51771/66372), 59.63 MiB | 29.81 MiB/s Receiving objects: 79% (52434/66372), 59.63 MiB | 29.81 MiB/s Receiving objects: 80% (53098/66372), 75.96 MiB | 30.38 MiB/s Receiving objects: 81% (53762/66372), 75.96 MiB | 30.38 MiB/s Receiving objects: 82% (54426/66372), 75.96 MiB | 30.38 MiB/s Receiving objects: 83% (55089/66372), 75.96 MiB | 30.38 MiB/s Receiving objects: 84% (55753/66372), 75.96 MiB | 30.38 MiB/s Receiving objects: 85% (56417/66372), 75.96 MiB | 30.38 MiB/s Receiving objects: 86% (57080/66372), 75.96 MiB | 30.38 MiB/s Receiving objects: 87% (57744/66372), 75.96 MiB | 30.38 MiB/s Receiving objects: 88% (58408/66372), 75.96 MiB | 30.38 MiB/s Receiving objects: 89% (59072/66372), 75.96 MiB | 30.38 MiB/s Receiving objects: 90% (59735/66372), 75.96 MiB | 30.38 MiB/s Receiving objects: 91% (60399/66372), 75.96 MiB | 30.38 MiB/s Receiving objects: 92% (61063/66372), 75.96 MiB | 30.38 MiB/s Receiving objects: 93% (61726/66372), 75.96 MiB | 30.38 MiB/s Receiving objects: 94% (62390/66372), 75.96 MiB | 30.38 MiB/s Receiving objects: 95% (63054/66372), 75.96 MiB | 30.38 MiB/s Receiving objects: 96% (63718/66372), 75.96 MiB | 30.38 MiB/s Receiving objects: 97% (64381/66372), 75.96 MiB | 30.38 MiB/s Receiving objects: 98% (65045/66372), 75.96 MiB | 30.38 MiB/s Receiving objects: 99% (65709/66372), 75.96 MiB | 30.38 MiB/s Receiving objects: 99% (66105/66372), 91.85 MiB | 30.61 MiB/s remote: Total 66372 (delta 7293), reused 7260 (delta 6608), pack-reused 57349 (from 1)
  7. 7.21 s Receiving objects: 100% (66372/66372), 91.85 MiB | 30.61 MiB/s Receiving objects: 100% (66372/66372), 98.65 MiB | 30.73 MiB/s, done.
  8. 7.84 s Resolving deltas: 0% (0/46411) Resolving deltas: 1% (465/46411) Resolving deltas: 2% (929/46411) Resolving deltas: 3% (1393/46411) Resolving deltas: 4% (1858/46411) Resolving deltas: 5% (2321/46411) Resolving deltas: 6% (2789/46411) Resolving deltas: 7% (3249/46411) Resolving deltas: 8% (3713/46411) Resolving deltas: 9% (4177/46411) Resolving deltas: 10% (4642/46411) Resolving deltas: 11% (5107/46411) Resolving deltas: 12% (5572/46411) Resolving deltas: 13% (6034/46411) Resolving deltas: 14% (6498/46411) Resolving deltas: 15% (6962/46411) Resolving deltas: 16% (7426/46411) Resolving deltas: 17% (7890/46411) Resolving deltas: 18% (8354/46411) Resolving deltas: 19% (8819/46411) Resolving deltas: 20% (9284/46411) Resolving deltas: 21% (9749/46411) Resolving deltas: 22% (10211/46411) Resolving deltas: 23% (10675/46411) Resolving deltas: 24% (11142/46411) Resolving deltas: 25% (11603/46411) Resolving deltas: 26% (12068/46411) Resolving deltas: 27% (12531/46411) Resolving deltas: 28% (12996/46411) Resolving deltas: 29% (13460/46411) Resolving deltas: 30% (13924/46411) Resolving deltas: 31% (14388/46411) Resolving deltas: 32% (14854/46411) Resolving deltas: 33% (15316/46411) Resolving deltas: 34% (15780/46411) Resolving deltas: 35% (16244/46411) Resolving deltas: 36% (16708/46411) Resolving deltas: 37% (17176/46411) Resolving deltas: 38% (17637/46411) Resolving deltas: 39% (18101/46411) Resolving deltas: 40% (18565/46411) Resolving deltas: 41% (19029/46411) Resolving deltas: 42% (19493/46411) Resolving deltas: 43% (19957/46411) Resolving deltas: 44% (20423/46411) Resolving deltas: 45% (20886/46411) Resolving deltas: 46% (21350/46411) Resolving deltas: 47% (21814/46411) Resolving deltas: 48% (22281/46411) Resolving deltas: 49% (22742/46411) Resolving deltas: 50% (23208/46411) Resolving deltas: 51% (23670/46411) Resolving deltas: 52% (24134/46411) Resolving deltas: 53% (24598/46411) Resolving deltas: 54% (25062/46411) Resolving deltas: 55% (25528/46411) Resolving deltas: 56% (25992/46411) Resolving deltas: 57% (26456/46411) Resolving deltas: 58% (26920/46411) Resolving deltas: 59% (27384/46411) Resolving deltas: 60% (27848/46411) Resolving deltas: 61% (28314/46411) Resolving deltas: 62% (28776/46411) Resolving deltas: 63% (29239/46411) Resolving deltas: 64% (29704/46411) Resolving deltas: 65% (30168/46411) Resolving deltas: 66% (30632/46411) Resolving deltas: 67% (31096/46411) Resolving deltas: 68% (31560/46411) Resolving deltas: 69% (32024/46411) Resolving deltas: 70% (32488/46411) Resolving deltas: 71% (32952/46411) Resolving deltas: 72% (33416/46411) Resolving deltas: 73% (33881/46411) Resolving deltas: 74% (34345/46411) Resolving deltas: 75% (34809/46411) Resolving deltas: 76% (35273/46411) Resolving deltas: 77% (35737/46411) Resolving deltas: 78% (36201/46411) Resolving deltas: 79% (36665/46411) Resolving deltas: 80% (37129/46411) Resolving deltas: 81% (37593/46411) Resolving deltas: 82% (38058/46411) Resolving deltas: 83% (38523/46411) Resolving deltas: 84% (38986/46411) Resolving deltas: 85% (39450/46411) Resolving deltas: 86% (39914/46411) Resolving deltas: 87% (40378/46411) Resolving deltas: 88% (40842/46411) Resolving deltas: 89% (41306/46411) Resolving deltas: 90% (41772/46411) Resolving deltas: 91% (42235/46411) Resolving deltas: 92% (42699/46411) Resolving deltas: 93% (43163/46411) Resolving deltas: 94% (43627/46411) Resolving deltas: 95% (44092/46411) Resolving deltas: 96% (44555/46411) Resolving deltas: 97% (45019/46411) Resolving deltas: 98% (45483/46411) Resolving deltas: 99% (45947/46411) Resolving deltas: 100% (46411/46411) Resolving deltas: 100% (46411/46411), done.
  9. 8.53 s Fetching commit 63073375d37e632f4b7021a2cf030b3a85d47360 for feynkit ...
  10. 8.53 s $ /nix/store/bcnisk3ydfgv26v2gw3zlky24g00yww2-git-2.54.0/bin/git fetch origin 63073375d37e632f4b7021a2cf030b3a85d47360
  11. 9.02 s From https://github.com/alphal00p/gammaloop
  12. 9.02 s * branch 63073375d37e632f4b7021a2cf030b3a85d47360 -> FETCH_HEAD
  13. 9.03 s $ /nix/store/9ypz3flqsrl5xl495mm8h645gadjsxi1-coreutils-9.11/bin/timeout --kill-after=15s 7200s /nix/store/bcnisk3ydfgv26v2gw3zlky24g00yww2-git-2.54.0/bin/git -c advice.detachedHead=false checkout 63073375d37e632f4b7021a2cf030b3a85d47360
  14. 9.21 s HEAD is now at 63073375d make feynkit tensor reduction default
  15. 9.21 s $ /nix/store/9ypz3flqsrl5xl495mm8h645gadjsxi1-coreutils-9.11/bin/timeout --kill-after=15s 7200s /nix/store/23zk8sgzamrbmj1fday15szf7f2279s8-nix-2.34.7/bin/nix --extra-experimental-features nix-command --extra-experimental-features flakes --log-format internal-json run .#packages.x86_64-linux.nix-ci-check-gammaloop-doctest --print-build-logs
  16. 9.32 s
  17. 11.24 s evaluating derivation 'g copying '/nix/store/hphc [0/1 built] [1/0/1 built] building ggammaloop-workspace-doctest> Running phase: unpackPhase
  18. 11.24 s gammaloop-workspace-doctest> unpacking source archive /nix/store/izmk7p64ksm1ga41kxchvc0054lwrb7s-source
  19. 11.34 s gammaloop-workspace-doctest> source root is source
  20. 11.36 s gammaloop-workspace-doctest> Running phase: patchPhase
  21. 11.36 s gammaloop-workspace-doctest> Executing configureCargoCommonVars
  22. 11.37 s gammaloop-workspace-doctest> decompressing cargo artifacts from /nix/store/ll9b1in64vh8qki89lybxzjjz809daql-gammaloop-workspace-deps-deps-0.1.0/target.tar.zst to target
  23. 12.45 s gammaloop-workspace-doctest> Running phase: updateAutotoolsGnuConfigScriptsPhase
  24. 12.54 s gammaloop-workspace-doctest> Running phase: configurePhase
  25. 12.54 s gammaloop-workspace-doctest> will append /build/source/.cargo-home/config.toml with contents of /nix/store/5k2rp6i9lv5zqizci840fqwg07lqhf3q-vendor-cargo-deps/config.toml
  26. 12.54 s gammaloop-workspace-doctest> default configurePhase, nothing to do
  27. 12.54 s gammaloop-workspace-doctest> Running phase: buildPhase
  28. 12.54 s gammaloop-workspace-doctest> +++ command cargo --version
  29. 12.54 s gammaloop-workspace-doctest> cargo 1.97.0 (c980f4866 2026-06-30)
  30. 12.54 s gammaloop-workspace-doctest> +++ command cargo test --profile ci-optim --doc --locked --workspace --features gammaloop-tracing-filter/clap,gammaloop-tracing-filter/symbolica,idenso/bincode,idenso/reference-cases,linnet/bincode,linnet/drawing,linnet/rkyv,linnet/serde,linnet/symbolica,spenso-macros/shadowing,spenso/shadowing,symbolica/tracing_max_level_info
  31. 12.81 s gammaloop-workspace-doctest> Compiling pyo3-build-config v0.28.3
  32. 12.82 s gammaloop-workspace-doctest> Compiling phf_shared v0.11.3
  33. 12.82 s gammaloop-workspace-doctest> Compiling getopts v0.2.24
  34. 12.82 s gammaloop-workspace-doctest> Compiling unic-char-range v0.9.0
  35. 12.82 s gammaloop-workspace-doctest> Compiling unic-common v0.9.0
  36. 12.82 s gammaloop-workspace-doctest> Compiling is-macro v0.3.7
  37. 12.82 s gammaloop-workspace-doctest> Compiling rustpython-parser-vendored v0.4.0
  38. 12.83 s gammaloop-workspace-doctest> Compiling lalrpop-util v0.20.2
  39. 12.83 s gammaloop-workspace-doctest> Compiling rustc-hash v1.1.0
  40. 12.84 s gammaloop-workspace-doctest> Compiling symbolica v2.2.0 (https://github.com/symbolica-dev/symbolica?branch=dev#0441bd7a)
  41. 12.85 s gammaloop-workspace-doctest> Compiling gammaloop-tracing-filter-macros v0.1.0 (/build/source/crates/gammaloop-tracing-filter-macros)
  42. 12.85 s gammaloop-workspace-doctest> Compiling vakint v0.1.2 (/build/source/crates/vakint)
  43. 12.86 s gammaloop-workspace-doctest> Compiling unic-ucd-version v0.9.0
  44. 12.86 s gammaloop-workspace-doctest> Compiling unic-char-property v0.9.0
  45. 12.88 s gammaloop-workspace-doctest> Compiling gammalooprs v0.3.4 (/build/source/crates/gammalooprs)
  46. 12.89 s gammaloop-workspace-doctest> Compiling rustc_version v0.4.1
  47. 12.89 s gammaloop-workspace-doctest> Compiling gammaloop-api v0.1.0 (/build/source/crates/gammaloop-api)
  48. 12.90 s gammaloop-workspace-doctest> Compiling bincode v1.3.3
  49. 12.90 s gammaloop-workspace-doctest> Compiling gungraun-runner v0.18.2
  50. 12.91 s gammaloop-workspace-doctest> Compiling phf_generator v0.11.3
  51. 12.94 s gammaloop-workspace-doctest> Compiling phf v0.11.3
  52. 12.95 s gammaloop-workspace-doctest> Compiling unic-emoji-char v0.9.0
  53. 13.02 s gammaloop-workspace-doctest> Compiling phf_codegen v0.11.3
  54. 13.04 s gammaloop-workspace-doctest> Compiling unic-ucd-ident v0.9.0
  55. 13.06 s gammaloop-workspace-doctest> Compiling iai-callgrind-runner v0.14.2
  56. 13.07 s gammaloop-workspace-doctest> Compiling gammaloop-integration-tests v0.1.0 (/build/source/tests)
  57. 13.07 s gammaloop-workspace-doctest> Compiling test-log-core v0.2.20
  58. 13.08 s gammaloop-workspace-doctest> Compiling unicode_names2_generator v1.3.0
  59. 13.09 s gammaloop-workspace-doctest> Compiling wait-timeout v0.2.1
  60. 13.10 s gammaloop-workspace-doctest> Compiling iai-callgrind v0.14.2
  61. 13.16 s gammaloop-workspace-doctest> Compiling quick-error v1.2.3
  62. 13.17 s gammaloop-workspace-doctest> Compiling maplit v1.0.2
  63. 13.19 s gammaloop-workspace-doctest> Compiling bit-vec v0.8.0
  64. 13.20 s gammaloop-workspace-doctest> Compiling rustpython-parser v0.4.0
  65. 13.21 s gammaloop-workspace-doctest> Compiling rusty-fork v0.3.1
  66. 13.23 s gammaloop-workspace-doctest> Compiling iai-callgrind-macros v0.5.1
  67. 13.28 s gammaloop-workspace-doctest> Compiling rand_xorshift v0.4.0
  68. 13.36 s gammaloop-workspace-doctest> Compiling bit-set v0.8.0
  69. 13.39 s gammaloop-workspace-doctest> Compiling console v0.15.11
  70. 13.44 s gammaloop-workspace-doctest> Compiling gungraun-macros v0.8.0
  71. 13.45 s gammaloop-workspace-doctest> Compiling base64 v0.21.7
  72. 13.46 s gammaloop-workspace-doctest> Compiling unarray v0.1.4
  73. 13.51 s gammaloop-workspace-doctest> Compiling proptest v1.11.0
  74. 13.70 s gammaloop-workspace-doctest> Compiling similar-asserts v1.7.0
  75. 13.81 s gammaloop-workspace-doctest> Compiling ron v0.8.1
  76. 13.92 s gammaloop-workspace-doctest> Compiling kurvst v0.1.0 (/build/source/crates/kurvst)
  77. 14.42 s gammaloop-workspace-doctest> Compiling test-log-macros v0.2.20
  78. 15.05 s gammaloop-workspace-doctest> Compiling unicode_names2 v1.3.0
  79. 15.91 s gammaloop-workspace-doctest> Compiling rustpython-parser-core v0.4.0
  80. 15.99 s gammaloop-workspace-doctest> Compiling rustpython-ast v0.4.0
  81. 16.05 s gammaloop-workspace-doctest> Compiling test-log v0.2.20
  82. 16.33 s gammaloop-workspace-doctest> Compiling pyo3-ffi v0.28.3
  83. 16.48 s gammaloop-workspace-doctest> Compiling pyo3-macros-backend v0.28.3
  84. 16.70 s gammaloop-workspace-doctest> Compiling pyo3 v0.28.3
  85. 16.80 s gammaloop-workspace-doctest> Compiling numpy v0.28.0
  86. 17.73 s gammaloop-workspace-doctest> Compiling gungraun v0.18.2
  87. 20.92 s gammaloop-workspace-doctest> Compiling pyo3-macros v0.28.3
  88. 23.48 s gammaloop-workspace-doctest> Compiling pyo3-stub-gen-derive v0.17.2
  89. 25.82 s gammaloop-workspace-doctest> Compiling numerica v2.2.0 (https://github.com/symbolica-dev/symbolica?branch=dev#0441bd7a)
  90. 26.25 s gammaloop-workspace-doctest> Compiling pyo3-stub-gen v0.17.2
  91. 27.84 s gammaloop-workspace-doctest> Compiling graphica v2.1.0 (https://github.com/symbolica-dev/symbolica?branch=dev#0441bd7a)
  92. 32.03 s gammaloop-workspace-doctest> Compiling symbolica-utils v0.1.0 (/build/source/crates/symbolica-utils)
  93. 32.14 s gammaloop-workspace-doctest> Compiling linnet v0.17.0 (/build/source/crates/linnet)
  94. 53.71 s gammaloop-workspace-doctest> Compiling feynkit-model v0.1.0 (/build/source/crates/feynkit-model)
  95. 54.64 s gammaloop-workspace-doctest> Compiling feynkit-ufo v0.1.0 (/build/source/crates/feynkit-ufo)
  96. 58.65 s gammaloop-workspace-doctest> Compiling feynkit-kinematics v0.1.0 (/build/source/crates/feynkit-kinematics)
  97. 59.27 s gammaloop-workspace-doctest> Compiling feynkit-graph v0.1.0 (/build/source/crates/feynkit-graph)
  98. 63.49 s gammaloop-workspace-doctest> Compiling feynkit-cff v0.1.0 (/build/source/crates/feynkit-cff)
  99. 170.58 s gammaloop-workspace-doctest> Compiling spenso-macros v0.3.2 (/build/source/crates/spenso-macros)
  100. 170.63 s gammaloop-workspace-doctest> Compiling gammaloop-workspace-hack v0.1.0 (/build/source/crates/gammaloop-workspace-hack)
  101. 170.83 s gammaloop-workspace-doctest> Compiling spenso v0.6.0 (/build/source/crates/spenso)
  102. 176.34 s gammaloop-workspace-doctest> Compiling idenso v0.3.0 (/build/source/crates/idenso)
  103. 176.37 s gammaloop-workspace-doctest> Compiling gammaloop-tracing-filter v0.1.0 (/build/source/crates/gammaloop-tracing-filter)
  104. 179.41 s gammaloop-workspace-doctest> Compiling spenso-hep-lib v0.1.7 (/build/source/crates/spenso-hep-lib)
  105. 179.41 s gammaloop-workspace-doctest> Compiling feynkit-tensor v0.1.0 (/build/source/crates/feynkit-tensor)
  106. 179.63 s gammaloop-workspace-doctest> Compiling feynkit-generator v0.1.0 (/build/source/crates/feynkit-generator)
  107. 179.63 s gammaloop-workspace-doctest> Compiling spynso3 v0.1.2 (/build/source/crates/spynso3)
  108. 184.57 s gammaloop-workspace-doctest> Compiling feynkit v0.1.0 (/build/source/crates/feynkit)
  109. 184.62 s gammaloop-workspace-doctest> Compiling feynkit-py v0.1.0 (/build/source/crates/feynkit-py)
  110. 222.16 s gammaloop-workspace-doctest> Compiling linnest v0.1.0 (/build/source/crates/linnest)
  111. 222.19 s gammaloop-workspace-doctest> Compiling linnet-py v0.1.0 (/build/source/crates/linnet-py)
  112. 314.77 s gammaloop-workspace-doctest> Finished `ci-optim` profile [optimized] target(s) in 5m 02s
  113. 314.88 s gammaloop-workspace-doctest> warning: the following packages contain code that will be rejected by a future version of Rust: proc-macro-error2 v2.0.1
  114. 314.88 s gammaloop-workspace-doctest> note: to see what the problems were, use the option `--future-incompat-report`, or run `cargo report future-incompatibilities --id 1`
  115. 314.90 s gammaloop-workspace-doctest> Doc-tests feynkit
  116. 314.93 s gammaloop-workspace-doctest>
  117. 314.93 s gammaloop-workspace-doctest> running 0 tests
  118. 314.93 s gammaloop-workspace-doctest>
  119. 314.93 s gammaloop-workspace-doctest> test result: ok. 0 passed; 0 failed; 0 ignored; 0 measured; 0 filtered out; finished in 0.00s
  120. 314.93 s gammaloop-workspace-doctest>
  121. 314.93 s gammaloop-workspace-doctest> Doc-tests feynkit_cff
  122. 316.15 s gammaloop-workspace-doctest>
  123. 316.15 s gammaloop-workspace-doctest> running 1 test
  124. 316.15 s gammaloop-workspace-doctest> test crates/feynkit-cff/src/lib.rs - (line 10) ... ok
  125. 316.15 s gammaloop-workspace-doctest>
  126. 316.15 s gammaloop-workspace-doctest> test result: ok. 1 passed; 0 failed; 0 ignored; 0 measured; 0 filtered out; finished in 0.00s
  127. 316.15 s gammaloop-workspace-doctest>
  128. 316.16 s gammaloop-workspace-doctest> all doctests ran in 1.13s; merged doctests compilation took 1.12s
  129. 316.16 s gammaloop-workspace-doctest> Doc-tests feynkit_generator
  130. 316.28 s gammaloop-workspace-doctest>
  131. 316.28 s gammaloop-workspace-doctest> running 0 tests
  132. 316.28 s gammaloop-workspace-doctest>
  133. 316.28 s gammaloop-workspace-doctest> test result: ok. 0 passed; 0 failed; 0 ignored; 0 measured; 0 filtered out; finished in 0.00s
  134. 316.28 s gammaloop-workspace-doctest>
  135. 316.28 s gammaloop-workspace-doctest> Doc-tests feynkit_graph
  136. 316.36 s gammaloop-workspace-doctest>
  137. 316.36 s gammaloop-workspace-doctest> running 0 tests
  138. 316.36 s gammaloop-workspace-doctest>
  139. 316.36 s gammaloop-workspace-doctest> test result: ok. 0 passed; 0 failed; 0 ignored; 0 measured; 0 filtered out; finished in 0.00s
  140. 316.36 s gammaloop-workspace-doctest>
  141. 316.36 s gammaloop-workspace-doctest> Doc-tests feynkit_kinematics
  142. 316.41 s gammaloop-workspace-doctest>
  143. 316.41 s gammaloop-workspace-doctest> running 0 tests
  144. 316.41 s gammaloop-workspace-doctest>
  145. 316.41 s gammaloop-workspace-doctest> test result: ok. 0 passed; 0 failed; 0 ignored; 0 measured; 0 filtered out; finished in 0.00s
  146. 316.41 s gammaloop-workspace-doctest>
  147. 316.41 s gammaloop-workspace-doctest> Doc-tests feynkit_model
  148. 316.49 s gammaloop-workspace-doctest>
  149. 316.49 s gammaloop-workspace-doctest> running 0 tests
  150. 316.49 s gammaloop-workspace-doctest>
  151. 316.49 s gammaloop-workspace-doctest> test result: ok. 0 passed; 0 failed; 0 ignored; 0 measured; 0 filtered out; finished in 0.00s
  152. 316.49 s gammaloop-workspace-doctest>
  153. 316.49 s gammaloop-workspace-doctest> Doc-tests feynkit_py
  154. 316.75 s gammaloop-workspace-doctest>
  155. 316.75 s gammaloop-workspace-doctest> running 0 tests
  156. 316.75 s gammaloop-workspace-doctest>
  157. 316.75 s gammaloop-workspace-doctest> test result: ok. 0 passed; 0 failed; 0 ignored; 0 measured; 0 filtered out; finished in 0.00s
  158. 316.75 s gammaloop-workspace-doctest>
  159. 316.75 s gammaloop-workspace-doctest> Doc-tests feynkit_tensor
  160. 318.38 s gammaloop-workspace-doctest>
  161. 318.38 s gammaloop-workspace-doctest> running 17 tests
  162. 318.38 s gammaloop-workspace-doctest> test crates/feynkit-tensor/src/reduction.rs - reduction::ContractionOrbit (line 65) - compile ... ok
  163. 318.38 s gammaloop-workspace-doctest> test crates/feynkit-tensor/src/reduction.rs - reduction::FeynmanDiagramTensorExt (line 905) - compile ... ok
  164. 318.38 s gammaloop-workspace-doctest> test crates/feynkit-tensor/src/reduction.rs - reduction::TensorReducer::reduce (line 395) - compile ... ok
  165. 318.38 s gammaloop-workspace-doctest> test crates/feynkit-tensor/src/reduction.rs - reduction::TensorReduction (line 202) - compile ... ok
  166. 318.38 s gammaloop-workspace-doctest> test crates/feynkit-tensor/src/reduction.rs - reduction::TensorReducer (line 283) - compile ... ok
  167. 318.38 s gammaloop-workspace-doctest> test crates/feynkit-tensor/src/reduction.rs - reduction::TensorReduction::expression (line 247) - compile ... ok
  168. 318.38 s gammaloop-workspace-doctest> test crates/feynkit-tensor/src/reduction.rs - reduction::TensorReductionTerm (line 145) - compile ... ok
  169. 318.38 s gammaloop-workspace-doctest> test crates/feynkit-tensor/src/weingarten.rs - weingarten::OrthogonalWeingarten (line 199) - compile ... ok
  170. 318.38 s gammaloop-workspace-doctest> test crates/feynkit-tensor/src/weingarten.rs - weingarten::OrthogonalWeingarten::coefficient (line 309) - compile ... ok
  171. 318.38 s gammaloop-workspace-doctest> test crates/feynkit-tensor/src/weingarten.rs - weingarten::OrthogonalWeingarten::for_rank (line 275) - compile ... ok
  172. 318.38 s gammaloop-workspace-doctest> test crates/feynkit-tensor/src/weingarten.rs - weingarten::OrthogonalWeingarten::new (line 231) - compile ... ok
  173. 318.39 s gammaloop-workspace-doctest> test crates/feynkit-tensor/src/weingarten.rs - weingarten::CosetType::between_matchings (line 92) ... ok
  174. 318.39 s gammaloop-workspace-doctest> test crates/feynkit-tensor/src/weingarten.rs - weingarten::CosetType::class_size (line 152) ... ok
  175. 318.39 s gammaloop-workspace-doctest> test crates/feynkit-tensor/src/weingarten.rs - weingarten::CosetType (line 34) ... ok
  176. 318.39 s gammaloop-workspace-doctest> test crates/feynkit-tensor/src/weingarten.rs - weingarten::CosetType::new (line 55) ... ok
  177. 318.39 s gammaloop-workspace-doctest> test crates/feynkit-tensor/src/weingarten.rs - weingarten::WeingartenError (line 409) ... ok
  178. 318.46 s gammaloop-workspace-doctest> test crates/feynkit-tensor/src/weingarten.rs - weingarten::OrthogonalWeingarten::isotropic_pairing_coefficient (line 345) ... FAILED
  179. 318.46 s gammaloop-workspace-doctest>
  180. 318.46 s gammaloop-workspace-doctest> failures:
  181. 318.46 s gammaloop-workspace-doctest>
  182. 318.46 s gammaloop-workspace-doctest> ---- crates/feynkit-tensor/src/weingarten.rs - weingarten::OrthogonalWeingarten::isotropic_pairing_coefficient (line 345) stdout ----
  183. 318.46 s gammaloop-workspace-doctest> Test executable failed (terminated by signal).
  184. 318.46 s gammaloop-workspace-doctest>
  185. 318.46 s gammaloop-workspace-doctest> stdout:
  186. 318.46 s gammaloop-workspace-doctest> ┌────────────────────────────────────────────────────────┐
  187. 318.46 s gammaloop-workspace-doctest> │ You are running a restricted Symbolica instance. │
  188. 318.46 s gammaloop-workspace-doctest> │ │
  189. 318.46 s gammaloop-workspace-doctest> │ This mode is only permitted for non-commercial use and │
  190. 318.46 s gammaloop-workspace-doctest> │ is limited to one instance and core per machine. │
  191. 318.46 s gammaloop-workspace-doctest> │ │
  192. 318.46 s gammaloop-workspace-doctest> │ Hobbyists can easily acquire a free license key │
  193. 318.46 s gammaloop-workspace-doctest> │ that unlocks all cores and removes this banner: │
  194. 318.46 s gammaloop-workspace-doctest> │ │
  195. 318.46 s gammaloop-workspace-doctest> │ from symbolica import * │
  196. 318.46 s gammaloop-workspace-doctest> │ request_hobbyist_license('YOUR_NAME', 'YOUR_EMAIL') │
  197. 318.46 s gammaloop-workspace-doctest> │ │
  198. 318.46 s gammaloop-workspace-doctest> │ All other users can obtain a free 30-day trial key: │
  199. 318.46 s gammaloop-workspace-doctest> │ │
  200. 318.46 s gammaloop-workspace-doctest> │ from symbolica import * │
  201. 318.46 s gammaloop-workspace-doctest> │ request_trial_license('NAME', 'EMAIL', 'EMPLOYER') │
  202. 318.46 s gammaloop-workspace-doctest> │ │
  203. 318.46 s gammaloop-workspace-doctest> │ See https://symbolica.io/docs/get_started.html#license │
  204. 318.46 s gammaloop-workspace-doctest> └────────────────────────────────────────────────────────┘
  205. 318.46 s gammaloop-workspace-doctest> ┌───────────────────────────────────────────────────────────────────────────────────────────────────────────┐
  206. 318.46 s gammaloop-workspace-doctest> │ Cannot start new unlicensed Symbolica instance since there is already another one running on the machine. │
  207. 318.46 s gammaloop-workspace-doctest> └───────────────────────────────────────────────────────────────────────────────────────────────────────────┘
  208. 318.46 s gammaloop-workspace-doctest>
  209. 318.46 s gammaloop-workspace-doctest> stderr:
  210. 318.46 s gammaloop-workspace-doctest> ┌───────────────────────────────────┐
  211. 318.46 s gammaloop-workspace-doctest> │ The Symbolica license has expired │
  212. 318.46 s gammaloop-workspace-doctest> └───────────────────────────────────┘
  213. 318.46 s gammaloop-workspace-doctest>
  214. 318.46 s gammaloop-workspace-doctest>
  215. 318.46 s gammaloop-workspace-doctest>
  216. 318.46 s gammaloop-workspace-doctest> failures:
  217. 318.46 s gammaloop-workspace-doctest> crates/feynkit-tensor/src/weingarten.rs - weingarten::OrthogonalWeingarten::isotropic_pairing_coefficient (line 345)
  218. 318.46 s gammaloop-workspace-doctest>
  219. 318.46 s gammaloop-workspace-doctest> test result: FAILED. 16 passed; 1 failed; 0 ignored; 0 measured; 0 filtered out; finished in 0.07s
  220. 318.46 s gammaloop-workspace-doctest>
  221. 318.46 s gammaloop-workspace-doctest> all doctests ran in 1.66s; merged doctests compilation took 1.58s
  222. 318.47 s gammaloop-workspace-doctest> error: doctest failed, to rerun pass `-p feynkit-tensor --doc`
  223. 318.91 s error: Cannot build '/nix/store/7243z5fbvw0imfqx2r5ac9cx8m30zlfg-gammaloop-workspace-doctest-0.1.0.drv'.
  224. 318.91 s Reason: builder failed with exit code 101.
  225. 318.91 s Output paths:
  226. 318.91 s /nix/store/3969gy71i8grwb1kbwdbjly8jva7h4g6-gammaloop-workspace-doctest-0.1.0
  227. 318.91 s Last 206 log lines:
  228. 318.91 s > Running phase: unpackPhase
  229. 318.91 s > unpacking source archive /nix/store/izmk7p64ksm1ga41kxchvc0054lwrb7s-source
  230. 318.91 s > source root is source
  231. 318.91 s > Running phase: patchPhase
  232. 318.91 s > Executing configureCargoCommonVars
  233. 318.91 s > decompressing cargo artifacts from /nix/store/ll9b1in64vh8qki89lybxzjjz809daql-gammaloop-workspace-deps-deps-0.1.0/target.tar.zst to target
  234. 318.91 s > Running phase: updateAutotoolsGnuConfigScriptsPhase
  235. 318.91 s > Running phase: configurePhase
  236. 318.91 s > will append /build/source/.cargo-home/config.toml with contents of /nix/store/5k2rp6i9lv5zqizci840fqwg07lqhf3q-vendor-cargo-deps/config.toml
  237. 318.91 s > default configurePhase, nothing to do
  238. 318.91 s > Running phase: buildPhase
  239. 318.91 s > +++ command cargo --version
  240. 318.91 s > cargo 1.97.0 (c980f4866 2026-06-30)
  241. 318.91 s > +++ command cargo test --profile ci-optim --doc --locked --workspace --features gammaloop-tracing-filter/clap,gammaloop-tracing-filter/symbolica,idenso/bincode,idenso/reference-cases,linnet/bincode,linnet/drawing,linnet/rkyv,linnet/serde,linnet/symbolica,spenso-macros/shadowing,spenso/shadowing,symbolica/tracing_max_level_info
  242. 318.91 s > Compiling pyo3-build-config v0.28.3
  243. 318.91 s > Compiling phf_shared v0.11.3
  244. 318.91 s > Compiling getopts v0.2.24
  245. 318.91 s > Compiling unic-char-range v0.9.0
  246. 318.91 s > Compiling unic-common v0.9.0
  247. 318.91 s > Compiling is-macro v0.3.7
  248. 318.91 s > Compiling rustpython-parser-vendored v0.4.0
  249. 318.91 s > Compiling lalrpop-util v0.20.2
  250. 318.91 s > Compiling rustc-hash v1.1.0
  251. 318.91 s > Compiling symbolica v2.2.0 (https://github.com/symbolica-dev/symbolica?branch=dev#0441bd7a)
  252. 318.91 s > Compiling gammaloop-tracing-filter-macros v0.1.0 (/build/source/crates/gammaloop-tracing-filter-macros)
  253. 318.91 s > Compiling vakint v0.1.2 (/build/source/crates/vakint)
  254. 318.91 s > Compiling unic-ucd-version v0.9.0
  255. 318.91 s > Compiling unic-char-property v0.9.0
  256. 318.91 s > Compiling gammalooprs v0.3.4 (/build/source/crates/gammalooprs)
  257. 318.91 s > Compiling rustc_version v0.4.1
  258. 318.91 s > Compiling gammaloop-api v0.1.0 (/build/source/crates/gammaloop-api)
  259. 318.91 s > Compiling bincode v1.3.3
  260. 318.91 s > Compiling gungraun-runner v0.18.2
  261. 318.91 s > Compiling phf_generator v0.11.3
  262. 318.91 s > Compiling phf v0.11.3
  263. 318.91 s > Compiling unic-emoji-char v0.9.0
  264. 318.91 s > Compiling phf_codegen v0.11.3
  265. 318.91 s > Compiling unic-ucd-ident v0.9.0
  266. 318.91 s > Compiling iai-callgrind-runner v0.14.2
  267. 318.91 s > Compiling gammaloop-integration-tests v0.1.0 (/build/source/tests)
  268. 318.91 s > Compiling test-log-core v0.2.20
  269. 318.91 s > Compiling unicode_names2_generator v1.3.0
  270. 318.91 s > Compiling wait-timeout v0.2.1
  271. 318.91 s > Compiling iai-callgrind v0.14.2
  272. 318.91 s > Compiling quick-error v1.2.3
  273. 318.91 s > Compiling maplit v1.0.2
  274. 318.91 s > Compiling bit-vec v0.8.0
  275. 318.91 s > Compiling rustpython-parser v0.4.0
  276. 318.91 s > Compiling rusty-fork v0.3.1
  277. 318.91 s > Compiling iai-callgrind-macros v0.5.1
  278. 318.91 s > Compiling rand_xorshift v0.4.0
  279. 318.91 s > Compiling bit-set v0.8.0
  280. 318.91 s > Compiling console v0.15.11
  281. 318.91 s > Compiling gungraun-macros v0.8.0
  282. 318.91 s > Compiling base64 v0.21.7
  283. 318.91 s > Compiling unarray v0.1.4
  284. 318.91 s > Compiling proptest v1.11.0
  285. 318.91 s > Compiling similar-asserts v1.7.0
  286. 318.91 s > Compiling ron v0.8.1
  287. 318.91 s > Compiling kurvst v0.1.0 (/build/source/crates/kurvst)
  288. 318.91 s > Compiling test-log-macros v0.2.20
  289. 318.91 s > Compiling unicode_names2 v1.3.0
  290. 318.91 s > Compiling rustpython-parser-core v0.4.0
  291. 318.91 s > Compiling rustpython-ast v0.4.0
  292. 318.91 s > Compiling test-log v0.2.20
  293. 318.91 s > Compiling pyo3-ffi v0.28.3
  294. 318.91 s > Compiling pyo3-macros-backend v0.28.3
  295. 318.91 s > Compiling pyo3 v0.28.3
  296. 318.91 s > Compiling numpy v0.28.0
  297. 318.91 s > Compiling gungraun v0.18.2
  298. 318.91 s > Compiling pyo3-macros v0.28.3
  299. 318.91 s > Compiling pyo3-stub-gen-derive v0.17.2
  300. 318.91 s > Compiling numerica v2.2.0 (https://github.com/symbolica-dev/symbolica?branch=dev#0441bd7a)
  301. 318.91 s > Compiling pyo3-stub-gen v0.17.2
  302. 318.91 s > Compiling graphica v2.1.0 (https://github.com/symbolica-dev/symbolica?branch=dev#0441bd7a)
  303. 318.91 s > Compiling symbolica-utils v0.1.0 (/build/source/crates/symbolica-utils)
  304. 318.91 s > Compiling linnet v0.17.0 (/build/source/crates/linnet)
  305. 318.91 s > Compiling feynkit-model v0.1.0 (/build/source/crates/feynkit-model)
  306. 318.91 s > Compiling feynkit-ufo v0.1.0 (/build/source/crates/feynkit-ufo)
  307. 318.91 s > Compiling feynkit-kinematics v0.1.0 (/build/source/crates/feynkit-kinematics)
  308. 318.91 s > Compiling feynkit-graph v0.1.0 (/build/source/crates/feynkit-graph)
  309. 318.91 s > Compiling feynkit-cff v0.1.0 (/build/source/crates/feynkit-cff)
  310. 318.91 s > Compiling spenso-macros v0.3.2 (/build/source/crates/spenso-macros)
  311. 318.91 s > Compiling gammaloop-workspace-hack v0.1.0 (/build/source/crates/gammaloop-workspace-hack)
  312. 318.91 s > Compiling spenso v0.6.0 (/build/source/crates/spenso)
  313. 318.91 s > Compiling idenso v0.3.0 (/build/source/crates/idenso)
  314. 318.91 s > Compiling gammaloop-tracing-filter v0.1.0 (/build/source/crates/gammaloop-tracing-filter)
  315. 318.91 s > Compiling spenso-hep-lib v0.1.7 (/build/source/crates/spenso-hep-lib)
  316. 318.91 s > Compiling feynkit-tensor v0.1.0 (/build/source/crates/feynkit-tensor)
  317. 318.91 s > Compiling feynkit-generator v0.1.0 (/build/source/crates/feynkit-generator)
  318. 318.91 s > Compiling spynso3 v0.1.2 (/build/source/crates/spynso3)
  319. 318.91 s > Compiling feynkit v0.1.0 (/build/source/crates/feynkit)
  320. 318.91 s > Compiling feynkit-py v0.1.0 (/build/source/crates/feynkit-py)
  321. 318.91 s > Compiling linnest v0.1.0 (/build/source/crates/linnest)
  322. 318.91 s > Compiling linnet-py v0.1.0 (/build/source/crates/linnet-py)
  323. 318.91 s > Finished `ci-optim` profile [optimized] target(s) in 5m 02s
  324. 318.91 s > warning: the following packages contain code that will be rejected by a future version of Rust: proc-macro-error2 v2.0.1
  325. 318.91 s > note: to see what the problems were, use the option `--future-incompat-report`, or run `cargo report future-incompatibilities --id 1`
  326. 318.91 s > Doc-tests feynkit
  327. 318.91 s >
  328. 318.91 s > running 0 tests
  329. 318.91 s >
  330. 318.91 s > test result: ok. 0 passed; 0 failed; 0 ignored; 0 measured; 0 filtered out; finished in 0.00s
  331. 318.91 s >
  332. 318.91 s > Doc-tests feynkit_cff
  333. 318.91 s >
  334. 318.91 s > running 1 test
  335. 318.91 s > test crates/feynkit-cff/src/lib.rs - (line 10) ... ok
  336. 318.91 s >
  337. 318.91 s > test result: ok. 1 passed; 0 failed; 0 ignored; 0 measured; 0 filtered out; finished in 0.00s
  338. 318.91 s >
  339. 318.91 s > all doctests ran in 1.13s; merged doctests compilation took 1.12s
  340. 318.91 s > Doc-tests feynkit_generator
  341. 318.91 s >
  342. 318.91 s > running 0 tests
  343. 318.91 s >
  344. 318.91 s > test result: ok. 0 passed; 0 failed; 0 ignored; 0 measured; 0 filtered out; finished in 0.00s
  345. 318.91 s >
  346. 318.91 s > Doc-tests feynkit_graph
  347. 318.91 s >
  348. 318.91 s > running 0 tests
  349. 318.91 s >
  350. 318.91 s > test result: ok. 0 passed; 0 failed; 0 ignored; 0 measured; 0 filtered out; finished in 0.00s
  351. 318.91 s >
  352. 318.91 s > Doc-tests feynkit_kinematics
  353. 318.91 s >
  354. 318.91 s > running 0 tests
  355. 318.91 s >
  356. 318.91 s > test result: ok. 0 passed; 0 failed; 0 ignored; 0 measured; 0 filtered out; finished in 0.00s
  357. 318.91 s >
  358. 318.91 s > Doc-tests feynkit_model
  359. 318.91 s >
  360. 318.91 s > running 0 tests
  361. 318.91 s >
  362. 318.91 s > test result: ok. 0 passed; 0 failed; 0 ignored; 0 measured; 0 filtered out; finished in 0.00s
  363. 318.91 s >
  364. 318.91 s > Doc-tests feynkit_py
  365. 318.91 s >
  366. 318.91 s > running 0 tests
  367. 318.91 s >
  368. 318.91 s > test result: ok. 0 passed; 0 failed; 0 ignored; 0 measured; 0 filtered out; finished in 0.00s
  369. 318.91 s >
  370. 318.91 s > Doc-tests feynkit_tensor
  371. 318.91 s >
  372. 318.91 s > running 17 tests
  373. 318.91 s > test crates/feynkit-tensor/src/reduction.rs - reduction::ContractionOrbit (line 65) - compile ... ok
  374. 318.91 s > test crates/feynkit-tensor/src/reduction.rs - reduction::FeynmanDiagramTensorExt (line 905) - compile ... ok
  375. 318.91 s > test crates/feynkit-tensor/src/reduction.rs - reduction::TensorReducer::reduce (line 395) - compile ... ok
  376. 318.91 s > test crates/feynkit-tensor/src/reduction.rs - reduction::TensorReduction (line 202) - compile ... ok
  377. 318.91 s > test crates/feynkit-tensor/src/reduction.rs - reduction::TensorReducer (line 283) - compile ... ok
  378. 318.91 s > test crates/feynkit-tensor/src/reduction.rs - reduction::TensorReduction::expression (line 247) - compile ... ok
  379. 318.91 s > test crates/feynkit-tensor/src/reduction.rs - reduction::TensorReductionTerm (line 145) - compile ... ok
  380. 318.91 s > test crates/feynkit-tensor/src/weingarten.rs - weingarten::OrthogonalWeingarten (line 199) - compile ... ok
  381. 318.91 s > test crates/feynkit-tensor/src/weingarten.rs - weingarten::OrthogonalWeingarten::coefficient (line 309) - compile ... ok
  382. 318.91 s > test crates/feynkit-tensor/src/weingarten.rs - weingarten::OrthogonalWeingarten::for_rank (line 275) - compile ... ok
  383. 318.91 s > test crates/feynkit-tensor/src/weingarten.rs - weingarten::OrthogonalWeingarten::new (line 231) - compile ... ok
  384. 318.91 s > test crates/feynkit-tensor/src/weingarten.rs - weingarten::CosetType::between_matchings (line 92) ... ok
  385. 318.91 s > test crates/feynkit-tensor/src/weingarten.rs - weingarten::CosetType::class_size (line 152) ... ok
  386. 318.91 s > test crates/feynkit-tensor/src/weingarten.rs - weingarten::CosetType (line 34) ... ok
  387. 318.91 s > test crates/feynkit-tensor/src/weingarten.rs - weingarten::CosetType::new (line 55) ... ok
  388. 318.91 s > test crates/feynkit-tensor/src/weingarten.rs - weingarten::WeingartenError (line 409) ... ok
  389. 318.91 s > test crates/feynkit-tensor/src/weingarten.rs - weingarten::OrthogonalWeingarten::isotropic_pairing_coefficient (line 345) ... FAILED
  390. 318.91 s >
  391. 318.91 s > failures:
  392. 318.91 s >
  393. 318.91 s > ---- crates/feynkit-tensor/src/weingarten.rs - weingarten::OrthogonalWeingarten::isotropic_pairing_coefficient (line 345) stdout ----
  394. 318.91 s > Test executable failed (terminated by signal).
  395. 318.91 s >
  396. 318.91 s > stdout:
  397. 318.91 s > ┌────────────────────────────────────────────────────────┐
  398. 318.91 s > │ You are running a restricted Symbolica instance. │
  399. 318.91 s > │ │
  400. 318.91 s > │ This mode is only permitted for non-commercial use and │
  401. 318.91 s > │ is limited to one instance and core per machine. │
  402. 318.91 s > │ │
  403. 318.91 s > │ Hobbyists can easily acquire a free license key │
  404. 318.91 s > │ that unlocks all cores and removes this banner: │
  405. 318.91 s > │ │
  406. 318.91 s > │ from symbolica import * │
  407. 318.91 s > │ request_hobbyist_license('YOUR_NAME', 'YOUR_EMAIL') │
  408. 318.91 s > │ │
  409. 318.91 s > │ All other users can obtain a free 30-day trial key: │
  410. 318.91 s > │ │
  411. 318.91 s > │ from symbolica import * │
  412. 318.91 s > │ request_trial_license('NAME', 'EMAIL', 'EMPLOYER') │
  413. 318.91 s > │ │
  414. 318.91 s > │ See https://symbolica.io/docs/get_started.html#license │
  415. 318.91 s > └────────────────────────────────────────────────────────┘
  416. 318.91 s > ┌───────────────────────────────────────────────────────────────────────────────────────────────────────────┐
  417. 318.91 s > │ Cannot start new unlicensed Symbolica instance since there is already another one running on the machine. │
  418. 318.91 s > └───────────────────────────────────────────────────────────────────────────────────────────────────────────┘
  419. 318.91 s >
  420. 318.91 s > stderr:
  421. 318.91 s > ┌───────────────────────────────────┐
  422. 318.91 s > │ The Symbolica license has expired │
  423. 318.91 s > └───────────────────────────────────┘
  424. 318.91 s >
  425. 318.91 s >
  426. 318.91 s >
  427. 318.91 s > failures:
  428. 318.91 s > crates/feynkit-tensor/src/weingarten.rs - weingarten::OrthogonalWeingarten::isotropic_pairing_coefficient (line 345)
  429. 318.91 s >
  430. 318.91 s > test result: FAILED. 16 passed; 1 failed; 0 ignored; 0 measured; 0 filtered out; finished in 0.07s
  431. 318.91 s >
  432. 318.91 s > all doctests ran in 1.66s; merged doctests compilation took 1.58s
  433. 318.91 s > error: doctest failed, to rerun pass `-p feynkit-tensor --doc`
  434. 318.91 s For full logs, run:
  435. 318.91 s nix log /nix/store/7243z5fbvw0imfqx2r5ac9cx8m30zlfg-gammaloop-workspace-doctest-0.1.0.drv
  436. 319.00 s [0 built (1 failed)]Run failed.