test packages.x86_64-linux.nix-ci-check-gammaloop-doctest

Reproduce this run
Retry Run
  1. 0.15 s $ /nix/store/9ypz3flqsrl5xl495mm8h645gadjsxi1-coreutils-9.11/bin/timeout --kill-after=15s 7200s /nix/store/23zk8sgzamrbmj1fday15szf7f2279s8-nix-2.34.7/bin/nix --extra-experimental-features nix-command --extra-experimental-features flakes flake clone git+https://github.com/alphal00p/gammaloop --dest /tmp/nix-ci-worker/stable-pwd/repo/
  2. 0.18 s Cloning into '/tmp/nix-ci-worker/stable-pwd/repo'...
  3. 0.85 s remote: Enumerating objects: 66372, done.
  4. 1.08 s remote: Counting objects: 0% (1/9044) remote: Counting objects: 1% (91/9044) remote: Counting objects: 2% (181/9044) remote: Counting objects: 3% (272/9044) remote: Counting objects: 4% (362/9044) remote: Counting objects: 5% (453/9044) remote: Counting objects: 6% (543/9044) remote: Counting objects: 7% (634/9044) remote: Counting objects: 8% (724/9044) remote: Counting objects: 9% (814/9044) remote: Counting objects: 10% (905/9044) remote: Counting objects: 11% (995/9044) remote: Counting objects: 12% (1086/9044) remote: Counting objects: 13% (1176/9044) remote: Counting objects: 14% (1267/9044) remote: Counting objects: 15% (1357/9044) remote: Counting objects: 16% (1448/9044) remote: Counting objects: 17% (1538/9044) remote: Counting objects: 18% (1628/9044) remote: Counting objects: 19% (1719/9044) remote: Counting objects: 20% (1809/9044) remote: Counting objects: 21% (1900/9044) remote: Counting objects: 22% (1990/9044) remote: Counting objects: 23% (2081/9044) remote: Counting objects: 24% (2171/9044) remote: Counting objects: 25% (2261/9044) remote: Counting objects: 26% (2352/9044) remote: Counting objects: 27% (2442/9044) remote: Counting objects: 28% (2533/9044) remote: Counting objects: 29% (2623/9044) remote: Counting objects: 30% (2714/9044) remote: Counting objects: 31% (2804/9044) remote: Counting objects: 32% (2895/9044) remote: Counting objects: 33% (2985/9044) remote: Counting objects: 34% (3075/9044) remote: Counting objects: 35% (3166/9044) remote: Counting objects: 36% (3256/9044) remote: Counting objects: 37% (3347/9044) remote: Counting objects: 38% (3437/9044) remote: Counting objects: 39% (3528/9044) remote: Counting objects: 40% (3618/9044) remote: Counting objects: 41% (3709/9044) remote: Counting objects: 42% (3799/9044) remote: Counting objects: 43% (3889/9044) remote: Counting objects: 44% (3980/9044) remote: Counting objects: 45% (4070/9044) remote: Counting objects: 46% (4161/9044) remote: Counting objects: 47% (4251/9044) remote: Counting objects: 48% (4342/9044) remote: Counting objects: 49% (4432/9044) remote: Counting objects: 50% (4522/9044) remote: Counting objects: 51% (4613/9044) remote: Counting objects: 52% (4703/9044) remote: Counting objects: 53% (4794/9044) remote: Counting objects: 54% (4884/9044) remote: Counting objects: 55% (4975/9044) remote: Counting objects: 56% (5065/9044) remote: Counting objects: 57% (5156/9044) remote: Counting objects: 58% (5246/9044) remote: Counting objects: 59% (5336/9044) remote: Counting objects: 60% (5427/9044) remote: Counting objects: 61% (5517/9044) remote: Counting objects: 62% (5608/9044) remote: Counting objects: 63% (5698/9044) remote: Counting objects: 64% (5789/9044) remote: Counting objects: 65% (5879/9044) remote: Counting objects: 66% (5970/9044) remote: Counting objects: 67% (6060/9044) remote: Counting objects: 68% (6150/9044) remote: Counting objects: 69% (6241/9044) remote: Counting objects: 70% (6331/9044) remote: Counting objects: 71% (6422/9044) remote: Counting objects: 72% (6512/9044) remote: Counting objects: 73% (6603/9044) remote: Counting objects: 74% (6693/9044) remote: Counting objects: 75% (6783/9044) remote: Counting objects: 76% (6874/9044) remote: Counting objects: 77% (6964/9044) remote: Counting objects: 78% (7055/9044) remote: Counting objects: 79% (7145/9044) remote: Counting objects: 80% (7236/9044) remote: Counting objects: 81% (7326/9044) remote: Counting objects: 82% (7417/9044) remote: Counting objects: 83% (7507/9044) remote: Counting objects: 84% (7597/9044) remote: Counting objects: 85% (7688/9044) remote: Counting objects: 86% (7778/9044) remote: Counting objects: 87% (7869/9044) remote: Counting objects: 88% (7959/9044) remote: Counting objects: 89% (8050/9044) remote: Counting objects: 90% (8140/9044) remote: Counting objects: 91% (8231/9044) remote: Counting objects: 92% (8321/9044) remote: Counting objects: 93% (8411/9044) remote: Counting objects: 94% (8502/9044) remote: Counting objects: 95% (8592/9044) remote: Counting objects: 96% (8683/9044) remote: Counting objects: 97% (8773/9044) remote: Counting objects: 98% (8864/9044) remote: Counting objects: 99% (8954/9044) remote: Counting objects: 100% (9044/9044) remote: Counting objects: 100% (9044/9044), done.
  5. 3.06 s remote: Compressing objects: 0% (1/2130) remote: Compressing objects: 1% (22/2130) remote: Compressing objects: 2% (43/2130) remote: Compressing objects: 3% (64/2130) remote: Compressing objects: 4% (86/2130) remote: Compressing objects: 5% (107/2130) remote: Compressing objects: 6% (128/2130) remote: Compressing objects: 7% (150/2130) remote: Compressing objects: 8% (171/2130) remote: Compressing objects: 9% (192/2130) remote: Compressing objects: 10% (213/2130) remote: Compressing objects: 11% (235/2130) remote: Compressing objects: 12% (256/2130) remote: Compressing objects: 13% (277/2130) remote: Compressing objects: 14% (299/2130) remote: Compressing objects: 15% (320/2130) remote: Compressing objects: 16% (341/2130) remote: Compressing objects: 17% (363/2130) remote: Compressing objects: 18% (384/2130) remote: Compressing objects: 19% (405/2130) remote: Compressing objects: 20% (426/2130) remote: Compressing objects: 21% (448/2130) remote: Compressing objects: 21% (455/2130) remote: Compressing objects: 22% (469/2130) remote: Compressing objects: 23% (490/2130) remote: Compressing objects: 24% (512/2130) remote: Compressing objects: 25% (533/2130) remote: Compressing objects: 26% (554/2130) remote: Compressing objects: 27% (576/2130) remote: Compressing objects: 28% (597/2130) remote: Compressing objects: 29% (618/2130) remote: Compressing objects: 30% (639/2130) remote: Compressing objects: 31% (661/2130) remote: Compressing objects: 32% (682/2130) remote: Compressing objects: 33% (703/2130) remote: Compressing objects: 34% (725/2130) remote: Compressing objects: 35% (746/2130) remote: Compressing objects: 36% (767/2130) remote: Compressing objects: 37% (789/2130) remote: Compressing objects: 38% (810/2130) remote: Compressing objects: 39% (831/2130) remote: Compressing objects: 40% (852/2130) remote: Compressing objects: 41% (874/2130) remote: Compressing objects: 42% (895/2130) remote: Compressing objects: 43% (916/2130) remote: Compressing objects: 44% (938/2130) remote: Compressing objects: 45% (959/2130) remote: Compressing objects: 46% (980/2130) remote: Compressing objects: 47% (1002/2130) remote: Compressing objects: 48% (1023/2130) remote: Compressing objects: 49% (1044/2130) remote: Compressing objects: 50% (1065/2130) remote: Compressing objects: 51% (1087/2130) remote: Compressing objects: 52% (1108/2130) remote: Compressing objects: 53% (1129/2130) remote: Compressing objects: 54% (1151/2130) remote: Compressing objects: 55% (1172/2130) remote: Compressing objects: 56% (1193/2130) remote: Compressing objects: 57% (1215/2130) remote: Compressing objects: 58% (1236/2130) remote: Compressing objects: 59% (1257/2130) remote: Compressing objects: 60% (1278/2130) remote: Compressing objects: 61% (1300/2130) remote: Compressing objects: 62% (1321/2130) remote: Compressing objects: 63% (1342/2130) remote: Compressing objects: 64% (1364/2130) remote: Compressing objects: 65% (1385/2130) remote: Compressing objects: 66% (1406/2130) remote: Compressing objects: 67% (1428/2130) remote: Compressing objects: 68% (1449/2130) remote: Compressing objects: 69% (1470/2130) remote: Compressing objects: 70% (1491/2130) remote: Compressing objects: 71% (1513/2130) remote: Compressing objects: 72% (1534/2130) remote: Compressing objects: 73% (1555/2130) remote: Compressing objects: 74% (1577/2130) remote: Compressing objects: 75% (1598/2130) remote: Compressing objects: 76% (1619/2130) remote: Compressing objects: 77% (1641/2130) remote: Compressing objects: 78% (1662/2130) remote: Compressing objects: 79% (1683/2130) remote: Compressing objects: 80% (1704/2130) remote: Compressing objects: 81% (1726/2130) remote: Compressing objects: 82% (1747/2130) remote: Compressing objects: 83% (1768/2130) remote: Compressing objects: 84% (1790/2130) remote: Compressing objects: 85% (1811/2130) remote: Compressing objects: 86% (1832/2130) remote: Compressing objects: 87% (1854/2130) remote: Compressing objects: 88% (1875/2130) remote: Compressing objects: 89% (1896/2130) remote: Compressing objects: 90% (1917/2130) remote: Compressing objects: 91% (1939/2130) remote: Compressing objects: 92% (1960/2130) remote: Compressing objects: 93% (1981/2130) remote: Compressing objects: 94% (2003/2130) remote: Compressing objects: 95% (2024/2130) remote: Compressing objects: 96% (2045/2130) remote: Compressing objects: 97% (2067/2130) remote: Compressing objects: 98% (2088/2130) remote: Compressing objects: 99% (2109/2130) remote: Compressing objects: 100% (2130/2130) remote: Compressing objects: 100% (2130/2130), done.
  6. 6.28 s Receiving objects: 0% (1/66372) Receiving objects: 1% (664/66372) Receiving objects: 2% (1328/66372) Receiving objects: 3% (1992/66372) Receiving objects: 4% (2655/66372) Receiving objects: 5% (3319/66372) Receiving objects: 6% (3983/66372) Receiving objects: 7% (4647/66372) Receiving objects: 8% (5310/66372) Receiving objects: 9% (5974/66372) Receiving objects: 10% (6638/66372) Receiving objects: 11% (7301/66372), 11.53 MiB | 23.04 MiB/s Receiving objects: 12% (7965/66372), 11.53 MiB | 23.04 MiB/s Receiving objects: 13% (8629/66372), 11.53 MiB | 23.04 MiB/s Receiving objects: 14% (9293/66372), 11.53 MiB | 23.04 MiB/s Receiving objects: 15% (9956/66372), 11.53 MiB | 23.04 MiB/s Receiving objects: 16% (10620/66372), 11.53 MiB | 23.04 MiB/s Receiving objects: 17% (11284/66372), 11.53 MiB | 23.04 MiB/s Receiving objects: 18% (11947/66372), 11.53 MiB | 23.04 MiB/s Receiving objects: 19% (12611/66372), 11.53 MiB | 23.04 MiB/s Receiving objects: 20% (13275/66372), 11.53 MiB | 23.04 MiB/s Receiving objects: 21% (13939/66372), 11.53 MiB | 23.04 MiB/s Receiving objects: 22% (14602/66372), 11.53 MiB | 23.04 MiB/s Receiving objects: 23% (15266/66372), 11.53 MiB | 23.04 MiB/s Receiving objects: 24% (15930/66372), 11.53 MiB | 23.04 MiB/s Receiving objects: 25% (16593/66372), 11.53 MiB | 23.04 MiB/s Receiving objects: 26% (17257/66372), 11.53 MiB | 23.04 MiB/s Receiving objects: 27% (17921/66372), 11.53 MiB | 23.04 MiB/s Receiving objects: 28% (18585/66372), 11.53 MiB | 23.04 MiB/s Receiving objects: 29% (19248/66372), 11.53 MiB | 23.04 MiB/s Receiving objects: 30% (19912/66372), 11.53 MiB | 23.04 MiB/s Receiving objects: 31% (20576/66372), 11.53 MiB | 23.04 MiB/s Receiving objects: 32% (21240/66372), 11.53 MiB | 23.04 MiB/s Receiving objects: 33% (21903/66372), 11.53 MiB | 23.04 MiB/s Receiving objects: 34% (22567/66372), 11.53 MiB | 23.04 MiB/s Receiving objects: 35% (23231/66372), 11.53 MiB | 23.04 MiB/s Receiving objects: 36% (23894/66372), 11.53 MiB | 23.04 MiB/s Receiving objects: 37% (24558/66372), 11.53 MiB | 23.04 MiB/s Receiving objects: 38% (25222/66372), 11.53 MiB | 23.04 MiB/s Receiving objects: 39% (25886/66372), 11.53 MiB | 23.04 MiB/s Receiving objects: 40% (26549/66372), 11.53 MiB | 23.04 MiB/s Receiving objects: 41% (27213/66372), 11.53 MiB | 23.04 MiB/s Receiving objects: 42% (27877/66372), 11.53 MiB | 23.04 MiB/s Receiving objects: 43% (28540/66372), 11.53 MiB | 23.04 MiB/s Receiving objects: 44% (29204/66372), 11.53 MiB | 23.04 MiB/s Receiving objects: 45% (29868/66372), 11.53 MiB | 23.04 MiB/s Receiving objects: 46% (30532/66372), 11.53 MiB | 23.04 MiB/s Receiving objects: 47% (31195/66372), 11.53 MiB | 23.04 MiB/s Receiving objects: 47% (31549/66372), 28.75 MiB | 28.51 MiB/s Receiving objects: 48% (31859/66372), 28.75 MiB | 28.51 MiB/s Receiving objects: 49% (32523/66372), 28.75 MiB | 28.51 MiB/s Receiving objects: 50% (33186/66372), 28.75 MiB | 28.51 MiB/s Receiving objects: 51% (33850/66372), 28.75 MiB | 28.51 MiB/s Receiving objects: 52% (34514/66372), 28.75 MiB | 28.51 MiB/s Receiving objects: 53% (35178/66372), 28.75 MiB | 28.51 MiB/s Receiving objects: 54% (35841/66372), 28.75 MiB | 28.51 MiB/s Receiving objects: 55% (36505/66372), 28.75 MiB | 28.51 MiB/s Receiving objects: 56% (37169/66372), 28.75 MiB | 28.51 MiB/s Receiving objects: 57% (37833/66372), 28.75 MiB | 28.51 MiB/s Receiving objects: 58% (38496/66372), 28.75 MiB | 28.51 MiB/s Receiving objects: 59% (39160/66372), 44.49 MiB | 29.29 MiB/s Receiving objects: 60% (39824/66372), 44.49 MiB | 29.29 MiB/s Receiving objects: 61% (40487/66372), 44.49 MiB | 29.29 MiB/s Receiving objects: 62% (41151/66372), 44.49 MiB | 29.29 MiB/s Receiving objects: 63% (41815/66372), 44.49 MiB | 29.29 MiB/s Receiving objects: 64% (42479/66372), 44.49 MiB | 29.29 MiB/s Receiving objects: 65% (43142/66372), 44.49 MiB | 29.29 MiB/s Receiving objects: 66% (43806/66372), 44.49 MiB | 29.29 MiB/s Receiving objects: 67% (44470/66372), 44.49 MiB | 29.29 MiB/s Receiving objects: 68% (45133/66372), 44.49 MiB | 29.29 MiB/s Receiving objects: 69% (45797/66372), 44.49 MiB | 29.29 MiB/s Receiving objects: 70% (46461/66372), 44.49 MiB | 29.29 MiB/s Receiving objects: 71% (47125/66372), 44.49 MiB | 29.29 MiB/s Receiving objects: 71% (47624/66372), 44.49 MiB | 29.29 MiB/s Receiving objects: 72% (47788/66372), 44.49 MiB | 29.29 MiB/s Receiving objects: 73% (48452/66372), 60.73 MiB | 30.08 MiB/s Receiving objects: 74% (49116/66372), 60.73 MiB | 30.08 MiB/s Receiving objects: 75% (49779/66372), 60.73 MiB | 30.08 MiB/s Receiving objects: 76% (50443/66372), 60.73 MiB | 30.08 MiB/s Receiving objects: 77% (51107/66372), 60.73 MiB | 30.08 MiB/s Receiving objects: 78% (51771/66372), 60.73 MiB | 30.08 MiB/s Receiving objects: 79% (52434/66372), 60.73 MiB | 30.08 MiB/s Receiving objects: 80% (53098/66372), 60.73 MiB | 30.08 MiB/s Receiving objects: 81% (53762/66372), 76.60 MiB | 30.35 MiB/s Receiving objects: 82% (54426/66372), 76.60 MiB | 30.35 MiB/s Receiving objects: 83% (55089/66372), 76.60 MiB | 30.35 MiB/s Receiving objects: 84% (55753/66372), 76.60 MiB | 30.35 MiB/s Receiving objects: 85% (56417/66372), 76.60 MiB | 30.35 MiB/s Receiving objects: 86% (57080/66372), 76.60 MiB | 30.35 MiB/s Receiving objects: 87% (57744/66372), 76.60 MiB | 30.35 MiB/s Receiving objects: 88% (58408/66372), 76.60 MiB | 30.35 MiB/s Receiving objects: 89% (59072/66372), 76.60 MiB | 30.35 MiB/s Receiving objects: 90% (59735/66372), 76.60 MiB | 30.35 MiB/s Receiving objects: 91% (60399/66372), 76.60 MiB | 30.35 MiB/s Receiving objects: 92% (61063/66372), 76.60 MiB | 30.35 MiB/s Receiving objects: 93% (61726/66372), 76.60 MiB | 30.35 MiB/s Receiving objects: 94% (62390/66372), 76.60 MiB | 30.35 MiB/s Receiving objects: 95% (63054/66372), 76.60 MiB | 30.35 MiB/s Receiving objects: 96% (63718/66372), 76.60 MiB | 30.35 MiB/s Receiving objects: 97% (64381/66372), 76.60 MiB | 30.35 MiB/s Receiving objects: 98% (65045/66372), 76.60 MiB | 30.35 MiB/s Receiving objects: 99% (65709/66372), 76.60 MiB | 30.35 MiB/s Receiving objects: 99% (66105/66372), 93.03 MiB | 30.65 MiB/s remote: Total 66372 (delta 7314), reused 7279 (delta 6627), pack-reused 57328 (from 1)
  7. 6.35 s Receiving objects: 100% (66372/66372), 93.03 MiB | 30.65 MiB/s Receiving objects: 100% (66372/66372), 98.65 MiB | 30.78 MiB/s, done.
  8. 6.95 s Resolving deltas: 0% (0/46411) Resolving deltas: 1% (465/46411) Resolving deltas: 2% (929/46411) Resolving deltas: 3% (1393/46411) Resolving deltas: 4% (1857/46411) Resolving deltas: 5% (2321/46411) Resolving deltas: 6% (2785/46411) Resolving deltas: 7% (3249/46411) Resolving deltas: 8% (3713/46411) Resolving deltas: 9% (4177/46411) Resolving deltas: 10% (4642/46411) Resolving deltas: 11% (5107/46411) Resolving deltas: 12% (5570/46411) Resolving deltas: 13% (6034/46411) Resolving deltas: 14% (6498/46411) Resolving deltas: 15% (6962/46411) Resolving deltas: 16% (7427/46411) Resolving deltas: 17% (7890/46411) Resolving deltas: 18% (8354/46411) Resolving deltas: 19% (8820/46411) Resolving deltas: 20% (9283/46411) Resolving deltas: 21% (9747/46411) Resolving deltas: 22% (10211/46411) Resolving deltas: 23% (10677/46411) Resolving deltas: 24% (11139/46411) Resolving deltas: 25% (11603/46411) Resolving deltas: 26% (12067/46411) Resolving deltas: 27% (12531/46411) Resolving deltas: 28% (12996/46411) Resolving deltas: 29% (13461/46411) Resolving deltas: 30% (13924/46411) Resolving deltas: 31% (14388/46411) Resolving deltas: 32% (14852/46411) Resolving deltas: 33% (15316/46411) Resolving deltas: 34% (15780/46411) Resolving deltas: 35% (16244/46411) Resolving deltas: 36% (16708/46411) Resolving deltas: 37% (17174/46411) Resolving deltas: 38% (17638/46411) Resolving deltas: 39% (18101/46411) Resolving deltas: 40% (18565/46411) Resolving deltas: 41% (19029/46411) Resolving deltas: 42% (19493/46411) Resolving deltas: 43% (19957/46411) Resolving deltas: 44% (20421/46411) Resolving deltas: 45% (20885/46411) Resolving deltas: 46% (21351/46411) Resolving deltas: 47% (21815/46411) Resolving deltas: 48% (22278/46411) Resolving deltas: 49% (22743/46411) Resolving deltas: 50% (23209/46411) Resolving deltas: 51% (23670/46411) Resolving deltas: 52% (24134/46411) Resolving deltas: 53% (24598/46411) Resolving deltas: 54% (25062/46411) Resolving deltas: 55% (25527/46411) Resolving deltas: 56% (25993/46411) Resolving deltas: 57% (26455/46411) Resolving deltas: 58% (26919/46411) Resolving deltas: 59% (27383/46411) Resolving deltas: 60% (27852/46411) Resolving deltas: 61% (28312/46411) Resolving deltas: 62% (28775/46411) Resolving deltas: 63% (29240/46411) Resolving deltas: 64% (29704/46411) Resolving deltas: 65% (30170/46411) Resolving deltas: 66% (30632/46411) Resolving deltas: 67% (31096/46411) Resolving deltas: 68% (31560/46411) Resolving deltas: 69% (32024/46411) Resolving deltas: 70% (32488/46411) Resolving deltas: 71% (32952/46411) Resolving deltas: 72% (33417/46411) Resolving deltas: 73% (33881/46411) Resolving deltas: 74% (34345/46411) Resolving deltas: 75% (34809/46411) Resolving deltas: 76% (35273/46411) Resolving deltas: 77% (35737/46411) Resolving deltas: 78% (36201/46411) Resolving deltas: 79% (36665/46411) Resolving deltas: 80% (37129/46411) Resolving deltas: 81% (37593/46411) Resolving deltas: 82% (38058/46411) Resolving deltas: 83% (38522/46411) Resolving deltas: 84% (38988/46411) Resolving deltas: 85% (39450/46411) Resolving deltas: 86% (39914/46411) Resolving deltas: 87% (40378/46411) Resolving deltas: 88% (40842/46411) Resolving deltas: 89% (41306/46411) Resolving deltas: 90% (41770/46411) Resolving deltas: 91% (42235/46411) Resolving deltas: 92% (42699/46411) Resolving deltas: 93% (43163/46411) Resolving deltas: 94% (43627/46411) Resolving deltas: 95% (44092/46411) Resolving deltas: 96% (44556/46411) Resolving deltas: 97% (45020/46411) Resolving deltas: 98% (45484/46411) Resolving deltas: 99% (45947/46411) Resolving deltas: 100% (46411/46411) Resolving deltas: 100% (46411/46411), done.
  9. 7.23 s Fetching commit 63073375d37e632f4b7021a2cf030b3a85d47360 for feynkit ...
  10. 7.23 s $ /nix/store/bcnisk3ydfgv26v2gw3zlky24g00yww2-git-2.54.0/bin/git fetch origin 63073375d37e632f4b7021a2cf030b3a85d47360
  11. 7.72 s From https://github.com/alphal00p/gammaloop
  12. 7.72 s * branch 63073375d37e632f4b7021a2cf030b3a85d47360 -> FETCH_HEAD
  13. 7.73 s $ /nix/store/9ypz3flqsrl5xl495mm8h645gadjsxi1-coreutils-9.11/bin/timeout --kill-after=15s 7200s /nix/store/bcnisk3ydfgv26v2gw3zlky24g00yww2-git-2.54.0/bin/git -c advice.detachedHead=false checkout 63073375d37e632f4b7021a2cf030b3a85d47360
  14. 7.81 s HEAD is now at 63073375d make feynkit tensor reduction default
  15. 7.82 s $ /nix/store/9ypz3flqsrl5xl495mm8h645gadjsxi1-coreutils-9.11/bin/timeout --kill-after=15s 7200s /nix/store/23zk8sgzamrbmj1fday15szf7f2279s8-nix-2.34.7/bin/nix --extra-experimental-features nix-command --extra-experimental-features flakes --log-format internal-json run .#packages.x86_64-linux.nix-ci-check-gammaloop-doctest --print-build-logs
  16. 9.90 s
  17. 10.17 s Building /nix/store/k98jfa8v8vmy9b91bbhdlkd9w1w7nmls-nix-ci-check-gammaloop-doctest.drv
  18. 10.25 s [nix-ci-check-gammaloop-doctest:post-build] Uploading to the NixCI cache: /nix/store/fqv11695ardnsgp4a6dxils8bdvk7ibw-nix-ci-check-gammaloop-doctest
  19. 10.28 s [nix-ci-check-gammaloop-doctest:post-build] warning: 'warn-short-path-literals' is deprecated, use 'lint-short-path-literals = ignore' instead
  20. 10.31 s [nix-ci-check-gammaloop-doctest:post-build] copying 1 paths...
  21. 10.31 s [nix-ci-check-gammaloop-doctest:post-build] copying path '/nix/store/fqv11695ardnsgp4a6dxils8bdvk7ibw-nix-ci-check-gammaloop-doctest' to 'https://cache.nix-ci.com'...
  22. 11.80 s [nix-ci-check-gammaloop-doctest:post-build] warning: 'warn-short-path-literals' is deprecated, use 'lint-short-path-literals = ignore' instead
  23. 12.56 s [nix-ci-check-gammaloop-doctest:post-build] copying 1 paths...
  24. 12.56 s [nix-ci-check-gammaloop-doctest:post-build] copying path '/nix/store/k98jfa8v8vmy9b91bbhdlkd9w1w7nmls-nix-ci-check-gammaloop-doctest.drv' to 'https://cache.nix-ci.com'...
  25. 13.79 s Uploaded nix-ci-check-gammaloop-doctest in 3.5s
  26. 13.79 s Progress: 1 of 2 built
  27. 13.79 s Built nix-ci-check-gammaloop-doctest in 3.6s
  28. 13.79 s Progress: 2 of 2 built
  29. 16.14 s evaluating derivation 'g copying '/nix/store/hphc evaluating derivation 'g querying gammaloop-works [0.0 KiB DL] [0/1 built, 0.0 KiB DL] [1/0/1 built, 0.0 KiB DLgammaloop-workspace-doctest> Running phase: unpackPhase
  30. 16.14 s gammaloop-workspace-doctest> unpacking source archive /nix/store/izmk7p64ksm1ga41kxchvc0054lwrb7s-source
  31. 16.25 s gammaloop-workspace-doctest> source root is source
  32. 16.27 s gammaloop-workspace-doctest> Running phase: patchPhase
  33. 16.28 s gammaloop-workspace-doctest> Executing configureCargoCommonVars
  34. 16.28 s gammaloop-workspace-doctest> decompressing cargo artifacts from /nix/store/ll9b1in64vh8qki89lybxzjjz809daql-gammaloop-workspace-deps-deps-0.1.0/target.tar.zst to target
  35. 17.34 s gammaloop-workspace-doctest> Running phase: updateAutotoolsGnuConfigScriptsPhase
  36. 17.39 s gammaloop-workspace-doctest> Running phase: configurePhase
  37. 17.39 s gammaloop-workspace-doctest> will append /build/source/.cargo-home/config.toml with contents of /nix/store/5k2rp6i9lv5zqizci840fqwg07lqhf3q-vendor-cargo-deps/config.toml
  38. 17.39 s gammaloop-workspace-doctest> default configurePhase, nothing to do
  39. 17.39 s gammaloop-workspace-doctest> Running phase: buildPhase
  40. 17.39 s gammaloop-workspace-doctest> +++ command cargo --version
  41. 17.39 s gammaloop-workspace-doctest> cargo 1.97.0 (c980f4866 2026-06-30)
  42. 17.41 s gammaloop-workspace-doctest> +++ command cargo test --profile ci-optim --doc --locked --workspace --features gammaloop-tracing-filter/clap,gammaloop-tracing-filter/symbolica,idenso/bincode,idenso/reference-cases,linnet/bincode,linnet/drawing,linnet/rkyv,linnet/serde,linnet/symbolica,spenso-macros/shadowing,spenso/shadowing,symbolica/tracing_max_level_info
  43. 17.73 s gammaloop-workspace-doctest> Compiling pyo3-build-config v0.28.3
  44. 17.73 s gammaloop-workspace-doctest> Compiling phf_shared v0.11.3
  45. 17.74 s gammaloop-workspace-doctest> Compiling getopts v0.2.24
  46. 17.74 s gammaloop-workspace-doctest> Compiling unic-common v0.9.0
  47. 17.74 s gammaloop-workspace-doctest> Compiling unic-char-range v0.9.0
  48. 17.74 s gammaloop-workspace-doctest> Compiling is-macro v0.3.7
  49. 17.74 s gammaloop-workspace-doctest> Compiling rustpython-parser-vendored v0.4.0
  50. 17.75 s gammaloop-workspace-doctest> Compiling lalrpop-util v0.20.2
  51. 17.75 s gammaloop-workspace-doctest> Compiling rustc-hash v1.1.0
  52. 17.75 s gammaloop-workspace-doctest> Compiling symbolica v2.2.0 (https://github.com/symbolica-dev/symbolica?branch=dev#0441bd7a)
  53. 17.77 s gammaloop-workspace-doctest> Compiling gammaloop-tracing-filter-macros v0.1.0 (/build/source/crates/gammaloop-tracing-filter-macros)
  54. 17.77 s gammaloop-workspace-doctest> Compiling vakint v0.1.2 (/build/source/crates/vakint)
  55. 17.77 s gammaloop-workspace-doctest> Compiling unic-ucd-version v0.9.0
  56. 17.78 s gammaloop-workspace-doctest> Compiling unic-char-property v0.9.0
  57. 17.79 s gammaloop-workspace-doctest> Compiling gammalooprs v0.3.4 (/build/source/crates/gammalooprs)
  58. 17.79 s gammaloop-workspace-doctest> Compiling rustc_version v0.4.1
  59. 17.80 s gammaloop-workspace-doctest> Compiling gammaloop-api v0.1.0 (/build/source/crates/gammaloop-api)
  60. 17.81 s gammaloop-workspace-doctest> Compiling bincode v1.3.3
  61. 17.81 s gammaloop-workspace-doctest> Compiling gungraun-runner v0.18.2
  62. 17.83 s gammaloop-workspace-doctest> Compiling phf_generator v0.11.3
  63. 17.86 s gammaloop-workspace-doctest> Compiling phf v0.11.3
  64. 17.86 s gammaloop-workspace-doctest> Compiling unic-ucd-ident v0.9.0
  65. 17.94 s gammaloop-workspace-doctest> Compiling phf_codegen v0.11.3
  66. 17.95 s gammaloop-workspace-doctest> Compiling unic-emoji-char v0.9.0
  67. 17.98 s gammaloop-workspace-doctest> Compiling iai-callgrind-runner v0.14.2
  68. 17.98 s gammaloop-workspace-doctest> Compiling gammaloop-integration-tests v0.1.0 (/build/source/tests)
  69. 17.98 s gammaloop-workspace-doctest> Compiling test-log-core v0.2.20
  70. 18.00 s gammaloop-workspace-doctest> Compiling wait-timeout v0.2.1
  71. 18.01 s gammaloop-workspace-doctest> Compiling unicode_names2_generator v1.3.0
  72. 18.02 s gammaloop-workspace-doctest> Compiling bit-vec v0.8.0
  73. 18.07 s gammaloop-workspace-doctest> Compiling maplit v1.0.2
  74. 18.09 s gammaloop-workspace-doctest> Compiling quick-error v1.2.3
  75. 18.10 s gammaloop-workspace-doctest> Compiling iai-callgrind v0.14.2
  76. 18.12 s gammaloop-workspace-doctest> Compiling rustpython-parser v0.4.0
  77. 18.13 s gammaloop-workspace-doctest> Compiling rusty-fork v0.3.1
  78. 18.14 s gammaloop-workspace-doctest> Compiling iai-callgrind-macros v0.5.1
  79. 18.21 s gammaloop-workspace-doctest> Compiling bit-set v0.8.0
  80. 18.28 s gammaloop-workspace-doctest> Compiling rand_xorshift v0.4.0
  81. 18.31 s gammaloop-workspace-doctest> Compiling gungraun-macros v0.8.0
  82. 18.33 s gammaloop-workspace-doctest> Compiling console v0.15.11
  83. 18.34 s gammaloop-workspace-doctest> Compiling base64 v0.21.7
  84. 18.36 s gammaloop-workspace-doctest> Compiling unarray v0.1.4
  85. 18.41 s gammaloop-workspace-doctest> Compiling proptest v1.11.0
  86. 18.61 s gammaloop-workspace-doctest> Compiling similar-asserts v1.7.0
  87. 18.71 s gammaloop-workspace-doctest> Compiling ron v0.8.1
  88. 18.82 s gammaloop-workspace-doctest> Compiling kurvst v0.1.0 (/build/source/crates/kurvst)
  89. 19.30 s gammaloop-workspace-doctest> Compiling test-log-macros v0.2.20
  90. 19.83 s gammaloop-workspace-doctest> Compiling unicode_names2 v1.3.0
  91. 21.08 s gammaloop-workspace-doctest> Compiling test-log v0.2.20
  92. 21.16 s gammaloop-workspace-doctest> Compiling rustpython-parser-core v0.4.0
  93. 21.30 s gammaloop-workspace-doctest> Compiling rustpython-ast v0.4.0
  94. 21.57 s gammaloop-workspace-doctest> Compiling pyo3-ffi v0.28.3
  95. 21.63 s gammaloop-workspace-doctest> Compiling pyo3-macros-backend v0.28.3
  96. 21.70 s gammaloop-workspace-doctest> Compiling pyo3 v0.28.3
  97. 21.71 s gammaloop-workspace-doctest> Compiling numpy v0.28.0
  98. 22.42 s gammaloop-workspace-doctest> Compiling gungraun v0.18.2
  99. 26.02 s gammaloop-workspace-doctest> Compiling pyo3-macros v0.28.3
  100. 27.98 s gammaloop-workspace-doctest> Compiling pyo3-stub-gen-derive v0.17.2
  101. 30.67 s gammaloop-workspace-doctest> Compiling pyo3-stub-gen v0.17.2
  102. 30.74 s gammaloop-workspace-doctest> Compiling numerica v2.2.0 (https://github.com/symbolica-dev/symbolica?branch=dev#0441bd7a)
  103. 32.71 s gammaloop-workspace-doctest> Compiling graphica v2.1.0 (https://github.com/symbolica-dev/symbolica?branch=dev#0441bd7a)
  104. 35.93 s gammaloop-workspace-doctest> Compiling symbolica-utils v0.1.0 (/build/source/crates/symbolica-utils)
  105. 36.04 s gammaloop-workspace-doctest> Compiling linnet v0.17.0 (/build/source/crates/linnet)
  106. 56.94 s gammaloop-workspace-doctest> Compiling feynkit-model v0.1.0 (/build/source/crates/feynkit-model)
  107. 57.76 s gammaloop-workspace-doctest> Compiling feynkit-ufo v0.1.0 (/build/source/crates/feynkit-ufo)
  108. 61.55 s gammaloop-workspace-doctest> Compiling feynkit-kinematics v0.1.0 (/build/source/crates/feynkit-kinematics)
  109. 62.09 s gammaloop-workspace-doctest> Compiling feynkit-graph v0.1.0 (/build/source/crates/feynkit-graph)
  110. 65.97 s gammaloop-workspace-doctest> Compiling feynkit-cff v0.1.0 (/build/source/crates/feynkit-cff)
  111. 169.82 s gammaloop-workspace-doctest> Compiling spenso-macros v0.3.2 (/build/source/crates/spenso-macros)
  112. 170.75 s gammaloop-workspace-doctest> Compiling gammaloop-workspace-hack v0.1.0 (/build/source/crates/gammaloop-workspace-hack)
  113. 170.75 s gammaloop-workspace-doctest> Compiling spenso v0.6.0 (/build/source/crates/spenso)
  114. 175.96 s gammaloop-workspace-doctest> Compiling idenso v0.3.0 (/build/source/crates/idenso)
  115. 176.00 s gammaloop-workspace-doctest> Compiling gammaloop-tracing-filter v0.1.0 (/build/source/crates/gammaloop-tracing-filter)
  116. 179.11 s gammaloop-workspace-doctest> Compiling spenso-hep-lib v0.1.7 (/build/source/crates/spenso-hep-lib)
  117. 179.11 s gammaloop-workspace-doctest> Compiling feynkit-tensor v0.1.0 (/build/source/crates/feynkit-tensor)
  118. 179.34 s gammaloop-workspace-doctest> Compiling feynkit-generator v0.1.0 (/build/source/crates/feynkit-generator)
  119. 179.34 s gammaloop-workspace-doctest> Compiling spynso3 v0.1.2 (/build/source/crates/spynso3)
  120. 184.94 s gammaloop-workspace-doctest> Compiling feynkit-py v0.1.0 (/build/source/crates/feynkit-py)
  121. 185.94 s gammaloop-workspace-doctest> Compiling feynkit v0.1.0 (/build/source/crates/feynkit)
  122. 223.92 s gammaloop-workspace-doctest> Compiling linnest v0.1.0 (/build/source/crates/linnest)
  123. 223.96 s gammaloop-workspace-doctest> Compiling linnet-py v0.1.0 (/build/source/crates/linnet-py)
  124. 333.02 s gammaloop-workspace-doctest> Finished `ci-optim` profile [optimized] target(s) in 5m 15s
  125. 333.15 s gammaloop-workspace-doctest> warning: the following packages contain code that will be rejected by a future version of Rust: proc-macro-error2 v2.0.1
  126. 333.15 s gammaloop-workspace-doctest> note: to see what the problems were, use the option `--future-incompat-report`, or run `cargo report future-incompatibilities --id 1`
  127. 333.18 s gammaloop-workspace-doctest> Doc-tests feynkit
  128. 333.22 s gammaloop-workspace-doctest>
  129. 333.22 s gammaloop-workspace-doctest> running 0 tests
  130. 333.22 s gammaloop-workspace-doctest>
  131. 333.22 s gammaloop-workspace-doctest> test result: ok. 0 passed; 0 failed; 0 ignored; 0 measured; 0 filtered out; finished in 0.00s
  132. 333.22 s gammaloop-workspace-doctest>
  133. 333.23 s gammaloop-workspace-doctest> Doc-tests feynkit_cff
  134. 334.90 s gammaloop-workspace-doctest>
  135. 334.90 s gammaloop-workspace-doctest> running 1 test
  136. 334.90 s gammaloop-workspace-doctest> test crates/feynkit-cff/src/lib.rs - (line 10) ... ok
  137. 334.90 s gammaloop-workspace-doctest>
  138. 334.90 s gammaloop-workspace-doctest> test result: ok. 1 passed; 0 failed; 0 ignored; 0 measured; 0 filtered out; finished in 0.00s
  139. 334.90 s gammaloop-workspace-doctest>
  140. 334.91 s gammaloop-workspace-doctest> all doctests ran in 1.57s; merged doctests compilation took 1.56s
  141. 334.91 s gammaloop-workspace-doctest> Doc-tests feynkit_generator
  142. 335.08 s gammaloop-workspace-doctest>
  143. 335.08 s gammaloop-workspace-doctest> running 0 tests
  144. 335.08 s gammaloop-workspace-doctest>
  145. 335.08 s gammaloop-workspace-doctest> test result: ok. 0 passed; 0 failed; 0 ignored; 0 measured; 0 filtered out; finished in 0.00s
  146. 335.08 s gammaloop-workspace-doctest>
  147. 335.08 s gammaloop-workspace-doctest> Doc-tests feynkit_graph
  148. 335.19 s gammaloop-workspace-doctest>
  149. 335.19 s gammaloop-workspace-doctest> running 0 tests
  150. 335.19 s gammaloop-workspace-doctest>
  151. 335.19 s gammaloop-workspace-doctest> test result: ok. 0 passed; 0 failed; 0 ignored; 0 measured; 0 filtered out; finished in 0.00s
  152. 335.19 s gammaloop-workspace-doctest>
  153. 335.19 s gammaloop-workspace-doctest> Doc-tests feynkit_kinematics
  154. 335.26 s gammaloop-workspace-doctest>
  155. 335.26 s gammaloop-workspace-doctest> running 0 tests
  156. 335.26 s gammaloop-workspace-doctest>
  157. 335.26 s gammaloop-workspace-doctest> test result: ok. 0 passed; 0 failed; 0 ignored; 0 measured; 0 filtered out; finished in 0.00s
  158. 335.26 s gammaloop-workspace-doctest>
  159. 335.26 s gammaloop-workspace-doctest> Doc-tests feynkit_model
  160. 335.36 s gammaloop-workspace-doctest>
  161. 335.36 s gammaloop-workspace-doctest> running 0 tests
  162. 335.36 s gammaloop-workspace-doctest>
  163. 335.36 s gammaloop-workspace-doctest> test result: ok. 0 passed; 0 failed; 0 ignored; 0 measured; 0 filtered out; finished in 0.00s
  164. 335.36 s gammaloop-workspace-doctest>
  165. 335.36 s gammaloop-workspace-doctest> Doc-tests feynkit_py
  166. 335.69 s gammaloop-workspace-doctest>
  167. 335.69 s gammaloop-workspace-doctest> running 0 tests
  168. 335.69 s gammaloop-workspace-doctest>
  169. 335.69 s gammaloop-workspace-doctest> test result: ok. 0 passed; 0 failed; 0 ignored; 0 measured; 0 filtered out; finished in 0.00s
  170. 335.69 s gammaloop-workspace-doctest>
  171. 335.70 s gammaloop-workspace-doctest> Doc-tests feynkit_tensor
  172. 337.77 s gammaloop-workspace-doctest>
  173. 337.77 s gammaloop-workspace-doctest> running 17 tests
  174. 337.77 s gammaloop-workspace-doctest> test crates/feynkit-tensor/src/reduction.rs - reduction::ContractionOrbit (line 65) - compile ... ok
  175. 337.77 s gammaloop-workspace-doctest> test crates/feynkit-tensor/src/reduction.rs - reduction::FeynmanDiagramTensorExt (line 905) - compile ... ok
  176. 337.77 s gammaloop-workspace-doctest> test crates/feynkit-tensor/src/reduction.rs - reduction::TensorReduction (line 202) - compile ... ok
  177. 337.77 s gammaloop-workspace-doctest> test crates/feynkit-tensor/src/reduction.rs - reduction::TensorReducer::reduce (line 395) - compile ... ok
  178. 337.77 s gammaloop-workspace-doctest> test crates/feynkit-tensor/src/reduction.rs - reduction::TensorReducer (line 283) - compile ... ok
  179. 337.77 s gammaloop-workspace-doctest> test crates/feynkit-tensor/src/reduction.rs - reduction::TensorReduction::expression (line 247) - compile ... ok
  180. 337.77 s gammaloop-workspace-doctest> test crates/feynkit-tensor/src/reduction.rs - reduction::TensorReductionTerm (line 145) - compile ... ok
  181. 337.77 s gammaloop-workspace-doctest> test crates/feynkit-tensor/src/weingarten.rs - weingarten::OrthogonalWeingarten (line 199) - compile ... ok
  182. 337.77 s gammaloop-workspace-doctest> test crates/feynkit-tensor/src/weingarten.rs - weingarten::OrthogonalWeingarten::for_rank (line 275) - compile ... ok
  183. 337.77 s gammaloop-workspace-doctest> test crates/feynkit-tensor/src/weingarten.rs - weingarten::OrthogonalWeingarten::coefficient (line 309) - compile ... ok
  184. 337.77 s gammaloop-workspace-doctest> test crates/feynkit-tensor/src/weingarten.rs - weingarten::OrthogonalWeingarten::new (line 231) - compile ... ok
  185. 337.77 s gammaloop-workspace-doctest> test crates/feynkit-tensor/src/weingarten.rs - weingarten::CosetType::new (line 55) ... ok
  186. 337.77 s gammaloop-workspace-doctest> test crates/feynkit-tensor/src/weingarten.rs - weingarten::CosetType::between_matchings (line 92) ... ok
  187. 337.77 s gammaloop-workspace-doctest> test crates/feynkit-tensor/src/weingarten.rs - weingarten::CosetType::class_size (line 152) ... ok
  188. 337.77 s gammaloop-workspace-doctest> test crates/feynkit-tensor/src/weingarten.rs - weingarten::CosetType (line 34) ... ok
  189. 337.77 s gammaloop-workspace-doctest> test crates/feynkit-tensor/src/weingarten.rs - weingarten::OrthogonalWeingarten::isotropic_pairing_coefficient (line 345) ... ok
  190. 337.85 s gammaloop-workspace-doctest> test crates/feynkit-tensor/src/weingarten.rs - weingarten::WeingartenError (line 409) ... FAILED
  191. 337.85 s gammaloop-workspace-doctest>
  192. 337.85 s gammaloop-workspace-doctest> failures:
  193. 337.85 s gammaloop-workspace-doctest>
  194. 337.85 s gammaloop-workspace-doctest> ---- crates/feynkit-tensor/src/weingarten.rs - weingarten::WeingartenError (line 409) stdout ----
  195. 337.85 s gammaloop-workspace-doctest> Test executable failed (terminated by signal).
  196. 337.85 s gammaloop-workspace-doctest>
  197. 337.85 s gammaloop-workspace-doctest> stdout:
  198. 337.85 s gammaloop-workspace-doctest> ┌────────────────────────────────────────────────────────┐
  199. 337.85 s gammaloop-workspace-doctest> │ You are running a restricted Symbolica instance. │
  200. 337.85 s gammaloop-workspace-doctest> │ │
  201. 337.85 s gammaloop-workspace-doctest> │ This mode is only permitted for non-commercial use and │
  202. 337.85 s gammaloop-workspace-doctest> │ is limited to one instance and core per machine. │
  203. 337.85 s gammaloop-workspace-doctest> │ │
  204. 337.85 s gammaloop-workspace-doctest> │ Hobbyists can easily acquire a free license key │
  205. 337.85 s gammaloop-workspace-doctest> │ that unlocks all cores and removes this banner: │
  206. 337.85 s gammaloop-workspace-doctest> │ │
  207. 337.85 s gammaloop-workspace-doctest> │ from symbolica import * │
  208. 337.85 s gammaloop-workspace-doctest> │ request_hobbyist_license('YOUR_NAME', 'YOUR_EMAIL') │
  209. 337.85 s gammaloop-workspace-doctest> │ │
  210. 337.85 s gammaloop-workspace-doctest> │ All other users can obtain a free 30-day trial key: │
  211. 337.85 s gammaloop-workspace-doctest> │ │
  212. 337.85 s gammaloop-workspace-doctest> │ from symbolica import * │
  213. 337.85 s gammaloop-workspace-doctest> │ request_trial_license('NAME', 'EMAIL', 'EMPLOYER') │
  214. 337.85 s gammaloop-workspace-doctest> │ │
  215. 337.85 s gammaloop-workspace-doctest> │ See https://symbolica.io/docs/get_started.html#license │
  216. 337.85 s gammaloop-workspace-doctest> └────────────────────────────────────────────────────────┘
  217. 337.85 s gammaloop-workspace-doctest> ┌───────────────────────────────────────────────────────────────────────────────────────────────────────────┐
  218. 337.85 s gammaloop-workspace-doctest> │ Cannot start new unlicensed Symbolica instance since there is already another one running on the machine. │
  219. 337.85 s gammaloop-workspace-doctest> └───────────────────────────────────────────────────────────────────────────────────────────────────────────┘
  220. 337.85 s gammaloop-workspace-doctest>
  221. 337.85 s gammaloop-workspace-doctest> stderr:
  222. 337.85 s gammaloop-workspace-doctest> ┌───────────────────────────────────┐
  223. 337.85 s gammaloop-workspace-doctest> │ The Symbolica license has expired │
  224. 337.85 s gammaloop-workspace-doctest> └───────────────────────────────────┘
  225. 337.85 s gammaloop-workspace-doctest>
  226. 337.85 s gammaloop-workspace-doctest>
  227. 337.85 s gammaloop-workspace-doctest>
  228. 337.85 s gammaloop-workspace-doctest> failures:
  229. 337.85 s gammaloop-workspace-doctest> crates/feynkit-tensor/src/weingarten.rs - weingarten::WeingartenError (line 409)
  230. 337.85 s gammaloop-workspace-doctest>
  231. 337.85 s gammaloop-workspace-doctest> test result: FAILED. 16 passed; 1 failed; 0 ignored; 0 measured; 0 filtered out; finished in 0.08s
  232. 337.85 s gammaloop-workspace-doctest>
  233. 337.85 s gammaloop-workspace-doctest> all doctests ran in 2.09s; merged doctests compilation took 2.00s
  234. 337.86 s gammaloop-workspace-doctest> error: doctest failed, to rerun pass `-p feynkit-tensor --doc`
  235. 338.34 s error: Cannot build '/nix/store/7243z5fbvw0imfqx2r5ac9cx8m30zlfg-gammaloop-workspace-doctest-0.1.0.drv'.
  236. 338.41 s Reason: builder failed with exit code 101.
  237. 338.41 s Output paths:
  238. 338.41 s /nix/store/3969gy71i8grwb1kbwdbjly8jva7h4g6-gammaloop-workspace-doctest-0.1.0
  239. 338.41 s Last 206 log lines:
  240. 338.41 s > Running phase: unpackPhase
  241. 338.41 s > unpacking source archive /nix/store/izmk7p64ksm1ga41kxchvc0054lwrb7s-source
  242. 338.41 s > source root is source
  243. 338.41 s > Running phase: patchPhase
  244. 338.41 s > Executing configureCargoCommonVars
  245. 338.41 s > decompressing cargo artifacts from /nix/store/ll9b1in64vh8qki89lybxzjjz809daql-gammaloop-workspace-deps-deps-0.1.0/target.tar.zst to target
  246. 338.41 s > Running phase: updateAutotoolsGnuConfigScriptsPhase
  247. 338.41 s > Running phase: configurePhase
  248. 338.41 s > will append /build/source/.cargo-home/config.toml with contents of /nix/store/5k2rp6i9lv5zqizci840fqwg07lqhf3q-vendor-cargo-deps/config.toml
  249. 338.41 s > default configurePhase, nothing to do
  250. 338.41 s > Running phase: buildPhase
  251. 338.41 s > +++ command cargo --version
  252. 338.41 s > cargo 1.97.0 (c980f4866 2026-06-30)
  253. 338.41 s > +++ command cargo test --profile ci-optim --doc --locked --workspace --features gammaloop-tracing-filter/clap,gammaloop-tracing-filter/symbolica,idenso/bincode,idenso/reference-cases,linnet/bincode,linnet/drawing,linnet/rkyv,linnet/serde,linnet/symbolica,spenso-macros/shadowing,spenso/shadowing,symbolica/tracing_max_level_info
  254. 338.41 s > Compiling pyo3-build-config v0.28.3
  255. 338.41 s > Compiling phf_shared v0.11.3
  256. 338.41 s > Compiling getopts v0.2.24
  257. 338.41 s > Compiling unic-common v0.9.0
  258. 338.41 s > Compiling unic-char-range v0.9.0
  259. 338.41 s > Compiling is-macro v0.3.7
  260. 338.41 s > Compiling rustpython-parser-vendored v0.4.0
  261. 338.41 s > Compiling lalrpop-util v0.20.2
  262. 338.41 s > Compiling rustc-hash v1.1.0
  263. 338.41 s > Compiling symbolica v2.2.0 (https://github.com/symbolica-dev/symbolica?branch=dev#0441bd7a)
  264. 338.41 s > Compiling gammaloop-tracing-filter-macros v0.1.0 (/build/source/crates/gammaloop-tracing-filter-macros)
  265. 338.41 s > Compiling vakint v0.1.2 (/build/source/crates/vakint)
  266. 338.41 s > Compiling unic-ucd-version v0.9.0
  267. 338.41 s > Compiling unic-char-property v0.9.0
  268. 338.41 s > Compiling gammalooprs v0.3.4 (/build/source/crates/gammalooprs)
  269. 338.41 s > Compiling rustc_version v0.4.1
  270. 338.41 s > Compiling gammaloop-api v0.1.0 (/build/source/crates/gammaloop-api)
  271. 338.41 s > Compiling bincode v1.3.3
  272. 338.41 s > Compiling gungraun-runner v0.18.2
  273. 338.41 s > Compiling phf_generator v0.11.3
  274. 338.41 s > Compiling phf v0.11.3
  275. 338.41 s > Compiling unic-ucd-ident v0.9.0
  276. 338.41 s > Compiling phf_codegen v0.11.3
  277. 338.41 s > Compiling unic-emoji-char v0.9.0
  278. 338.41 s > Compiling iai-callgrind-runner v0.14.2
  279. 338.41 s > Compiling gammaloop-integration-tests v0.1.0 (/build/source/tests)
  280. 338.41 s > Compiling test-log-core v0.2.20
  281. 338.41 s > Compiling wait-timeout v0.2.1
  282. 338.41 s > Compiling unicode_names2_generator v1.3.0
  283. 338.41 s > Compiling bit-vec v0.8.0
  284. 338.41 s > Compiling maplit v1.0.2
  285. 338.41 s > Compiling quick-error v1.2.3
  286. 338.41 s > Compiling iai-callgrind v0.14.2
  287. 338.41 s > Compiling rustpython-parser v0.4.0
  288. 338.41 s > Compiling rusty-fork v0.3.1
  289. 338.41 s > Compiling iai-callgrind-macros v0.5.1
  290. 338.41 s > Compiling bit-set v0.8.0
  291. 338.41 s > Compiling rand_xorshift v0.4.0
  292. 338.41 s > Compiling gungraun-macros v0.8.0
  293. 338.41 s > Compiling console v0.15.11
  294. 338.41 s > Compiling base64 v0.21.7
  295. 338.41 s > Compiling unarray v0.1.4
  296. 338.41 s > Compiling proptest v1.11.0
  297. 338.41 s > Compiling similar-asserts v1.7.0
  298. 338.41 s > Compiling ron v0.8.1
  299. 338.41 s > Compiling kurvst v0.1.0 (/build/source/crates/kurvst)
  300. 338.41 s > Compiling test-log-macros v0.2.20
  301. 338.41 s > Compiling unicode_names2 v1.3.0
  302. 338.41 s > Compiling test-log v0.2.20
  303. 338.41 s > Compiling rustpython-parser-core v0.4.0
  304. 338.41 s > Compiling rustpython-ast v0.4.0
  305. 338.41 s > Compiling pyo3-ffi v0.28.3
  306. 338.41 s > Compiling pyo3-macros-backend v0.28.3
  307. 338.41 s > Compiling pyo3 v0.28.3
  308. 338.41 s > Compiling numpy v0.28.0
  309. 338.41 s > Compiling gungraun v0.18.2
  310. 338.41 s > Compiling pyo3-macros v0.28.3
  311. 338.41 s > Compiling pyo3-stub-gen-derive v0.17.2
  312. 338.41 s > Compiling pyo3-stub-gen v0.17.2
  313. 338.41 s > Compiling numerica v2.2.0 (https://github.com/symbolica-dev/symbolica?branch=dev#0441bd7a)
  314. 338.41 s > Compiling graphica v2.1.0 (https://github.com/symbolica-dev/symbolica?branch=dev#0441bd7a)
  315. 338.41 s > Compiling symbolica-utils v0.1.0 (/build/source/crates/symbolica-utils)
  316. 338.41 s > Compiling linnet v0.17.0 (/build/source/crates/linnet)
  317. 338.41 s > Compiling feynkit-model v0.1.0 (/build/source/crates/feynkit-model)
  318. 338.41 s > Compiling feynkit-ufo v0.1.0 (/build/source/crates/feynkit-ufo)
  319. 338.41 s > Compiling feynkit-kinematics v0.1.0 (/build/source/crates/feynkit-kinematics)
  320. 338.41 s > Compiling feynkit-graph v0.1.0 (/build/source/crates/feynkit-graph)
  321. 338.41 s > Compiling feynkit-cff v0.1.0 (/build/source/crates/feynkit-cff)
  322. 338.41 s > Compiling spenso-macros v0.3.2 (/build/source/crates/spenso-macros)
  323. 338.41 s > Compiling gammaloop-workspace-hack v0.1.0 (/build/source/crates/gammaloop-workspace-hack)
  324. 338.41 s > Compiling spenso v0.6.0 (/build/source/crates/spenso)
  325. 338.41 s > Compiling idenso v0.3.0 (/build/source/crates/idenso)
  326. 338.41 s > Compiling gammaloop-tracing-filter v0.1.0 (/build/source/crates/gammaloop-tracing-filter)
  327. 338.41 s > Compiling spenso-hep-lib v0.1.7 (/build/source/crates/spenso-hep-lib)
  328. 338.41 s > Compiling feynkit-tensor v0.1.0 (/build/source/crates/feynkit-tensor)
  329. 338.41 s > Compiling feynkit-generator v0.1.0 (/build/source/crates/feynkit-generator)
  330. 338.41 s > Compiling spynso3 v0.1.2 (/build/source/crates/spynso3)
  331. 338.41 s > Compiling feynkit-py v0.1.0 (/build/source/crates/feynkit-py)
  332. 338.41 s > Compiling feynkit v0.1.0 (/build/source/crates/feynkit)
  333. 338.41 s > Compiling linnest v0.1.0 (/build/source/crates/linnest)
  334. 338.41 s > Compiling linnet-py v0.1.0 (/build/source/crates/linnet-py)
  335. 338.41 s > Finished `ci-optim` profile [optimized] target(s) in 5m 15s
  336. 338.41 s > warning: the following packages contain code that will be rejected by a future version of Rust: proc-macro-error2 v2.0.1
  337. 338.41 s > note: to see what the problems were, use the option `--future-incompat-report`, or run `cargo report future-incompatibilities --id 1`
  338. 338.41 s > Doc-tests feynkit
  339. 338.41 s >
  340. 338.41 s > running 0 tests
  341. 338.41 s >
  342. 338.41 s > test result: ok. 0 passed; 0 failed; 0 ignored; 0 measured; 0 filtered out; finished in 0.00s
  343. 338.41 s >
  344. 338.41 s > Doc-tests feynkit_cff
  345. 338.41 s >
  346. 338.41 s > running 1 test
  347. 338.41 s > test crates/feynkit-cff/src/lib.rs - (line 10) ... ok
  348. 338.41 s >
  349. 338.41 s > test result: ok. 1 passed; 0 failed; 0 ignored; 0 measured; 0 filtered out; finished in 0.00s
  350. 338.41 s >
  351. 338.41 s > all doctests ran in 1.57s; merged doctests compilation took 1.56s
  352. 338.41 s > Doc-tests feynkit_generator
  353. 338.41 s >
  354. 338.41 s > running 0 tests
  355. 338.41 s >
  356. 338.41 s > test result: ok. 0 passed; 0 failed; 0 ignored; 0 measured; 0 filtered out; finished in 0.00s
  357. 338.41 s >
  358. 338.41 s > Doc-tests feynkit_graph
  359. 338.41 s >
  360. 338.41 s > running 0 tests
  361. 338.41 s >
  362. 338.41 s > test result: ok. 0 passed; 0 failed; 0 ignored; 0 measured; 0 filtered out; finished in 0.00s
  363. 338.41 s >
  364. 338.41 s > Doc-tests feynkit_kinematics
  365. 338.41 s >
  366. 338.41 s > running 0 tests
  367. 338.41 s >
  368. 338.41 s > test result: ok. 0 passed; 0 failed; 0 ignored; 0 measured; 0 filtered out; finished in 0.00s
  369. 338.41 s >
  370. 338.41 s > Doc-tests feynkit_model
  371. 338.41 s >
  372. 338.41 s > running 0 tests
  373. 338.41 s >
  374. 338.41 s > test result: ok. 0 passed; 0 failed; 0 ignored; 0 measured; 0 filtered out; finished in 0.00s
  375. 338.41 s >
  376. 338.41 s > Doc-tests feynkit_py
  377. 338.41 s >
  378. 338.41 s > running 0 tests
  379. 338.41 s >
  380. 338.41 s > test result: ok. 0 passed; 0 failed; 0 ignored; 0 measured; 0 filtered out; finished in 0.00s
  381. 338.41 s >
  382. 338.41 s > Doc-tests feynkit_tensor
  383. 338.41 s >
  384. 338.41 s > running 17 tests
  385. 338.41 s > test crates/feynkit-tensor/src/reduction.rs - reduction::ContractionOrbit (line 65) - compile ... ok
  386. 338.41 s > test crates/feynkit-tensor/src/reduction.rs - reduction::FeynmanDiagramTensorExt (line 905) - compile ... ok
  387. 338.41 s > test crates/feynkit-tensor/src/reduction.rs - reduction::TensorReduction (line 202) - compile ... ok
  388. 338.41 s > test crates/feynkit-tensor/src/reduction.rs - reduction::TensorReducer::reduce (line 395) - compile ... ok
  389. 338.41 s > test crates/feynkit-tensor/src/reduction.rs - reduction::TensorReducer (line 283) - compile ... ok
  390. 338.41 s > test crates/feynkit-tensor/src/reduction.rs - reduction::TensorReduction::expression (line 247) - compile ... ok
  391. 338.41 s > test crates/feynkit-tensor/src/reduction.rs - reduction::TensorReductionTerm (line 145) - compile ... ok
  392. 338.41 s > test crates/feynkit-tensor/src/weingarten.rs - weingarten::OrthogonalWeingarten (line 199) - compile ... ok
  393. 338.41 s > test crates/feynkit-tensor/src/weingarten.rs - weingarten::OrthogonalWeingarten::for_rank (line 275) - compile ... ok
  394. 338.41 s > test crates/feynkit-tensor/src/weingarten.rs - weingarten::OrthogonalWeingarten::coefficient (line 309) - compile ... ok
  395. 338.41 s > test crates/feynkit-tensor/src/weingarten.rs - weingarten::OrthogonalWeingarten::new (line 231) - compile ... ok
  396. 338.41 s > test crates/feynkit-tensor/src/weingarten.rs - weingarten::CosetType::new (line 55) ... ok
  397. 338.41 s > test crates/feynkit-tensor/src/weingarten.rs - weingarten::CosetType::between_matchings (line 92) ... ok
  398. 338.41 s > test crates/feynkit-tensor/src/weingarten.rs - weingarten::CosetType::class_size (line 152) ... ok
  399. 338.41 s > test crates/feynkit-tensor/src/weingarten.rs - weingarten::CosetType (line 34) ... ok
  400. 338.41 s > test crates/feynkit-tensor/src/weingarten.rs - weingarten::OrthogonalWeingarten::isotropic_pairing_coefficient (line 345) ... ok
  401. 338.41 s > test crates/feynkit-tensor/src/weingarten.rs - weingarten::WeingartenError (line 409) ... FAILED
  402. 338.41 s >
  403. 338.41 s > failures:
  404. 338.41 s >
  405. 338.41 s > ---- crates/feynkit-tensor/src/weingarten.rs - weingarten::WeingartenError (line 409) stdout ----
  406. 338.41 s > Test executable failed (terminated by signal).
  407. 338.41 s >
  408. 338.41 s > stdout:
  409. 338.41 s > ┌────────────────────────────────────────────────────────┐
  410. 338.41 s > │ You are running a restricted Symbolica instance. │
  411. 338.41 s > │ │
  412. 338.41 s > │ This mode is only permitted for non-commercial use and │
  413. 338.41 s > │ is limited to one instance and core per machine. │
  414. 338.41 s > │ │
  415. 338.41 s > │ Hobbyists can easily acquire a free license key │
  416. 338.41 s > │ that unlocks all cores and removes this banner: │
  417. 338.41 s > │ │
  418. 338.41 s > │ from symbolica import * │
  419. 338.41 s > │ request_hobbyist_license('YOUR_NAME', 'YOUR_EMAIL') │
  420. 338.41 s > │ │
  421. 338.41 s > │ All other users can obtain a free 30-day trial key: │
  422. 338.41 s > │ │
  423. 338.41 s > │ from symbolica import * │
  424. 338.41 s > │ request_trial_license('NAME', 'EMAIL', 'EMPLOYER') │
  425. 338.41 s > │ │
  426. 338.41 s > │ See https://symbolica.io/docs/get_started.html#license │
  427. 338.41 s > └────────────────────────────────────────────────────────┘
  428. 338.41 s > ┌───────────────────────────────────────────────────────────────────────────────────────────────────────────┐
  429. 338.41 s > │ Cannot start new unlicensed Symbolica instance since there is already another one running on the machine. │
  430. 338.41 s > └───────────────────────────────────────────────────────────────────────────────────────────────────────────┘
  431. 338.41 s >
  432. 338.41 s > stderr:
  433. 338.41 s > ┌───────────────────────────────────┐
  434. 338.41 s > │ The Symbolica license has expired │
  435. 338.41 s > └───────────────────────────────────┘
  436. 338.41 s >
  437. 338.41 s >
  438. 338.41 s >
  439. 338.41 s > failures:
  440. 338.41 s > crates/feynkit-tensor/src/weingarten.rs - weingarten::WeingartenError (line 409)
  441. 338.41 s >
  442. 338.41 s > test result: FAILED. 16 passed; 1 failed; 0 ignored; 0 measured; 0 filtered out; finished in 0.08s
  443. 338.41 s >
  444. 338.41 s > all doctests ran in 2.09s; merged doctests compilation took 2.00s
  445. 338.41 s > error: doctest failed, to rerun pass `-p feynkit-tensor --doc`
  446. 338.41 s For full logs, run:
  447. 338.41 s nix log /nix/store/7243z5fbvw0imfqx2r5ac9cx8m30zlfg-gammaloop-workspace-doctest-0.1.0.drv
  448. 338.45 s [0 built (1 failed), 0.0Run failed.