test packages.x86_64-linux.nix-ci-check-gammaloop-nextest-python-api
- 0.19 s
$ /nix/store/9ypz3flqsrl5xl495mm8h645gadjsxi1-coreutils-9.11/bin/timeout --kill-after=15s 7200s /nix/store/23zk8sgzamrbmj1fday15szf7f2279s8-nix-2.34.7/bin/nix --extra-experimental-features nix-command --extra-experimental-features flakes flake clone git+https://github.com/alphal00p/gammaloop --dest /tmp/nix-ci-worker/stable-pwd/repo/
- 0.54 s
Cloning into '/tmp/nix-ci-worker/stable-pwd/repo'...
- 1.96 s
remote: Enumerating objects: 66499, done.
- 2.07 s
remote: Counting objects: 0% (1/9150)
remote: Counting objects: 1% (92/9150)
remote: Counting objects: 2% (183/9150)
remote: Counting objects: 3% (275/9150)
remote: Counting objects: 4% (366/9150)
remote: Counting objects: 5% (458/9150)
remote: Counting objects: 6% (549/9150)
remote: Counting objects: 7% (641/9150)
remote: Counting objects: 8% (732/9150)
remote: Counting objects: 9% (824/9150)
remote: Counting objects: 10% (915/9150)
remote: Counting objects: 11% (1007/9150)
remote: Counting objects: 12% (1098/9150)
remote: Counting objects: 13% (1190/9150)
remote: Counting objects: 14% (1281/9150)
remote: Counting objects: 15% (1373/9150)
remote: Counting objects: 16% (1464/9150)
remote: Counting objects: 17% (1556/9150)
remote: Counting objects: 18% (1647/9150)
remote: Counting objects: 19% (1739/9150)
remote: Counting objects: 20% (1830/9150)
remote: Counting objects: 21% (1922/9150)
remote: Counting objects: 22% (2013/9150)
remote: Counting objects: 23% (2105/9150)
remote: Counting objects: 24% (2196/9150)
remote: Counting objects: 25% (2288/9150)
remote: Counting objects: 26% (2379/9150)
remote: Counting objects: 27% (2471/9150)
remote: Counting objects: 28% (2562/9150)
remote: Counting objects: 29% (2654/9150)
remote: Counting objects: 30% (2745/9150)
remote: Counting objects: 31% (2837/9150)
remote: Counting objects: 32% (2928/9150)
remote: Counting objects: 33% (3020/9150)
remote: Counting objects: 34% (3111/9150)
remote: Counting objects: 35% (3203/9150)
remote: Counting objects: 36% (3294/9150)
remote: Counting objects: 37% (3386/9150)
remote: Counting objects: 38% (3477/9150)
remote: Counting objects: 39% (3569/9150)
remote: Counting objects: 40% (3660/9150)
remote: Counting objects: 41% (3752/9150)
remote: Counting objects: 42% (3843/9150)
remote: Counting objects: 43% (3935/9150)
remote: Counting objects: 44% (4026/9150)
remote: Counting objects: 45% (4118/9150)
remote: Counting objects: 46% (4209/9150)
remote: Counting objects: 47% (4301/9150)
remote: Counting objects: 48% (4392/9150)
remote: Counting objects: 49% (4484/9150)
remote: Counting objects: 50% (4575/9150)
remote: Counting objects: 51% (4667/9150)
remote: Counting objects: 52% (4758/9150)
remote: Counting objects: 53% (4850/9150)
remote: Counting objects: 54% (4941/9150)
remote: Counting objects: 55% (5033/9150)
remote: Counting objects: 56% (5124/9150)
remote: Counting objects: 57% (5216/9150)
remote: Counting objects: 58% (5307/9150)
remote: Counting objects: 59% (5399/9150)
remote: Counting objects: 60% (5490/9150)
remote: Counting objects: 61% (5582/9150)
remote: Counting objects: 62% (5673/9150)
remote: Counting objects: 63% (5765/9150)
remote: Counting objects: 64% (5856/9150)
remote: Counting objects: 65% (5948/9150)
remote: Counting objects: 66% (6039/9150)
remote: Counting objects: 67% (6131/9150)
remote: Counting objects: 68% (6222/9150)
remote: Counting objects: 69% (6314/9150)
remote: Counting objects: 70% (6405/9150)
remote: Counting objects: 71% (6497/9150)
remote: Counting objects: 72% (6588/9150)
remote: Counting objects: 73% (6680/9150)
remote: Counting objects: 74% (6771/9150)
remote: Counting objects: 75% (6863/9150)
remote: Counting objects: 76% (6954/9150)
remote: Counting objects: 77% (7046/9150)
remote: Counting objects: 78% (7137/9150)
remote: Counting objects: 79% (7229/9150)
remote: Counting objects: 80% (7320/9150)
remote: Counting objects: 81% (7412/9150)
remote: Counting objects: 82% (7503/9150)
remote: Counting objects: 83% (7595/9150)
remote: Counting objects: 84% (7686/9150)
remote: Counting objects: 85% (7778/9150)
remote: Counting objects: 86% (7869/9150)
remote: Counting objects: 87% (7961/9150)
remote: Counting objects: 88% (8052/9150)
remote: Counting objects: 89% (8144/9150)
remote: Counting objects: 90% (8235/9150)
remote: Counting objects: 91% (8327/9150)
remote: Counting objects: 92% (8418/9150)
remote: Counting objects: 93% (8510/9150)
remote: Counting objects: 94% (8601/9150)
remote: Counting objects: 95% (8693/9150)
remote: Counting objects: 96% (8784/9150)
remote: Counting objects: 97% (8876/9150)
remote: Counting objects: 98% (8967/9150)
remote: Counting objects: 99% (9059/9150)
remote: Counting objects: 100% (9150/9150)
remote: Counting objects: 100% (9150/9150), done.
- 4.49 s
remote: Compressing objects: 0% (1/2231)
remote: Compressing objects: 1% (23/2231)
remote: Compressing objects: 2% (45/2231)
remote: Compressing objects: 3% (67/2231)
remote: Compressing objects: 4% (90/2231)
remote: Compressing objects: 5% (112/2231)
remote: Compressing objects: 6% (134/2231)
remote: Compressing objects: 7% (157/2231)
remote: Compressing objects: 8% (179/2231)
remote: Compressing objects: 9% (201/2231)
remote: Compressing objects: 10% (224/2231)
remote: Compressing objects: 11% (246/2231)
remote: Compressing objects: 12% (268/2231)
remote: Compressing objects: 13% (291/2231)
remote: Compressing objects: 14% (313/2231)
remote: Compressing objects: 15% (335/2231)
remote: Compressing objects: 16% (357/2231)
remote: Compressing objects: 17% (380/2231)
remote: Compressing objects: 18% (402/2231)
remote: Compressing objects: 19% (424/2231)
remote: Compressing objects: 20% (447/2231)
remote: Compressing objects: 21% (469/2231)
remote: Compressing objects: 21% (489/2231)
remote: Compressing objects: 22% (491/2231)
remote: Compressing objects: 23% (514/2231)
remote: Compressing objects: 24% (536/2231)
remote: Compressing objects: 25% (558/2231)
remote: Compressing objects: 26% (581/2231)
remote: Compressing objects: 27% (603/2231)
remote: Compressing objects: 28% (625/2231)
remote: Compressing objects: 29% (647/2231)
remote: Compressing objects: 29% (657/2231)
remote: Compressing objects: 30% (670/2231)
remote: Compressing objects: 31% (692/2231)
remote: Compressing objects: 32% (714/2231)
remote: Compressing objects: 33% (737/2231)
remote: Compressing objects: 34% (759/2231)
remote: Compressing objects: 35% (781/2231)
remote: Compressing objects: 36% (804/2231)
remote: Compressing objects: 37% (826/2231)
remote: Compressing objects: 38% (848/2231)
remote: Compressing objects: 39% (871/2231)
remote: Compressing objects: 40% (893/2231)
remote: Compressing objects: 41% (915/2231)
remote: Compressing objects: 42% (938/2231)
remote: Compressing objects: 43% (960/2231)
remote: Compressing objects: 44% (982/2231)
remote: Compressing objects: 45% (1004/2231)
remote: Compressing objects: 46% (1027/2231)
remote: Compressing objects: 47% (1049/2231)
remote: Compressing objects: 48% (1071/2231)
remote: Compressing objects: 49% (1094/2231)
remote: Compressing objects: 50% (1116/2231)
remote: Compressing objects: 51% (1138/2231)
remote: Compressing objects: 52% (1161/2231)
remote: Compressing objects: 53% (1183/2231)
remote: Compressing objects: 54% (1205/2231)
remote: Compressing objects: 55% (1228/2231)
remote: Compressing objects: 56% (1250/2231)
remote: Compressing objects: 57% (1272/2231)
remote: Compressing objects: 58% (1294/2231)
remote: Compressing objects: 59% (1317/2231)
remote: Compressing objects: 60% (1339/2231)
remote: Compressing objects: 61% (1361/2231)
remote: Compressing objects: 62% (1384/2231)
remote: Compressing objects: 63% (1406/2231)
remote: Compressing objects: 64% (1428/2231)
remote: Compressing objects: 65% (1451/2231)
remote: Compressing objects: 66% (1473/2231)
remote: Compressing objects: 67% (1495/2231)
remote: Compressing objects: 68% (1518/2231)
remote: Compressing objects: 69% (1540/2231)
remote: Compressing objects: 70% (1562/2231)
remote: Compressing objects: 71% (1585/2231)
remote: Compressing objects: 72% (1607/2231)
remote: Compressing objects: 73% (1629/2231)
remote: Compressing objects: 74% (1651/2231)
remote: Compressing objects: 75% (1674/2231)
remote: Compressing objects: 76% (1696/2231)
remote: Compressing objects: 77% (1718/2231)
remote: Compressing objects: 78% (1741/2231)
remote: Compressing objects: 79% (1763/2231)
remote: Compressing objects: 80% (1785/2231)
remote: Compressing objects: 81% (1808/2231)
remote: Compressing objects: 82% (1830/2231)
remote: Compressing objects: 83% (1852/2231)
remote: Compressing objects: 84% (1875/2231)
remote: Compressing objects: 85% (1897/2231)
remote: Compressing objects: 86% (1919/2231)
remote: Compressing objects: 87% (1941/2231)
remote: Compressing objects: 88% (1964/2231)
remote: Compressing objects: 89% (1986/2231)
remote: Compressing objects: 90% (2008/2231)
remote: Compressing objects: 91% (2031/2231)
remote: Compressing objects: 92% (2053/2231)
remote: Compressing objects: 93% (2075/2231)
remote: Compressing objects: 94% (2098/2231)
remote: Compressing objects: 95% (2120/2231)
remote: Compressing objects: 96% (2142/2231)
remote: Compressing objects: 97% (2165/2231)
remote: Compressing objects: 98% (2187/2231)
remote: Compressing objects: 99% (2209/2231)
remote: Compressing objects: 100% (2231/2231)
remote: Compressing objects: 100% (2231/2231), done.
- 10.73 s
Receiving objects: 0% (1/66499)
Receiving objects: 1% (665/66499)
Receiving objects: 2% (1330/66499)
Receiving objects: 3% (1995/66499)
Receiving objects: 4% (2660/66499)
Receiving objects: 5% (3325/66499)
Receiving objects: 6% (3990/66499)
Receiving objects: 7% (4655/66499)
Receiving objects: 8% (5320/66499), 9.11 MiB | 18.17 MiB/s
Receiving objects: 9% (5985/66499), 9.11 MiB | 18.17 MiB/s
Receiving objects: 10% (6650/66499), 9.11 MiB | 18.17 MiB/s
Receiving objects: 11% (7315/66499), 9.11 MiB | 18.17 MiB/s
Receiving objects: 12% (7980/66499), 9.11 MiB | 18.17 MiB/s
Receiving objects: 12% (8389/66499), 18.27 MiB | 18.24 MiB/s
Receiving objects: 13% (8645/66499), 18.27 MiB | 18.24 MiB/s
Receiving objects: 14% (9310/66499), 18.27 MiB | 18.24 MiB/s
Receiving objects: 15% (9975/66499), 18.27 MiB | 18.24 MiB/s
Receiving objects: 16% (10640/66499), 18.27 MiB | 18.24 MiB/s
Receiving objects: 17% (11305/66499), 18.27 MiB | 18.24 MiB/s
Receiving objects: 18% (11970/66499), 18.27 MiB | 18.24 MiB/s
Receiving objects: 19% (12635/66499), 18.27 MiB | 18.24 MiB/s
Receiving objects: 20% (13300/66499), 18.27 MiB | 18.24 MiB/s
Receiving objects: 21% (13965/66499), 18.27 MiB | 18.24 MiB/s
Receiving objects: 22% (14630/66499), 18.27 MiB | 18.24 MiB/s
Receiving objects: 23% (15295/66499), 18.27 MiB | 18.24 MiB/s
Receiving objects: 24% (15960/66499), 18.27 MiB | 18.24 MiB/s
Receiving objects: 25% (16625/66499), 18.27 MiB | 18.24 MiB/s
Receiving objects: 26% (17290/66499), 18.27 MiB | 18.24 MiB/s
Receiving objects: 27% (17955/66499), 18.27 MiB | 18.24 MiB/s
Receiving objects: 28% (18620/66499), 18.27 MiB | 18.24 MiB/s
Receiving objects: 29% (19285/66499), 18.27 MiB | 18.24 MiB/s
Receiving objects: 30% (19950/66499), 18.27 MiB | 18.24 MiB/s
Receiving objects: 31% (20615/66499), 18.27 MiB | 18.24 MiB/s
Receiving objects: 32% (21280/66499), 18.27 MiB | 18.24 MiB/s
Receiving objects: 33% (21945/66499), 18.27 MiB | 18.24 MiB/s
Receiving objects: 34% (22610/66499), 18.27 MiB | 18.24 MiB/s
Receiving objects: 35% (23275/66499), 18.27 MiB | 18.24 MiB/s
Receiving objects: 36% (23940/66499), 18.27 MiB | 18.24 MiB/s
Receiving objects: 37% (24605/66499), 18.27 MiB | 18.24 MiB/s
Receiving objects: 38% (25270/66499), 18.27 MiB | 18.24 MiB/s
Receiving objects: 39% (25935/66499), 18.27 MiB | 18.24 MiB/s
Receiving objects: 40% (26600/66499), 18.27 MiB | 18.24 MiB/s
Receiving objects: 41% (27265/66499), 18.27 MiB | 18.24 MiB/s
Receiving objects: 42% (27930/66499), 18.27 MiB | 18.24 MiB/s
Receiving objects: 43% (28595/66499), 18.27 MiB | 18.24 MiB/s
Receiving objects: 44% (29260/66499), 18.27 MiB | 18.24 MiB/s
Receiving objects: 45% (29925/66499), 18.27 MiB | 18.24 MiB/s
Receiving objects: 46% (30590/66499), 18.27 MiB | 18.24 MiB/s
Receiving objects: 47% (31255/66499), 18.27 MiB | 18.24 MiB/s
Receiving objects: 48% (31920/66499), 28.24 MiB | 18.81 MiB/s
Receiving objects: 49% (32585/66499), 28.24 MiB | 18.81 MiB/s
Receiving objects: 50% (33250/66499), 28.24 MiB | 18.81 MiB/s
Receiving objects: 51% (33915/66499), 28.24 MiB | 18.81 MiB/s
Receiving objects: 52% (34580/66499), 28.24 MiB | 18.81 MiB/s
Receiving objects: 52% (34744/66499), 33.76 MiB | 16.79 MiB/s
Receiving objects: 53% (35245/66499), 33.76 MiB | 16.79 MiB/s
Receiving objects: 54% (35910/66499), 33.76 MiB | 16.79 MiB/s
Receiving objects: 55% (36575/66499), 37.62 MiB | 14.97 MiB/s
Receiving objects: 56% (37240/66499), 37.62 MiB | 14.97 MiB/s
Receiving objects: 56% (37769/66499), 37.62 MiB | 14.97 MiB/s
Receiving objects: 57% (37905/66499), 42.04 MiB | 13.94 MiB/s
Receiving objects: 58% (38570/66499), 42.04 MiB | 13.94 MiB/s
Receiving objects: 59% (39235/66499), 42.04 MiB | 13.94 MiB/s
Receiving objects: 60% (39900/66499), 46.69 MiB | 13.28 MiB/s
Receiving objects: 61% (40565/66499), 46.69 MiB | 13.28 MiB/s
Receiving objects: 62% (41230/66499), 46.69 MiB | 13.28 MiB/s
Receiving objects: 63% (41895/66499), 46.69 MiB | 13.28 MiB/s
Receiving objects: 64% (42560/66499), 46.69 MiB | 13.28 MiB/s
Receiving objects: 65% (43225/66499), 46.69 MiB | 13.28 MiB/s
Receiving objects: 66% (43890/66499), 46.69 MiB | 13.28 MiB/s
Receiving objects: 66% (44511/66499), 46.69 MiB | 13.28 MiB/s
Receiving objects: 67% (44555/66499), 53.39 MiB | 13.27 MiB/s
Receiving objects: 68% (45220/66499), 53.39 MiB | 13.27 MiB/s
Receiving objects: 69% (45885/66499), 53.39 MiB | 13.27 MiB/s
Receiving objects: 70% (46550/66499), 53.39 MiB | 13.27 MiB/s
Receiving objects: 71% (47215/66499), 53.39 MiB | 13.27 MiB/s
Receiving objects: 72% (47880/66499), 60.33 MiB | 13.33 MiB/s
Receiving objects: 73% (48545/66499), 60.33 MiB | 13.33 MiB/s
Receiving objects: 74% (49210/66499), 60.33 MiB | 13.33 MiB/s
Receiving objects: 75% (49875/66499), 60.33 MiB | 13.33 MiB/s
Receiving objects: 76% (50540/66499), 60.33 MiB | 13.33 MiB/s
Receiving objects: 76% (50553/66499), 60.33 MiB | 13.33 MiB/s
Receiving objects: 77% (51205/66499), 71.17 MiB | 13.72 MiB/s
Receiving objects: 78% (51870/66499), 71.17 MiB | 13.72 MiB/s
Receiving objects: 79% (52535/66499), 71.17 MiB | 13.72 MiB/s
Receiving objects: 80% (53200/66499), 71.17 MiB | 13.72 MiB/s
Receiving objects: 81% (53865/66499), 71.17 MiB | 13.72 MiB/s
Receiving objects: 82% (54530/66499), 78.58 MiB | 13.34 MiB/s
Receiving objects: 83% (55195/66499), 78.58 MiB | 13.34 MiB/s
Receiving objects: 84% (55860/66499), 78.58 MiB | 13.34 MiB/s
Receiving objects: 85% (56525/66499), 78.58 MiB | 13.34 MiB/s
Receiving objects: 86% (57190/66499), 78.58 MiB | 13.34 MiB/s
Receiving objects: 87% (57855/66499), 78.58 MiB | 13.34 MiB/s
Receiving objects: 88% (58520/66499), 78.58 MiB | 13.34 MiB/s
Receiving objects: 89% (59185/66499), 78.58 MiB | 13.34 MiB/s
Receiving objects: 90% (59850/66499), 78.58 MiB | 13.34 MiB/s
Receiving objects: 91% (60515/66499), 78.58 MiB | 13.34 MiB/s
Receiving objects: 92% (61180/66499), 78.58 MiB | 13.34 MiB/s
Receiving objects: 93% (61845/66499), 78.58 MiB | 13.34 MiB/s
Receiving objects: 94% (62510/66499), 78.58 MiB | 13.34 MiB/s
Receiving objects: 95% (63175/66499), 78.58 MiB | 13.34 MiB/s
Receiving objects: 96% (63840/66499), 78.58 MiB | 13.34 MiB/s
Receiving objects: 97% (64505/66499), 78.58 MiB | 13.34 MiB/s
Receiving objects: 98% (65170/66499), 78.58 MiB | 13.34 MiB/s
Receiving objects: 99% (65835/66499), 78.58 MiB | 13.34 MiB/s
Receiving objects: 99% (66223/66499), 78.58 MiB | 13.34 MiB/s
remote: Total 66499 (delta 7345), reused 7319 (delta 6631), pack-reused 57349 (from 1)
- 10.74 s
Receiving objects: 100% (66499/66499), 92.64 MiB | 14.24 MiB/s
Receiving objects: 100% (66499/66499), 99.33 MiB | 15.93 MiB/s, done.
- 13.50 s
Resolving deltas: 0% (0/46463)
Resolving deltas: 1% (465/46463)
Resolving deltas: 2% (930/46463)
Resolving deltas: 3% (1394/46463)
Resolving deltas: 4% (1859/46463)
Resolving deltas: 5% (2325/46463)
Resolving deltas: 6% (2788/46463)
Resolving deltas: 7% (3254/46463)
Resolving deltas: 8% (3718/46463)
Resolving deltas: 9% (4182/46463)
Resolving deltas: 10% (4647/46463)
Resolving deltas: 11% (5111/46463)
Resolving deltas: 12% (5577/46463)
Resolving deltas: 13% (6041/46463)
Resolving deltas: 14% (6505/46463)
Resolving deltas: 15% (6971/46463)
Resolving deltas: 16% (7435/46463)
Resolving deltas: 17% (7899/46463)
Resolving deltas: 18% (8364/46463)
Resolving deltas: 19% (8828/46463)
Resolving deltas: 20% (9293/46463)
Resolving deltas: 21% (9759/46463)
Resolving deltas: 22% (10222/46463)
Resolving deltas: 23% (10687/46463)
Resolving deltas: 24% (11152/46463)
Resolving deltas: 25% (11616/46463)
Resolving deltas: 26% (12081/46463)
Resolving deltas: 27% (12546/46463)
Resolving deltas: 28% (13010/46463)
Resolving deltas: 29% (13475/46463)
Resolving deltas: 30% (13939/46463)
Resolving deltas: 31% (14404/46463)
Resolving deltas: 32% (14869/46463)
Resolving deltas: 33% (15333/46463)
Resolving deltas: 34% (15798/46463)
Resolving deltas: 35% (16263/46463)
Resolving deltas: 36% (16727/46463)
Resolving deltas: 37% (17192/46463)
Resolving deltas: 38% (17656/46463)
Resolving deltas: 39% (18121/46463)
Resolving deltas: 40% (18586/46463)
Resolving deltas: 41% (19050/46463)
Resolving deltas: 42% (19515/46463)
Resolving deltas: 43% (19980/46463)
Resolving deltas: 44% (20444/46463)
Resolving deltas: 45% (20909/46463)
Resolving deltas: 46% (21373/46463)
Resolving deltas: 47% (21838/46463)
Resolving deltas: 48% (22303/46463)
Resolving deltas: 49% (22767/46463)
Resolving deltas: 50% (23232/46463)
Resolving deltas: 51% (23697/46463)
Resolving deltas: 52% (24161/46463)
Resolving deltas: 53% (24626/46463)
Resolving deltas: 54% (25091/46463)
Resolving deltas: 55% (25555/46463)
Resolving deltas: 56% (26020/46463)
Resolving deltas: 57% (26484/46463)
Resolving deltas: 58% (26949/46463)
Resolving deltas: 59% (27414/46463)
Resolving deltas: 60% (27878/46463)
Resolving deltas: 60% (28311/46463)
Resolving deltas: 61% (28343/46463)
Resolving deltas: 62% (28808/46463)
Resolving deltas: 63% (29272/46463)
Resolving deltas: 64% (29737/46463)
Resolving deltas: 65% (30201/46463)
Resolving deltas: 66% (30666/46463)
Resolving deltas: 67% (31131/46463)
Resolving deltas: 68% (31595/46463)
Resolving deltas: 69% (32060/46463)
Resolving deltas: 70% (32525/46463)
Resolving deltas: 71% (32989/46463)
Resolving deltas: 72% (33454/46463)
Resolving deltas: 73% (33920/46463)
Resolving deltas: 74% (34384/46463)
Resolving deltas: 75% (34848/46463)
Resolving deltas: 76% (35312/46463)
Resolving deltas: 76% (35321/46463)
Resolving deltas: 77% (35777/46463)
Resolving deltas: 78% (36242/46463)
Resolving deltas: 79% (36706/46463)
Resolving deltas: 80% (37171/46463)
Resolving deltas: 81% (37636/46463)
Resolving deltas: 82% (38100/46463)
Resolving deltas: 83% (38565/46463)
Resolving deltas: 84% (39029/46463)
Resolving deltas: 85% (39494/46463)
Resolving deltas: 86% (39960/46463)
Resolving deltas: 87% (40423/46463)
Resolving deltas: 88% (40888/46463)
Resolving deltas: 89% (41353/46463)
Resolving deltas: 90% (41817/46463)
Resolving deltas: 91% (42282/46463)
Resolving deltas: 92% (42746/46463)
Resolving deltas: 93% (43211/46463)
Resolving deltas: 94% (43676/46463)
Resolving deltas: 95% (44140/46463)
Resolving deltas: 96% (44605/46463)
Resolving deltas: 97% (45070/46463)
Resolving deltas: 98% (45534/46463)
Resolving deltas: 99% (45999/46463)
Resolving deltas: 100% (46463/46463)
Resolving deltas: 100% (46463/46463), done.
- 15.00 s
Fetching commit 6eccc26fe47651addfae2f810918809139129a5c for feynkit ...
- 15.00 s
$ /nix/store/bcnisk3ydfgv26v2gw3zlky24g00yww2-git-2.54.0/bin/git fetch origin 6eccc26fe47651addfae2f810918809139129a5c
- 16.10 s
From https://github.com/alphal00p/gammaloop
- 16.10 s
* branch 6eccc26fe47651addfae2f810918809139129a5c -> FETCH_HEAD
- 16.13 s
$ /nix/store/9ypz3flqsrl5xl495mm8h645gadjsxi1-coreutils-9.11/bin/timeout --kill-after=15s 7200s /nix/store/bcnisk3ydfgv26v2gw3zlky24g00yww2-git-2.54.0/bin/git -c advice.detachedHead=false checkout 6eccc26fe47651addfae2f810918809139129a5c
- 16.47 s
HEAD is now at 6eccc26fe fix feynkit tensor bridge integration
- 16.49 s
$ /nix/store/9ypz3flqsrl5xl495mm8h645gadjsxi1-coreutils-9.11/bin/timeout --kill-after=15s 7200s /nix/store/23zk8sgzamrbmj1fday15szf7f2279s8-nix-2.34.7/bin/nix --extra-experimental-features nix-command --extra-experimental-features flakes --log-format internal-json run .#packages.x86_64-linux.nix-ci-check-gammaloop-nextest-python-api --print-build-logs
- 35.04 s
- 57.65 s
evaluating derivation 'g
copying '/nix/store/jirn
evaluating derivation 'g
copying '/nix/store/jirn
evaluating derivation 'g
copying '/nix/store/jirn
evaluating derivation 'g
copying '/nix/store/jirn
evaluating derivation 'g
copying '/nix/store/jirn
evaluating derivation 'g
copying '/nix/store/jirn
evaluating derivation 'g
copying '/nix/store/jirn
evaluating derivation 'g
copying '/nix/store/jirn
evaluating derivation 'g
copying '/nix/store/jirn
evaluating derivation 'g
copying '/nix/store/jirn
evaluating derivation 'g
copying '/nix/store/jirn
evaluating derivation 'g
copying '/nix/store/jirn
evaluating derivation 'g
copying '/nix/store/jirn
evaluating derivation 'g
copying '/nix/store/jirn
evaluating derivation 'g
copying '/nix/store/jirn
evaluating derivation 'g
copying '/nix/store/jirn
evaluating derivation 'g
copying '/nix/store/jirn
evaluating derivation 'g
copying '/nix/store/jirn
evaluating derivation 'g
copying '/nix/store/jirn
evaluating derivation 'g
copying '/nix/store/jirn
evaluating derivation 'g
copying '/nix/store/jirn
evaluating derivation 'g
copying '/nix/store/jirn
evaluating derivation 'g
copying '/nix/store/jirn
evaluating derivation 'g
copying '/nix/store/jirn
evaluating derivation 'g
copying '/nix/store/jirn
evaluating derivation 'g
copying '/nix/store/jirn
evaluating derivation 'g
copying '/nix/store/jirn
evaluating derivation 'g
copying '/nix/store/jirn
evaluating derivation 'g
querying gammaloop-nexte
[0.0 KiB DL]
[0/1 built, 0.0 KiB DL]
[1/0/1 built, 0.0 KiB DLgammaloop-nextest-python-api> Extracting 1 binary, 1 build script output directory, and 3 linked paths to /build/nextest-archive-FXjMJA
- 57.73 s
gammaloop-nextest-python-api> Extracted 18 files to /build/nextest-archive-FXjMJA in 0.09s
- 57.76 s
gammaloop-nextest-python-api> ------------
- 57.76 s
gammaloop-nextest-python-api> Nextest run ID 1ce1d4c4-a59d-4d86-b44c-3e05e146cbfe with nextest profile: ci_gammaloop
- 57.76 s
gammaloop-nextest-python-api> Starting 5 tests across 1 binary
- 58.30 s
gammaloop-nextest-python-api> FAIL [ 0.529s] (2/5) gammaloop-integration-tests::test_python_api python_evaluate_samples_batch_and_momentum_space_have_expected_shape
- 58.30 s
gammaloop-nextest-python-api> stdout ---
- 58.30 s
gammaloop-nextest-python-api>
- 58.30 s
gammaloop-nextest-python-api> running 1 test
- 58.30 s
gammaloop-nextest-python-api> test python_evaluate_samples_batch_and_momentum_space_have_expected_shape ... FAILED
- 58.30 s
gammaloop-nextest-python-api>
- 58.30 s
gammaloop-nextest-python-api> failures:
- 58.30 s
gammaloop-nextest-python-api>
- 58.30 s
gammaloop-nextest-python-api> failures:
- 58.30 s
gammaloop-nextest-python-api> python_evaluate_samples_batch_and_momentum_space_have_expected_shape
- 58.30 s
gammaloop-nextest-python-api>
- 58.30 s
gammaloop-nextest-python-api> test result: FAILED. 0 passed; 1 failed; 0 ignored; 0 measured; 4 filtered out; finished in 0.51s
- 58.30 s
gammaloop-nextest-python-api>
- 58.30 s
gammaloop-nextest-python-api> stderr ---
- 58.30 s
gammaloop-nextest-python-api> Error: Python API test subprocess failed.
- 58.30 s
gammaloop-nextest-python-api> stdout:
- 58.30 s
gammaloop-nextest-python-api> ┌────────────────────────────────────────────────────────┐
- 58.30 s
gammaloop-nextest-python-api> │ You are running a restricted Symbolica instance. │
- 58.30 s
gammaloop-nextest-python-api> │ │
- 58.30 s
gammaloop-nextest-python-api> │ This mode is only permitted for non-commercial use and │
- 58.30 s
gammaloop-nextest-python-api> │ is limited to one instance and core per machine. │
- 58.30 s
gammaloop-nextest-python-api> │ │
- 58.30 s
gammaloop-nextest-python-api> │ Hobbyists can easily acquire a free license key │
- 58.30 s
gammaloop-nextest-python-api> │ that unlocks all cores and removes this banner: │
- 58.30 s
gammaloop-nextest-python-api> │ │
- 58.30 s
gammaloop-nextest-python-api> │ from symbolica import * │
- 58.30 s
gammaloop-nextest-python-api> │ request_hobbyist_license('YOUR_NAME', 'YOUR_EMAIL') │
- 58.30 s
gammaloop-nextest-python-api> │ │
- 58.30 s
gammaloop-nextest-python-api> │ All other users can obtain a free 30-day trial key: │
- 58.30 s
gammaloop-nextest-python-api> │ │
- 58.30 s
gammaloop-nextest-python-api> │ from symbolica import * │
- 58.30 s
gammaloop-nextest-python-api> │ request_trial_license('NAME', 'EMAIL', 'EMPLOYER') │
- 58.30 s
gammaloop-nextest-python-api> │ │
- 58.30 s
gammaloop-nextest-python-api> │ See https://symbolica.io/docs/get_started.html#license │
- 58.30 s
gammaloop-nextest-python-api> └────────────────────────────────────────────────────────┘
- 58.30 s
gammaloop-nextest-python-api> ┌───────────────────────────────────────────────────────────────────────────────────────────────────────────┐
- 58.30 s
gammaloop-nextest-python-api> │ Cannot start new unlicensed Symbolica instance since there is already another one running on the machine. │
- 58.30 s
gammaloop-nextest-python-api> └───────────────────────────────────────────────────────────────────────────────────────────────────────────┘
- 58.30 s
gammaloop-nextest-python-api>
- 58.30 s
gammaloop-nextest-python-api> stderr:
- 58.30 s
gammaloop-nextest-python-api> ┌───────────────────────────────────┐
- 58.30 s
gammaloop-nextest-python-api> │ The Symbolica license has expired │
- 58.30 s
gammaloop-nextest-python-api> └───────────────────────────────────┘
- 58.30 s
gammaloop-nextest-python-api>
- 58.30 s
gammaloop-nextest-python-api>
- 58.30 s
gammaloop-nextest-python-api> Location:
- 58.30 s
gammaloop-nextest-python-api> tests/tests/test_python_api.rs:157:20
- 58.30 s
gammaloop-nextest-python-api>
- 58.32 s
gammaloop-nextest-python-api> FAIL [ 0.557s] (3/5) gammaloop-integration-tests::test_python_api python_evaluate_sample_honors_generate_events_and_observable_snapshots
- 58.32 s
gammaloop-nextest-python-api> stdout ---
- 58.32 s
gammaloop-nextest-python-api>
- 58.32 s
gammaloop-nextest-python-api> running 1 test
- 58.32 s
gammaloop-nextest-python-api> test python_evaluate_sample_honors_generate_events_and_observable_snapshots ... FAILED
- 58.32 s
gammaloop-nextest-python-api>
- 58.32 s
gammaloop-nextest-python-api> failures:
- 58.32 s
gammaloop-nextest-python-api>
- 58.32 s
gammaloop-nextest-python-api> failures:
- 58.32 s
gammaloop-nextest-python-api> python_evaluate_sample_honors_generate_events_and_observable_snapshots
- 58.32 s
gammaloop-nextest-python-api>
- 58.32 s
gammaloop-nextest-python-api> test result: FAILED. 0 passed; 1 failed; 0 ignored; 0 measured; 4 filtered out; finished in 0.54s
- 58.32 s
gammaloop-nextest-python-api>
- 58.32 s
gammaloop-nextest-python-api> stderr ---
- 58.32 s
gammaloop-nextest-python-api> Error: Python API test subprocess failed.
- 58.32 s
gammaloop-nextest-python-api> stdout:
- 58.32 s
gammaloop-nextest-python-api> ┌────────────────────────────────────────────────────────┐
- 58.32 s
gammaloop-nextest-python-api> │ You are running a restricted Symbolica instance. │
- 58.32 s
gammaloop-nextest-python-api> │ │
- 58.32 s
gammaloop-nextest-python-api> │ This mode is only permitted for non-commercial use and │
- 58.32 s
gammaloop-nextest-python-api> │ is limited to one instance and core per machine. │
- 58.32 s
gammaloop-nextest-python-api> │ │
- 58.32 s
gammaloop-nextest-python-api> │ Hobbyists can easily acquire a free license key │
- 58.32 s
gammaloop-nextest-python-api> │ that unlocks all cores and removes this banner: │
- 58.32 s
gammaloop-nextest-python-api> │ │
- 58.32 s
gammaloop-nextest-python-api> │ from symbolica import * │
- 58.32 s
gammaloop-nextest-python-api> │ request_hobbyist_license('YOUR_NAME', 'YOUR_EMAIL') │
- 58.32 s
gammaloop-nextest-python-api> │ │
- 58.32 s
gammaloop-nextest-python-api> │ All other users can obtain a free 30-day trial key: │
- 58.32 s
gammaloop-nextest-python-api> │ │
- 58.32 s
gammaloop-nextest-python-api> │ from symbolica import * │
- 58.32 s
gammaloop-nextest-python-api> │ request_trial_license('NAME', 'EMAIL', 'EMPLOYER') │
- 58.32 s
gammaloop-nextest-python-api> │ │
- 58.32 s
gammaloop-nextest-python-api> │ See https://symbolica.io/docs/get_started.html#license │
- 58.32 s
gammaloop-nextest-python-api> └────────────────────────────────────────────────────────┘
- 58.32 s
gammaloop-nextest-python-api> ┌───────────────────────────────────────────────────────────────────────────────────────────────────────────┐
- 58.32 s
gammaloop-nextest-python-api> │ Cannot start new unlicensed Symbolica instance since there is already another one running on the machine. │
- 58.32 s
gammaloop-nextest-python-api> └───────────────────────────────────────────────────────────────────────────────────────────────────────────┘
- 58.32 s
gammaloop-nextest-python-api>
- 58.32 s
gammaloop-nextest-python-api> stderr:
- 58.32 s
gammaloop-nextest-python-api> ┌───────────────────────────────────┐
- 58.32 s
gammaloop-nextest-python-api> │ The Symbolica license has expired │
- 58.32 s
gammaloop-nextest-python-api> └───────────────────────────────────┘
- 58.32 s
gammaloop-nextest-python-api>
- 58.32 s
gammaloop-nextest-python-api>
- 58.32 s
gammaloop-nextest-python-api> Location:
- 58.32 s
gammaloop-nextest-python-api> tests/tests/test_python_api.rs:157:20
- 58.32 s
gammaloop-nextest-python-api>
- 58.33 s
gammaloop-nextest-python-api> FAIL [ 0.561s] (4/5) gammaloop-integration-tests::test_python_api python_evaluate_sample_preserves_graph_grouping_and_incoming_pdgs
- 58.33 s
gammaloop-nextest-python-api> stdout ---
- 58.33 s
gammaloop-nextest-python-api>
- 58.33 s
gammaloop-nextest-python-api> running 1 test
- 58.33 s
gammaloop-nextest-python-api> test python_evaluate_sample_preserves_graph_grouping_and_incoming_pdgs ... FAILED
- 58.33 s
gammaloop-nextest-python-api>
- 58.33 s
gammaloop-nextest-python-api> failures:
- 58.33 s
gammaloop-nextest-python-api>
- 58.33 s
gammaloop-nextest-python-api> failures:
- 58.33 s
gammaloop-nextest-python-api> python_evaluate_sample_preserves_graph_grouping_and_incoming_pdgs
- 58.33 s
gammaloop-nextest-python-api>
- 58.33 s
gammaloop-nextest-python-api> test result: FAILED. 0 passed; 1 failed; 0 ignored; 0 measured; 4 filtered out; finished in 0.54s
- 58.33 s
gammaloop-nextest-python-api>
- 58.33 s
gammaloop-nextest-python-api> stderr ---
- 58.33 s
gammaloop-nextest-python-api> Error: Python API test subprocess failed.
- 58.33 s
gammaloop-nextest-python-api> stdout:
- 58.33 s
gammaloop-nextest-python-api> ┌────────────────────────────────────────────────────────┐
- 58.33 s
gammaloop-nextest-python-api> │ You are running a restricted Symbolica instance. │
- 58.33 s
gammaloop-nextest-python-api> │ │
- 58.33 s
gammaloop-nextest-python-api> │ This mode is only permitted for non-commercial use and │
- 58.33 s
gammaloop-nextest-python-api> │ is limited to one instance and core per machine. │
- 58.33 s
gammaloop-nextest-python-api> │ │
- 58.33 s
gammaloop-nextest-python-api> │ Hobbyists can easily acquire a free license key │
- 58.33 s
gammaloop-nextest-python-api> │ that unlocks all cores and removes this banner: │
- 58.33 s
gammaloop-nextest-python-api> │ │
- 58.33 s
gammaloop-nextest-python-api> │ from symbolica import * │
- 58.33 s
gammaloop-nextest-python-api> │ request_hobbyist_license('YOUR_NAME', 'YOUR_EMAIL') │
- 58.33 s
gammaloop-nextest-python-api> │ │
- 58.33 s
gammaloop-nextest-python-api> │ All other users can obtain a free 30-day trial key: │
- 58.33 s
gammaloop-nextest-python-api> │ │
- 58.33 s
gammaloop-nextest-python-api> │ from symbolica import * │
- 58.33 s
gammaloop-nextest-python-api> │ request_trial_license('NAME', 'EMAIL', 'EMPLOYER') │
- 58.33 s
gammaloop-nextest-python-api> │ │
- 58.33 s
gammaloop-nextest-python-api> │ See https://symbolica.io/docs/get_started.html#license │
- 58.33 s
gammaloop-nextest-python-api> └────────────────────────────────────────────────────────┘
- 58.33 s
gammaloop-nextest-python-api> ┌───────────────────────────────────────────────────────────────────────────────────────────────────────────┐
- 58.33 s
gammaloop-nextest-python-api> │ Cannot start new unlicensed Symbolica instance since there is already another one running on the machine. │
- 58.33 s
gammaloop-nextest-python-api> └───────────────────────────────────────────────────────────────────────────────────────────────────────────┘
- 58.33 s
gammaloop-nextest-python-api>
- 58.33 s
gammaloop-nextest-python-api> stderr:
- 58.33 s
gammaloop-nextest-python-api> ┌───────────────────────────────────┐
- 58.33 s
gammaloop-nextest-python-api> │ The Symbolica license has expired │
- 58.33 s
gammaloop-nextest-python-api> └───────────────────────────────────┘
- 58.33 s
gammaloop-nextest-python-api>
- 58.33 s
gammaloop-nextest-python-api>
- 58.33 s
gammaloop-nextest-python-api> Location:
- 58.33 s
gammaloop-nextest-python-api> tests/tests/test_python_api.rs:157:20
- 58.33 s
gammaloop-nextest-python-api>
- 58.71 s
gammaloop-nextest-python-api> ------------
- 58.71 s
gammaloop-nextest-python-api> Summary [ 0.944s] 5 tests run: 2 passed, 3 failed, 0 skipped
- 58.71 s
gammaloop-nextest-python-api> FAIL [ 0.529s] (2/5) gammaloop-integration-tests::test_python_api python_evaluate_samples_batch_and_momentum_space_have_expected_shape
- 58.71 s
gammaloop-nextest-python-api> stdout ---
- 58.71 s
gammaloop-nextest-python-api>
- 58.71 s
gammaloop-nextest-python-api> running 1 test
- 58.71 s
gammaloop-nextest-python-api> test python_evaluate_samples_batch_and_momentum_space_have_expected_shape ... FAILED
- 58.71 s
gammaloop-nextest-python-api>
- 58.71 s
gammaloop-nextest-python-api> failures:
- 58.71 s
gammaloop-nextest-python-api>
- 58.71 s
gammaloop-nextest-python-api> failures:
- 58.71 s
gammaloop-nextest-python-api> python_evaluate_samples_batch_and_momentum_space_have_expected_shape
- 58.71 s
gammaloop-nextest-python-api>
- 58.71 s
gammaloop-nextest-python-api> test result: FAILED. 0 passed; 1 failed; 0 ignored; 0 measured; 4 filtered out; finished in 0.51s
- 58.71 s
gammaloop-nextest-python-api>
- 58.71 s
gammaloop-nextest-python-api> stderr ---
- 58.71 s
gammaloop-nextest-python-api> Error: Python API test subprocess failed.
- 58.71 s
gammaloop-nextest-python-api> stdout:
- 58.71 s
gammaloop-nextest-python-api> ┌────────────────────────────────────────────────────────┐
- 58.71 s
gammaloop-nextest-python-api> │ You are running a restricted Symbolica instance. │
- 58.71 s
gammaloop-nextest-python-api> │ │
- 58.71 s
gammaloop-nextest-python-api> │ This mode is only permitted for non-commercial use and │
- 58.71 s
gammaloop-nextest-python-api> │ is limited to one instance and core per machine. │
- 58.71 s
gammaloop-nextest-python-api> │ │
- 58.71 s
gammaloop-nextest-python-api> │ Hobbyists can easily acquire a free license key │
- 58.71 s
gammaloop-nextest-python-api> │ that unlocks all cores and removes this banner: │
- 58.71 s
gammaloop-nextest-python-api> │ │
- 58.71 s
gammaloop-nextest-python-api> │ from symbolica import * │
- 58.71 s
gammaloop-nextest-python-api> │ request_hobbyist_license('YOUR_NAME', 'YOUR_EMAIL') │
- 58.71 s
gammaloop-nextest-python-api> │ │
- 58.71 s
gammaloop-nextest-python-api> │ All other users can obtain a free 30-day trial key: │
- 58.71 s
gammaloop-nextest-python-api> │ │
- 58.71 s
gammaloop-nextest-python-api> │ from symbolica import * │
- 58.71 s
gammaloop-nextest-python-api> │ request_trial_license('NAME', 'EMAIL', 'EMPLOYER') │
- 58.71 s
gammaloop-nextest-python-api> │ │
- 58.71 s
gammaloop-nextest-python-api> │ See https://symbolica.io/docs/get_started.html#license │
- 58.71 s
gammaloop-nextest-python-api> └────────────────────────────────────────────────────────┘
- 58.71 s
gammaloop-nextest-python-api> ┌───────────────────────────────────────────────────────────────────────────────────────────────────────────┐
- 58.71 s
gammaloop-nextest-python-api> │ Cannot start new unlicensed Symbolica instance since there is already another one running on the machine. │
- 58.71 s
gammaloop-nextest-python-api> └───────────────────────────────────────────────────────────────────────────────────────────────────────────┘
- 58.71 s
gammaloop-nextest-python-api>
- 58.71 s
gammaloop-nextest-python-api> stderr:
- 58.71 s
gammaloop-nextest-python-api> ┌───────────────────────────────────┐
- 58.71 s
gammaloop-nextest-python-api> │ The Symbolica license has expired │
- 58.71 s
gammaloop-nextest-python-api> └───────────────────────────────────┘
- 58.71 s
gammaloop-nextest-python-api>
- 58.71 s
gammaloop-nextest-python-api>
- 58.71 s
gammaloop-nextest-python-api> Location:
- 58.71 s
gammaloop-nextest-python-api> tests/tests/test_python_api.rs:157:20
- 58.71 s
gammaloop-nextest-python-api>
- 58.71 s
gammaloop-nextest-python-api> FAIL [ 0.557s] (3/5) gammaloop-integration-tests::test_python_api python_evaluate_sample_honors_generate_events_and_observable_snapshots
- 58.71 s
gammaloop-nextest-python-api> stdout ---
- 58.71 s
gammaloop-nextest-python-api>
- 58.71 s
gammaloop-nextest-python-api> running 1 test
- 58.71 s
gammaloop-nextest-python-api> test python_evaluate_sample_honors_generate_events_and_observable_snapshots ... FAILED
- 58.71 s
gammaloop-nextest-python-api>
- 58.71 s
gammaloop-nextest-python-api> failures:
- 58.71 s
gammaloop-nextest-python-api>
- 58.71 s
gammaloop-nextest-python-api> failures:
- 58.71 s
gammaloop-nextest-python-api> python_evaluate_sample_honors_generate_events_and_observable_snapshots
- 58.71 s
gammaloop-nextest-python-api>
- 58.71 s
gammaloop-nextest-python-api> test result: FAILED. 0 passed; 1 failed; 0 ignored; 0 measured; 4 filtered out; finished in 0.54s
- 58.71 s
gammaloop-nextest-python-api>
- 58.71 s
gammaloop-nextest-python-api> stderr ---
- 58.71 s
gammaloop-nextest-python-api> Error: Python API test subprocess failed.
- 58.71 s
gammaloop-nextest-python-api> stdout:
- 58.71 s
gammaloop-nextest-python-api> ┌────────────────────────────────────────────────────────┐
- 58.71 s
gammaloop-nextest-python-api> │ You are running a restricted Symbolica instance. │
- 58.71 s
gammaloop-nextest-python-api> │ │
- 58.71 s
gammaloop-nextest-python-api> │ This mode is only permitted for non-commercial use and │
- 58.71 s
gammaloop-nextest-python-api> │ is limited to one instance and core per machine. │
- 58.71 s
gammaloop-nextest-python-api> │ │
- 58.71 s
gammaloop-nextest-python-api> │ Hobbyists can easily acquire a free license key │
- 58.71 s
gammaloop-nextest-python-api> │ that unlocks all cores and removes this banner: │
- 58.71 s
gammaloop-nextest-python-api> │ │
- 58.71 s
gammaloop-nextest-python-api> │ from symbolica import * │
- 58.71 s
gammaloop-nextest-python-api> │ request_hobbyist_license('YOUR_NAME', 'YOUR_EMAIL') │
- 58.71 s
gammaloop-nextest-python-api> │ │
- 58.71 s
gammaloop-nextest-python-api> │ All other users can obtain a free 30-day trial key: │
- 58.71 s
gammaloop-nextest-python-api> │ │
- 58.71 s
gammaloop-nextest-python-api> │ from symbolica import * │
- 58.71 s
gammaloop-nextest-python-api> │ request_trial_license('NAME', 'EMAIL', 'EMPLOYER') │
- 58.71 s
gammaloop-nextest-python-api> │ │
- 58.71 s
gammaloop-nextest-python-api> │ See https://symbolica.io/docs/get_started.html#license │
- 58.71 s
gammaloop-nextest-python-api> └────────────────────────────────────────────────────────┘
- 58.71 s
gammaloop-nextest-python-api> ┌───────────────────────────────────────────────────────────────────────────────────────────────────────────┐
- 58.71 s
gammaloop-nextest-python-api> │ Cannot start new unlicensed Symbolica instance since there is already another one running on the machine. │
- 58.71 s
gammaloop-nextest-python-api> └───────────────────────────────────────────────────────────────────────────────────────────────────────────┘
- 58.71 s
gammaloop-nextest-python-api>
- 58.71 s
gammaloop-nextest-python-api> stderr:
- 58.71 s
gammaloop-nextest-python-api> ┌───────────────────────────────────┐
- 58.71 s
gammaloop-nextest-python-api> │ The Symbolica license has expired │
- 58.71 s
gammaloop-nextest-python-api> └───────────────────────────────────┘
- 58.71 s
gammaloop-nextest-python-api>
- 58.71 s
gammaloop-nextest-python-api>
- 58.71 s
gammaloop-nextest-python-api> Location:
- 58.71 s
gammaloop-nextest-python-api> tests/tests/test_python_api.rs:157:20
- 58.71 s
gammaloop-nextest-python-api>
- 58.71 s
gammaloop-nextest-python-api> FAIL [ 0.561s] (4/5) gammaloop-integration-tests::test_python_api python_evaluate_sample_preserves_graph_grouping_and_incoming_pdgs
- 58.71 s
gammaloop-nextest-python-api> stdout ---
- 58.71 s
gammaloop-nextest-python-api>
- 58.71 s
gammaloop-nextest-python-api> running 1 test
- 58.71 s
gammaloop-nextest-python-api> test python_evaluate_sample_preserves_graph_grouping_and_incoming_pdgs ... FAILED
- 58.71 s
gammaloop-nextest-python-api>
- 58.71 s
gammaloop-nextest-python-api> failures:
- 58.71 s
gammaloop-nextest-python-api>
- 58.71 s
gammaloop-nextest-python-api> failures:
- 58.71 s
gammaloop-nextest-python-api> python_evaluate_sample_preserves_graph_grouping_and_incoming_pdgs
- 58.71 s
gammaloop-nextest-python-api>
- 58.71 s
gammaloop-nextest-python-api> test result: FAILED. 0 passed; 1 failed; 0 ignored; 0 measured; 4 filtered out; finished in 0.54s
- 58.71 s
gammaloop-nextest-python-api>
- 58.71 s
gammaloop-nextest-python-api> stderr ---
- 58.71 s
gammaloop-nextest-python-api> Error: Python API test subprocess failed.
- 58.71 s
gammaloop-nextest-python-api> stdout:
- 58.71 s
gammaloop-nextest-python-api> ┌────────────────────────────────────────────────────────┐
- 58.71 s
gammaloop-nextest-python-api> │ You are running a restricted Symbolica instance. │
- 58.71 s
gammaloop-nextest-python-api> │ │
- 58.71 s
gammaloop-nextest-python-api> │ This mode is only permitted for non-commercial use and │
- 58.71 s
gammaloop-nextest-python-api> │ is limited to one instance and core per machine. │
- 58.71 s
gammaloop-nextest-python-api> │ │
- 58.71 s
gammaloop-nextest-python-api> │ Hobbyists can easily acquire a free license key │
- 58.71 s
gammaloop-nextest-python-api> │ that unlocks all cores and removes this banner: │
- 58.71 s
gammaloop-nextest-python-api> │ │
- 58.71 s
gammaloop-nextest-python-api> │ from symbolica import * │
- 58.71 s
gammaloop-nextest-python-api> │ request_hobbyist_license('YOUR_NAME', 'YOUR_EMAIL') │
- 58.71 s
gammaloop-nextest-python-api> │ │
- 58.71 s
gammaloop-nextest-python-api> │ All other users can obtain a free 30-day trial key: │
- 58.71 s
gammaloop-nextest-python-api> │ │
- 58.71 s
gammaloop-nextest-python-api> │ from symbolica import * │
- 58.71 s
gammaloop-nextest-python-api> │ request_trial_license('NAME', 'EMAIL', 'EMPLOYER') │
- 58.71 s
gammaloop-nextest-python-api> │ │
- 58.71 s
gammaloop-nextest-python-api> │ See https://symbolica.io/docs/get_started.html#license │
- 58.71 s
gammaloop-nextest-python-api> └────────────────────────────────────────────────────────┘
- 58.71 s
gammaloop-nextest-python-api> ┌───────────────────────────────────────────────────────────────────────────────────────────────────────────┐
- 58.71 s
gammaloop-nextest-python-api> │ Cannot start new unlicensed Symbolica instance since there is already another one running on the machine. │
- 58.71 s
gammaloop-nextest-python-api> └───────────────────────────────────────────────────────────────────────────────────────────────────────────┘
- 58.71 s
gammaloop-nextest-python-api>
- 58.71 s
gammaloop-nextest-python-api> stderr:
- 58.71 s
gammaloop-nextest-python-api> ┌───────────────────────────────────┐
- 58.71 s
gammaloop-nextest-python-api> │ The Symbolica license has expired │
- 58.71 s
gammaloop-nextest-python-api> └───────────────────────────────────┘
- 58.71 s
gammaloop-nextest-python-api>
- 58.71 s
gammaloop-nextest-python-api>
- 58.71 s
gammaloop-nextest-python-api> Location:
- 58.71 s
gammaloop-nextest-python-api> tests/tests/test_python_api.rs:157:20
- 58.71 s
gammaloop-nextest-python-api>
- 58.74 s
gammaloop-nextest-python-api> error: test run failed
- 58.78 s
gammaloop-nextest-python-api>
- 58.78 s
gammaloop-nextest-python-api> ========== nextest test summary ==========
- 58.78 s
gammaloop-nextest-python-api> report: target/nextest/ci_gammaloop/junit.xml
- 58.78 s
gammaloop-nextest-python-api> tests: 5, failures: 3, errors: 0
- 58.78 s
gammaloop-nextest-python-api>
- 58.78 s
gammaloop-nextest-python-api> 1. gammaloop-integration-tests::test_python_api::python_evaluate_samples_batch_and_momentum_space_have_expected_shape
- 58.78 s
gammaloop-nextest-python-api> failure: test failure with exit code 101
- 58.78 s
gammaloop-nextest-python-api> Error: Python API test subprocess failed.
- 58.78 s
gammaloop-nextest-python-api> stdout:
- 58.78 s
gammaloop-nextest-python-api> ┌────────────────────────────────────────────────────────┐
- 58.78 s
gammaloop-nextest-python-api> │ You are running a restricted Symbolica instance. │
- 58.78 s
gammaloop-nextest-python-api> │ │
- 58.78 s
gammaloop-nextest-python-api> │ This mode is only permitted for non-commercial use and │
- 58.78 s
gammaloop-nextest-python-api> │ is limited to one instance and core per machine. │
- 58.78 s
gammaloop-nextest-python-api> │ │
- 58.78 s
gammaloop-nextest-python-api> │ Hobbyists can easily acquire a free license key │
- 58.78 s
gammaloop-nextest-python-api> │ that unlocks all cores and removes this banner: │
- 58.78 s
gammaloop-nextest-python-api> │ │
- 58.78 s
gammaloop-nextest-python-api> │ from symbolica import * │
- 58.78 s
gammaloop-nextest-python-api> │ request_hobbyist_license('YOUR_NAME', 'YOUR_EMAIL') │
- 58.78 s
gammaloop-nextest-python-api> │ │
- 58.78 s
gammaloop-nextest-python-api> │ All other users can obtain a free 30-day trial key: │
- 58.78 s
gammaloop-nextest-python-api> │ │
- 58.78 s
gammaloop-nextest-python-api> │ from symbolica import * │
- 58.78 s
gammaloop-nextest-python-api> │ request_trial_license('NAME', 'EMAIL', 'EMPLOYER') │
- 58.78 s
gammaloop-nextest-python-api> │ │
- 58.78 s
gammaloop-nextest-python-api> │ See https://symbolica.io/docs/get_started.html#license │
- 58.78 s
gammaloop-nextest-python-api> └────────────────────────────────────────────────────────┘
- 58.78 s
gammaloop-nextest-python-api> ┌───────────────────────────────────────────────────────────────────────────────────────────────────────────┐
- 58.78 s
gammaloop-nextest-python-api> │ Cannot start new unlicensed Symbolica instance since there is already another one running on the machine. │
- 58.78 s
gammaloop-nextest-python-api> └───────────────────────────────────────────────────────────────────────────────────────────────────────────┘
- 58.78 s
gammaloop-nextest-python-api>
- 58.78 s
gammaloop-nextest-python-api> stderr:
- 58.78 s
gammaloop-nextest-python-api> ┌───────────────────────────────────┐
- 58.78 s
gammaloop-nextest-python-api> │ The Symbolica license has expired │
- 58.78 s
gammaloop-nextest-python-api> └───────────────────────────────────┘
- 58.78 s
gammaloop-nextest-python-api>
- 58.78 s
gammaloop-nextest-python-api>
- 58.78 s
gammaloop-nextest-python-api> Location:
- 58.78 s
gammaloop-nextest-python-api> tests/tests/test_python_api.rs:157:20
- 58.78 s
gammaloop-nextest-python-api> system-out
- 58.78 s
gammaloop-nextest-python-api> running 1 test
- 58.78 s
gammaloop-nextest-python-api> test python_evaluate_samples_batch_and_momentum_space_have_expected_shape ... FAILED
- 58.78 s
gammaloop-nextest-python-api>
- 58.78 s
gammaloop-nextest-python-api> failures:
- 58.78 s
gammaloop-nextest-python-api>
- 58.78 s
gammaloop-nextest-python-api> failures:
- 58.78 s
gammaloop-nextest-python-api> python_evaluate_samples_batch_and_momentum_space_have_expected_shape
- 58.78 s
gammaloop-nextest-python-api>
- 58.78 s
gammaloop-nextest-python-api> test result: FAILED. 0 passed; 1 failed; 0 ignored; 0 measured; 4 filtered out; finished in 0.51s
- 58.78 s
gammaloop-nextest-python-api> system-err
- 58.78 s
gammaloop-nextest-python-api> Error: Python API test subprocess failed.
- 58.78 s
gammaloop-nextest-python-api> stdout:
- 58.78 s
gammaloop-nextest-python-api> ┌────────────────────────────────────────────────────────┐
- 58.78 s
gammaloop-nextest-python-api> │ You are running a restricted Symbolica instance. │
- 58.78 s
gammaloop-nextest-python-api> │ │
- 58.78 s
gammaloop-nextest-python-api> │ This mode is only permitted for non-commercial use and │
- 58.78 s
gammaloop-nextest-python-api> │ is limited to one instance and core per machine. │
- 58.78 s
gammaloop-nextest-python-api> │ │
- 58.78 s
gammaloop-nextest-python-api> │ Hobbyists can easily acquire a free license key │
- 58.78 s
gammaloop-nextest-python-api> │ that unlocks all cores and removes this banner: │
- 58.78 s
gammaloop-nextest-python-api> │ │
- 58.78 s
gammaloop-nextest-python-api> │ from symbolica import * │
- 58.78 s
gammaloop-nextest-python-api> │ request_hobbyist_license('YOUR_NAME', 'YOUR_EMAIL') │
- 58.78 s
gammaloop-nextest-python-api> │ │
- 58.78 s
gammaloop-nextest-python-api> │ All other users can obtain a free 30-day trial key: │
- 58.78 s
gammaloop-nextest-python-api> │ │
- 58.78 s
gammaloop-nextest-python-api> │ from symbolica import * │
- 58.78 s
gammaloop-nextest-python-api> │ request_trial_license('NAME', 'EMAIL', 'EMPLOYER') │
- 58.78 s
gammaloop-nextest-python-api> │ │
- 58.78 s
gammaloop-nextest-python-api> │ See https://symbolica.io/docs/get_started.html#license │
- 58.78 s
gammaloop-nextest-python-api> └────────────────────────────────────────────────────────┘
- 58.78 s
gammaloop-nextest-python-api> ┌───────────────────────────────────────────────────────────────────────────────────────────────────────────┐
- 58.78 s
gammaloop-nextest-python-api> │ Cannot start new unlicensed Symbolica instance since there is already another one running on the machine. │
- 58.78 s
gammaloop-nextest-python-api> └───────────────────────────────────────────────────────────────────────────────────────────────────────────┘
- 58.78 s
gammaloop-nextest-python-api>
- 58.78 s
gammaloop-nextest-python-api> stderr:
- 58.78 s
gammaloop-nextest-python-api> ┌───────────────────────────────────┐
- 58.78 s
gammaloop-nextest-python-api> │ The Symbolica license has expired │
- 58.78 s
gammaloop-nextest-python-api> └───────────────────────────────────┘
- 58.78 s
gammaloop-nextest-python-api>
- 58.78 s
gammaloop-nextest-python-api>
- 58.78 s
gammaloop-nextest-python-api> Location:
- 58.78 s
gammaloop-nextest-python-api> tests/tests/test_python_api.rs:157:20
- 58.78 s
gammaloop-nextest-python-api>
- 58.78 s
gammaloop-nextest-python-api> 2. gammaloop-integration-tests::test_python_api::python_evaluate_sample_honors_generate_events_and_observable_snapshots
- 58.78 s
gammaloop-nextest-python-api> failure: test failure with exit code 101
- 58.78 s
gammaloop-nextest-python-api> Error: Python API test subprocess failed.
- 58.78 s
gammaloop-nextest-python-api> stdout:
- 58.78 s
gammaloop-nextest-python-api> ┌────────────────────────────────────────────────────────┐
- 58.78 s
gammaloop-nextest-python-api> │ You are running a restricted Symbolica instance. │
- 58.78 s
gammaloop-nextest-python-api> │ │
- 58.78 s
gammaloop-nextest-python-api> │ This mode is only permitted for non-commercial use and │
- 58.78 s
gammaloop-nextest-python-api> │ is limited to one instance and core per machine. │
- 58.78 s
gammaloop-nextest-python-api> │ │
- 58.78 s
gammaloop-nextest-python-api> │ Hobbyists can easily acquire a free license key │
- 58.78 s
gammaloop-nextest-python-api> │ that unlocks all cores and removes this banner: │
- 58.78 s
gammaloop-nextest-python-api> │ │
- 58.78 s
gammaloop-nextest-python-api> │ from symbolica import * │
- 58.78 s
gammaloop-nextest-python-api> │ request_hobbyist_license('YOUR_NAME', 'YOUR_EMAIL') │
- 58.78 s
gammaloop-nextest-python-api> │ │
- 58.78 s
gammaloop-nextest-python-api> │ All other users can obtain a free 30-day trial key: │
- 58.78 s
gammaloop-nextest-python-api> │ │
- 58.78 s
gammaloop-nextest-python-api> │ from symbolica import * │
- 58.78 s
gammaloop-nextest-python-api> │ request_trial_license('NAME', 'EMAIL', 'EMPLOYER') │
- 58.78 s
gammaloop-nextest-python-api> │ │
- 58.78 s
gammaloop-nextest-python-api> │ See https://symbolica.io/docs/get_started.html#license │
- 58.78 s
gammaloop-nextest-python-api> └────────────────────────────────────────────────────────┘
- 58.78 s
gammaloop-nextest-python-api> ┌───────────────────────────────────────────────────────────────────────────────────────────────────────────┐
- 58.78 s
gammaloop-nextest-python-api> │ Cannot start new unlicensed Symbolica instance since there is already another one running on the machine. │
- 58.78 s
gammaloop-nextest-python-api> └───────────────────────────────────────────────────────────────────────────────────────────────────────────┘
- 58.78 s
gammaloop-nextest-python-api>
- 58.78 s
gammaloop-nextest-python-api> stderr:
- 58.78 s
gammaloop-nextest-python-api> ┌───────────────────────────────────┐
- 58.78 s
gammaloop-nextest-python-api> │ The Symbolica license has expired │
- 58.78 s
gammaloop-nextest-python-api> └───────────────────────────────────┘
- 58.78 s
gammaloop-nextest-python-api>
- 58.78 s
gammaloop-nextest-python-api>
- 58.78 s
gammaloop-nextest-python-api> Location:
- 58.78 s
gammaloop-nextest-python-api> tests/tests/test_python_api.rs:157:20
- 58.78 s
gammaloop-nextest-python-api> system-out
- 58.78 s
gammaloop-nextest-python-api> running 1 test
- 58.78 s
gammaloop-nextest-python-api> test python_evaluate_sample_honors_generate_events_and_observable_snapshots ... FAILED
- 58.78 s
gammaloop-nextest-python-api>
- 58.78 s
gammaloop-nextest-python-api> failures:
- 58.78 s
gammaloop-nextest-python-api>
- 58.78 s
gammaloop-nextest-python-api> failures:
- 58.78 s
gammaloop-nextest-python-api> python_evaluate_sample_honors_generate_events_and_observable_snapshots
- 58.78 s
gammaloop-nextest-python-api>
- 58.78 s
gammaloop-nextest-python-api> test result: FAILED. 0 passed; 1 failed; 0 ignored; 0 measured; 4 filtered out; finished in 0.54s
- 58.78 s
gammaloop-nextest-python-api> system-err
- 58.78 s
gammaloop-nextest-python-api> Error: Python API test subprocess failed.
- 58.78 s
gammaloop-nextest-python-api> stdout:
- 58.78 s
gammaloop-nextest-python-api> ┌────────────────────────────────────────────────────────┐
- 58.78 s
gammaloop-nextest-python-api> │ You are running a restricted Symbolica instance. │
- 58.78 s
gammaloop-nextest-python-api> │ │
- 58.78 s
gammaloop-nextest-python-api> │ This mode is only permitted for non-commercial use and │
- 58.78 s
gammaloop-nextest-python-api> │ is limited to one instance and core per machine. │
- 58.78 s
gammaloop-nextest-python-api> │ │
- 58.78 s
gammaloop-nextest-python-api> │ Hobbyists can easily acquire a free license key │
- 58.78 s
gammaloop-nextest-python-api> │ that unlocks all cores and removes this banner: │
- 58.78 s
gammaloop-nextest-python-api> │ │
- 58.78 s
gammaloop-nextest-python-api> │ from symbolica import * │
- 58.78 s
gammaloop-nextest-python-api> │ request_hobbyist_license('YOUR_NAME', 'YOUR_EMAIL') │
- 58.78 s
gammaloop-nextest-python-api> │ │
- 58.78 s
gammaloop-nextest-python-api> │ All other users can obtain a free 30-day trial key: │
- 58.78 s
gammaloop-nextest-python-api> │ │
- 58.78 s
gammaloop-nextest-python-api> │ from symbolica import * │
- 58.78 s
gammaloop-nextest-python-api> │ request_trial_license('NAME', 'EMAIL', 'EMPLOYER') │
- 58.78 s
gammaloop-nextest-python-api> │ │
- 58.78 s
gammaloop-nextest-python-api> │ See https://symbolica.io/docs/get_started.html#license │
- 58.78 s
gammaloop-nextest-python-api> └────────────────────────────────────────────────────────┘
- 58.78 s
gammaloop-nextest-python-api> ┌───────────────────────────────────────────────────────────────────────────────────────────────────────────┐
- 58.78 s
gammaloop-nextest-python-api> │ Cannot start new unlicensed Symbolica instance since there is already another one running on the machine. │
- 58.78 s
gammaloop-nextest-python-api> └───────────────────────────────────────────────────────────────────────────────────────────────────────────┘
- 58.78 s
gammaloop-nextest-python-api>
- 58.78 s
gammaloop-nextest-python-api> stderr:
- 58.78 s
gammaloop-nextest-python-api> ┌───────────────────────────────────┐
- 58.78 s
gammaloop-nextest-python-api> │ The Symbolica license has expired │
- 58.78 s
gammaloop-nextest-python-api> └───────────────────────────────────┘
- 58.78 s
gammaloop-nextest-python-api>
- 58.78 s
gammaloop-nextest-python-api>
- 58.78 s
gammaloop-nextest-python-api> Location:
- 58.78 s
gammaloop-nextest-python-api> tests/tests/test_python_api.rs:157:20
- 58.78 s
gammaloop-nextest-python-api>
- 58.78 s
gammaloop-nextest-python-api> 3. gammaloop-integration-tests::test_python_api::python_evaluate_sample_preserves_graph_grouping_and_incoming_pdgs
- 58.78 s
gammaloop-nextest-python-api> failure: test failure with exit code 101
- 58.78 s
gammaloop-nextest-python-api> Error: Python API test subprocess failed.
- 58.78 s
gammaloop-nextest-python-api> stdout:
- 58.78 s
gammaloop-nextest-python-api> ┌────────────────────────────────────────────────────────┐
- 58.78 s
gammaloop-nextest-python-api> │ You are running a restricted Symbolica instance. │
- 58.78 s
gammaloop-nextest-python-api> │ │
- 58.78 s
gammaloop-nextest-python-api> │ This mode is only permitted for non-commercial use and │
- 58.78 s
gammaloop-nextest-python-api> │ is limited to one instance and core per machine. │
- 58.78 s
gammaloop-nextest-python-api> │ │
- 58.78 s
gammaloop-nextest-python-api> │ Hobbyists can easily acquire a free license key │
- 58.78 s
gammaloop-nextest-python-api> │ that unlocks all cores and removes this banner: │
- 58.78 s
gammaloop-nextest-python-api> │ │
- 58.78 s
gammaloop-nextest-python-api> │ from symbolica import * │
- 58.78 s
gammaloop-nextest-python-api> │ request_hobbyist_license('YOUR_NAME', 'YOUR_EMAIL') │
- 58.78 s
gammaloop-nextest-python-api> │ │
- 58.78 s
gammaloop-nextest-python-api> │ All other users can obtain a free 30-day trial key: │
- 58.78 s
gammaloop-nextest-python-api> │ │
- 58.78 s
gammaloop-nextest-python-api> │ from symbolica import * │
- 58.78 s
gammaloop-nextest-python-api> │ request_trial_license('NAME', 'EMAIL', 'EMPLOYER') │
- 58.78 s
gammaloop-nextest-python-api> │ │
- 58.78 s
gammaloop-nextest-python-api> │ See https://symbolica.io/docs/get_started.html#license │
- 58.78 s
gammaloop-nextest-python-api> └────────────────────────────────────────────────────────┘
- 58.78 s
gammaloop-nextest-python-api> ┌───────────────────────────────────────────────────────────────────────────────────────────────────────────┐
- 58.78 s
gammaloop-nextest-python-api> │ Cannot start new unlicensed Symbolica instance since there is already another one running on the machine. │
- 58.78 s
gammaloop-nextest-python-api> └───────────────────────────────────────────────────────────────────────────────────────────────────────────┘
- 58.78 s
gammaloop-nextest-python-api>
- 58.78 s
gammaloop-nextest-python-api> stderr:
- 58.78 s
gammaloop-nextest-python-api> ┌───────────────────────────────────┐
- 58.78 s
gammaloop-nextest-python-api> │ The Symbolica license has expired │
- 58.78 s
gammaloop-nextest-python-api> └───────────────────────────────────┘
- 58.78 s
gammaloop-nextest-python-api>
- 58.78 s
gammaloop-nextest-python-api>
- 58.78 s
gammaloop-nextest-python-api> Location:
- 58.78 s
gammaloop-nextest-python-api> tests/tests/test_python_api.rs:157:20
- 58.78 s
gammaloop-nextest-python-api> system-out
- 58.78 s
gammaloop-nextest-python-api> running 1 test
- 58.78 s
gammaloop-nextest-python-api> test python_evaluate_sample_preserves_graph_grouping_and_incoming_pdgs ... FAILED
- 58.78 s
gammaloop-nextest-python-api>
- 58.78 s
gammaloop-nextest-python-api> failures:
- 58.78 s
gammaloop-nextest-python-api>
- 58.78 s
gammaloop-nextest-python-api> failures:
- 58.78 s
gammaloop-nextest-python-api> python_evaluate_sample_preserves_graph_grouping_and_incoming_pdgs
- 58.78 s
gammaloop-nextest-python-api>
- 58.78 s
gammaloop-nextest-python-api> test result: FAILED. 0 passed; 1 failed; 0 ignored; 0 measured; 4 filtered out; finished in 0.54s
- 58.78 s
gammaloop-nextest-python-api> system-err
- 58.78 s
gammaloop-nextest-python-api> Error: Python API test subprocess failed.
- 58.78 s
gammaloop-nextest-python-api> stdout:
- 58.78 s
gammaloop-nextest-python-api> ┌────────────────────────────────────────────────────────┐
- 58.78 s
gammaloop-nextest-python-api> │ You are running a restricted Symbolica instance. │
- 58.78 s
gammaloop-nextest-python-api> │ │
- 58.78 s
gammaloop-nextest-python-api> │ This mode is only permitted for non-commercial use and │
- 58.78 s
gammaloop-nextest-python-api> │ is limited to one instance and core per machine. │
- 58.78 s
gammaloop-nextest-python-api> │ │
- 58.78 s
gammaloop-nextest-python-api> │ Hobbyists can easily acquire a free license key │
- 58.78 s
gammaloop-nextest-python-api> │ that unlocks all cores and removes this banner: │
- 58.78 s
gammaloop-nextest-python-api> │ │
- 58.78 s
gammaloop-nextest-python-api> │ from symbolica import * │
- 58.78 s
gammaloop-nextest-python-api> │ request_hobbyist_license('YOUR_NAME', 'YOUR_EMAIL') │
- 58.78 s
gammaloop-nextest-python-api> │ │
- 58.78 s
gammaloop-nextest-python-api> │ All other users can obtain a free 30-day trial key: │
- 58.78 s
gammaloop-nextest-python-api> │ │
- 58.78 s
gammaloop-nextest-python-api> │ from symbolica import * │
- 58.78 s
gammaloop-nextest-python-api> │ request_trial_license('NAME', 'EMAIL', 'EMPLOYER') │
- 58.78 s
gammaloop-nextest-python-api> │ │
- 58.78 s
gammaloop-nextest-python-api> │ See https://symbolica.io/docs/get_started.html#license │
- 58.78 s
gammaloop-nextest-python-api> └────────────────────────────────────────────────────────┘
- 58.78 s
gammaloop-nextest-python-api> ┌───────────────────────────────────────────────────────────────────────────────────────────────────────────┐
- 58.78 s
gammaloop-nextest-python-api> │ Cannot start new unlicensed Symbolica instance since there is already another one running on the machine. │
- 58.78 s
gammaloop-nextest-python-api> └───────────────────────────────────────────────────────────────────────────────────────────────────────────┘
- 58.78 s
gammaloop-nextest-python-api>
- 58.78 s
gammaloop-nextest-python-api> stderr:
- 58.78 s
gammaloop-nextest-python-api> ┌───────────────────────────────────┐
- 58.78 s
gammaloop-nextest-python-api> │ The Symbolica license has expired │
- 58.78 s
gammaloop-nextest-python-api> └───────────────────────────────────┘
- 58.78 s
gammaloop-nextest-python-api>
- 58.78 s
gammaloop-nextest-python-api>
- 58.78 s
gammaloop-nextest-python-api> Location:
- 58.78 s
gammaloop-nextest-python-api> tests/tests/test_python_api.rs:157:20
- 58.78 s
gammaloop-nextest-python-api> =========================================
- 58.84 s
error: Cannot build '/nix/store/fzljqa63rh9s640jcldimpyrcjcnir2c-gammaloop-nextest-python-api.drv'.
- 58.84 s
Reason: builder failed with exit code 100.
- 58.84 s
Output paths:
- 58.84 s
/nix/store/sw1jmzipa5q26jwkkcqa1c6ynssy5rwc-gammaloop-nextest-python-api
- 58.84 s
Last 541 log lines:
- 58.84 s
> Extracting 1 binary, 1 build script output directory, and 3 linked paths to /build/nextest-archive-FXjMJA
- 58.84 s
> Extracted 18 files to /build/nextest-archive-FXjMJA in 0.09s
- 58.84 s
> ------------
- 58.84 s
> Nextest run ID 1ce1d4c4-a59d-4d86-b44c-3e05e146cbfe with nextest profile: ci_gammaloop
- 58.84 s
> Starting 5 tests across 1 binary
- 58.84 s
> FAIL [ 0.529s] (2/5) gammaloop-integration-tests::test_python_api python_evaluate_samples_batch_and_momentum_space_have_expected_shape
- 58.84 s
> stdout ---
- 58.84 s
>
- 58.84 s
> running 1 test
- 58.84 s
> test python_evaluate_samples_batch_and_momentum_space_have_expected_shape ... FAILED
- 58.84 s
>
- 58.84 s
> failures:
- 58.84 s
>
- 58.84 s
> failures:
- 58.84 s
> python_evaluate_samples_batch_and_momentum_space_have_expected_shape
- 58.84 s
>
- 58.84 s
> test result: FAILED. 0 passed; 1 failed; 0 ignored; 0 measured; 4 filtered out; finished in 0.51s
- 58.84 s
>
- 58.84 s
> stderr ---
- 58.84 s
> Error: Python API test subprocess failed.
- 58.84 s
> stdout:
- 58.84 s
> ┌────────────────────────────────────────────────────────┐
- 58.84 s
> │ You are running a restricted Symbolica instance. │
- 58.84 s
> │ │
- 58.84 s
> │ This mode is only permitted for non-commercial use and │
- 58.84 s
> │ is limited to one instance and core per machine. │
- 58.84 s
> │ │
- 58.84 s
> │ Hobbyists can easily acquire a free license key │
- 58.84 s
> │ that unlocks all cores and removes this banner: │
- 58.84 s
> │ │
- 58.84 s
> │ from symbolica import * │
- 58.84 s
> │ request_hobbyist_license('YOUR_NAME', 'YOUR_EMAIL') │
- 58.84 s
> │ │
- 58.84 s
> │ All other users can obtain a free 30-day trial key: │
- 58.84 s
> │ │
- 58.84 s
> │ from symbolica import * │
- 58.84 s
> │ request_trial_license('NAME', 'EMAIL', 'EMPLOYER') │
- 58.84 s
> │ │
- 58.84 s
> │ See https://symbolica.io/docs/get_started.html#license │
- 58.84 s
> └────────────────────────────────────────────────────────┘
- 58.84 s
> ┌───────────────────────────────────────────────────────────────────────────────────────────────────────────┐
- 58.84 s
> │ Cannot start new unlicensed Symbolica instance since there is already another one running on the machine. │
- 58.84 s
> └───────────────────────────────────────────────────────────────────────────────────────────────────────────┘
- 58.84 s
>
- 58.84 s
> stderr:
- 58.84 s
> ┌───────────────────────────────────┐
- 58.84 s
> │ The Symbolica license has expired │
- 58.84 s
> └───────────────────────────────────┘
- 58.84 s
>
- 58.84 s
>
- 58.84 s
> Location:
- 58.84 s
> tests/tests/test_python_api.rs:157:20
- 58.84 s
>
- 58.84 s
> FAIL [ 0.557s] (3/5) gammaloop-integration-tests::test_python_api python_evaluate_sample_honors_generate_events_and_observable_snapshots
- 58.84 s
> stdout ---
- 58.84 s
>
- 58.84 s
> running 1 test
- 58.84 s
> test python_evaluate_sample_honors_generate_events_and_observable_snapshots ... FAILED
- 58.84 s
>
- 58.84 s
> failures:
- 58.84 s
>
- 58.84 s
> failures:
- 58.84 s
> python_evaluate_sample_honors_generate_events_and_observable_snapshots
- 58.84 s
>
- 58.84 s
> test result: FAILED. 0 passed; 1 failed; 0 ignored; 0 measured; 4 filtered out; finished in 0.54s
- 58.84 s
>
- 58.84 s
> stderr ---
- 58.84 s
> Error: Python API test subprocess failed.
- 58.84 s
> stdout:
- 58.84 s
> ┌────────────────────────────────────────────────────────┐
- 58.84 s
> │ You are running a restricted Symbolica instance. │
- 58.84 s
> │ │
- 58.84 s
> │ This mode is only permitted for non-commercial use and │
- 58.84 s
> │ is limited to one instance and core per machine. │
- 58.84 s
> │ │
- 58.84 s
> │ Hobbyists can easily acquire a free license key │
- 58.84 s
> │ that unlocks all cores and removes this banner: │
- 58.84 s
> │ │
- 58.84 s
> │ from symbolica import * │
- 58.84 s
> │ request_hobbyist_license('YOUR_NAME', 'YOUR_EMAIL') │
- 58.84 s
> │ │
- 58.84 s
> │ All other users can obtain a free 30-day trial key: │
- 58.84 s
> │ │
- 58.84 s
> │ from symbolica import * │
- 58.84 s
> │ request_trial_license('NAME', 'EMAIL', 'EMPLOYER') │
- 58.84 s
> │ │
- 58.84 s
> │ See https://symbolica.io/docs/get_started.html#license │
- 58.84 s
> └────────────────────────────────────────────────────────┘
- 58.84 s
> ┌───────────────────────────────────────────────────────────────────────────────────────────────────────────┐
- 58.84 s
> │ Cannot start new unlicensed Symbolica instance since there is already another one running on the machine. │
- 58.84 s
> └───────────────────────────────────────────────────────────────────────────────────────────────────────────┘
- 58.84 s
>
- 58.84 s
> stderr:
- 58.84 s
> ┌───────────────────────────────────┐
- 58.84 s
> │ The Symbolica license has expired │
- 58.84 s
> └───────────────────────────────────┘
- 58.84 s
>
- 58.84 s
>
- 58.84 s
> Location:
- 58.84 s
> tests/tests/test_python_api.rs:157:20
- 58.84 s
>
- 58.84 s
> FAIL [ 0.561s] (4/5) gammaloop-integration-tests::test_python_api python_evaluate_sample_preserves_graph_grouping_and_incoming_pdgs
- 58.84 s
> stdout ---
- 58.84 s
>
- 58.84 s
> running 1 test
- 58.84 s
> test python_evaluate_sample_preserves_graph_grouping_and_incoming_pdgs ... FAILED
- 58.84 s
>
- 58.84 s
> failures:
- 58.84 s
>
- 58.84 s
> failures:
- 58.84 s
> python_evaluate_sample_preserves_graph_grouping_and_incoming_pdgs
- 58.84 s
>
- 58.84 s
> test result: FAILED. 0 passed; 1 failed; 0 ignored; 0 measured; 4 filtered out; finished in 0.54s
- 58.84 s
>
- 58.84 s
> stderr ---
- 58.84 s
> Error: Python API test subprocess failed.
- 58.84 s
> stdout:
- 58.84 s
> ┌────────────────────────────────────────────────────────┐
- 58.84 s
> │ You are running a restricted Symbolica instance. │
- 58.84 s
> │ │
- 58.84 s
> │ This mode is only permitted for non-commercial use and │
- 58.84 s
> │ is limited to one instance and core per machine. │
- 58.84 s
> │ │
- 58.84 s
> │ Hobbyists can easily acquire a free license key │
- 58.84 s
> │ that unlocks all cores and removes this banner: │
- 58.84 s
> │ │
- 58.84 s
> │ from symbolica import * │
- 58.84 s
> │ request_hobbyist_license('YOUR_NAME', 'YOUR_EMAIL') │
- 58.84 s
> │ │
- 58.84 s
> │ All other users can obtain a free 30-day trial key: │
- 58.84 s
> │ │
- 58.84 s
> │ from symbolica import * │
- 58.84 s
> │ request_trial_license('NAME', 'EMAIL', 'EMPLOYER') │
- 58.84 s
> │ │
- 58.84 s
> │ See https://symbolica.io/docs/get_started.html#license │
- 58.84 s
> └────────────────────────────────────────────────────────┘
- 58.84 s
> ┌───────────────────────────────────────────────────────────────────────────────────────────────────────────┐
- 58.84 s
> │ Cannot start new unlicensed Symbolica instance since there is already another one running on the machine. │
- 58.84 s
> └───────────────────────────────────────────────────────────────────────────────────────────────────────────┘
- 58.84 s
>
- 58.84 s
> stderr:
- 58.84 s
> ┌───────────────────────────────────┐
- 58.84 s
> │ The Symbolica license has expired │
- 58.84 s
> └───────────────────────────────────┘
- 58.84 s
>
- 58.84 s
>
- 58.84 s
> Location:
- 58.84 s
> tests/tests/test_python_api.rs:157:20
- 58.84 s
>
- 58.84 s
> ------------
- 58.84 s
> Summary [ 0.944s] 5 tests run: 2 passed, 3 failed, 0 skipped
- 58.84 s
> FAIL [ 0.529s] (2/5) gammaloop-integration-tests::test_python_api python_evaluate_samples_batch_and_momentum_space_have_expected_shape
- 58.84 s
> stdout ---
- 58.84 s
>
- 58.84 s
> running 1 test
- 58.84 s
> test python_evaluate_samples_batch_and_momentum_space_have_expected_shape ... FAILED
- 58.84 s
>
- 58.84 s
> failures:
- 58.84 s
>
- 58.84 s
> failures:
- 58.84 s
> python_evaluate_samples_batch_and_momentum_space_have_expected_shape
- 58.84 s
>
- 58.84 s
> test result: FAILED. 0 passed; 1 failed; 0 ignored; 0 measured; 4 filtered out; finished in 0.51s
- 58.84 s
>
- 58.84 s
> stderr ---
- 58.84 s
> Error: Python API test subprocess failed.
- 58.84 s
> stdout:
- 58.84 s
> ┌────────────────────────────────────────────────────────┐
- 58.84 s
> │ You are running a restricted Symbolica instance. │
- 58.84 s
> │ │
- 58.84 s
> │ This mode is only permitted for non-commercial use and │
- 58.84 s
> │ is limited to one instance and core per machine. │
- 58.84 s
> │ │
- 58.84 s
> │ Hobbyists can easily acquire a free license key │
- 58.84 s
> │ that unlocks all cores and removes this banner: │
- 58.84 s
> │ │
- 58.84 s
> │ from symbolica import * │
- 58.84 s
> │ request_hobbyist_license('YOUR_NAME', 'YOUR_EMAIL') │
- 58.84 s
> │ │
- 58.84 s
> │ All other users can obtain a free 30-day trial key: │
- 58.84 s
> │ │
- 58.84 s
> │ from symbolica import * │
- 58.84 s
> │ request_trial_license('NAME', 'EMAIL', 'EMPLOYER') │
- 58.84 s
> │ │
- 58.84 s
> │ See https://symbolica.io/docs/get_started.html#license │
- 58.84 s
> └────────────────────────────────────────────────────────┘
- 58.84 s
> ┌───────────────────────────────────────────────────────────────────────────────────────────────────────────┐
- 58.84 s
> │ Cannot start new unlicensed Symbolica instance since there is already another one running on the machine. │
- 58.84 s
> └───────────────────────────────────────────────────────────────────────────────────────────────────────────┘
- 58.84 s
>
- 58.84 s
> stderr:
- 58.84 s
> ┌───────────────────────────────────┐
- 58.84 s
> │ The Symbolica license has expired │
- 58.84 s
> └───────────────────────────────────┘
- 58.84 s
>
- 58.84 s
>
- 58.84 s
> Location:
- 58.84 s
> tests/tests/test_python_api.rs:157:20
- 58.84 s
>
- 58.84 s
> FAIL [ 0.557s] (3/5) gammaloop-integration-tests::test_python_api python_evaluate_sample_honors_generate_events_and_observable_snapshots
- 58.84 s
> stdout ---
- 58.84 s
>
- 58.84 s
> running 1 test
- 58.84 s
> test python_evaluate_sample_honors_generate_events_and_observable_snapshots ... FAILED
- 58.84 s
>
- 58.84 s
> failures:
- 58.84 s
>
- 58.84 s
> failures:
- 58.84 s
> python_evaluate_sample_honors_generate_events_and_observable_snapshots
- 58.84 s
>
- 58.84 s
> test result: FAILED. 0 passed; 1 failed; 0 ignored; 0 measured; 4 filtered out; finished in 0.54s
- 58.84 s
>
- 58.84 s
> stderr ---
- 58.84 s
> Error: Python API test subprocess failed.
- 58.84 s
> stdout:
- 58.84 s
> ┌────────────────────────────────────────────────────────┐
- 58.84 s
> │ You are running a restricted Symbolica instance. │
- 58.84 s
> │ │
- 58.84 s
> │ This mode is only permitted for non-commercial use and │
- 58.84 s
> │ is limited to one instance and core per machine. │
- 58.84 s
> │ │
- 58.84 s
> │ Hobbyists can easily acquire a free license key │
- 58.84 s
> │ that unlocks all cores and removes this banner: │
- 58.84 s
> │ │
- 58.84 s
> │ from symbolica import * │
- 58.84 s
> │ request_hobbyist_license('YOUR_NAME', 'YOUR_EMAIL') │
- 58.84 s
> │ │
- 58.84 s
> │ All other users can obtain a free 30-day trial key: │
- 58.84 s
> │ │
- 58.84 s
> │ from symbolica import * │
- 58.84 s
> │ request_trial_license('NAME', 'EMAIL', 'EMPLOYER') │
- 58.84 s
> │ │
- 58.84 s
> │ See https://symbolica.io/docs/get_started.html#license │
- 58.84 s
> └────────────────────────────────────────────────────────┘
- 58.84 s
> ┌───────────────────────────────────────────────────────────────────────────────────────────────────────────┐
- 58.84 s
> │ Cannot start new unlicensed Symbolica instance since there is already another one running on the machine. │
- 58.84 s
> └───────────────────────────────────────────────────────────────────────────────────────────────────────────┘
- 58.84 s
>
- 58.84 s
> stderr:
- 58.84 s
> ┌───────────────────────────────────┐
- 58.84 s
> │ The Symbolica license has expired │
- 58.84 s
> └───────────────────────────────────┘
- 58.84 s
>
- 58.84 s
>
- 58.84 s
> Location:
- 58.84 s
> tests/tests/test_python_api.rs:157:20
- 58.84 s
>
- 58.84 s
> FAIL [ 0.561s] (4/5) gammaloop-integration-tests::test_python_api python_evaluate_sample_preserves_graph_grouping_and_incoming_pdgs
- 58.84 s
> stdout ---
- 58.84 s
>
- 58.84 s
> running 1 test
- 58.84 s
> test python_evaluate_sample_preserves_graph_grouping_and_incoming_pdgs ... FAILED
- 58.84 s
>
- 58.84 s
> failures:
- 58.84 s
>
- 58.84 s
> failures:
- 58.84 s
> python_evaluate_sample_preserves_graph_grouping_and_incoming_pdgs
- 58.84 s
>
- 58.84 s
> test result: FAILED. 0 passed; 1 failed; 0 ignored; 0 measured; 4 filtered out; finished in 0.54s
- 58.84 s
>
- 58.84 s
> stderr ---
- 58.84 s
> Error: Python API test subprocess failed.
- 58.84 s
> stdout:
- 58.84 s
> ┌────────────────────────────────────────────────────────┐
- 58.84 s
> │ You are running a restricted Symbolica instance. │
- 58.84 s
> │ │
- 58.84 s
> │ This mode is only permitted for non-commercial use and │
- 58.84 s
> │ is limited to one instance and core per machine. │
- 58.84 s
> │ │
- 58.84 s
> │ Hobbyists can easily acquire a free license key │
- 58.84 s
> │ that unlocks all cores and removes this banner: │
- 58.84 s
> │ │
- 58.84 s
> │ from symbolica import * │
- 58.84 s
> │ request_hobbyist_license('YOUR_NAME', 'YOUR_EMAIL') │
- 58.84 s
> │ │
- 58.84 s
> │ All other users can obtain a free 30-day trial key: │
- 58.84 s
> │ │
- 58.84 s
> │ from symbolica import * │
- 58.84 s
> │ request_trial_license('NAME', 'EMAIL', 'EMPLOYER') │
- 58.84 s
> │ │
- 58.84 s
> │ See https://symbolica.io/docs/get_started.html#license │
- 58.84 s
> └────────────────────────────────────────────────────────┘
- 58.84 s
> ┌───────────────────────────────────────────────────────────────────────────────────────────────────────────┐
- 58.84 s
> │ Cannot start new unlicensed Symbolica instance since there is already another one running on the machine. │
- 58.84 s
> └───────────────────────────────────────────────────────────────────────────────────────────────────────────┘
- 58.84 s
>
- 58.84 s
> stderr:
- 58.84 s
> ┌───────────────────────────────────┐
- 58.84 s
> │ The Symbolica license has expired │
- 58.84 s
> └───────────────────────────────────┘
- 58.84 s
>
- 58.84 s
>
- 58.84 s
> Location:
- 58.84 s
> tests/tests/test_python_api.rs:157:20
- 58.84 s
>
- 58.84 s
> error: test run failed
- 58.84 s
>
- 58.84 s
> ========== nextest test summary ==========
- 58.84 s
> report: target/nextest/ci_gammaloop/junit.xml
- 58.84 s
> tests: 5, failures: 3, errors: 0
- 58.84 s
>
- 58.84 s
> 1. gammaloop-integration-tests::test_python_api::python_evaluate_samples_batch_and_momentum_space_have_expected_shape
- 58.84 s
> failure: test failure with exit code 101
- 58.84 s
> Error: Python API test subprocess failed.
- 58.84 s
> stdout:
- 58.84 s
> ┌────────────────────────────────────────────────────────┐
- 58.84 s
> │ You are running a restricted Symbolica instance. │
- 58.84 s
> │ │
- 58.84 s
> │ This mode is only permitted for non-commercial use and │
- 58.84 s
> │ is limited to one instance and core per machine. │
- 58.84 s
> │ │
- 58.84 s
> │ Hobbyists can easily acquire a free license key │
- 58.84 s
> │ that unlocks all cores and removes this banner: │
- 58.84 s
> │ │
- 58.84 s
> │ from symbolica import * │
- 58.84 s
> │ request_hobbyist_license('YOUR_NAME', 'YOUR_EMAIL') │
- 58.84 s
> │ │
- 58.84 s
> │ All other users can obtain a free 30-day trial key: │
- 58.84 s
> │ │
- 58.84 s
> │ from symbolica import * │
- 58.84 s
> │ request_trial_license('NAME', 'EMAIL', 'EMPLOYER') │
- 58.84 s
> │ │
- 58.84 s
> │ See https://symbolica.io/docs/get_started.html#license │
- 58.84 s
> └────────────────────────────────────────────────────────┘
- 58.84 s
> ┌───────────────────────────────────────────────────────────────────────────────────────────────────────────┐
- 58.84 s
> │ Cannot start new unlicensed Symbolica instance since there is already another one running on the machine. │
- 58.84 s
> └───────────────────────────────────────────────────────────────────────────────────────────────────────────┘
- 58.84 s
>
- 58.84 s
> stderr:
- 58.84 s
> ┌───────────────────────────────────┐
- 58.84 s
> │ The Symbolica license has expired │
- 58.84 s
> └───────────────────────────────────┘
- 58.84 s
>
- 58.84 s
>
- 58.84 s
> Location:
- 58.84 s
> tests/tests/test_python_api.rs:157:20
- 58.84 s
> system-out
- 58.84 s
> running 1 test
- 58.84 s
> test python_evaluate_samples_batch_and_momentum_space_have_expected_shape ... FAILED
- 58.84 s
>
- 58.84 s
> failures:
- 58.84 s
>
- 58.84 s
> failures:
- 58.84 s
> python_evaluate_samples_batch_and_momentum_space_have_expected_shape
- 58.84 s
>
- 58.84 s
> test result: FAILED. 0 passed; 1 failed; 0 ignored; 0 measured; 4 filtered out; finished in 0.51s
- 58.84 s
> system-err
- 58.84 s
> Error: Python API test subprocess failed.
- 58.84 s
> stdout:
- 58.84 s
> ┌────────────────────────────────────────────────────────┐
- 58.84 s
> │ You are running a restricted Symbolica instance. │
- 58.84 s
> │ │
- 58.84 s
> │ This mode is only permitted for non-commercial use and │
- 58.84 s
> │ is limited to one instance and core per machine. │
- 58.84 s
> │ │
- 58.84 s
> │ Hobbyists can easily acquire a free license key │
- 58.84 s
> │ that unlocks all cores and removes this banner: │
- 58.84 s
> │ │
- 58.84 s
> │ from symbolica import * │
- 58.84 s
> │ request_hobbyist_license('YOUR_NAME', 'YOUR_EMAIL') │
- 58.84 s
> │ │
- 58.84 s
> │ All other users can obtain a free 30-day trial key: │
- 58.84 s
> │ │
- 58.84 s
> │ from symbolica import * │
- 58.84 s
> │ request_trial_license('NAME', 'EMAIL', 'EMPLOYER') │
- 58.84 s
> │ │
- 58.84 s
> │ See https://symbolica.io/docs/get_started.html#license │
- 58.84 s
> └────────────────────────────────────────────────────────┘
- 58.84 s
> ┌───────────────────────────────────────────────────────────────────────────────────────────────────────────┐
- 58.84 s
> │ Cannot start new unlicensed Symbolica instance since there is already another one running on the machine. │
- 58.84 s
> └───────────────────────────────────────────────────────────────────────────────────────────────────────────┘
- 58.84 s
>
- 58.84 s
> stderr:
- 58.84 s
> ┌───────────────────────────────────┐
- 58.84 s
> │ The Symbolica license has expired │
- 58.84 s
> └───────────────────────────────────┘
- 58.84 s
>
- 58.84 s
>
- 58.84 s
> Location:
- 58.84 s
> tests/tests/test_python_api.rs:157:20
- 58.84 s
>
- 58.84 s
> 2. gammaloop-integration-tests::test_python_api::python_evaluate_sample_honors_generate_events_and_observable_snapshots
- 58.84 s
> failure: test failure with exit code 101
- 58.84 s
> Error: Python API test subprocess failed.
- 58.84 s
> stdout:
- 58.84 s
> ┌────────────────────────────────────────────────────────┐
- 58.84 s
> │ You are running a restricted Symbolica instance. │
- 58.84 s
> │ │
- 58.84 s
> │ This mode is only permitted for non-commercial use and │
- 58.84 s
> │ is limited to one instance and core per machine. │
- 58.84 s
> │ │
- 58.84 s
> │ Hobbyists can easily acquire a free license key │
- 58.84 s
> │ that unlocks all cores and removes this banner: │
- 58.84 s
> │ │
- 58.84 s
> │ from symbolica import * │
- 58.84 s
> │ request_hobbyist_license('YOUR_NAME', 'YOUR_EMAIL') │
- 58.84 s
> │ │
- 58.84 s
> │ All other users can obtain a free 30-day trial key: │
- 58.84 s
> │ │
- 58.84 s
> │ from symbolica import * │
- 58.84 s
> │ request_trial_license('NAME', 'EMAIL', 'EMPLOYER') │
- 58.84 s
> │ │
- 58.84 s
> │ See https://symbolica.io/docs/get_started.html#license │
- 58.84 s
> └────────────────────────────────────────────────────────┘
- 58.84 s
> ┌───────────────────────────────────────────────────────────────────────────────────────────────────────────┐
- 58.84 s
> │ Cannot start new unlicensed Symbolica instance since there is already another one running on the machine. │
- 58.84 s
> └───────────────────────────────────────────────────────────────────────────────────────────────────────────┘
- 58.84 s
>
- 58.84 s
> stderr:
- 58.84 s
> ┌───────────────────────────────────┐
- 58.84 s
> │ The Symbolica license has expired │
- 58.84 s
> └───────────────────────────────────┘
- 58.84 s
>
- 58.84 s
>
- 58.84 s
> Location:
- 58.84 s
> tests/tests/test_python_api.rs:157:20
- 58.84 s
> system-out
- 58.84 s
> running 1 test
- 58.84 s
> test python_evaluate_sample_honors_generate_events_and_observable_snapshots ... FAILED
- 58.84 s
>
- 58.84 s
> failures:
- 58.84 s
>
- 58.84 s
> failures:
- 58.84 s
> python_evaluate_sample_honors_generate_events_and_observable_snapshots
- 58.84 s
>
- 58.84 s
> test result: FAILED. 0 passed; 1 failed; 0 ignored; 0 measured; 4 filtered out; finished in 0.54s
- 58.84 s
> system-err
- 58.84 s
> Error: Python API test subprocess failed.
- 58.84 s
> stdout:
- 58.84 s
> ┌────────────────────────────────────────────────────────┐
- 58.84 s
> │ You are running a restricted Symbolica instance. │
- 58.84 s
> │ │
- 58.84 s
> │ This mode is only permitted for non-commercial use and │
- 58.84 s
> │ is limited to one instance and core per machine. │
- 58.84 s
> │ │
- 58.84 s
> │ Hobbyists can easily acquire a free license key │
- 58.84 s
> │ that unlocks all cores and removes this banner: │
- 58.84 s
> │ │
- 58.84 s
> │ from symbolica import * │
- 58.84 s
> │ request_hobbyist_license('YOUR_NAME', 'YOUR_EMAIL') │
- 58.84 s
> │ │
- 58.84 s
> │ All other users can obtain a free 30-day trial key: │
- 58.84 s
> │ │
- 58.84 s
> │ from symbolica import * │
- 58.84 s
> │ request_trial_license('NAME', 'EMAIL', 'EMPLOYER') │
- 58.84 s
> │ │
- 58.84 s
> │ See https://symbolica.io/docs/get_started.html#license │
- 58.84 s
> └────────────────────────────────────────────────────────┘
- 58.84 s
> ┌───────────────────────────────────────────────────────────────────────────────────────────────────────────┐
- 58.84 s
> │ Cannot start new unlicensed Symbolica instance since there is already another one running on the machine. │
- 58.84 s
> └───────────────────────────────────────────────────────────────────────────────────────────────────────────┘
- 58.84 s
>
- 58.84 s
> stderr:
- 58.84 s
> ┌───────────────────────────────────┐
- 58.84 s
> │ The Symbolica license has expired │
- 58.84 s
> └───────────────────────────────────┘
- 58.84 s
>
- 58.84 s
>
- 58.84 s
> Location:
- 58.84 s
> tests/tests/test_python_api.rs:157:20
- 58.84 s
>
- 58.84 s
> 3. gammaloop-integration-tests::test_python_api::python_evaluate_sample_preserves_graph_grouping_and_incoming_pdgs
- 58.84 s
> failure: test failure with exit code 101
- 58.84 s
> Error: Python API test subprocess failed.
- 58.84 s
> stdout:
- 58.84 s
> ┌────────────────────────────────────────────────────────┐
- 58.84 s
> │ You are running a restricted Symbolica instance. │
- 58.84 s
> │ │
- 58.84 s
> │ This mode is only permitted for non-commercial use and │
- 58.84 s
> │ is limited to one instance and core per machine. │
- 58.84 s
> │ │
- 58.84 s
> │ Hobbyists can easily acquire a free license key │
- 58.84 s
> │ that unlocks all cores and removes this banner: │
- 58.84 s
> │ │
- 58.84 s
> │ from symbolica import * │
- 58.84 s
> │ request_hobbyist_license('YOUR_NAME', 'YOUR_EMAIL') │
- 58.84 s
> │ │
- 58.84 s
> │ All other users can obtain a free 30-day trial key: │
- 58.84 s
> │ │
- 58.84 s
> │ from symbolica import * │
- 58.84 s
> │ request_trial_license('NAME', 'EMAIL', 'EMPLOYER') │
- 58.84 s
> │ │
- 58.84 s
> │ See https://symbolica.io/docs/get_started.html#license │
- 58.84 s
> └────────────────────────────────────────────────────────┘
- 58.84 s
> ┌───────────────────────────────────────────────────────────────────────────────────────────────────────────┐
- 58.84 s
> │ Cannot start new unlicensed Symbolica instance since there is already another one running on the machine. │
- 58.84 s
> └───────────────────────────────────────────────────────────────────────────────────────────────────────────┘
- 58.84 s
>
- 58.84 s
> stderr:
- 58.84 s
> ┌───────────────────────────────────┐
- 58.84 s
> │ The Symbolica license has expired │
- 58.84 s
> └───────────────────────────────────┘
- 58.84 s
>
- 58.84 s
>
- 58.84 s
> Location:
- 58.84 s
> tests/tests/test_python_api.rs:157:20
- 58.84 s
> system-out
- 58.84 s
> running 1 test
- 58.84 s
> test python_evaluate_sample_preserves_graph_grouping_and_incoming_pdgs ... FAILED
- 58.84 s
>
- 58.84 s
> failures:
- 58.84 s
>
- 58.84 s
> failures:
- 58.84 s
> python_evaluate_sample_preserves_graph_grouping_and_incoming_pdgs
- 58.84 s
>
- 58.84 s
> test result: FAILED. 0 passed; 1 failed; 0 ignored; 0 measured; 4 filtered out; finished in 0.54s
- 58.84 s
> system-err
- 58.84 s
> Error: Python API test subprocess failed.
- 58.84 s
> stdout:
- 58.84 s
> ┌────────────────────────────────────────────────────────┐
- 58.84 s
> │ You are running a restricted Symbolica instance. │
- 58.84 s
> │ │
- 58.84 s
> │ This mode is only permitted for non-commercial use and │
- 58.84 s
> │ is limited to one instance and core per machine. │
- 58.84 s
> │ │
- 58.84 s
> │ Hobbyists can easily acquire a free license key │
- 58.84 s
> │ that unlocks all cores and removes this banner: │
- 58.84 s
> │ │
- 58.84 s
> │ from symbolica import * │
- 58.84 s
> │ request_hobbyist_license('YOUR_NAME', 'YOUR_EMAIL') │
- 58.84 s
> │ │
- 58.84 s
> │ All other users can obtain a free 30-day trial key: │
- 58.84 s
> │ │
- 58.84 s
> │ from symbolica import * │
- 58.84 s
> │ request_trial_license('NAME', 'EMAIL', 'EMPLOYER') │
- 58.84 s
> │ │
- 58.84 s
> │ See https://symbolica.io/docs/get_started.html#license │
- 58.84 s
> └────────────────────────────────────────────────────────┘
- 58.84 s
> ┌───────────────────────────────────────────────────────────────────────────────────────────────────────────┐
- 58.84 s
> │ Cannot start new unlicensed Symbolica instance since there is already another one running on the machine. │
- 58.84 s
> └───────────────────────────────────────────────────────────────────────────────────────────────────────────┘
- 58.84 s
>
- 58.84 s
> stderr:
- 58.84 s
> ┌───────────────────────────────────┐
- 58.84 s
> │ The Symbolica license has expired │
- 58.84 s
> └───────────────────────────────────┘
- 58.84 s
>
- 58.84 s
>
- 58.84 s
> Location:
- 58.84 s
> tests/tests/test_python_api.rs:157:20
- 58.84 s
> =========================================
- 58.84 s
For full logs, run:
- 58.84 s
nix log /nix/store/fzljqa63rh9s640jcldimpyrcjcnir2c-gammaloop-nextest-python-api.drv
- 58.96 s
[0 built (1 failed), 0.0Run failed.