1. 0.19 s $ /nix/store/9ypz3flqsrl5xl495mm8h645gadjsxi1-coreutils-9.11/bin/timeout --kill-after=15s 7200s /nix/store/23zk8sgzamrbmj1fday15szf7f2279s8-nix-2.34.7/bin/nix --extra-experimental-features nix-command --extra-experimental-features flakes flake clone git+https://github.com/alphal00p/gammaloop --dest /tmp/nix-ci-worker/stable-pwd/repo/
  2. 0.54 s Cloning into '/tmp/nix-ci-worker/stable-pwd/repo'...
  3. 1.96 s remote: Enumerating objects: 66499, done.
  4. 2.07 s remote: Counting objects: 0% (1/9150) remote: Counting objects: 1% (92/9150) remote: Counting objects: 2% (183/9150) remote: Counting objects: 3% (275/9150) remote: Counting objects: 4% (366/9150) remote: Counting objects: 5% (458/9150) remote: Counting objects: 6% (549/9150) remote: Counting objects: 7% (641/9150) remote: Counting objects: 8% (732/9150) remote: Counting objects: 9% (824/9150) remote: Counting objects: 10% (915/9150) remote: Counting objects: 11% (1007/9150) remote: Counting objects: 12% (1098/9150) remote: Counting objects: 13% (1190/9150) remote: Counting objects: 14% (1281/9150) remote: Counting objects: 15% (1373/9150) remote: Counting objects: 16% (1464/9150) remote: Counting objects: 17% (1556/9150) remote: Counting objects: 18% (1647/9150) remote: Counting objects: 19% (1739/9150) remote: Counting objects: 20% (1830/9150) remote: Counting objects: 21% (1922/9150) remote: Counting objects: 22% (2013/9150) remote: Counting objects: 23% (2105/9150) remote: Counting objects: 24% (2196/9150) remote: Counting objects: 25% (2288/9150) remote: Counting objects: 26% (2379/9150) remote: Counting objects: 27% (2471/9150) remote: Counting objects: 28% (2562/9150) remote: Counting objects: 29% (2654/9150) remote: Counting objects: 30% (2745/9150) remote: Counting objects: 31% (2837/9150) remote: Counting objects: 32% (2928/9150) remote: Counting objects: 33% (3020/9150) remote: Counting objects: 34% (3111/9150) remote: Counting objects: 35% (3203/9150) remote: Counting objects: 36% (3294/9150) remote: Counting objects: 37% (3386/9150) remote: Counting objects: 38% (3477/9150) remote: Counting objects: 39% (3569/9150) remote: Counting objects: 40% (3660/9150) remote: Counting objects: 41% (3752/9150) remote: Counting objects: 42% (3843/9150) remote: Counting objects: 43% (3935/9150) remote: Counting objects: 44% (4026/9150) remote: Counting objects: 45% (4118/9150) remote: Counting objects: 46% (4209/9150) remote: Counting objects: 47% (4301/9150) remote: Counting objects: 48% (4392/9150) remote: Counting objects: 49% (4484/9150) remote: Counting objects: 50% (4575/9150) remote: Counting objects: 51% (4667/9150) remote: Counting objects: 52% (4758/9150) remote: Counting objects: 53% (4850/9150) remote: Counting objects: 54% (4941/9150) remote: Counting objects: 55% (5033/9150) remote: Counting objects: 56% (5124/9150) remote: Counting objects: 57% (5216/9150) remote: Counting objects: 58% (5307/9150) remote: Counting objects: 59% (5399/9150) remote: Counting objects: 60% (5490/9150) remote: Counting objects: 61% (5582/9150) remote: Counting objects: 62% (5673/9150) remote: Counting objects: 63% (5765/9150) remote: Counting objects: 64% (5856/9150) remote: Counting objects: 65% (5948/9150) remote: Counting objects: 66% (6039/9150) remote: Counting objects: 67% (6131/9150) remote: Counting objects: 68% (6222/9150) remote: Counting objects: 69% (6314/9150) remote: Counting objects: 70% (6405/9150) remote: Counting objects: 71% (6497/9150) remote: Counting objects: 72% (6588/9150) remote: Counting objects: 73% (6680/9150) remote: Counting objects: 74% (6771/9150) remote: Counting objects: 75% (6863/9150) remote: Counting objects: 76% (6954/9150) remote: Counting objects: 77% (7046/9150) remote: Counting objects: 78% (7137/9150) remote: Counting objects: 79% (7229/9150) remote: Counting objects: 80% (7320/9150) remote: Counting objects: 81% (7412/9150) remote: Counting objects: 82% (7503/9150) remote: Counting objects: 83% (7595/9150) remote: Counting objects: 84% (7686/9150) remote: Counting objects: 85% (7778/9150) remote: Counting objects: 86% (7869/9150) remote: Counting objects: 87% (7961/9150) remote: Counting objects: 88% (8052/9150) remote: Counting objects: 89% (8144/9150) remote: Counting objects: 90% (8235/9150) remote: Counting objects: 91% (8327/9150) remote: Counting objects: 92% (8418/9150) remote: Counting objects: 93% (8510/9150) remote: Counting objects: 94% (8601/9150) remote: Counting objects: 95% (8693/9150) remote: Counting objects: 96% (8784/9150) remote: Counting objects: 97% (8876/9150) remote: Counting objects: 98% (8967/9150) remote: Counting objects: 99% (9059/9150) remote: Counting objects: 100% (9150/9150) remote: Counting objects: 100% (9150/9150), done.
  5. 4.49 s remote: Compressing objects: 0% (1/2231) remote: Compressing objects: 1% (23/2231) remote: Compressing objects: 2% (45/2231) remote: Compressing objects: 3% (67/2231) remote: Compressing objects: 4% (90/2231) remote: Compressing objects: 5% (112/2231) remote: Compressing objects: 6% (134/2231) remote: Compressing objects: 7% (157/2231) remote: Compressing objects: 8% (179/2231) remote: Compressing objects: 9% (201/2231) remote: Compressing objects: 10% (224/2231) remote: Compressing objects: 11% (246/2231) remote: Compressing objects: 12% (268/2231) remote: Compressing objects: 13% (291/2231) remote: Compressing objects: 14% (313/2231) remote: Compressing objects: 15% (335/2231) remote: Compressing objects: 16% (357/2231) remote: Compressing objects: 17% (380/2231) remote: Compressing objects: 18% (402/2231) remote: Compressing objects: 19% (424/2231) remote: Compressing objects: 20% (447/2231) remote: Compressing objects: 21% (469/2231) remote: Compressing objects: 21% (489/2231) remote: Compressing objects: 22% (491/2231) remote: Compressing objects: 23% (514/2231) remote: Compressing objects: 24% (536/2231) remote: Compressing objects: 25% (558/2231) remote: Compressing objects: 26% (581/2231) remote: Compressing objects: 27% (603/2231) remote: Compressing objects: 28% (625/2231) remote: Compressing objects: 29% (647/2231) remote: Compressing objects: 29% (657/2231) remote: Compressing objects: 30% (670/2231) remote: Compressing objects: 31% (692/2231) remote: Compressing objects: 32% (714/2231) remote: Compressing objects: 33% (737/2231) remote: Compressing objects: 34% (759/2231) remote: Compressing objects: 35% (781/2231) remote: Compressing objects: 36% (804/2231) remote: Compressing objects: 37% (826/2231) remote: Compressing objects: 38% (848/2231) remote: Compressing objects: 39% (871/2231) remote: Compressing objects: 40% (893/2231) remote: Compressing objects: 41% (915/2231) remote: Compressing objects: 42% (938/2231) remote: Compressing objects: 43% (960/2231) remote: Compressing objects: 44% (982/2231) remote: Compressing objects: 45% (1004/2231) remote: Compressing objects: 46% (1027/2231) remote: Compressing objects: 47% (1049/2231) remote: Compressing objects: 48% (1071/2231) remote: Compressing objects: 49% (1094/2231) remote: Compressing objects: 50% (1116/2231) remote: Compressing objects: 51% (1138/2231) remote: Compressing objects: 52% (1161/2231) remote: Compressing objects: 53% (1183/2231) remote: Compressing objects: 54% (1205/2231) remote: Compressing objects: 55% (1228/2231) remote: Compressing objects: 56% (1250/2231) remote: Compressing objects: 57% (1272/2231) remote: Compressing objects: 58% (1294/2231) remote: Compressing objects: 59% (1317/2231) remote: Compressing objects: 60% (1339/2231) remote: Compressing objects: 61% (1361/2231) remote: Compressing objects: 62% (1384/2231) remote: Compressing objects: 63% (1406/2231) remote: Compressing objects: 64% (1428/2231) remote: Compressing objects: 65% (1451/2231) remote: Compressing objects: 66% (1473/2231) remote: Compressing objects: 67% (1495/2231) remote: Compressing objects: 68% (1518/2231) remote: Compressing objects: 69% (1540/2231) remote: Compressing objects: 70% (1562/2231) remote: Compressing objects: 71% (1585/2231) remote: Compressing objects: 72% (1607/2231) remote: Compressing objects: 73% (1629/2231) remote: Compressing objects: 74% (1651/2231) remote: Compressing objects: 75% (1674/2231) remote: Compressing objects: 76% (1696/2231) remote: Compressing objects: 77% (1718/2231) remote: Compressing objects: 78% (1741/2231) remote: Compressing objects: 79% (1763/2231) remote: Compressing objects: 80% (1785/2231) remote: Compressing objects: 81% (1808/2231) remote: Compressing objects: 82% (1830/2231) remote: Compressing objects: 83% (1852/2231) remote: Compressing objects: 84% (1875/2231) remote: Compressing objects: 85% (1897/2231) remote: Compressing objects: 86% (1919/2231) remote: Compressing objects: 87% (1941/2231) remote: Compressing objects: 88% (1964/2231) remote: Compressing objects: 89% (1986/2231) remote: Compressing objects: 90% (2008/2231) remote: Compressing objects: 91% (2031/2231) remote: Compressing objects: 92% (2053/2231) remote: Compressing objects: 93% (2075/2231) remote: Compressing objects: 94% (2098/2231) remote: Compressing objects: 95% (2120/2231) remote: Compressing objects: 96% (2142/2231) remote: Compressing objects: 97% (2165/2231) remote: Compressing objects: 98% (2187/2231) remote: Compressing objects: 99% (2209/2231) remote: Compressing objects: 100% (2231/2231) remote: Compressing objects: 100% (2231/2231), done.
  6. 10.73 s Receiving objects: 0% (1/66499) Receiving objects: 1% (665/66499) Receiving objects: 2% (1330/66499) Receiving objects: 3% (1995/66499) Receiving objects: 4% (2660/66499) Receiving objects: 5% (3325/66499) Receiving objects: 6% (3990/66499) Receiving objects: 7% (4655/66499) Receiving objects: 8% (5320/66499), 9.11 MiB | 18.17 MiB/s Receiving objects: 9% (5985/66499), 9.11 MiB | 18.17 MiB/s Receiving objects: 10% (6650/66499), 9.11 MiB | 18.17 MiB/s Receiving objects: 11% (7315/66499), 9.11 MiB | 18.17 MiB/s Receiving objects: 12% (7980/66499), 9.11 MiB | 18.17 MiB/s Receiving objects: 12% (8389/66499), 18.27 MiB | 18.24 MiB/s Receiving objects: 13% (8645/66499), 18.27 MiB | 18.24 MiB/s Receiving objects: 14% (9310/66499), 18.27 MiB | 18.24 MiB/s Receiving objects: 15% (9975/66499), 18.27 MiB | 18.24 MiB/s Receiving objects: 16% (10640/66499), 18.27 MiB | 18.24 MiB/s Receiving objects: 17% (11305/66499), 18.27 MiB | 18.24 MiB/s Receiving objects: 18% (11970/66499), 18.27 MiB | 18.24 MiB/s Receiving objects: 19% (12635/66499), 18.27 MiB | 18.24 MiB/s Receiving objects: 20% (13300/66499), 18.27 MiB | 18.24 MiB/s Receiving objects: 21% (13965/66499), 18.27 MiB | 18.24 MiB/s Receiving objects: 22% (14630/66499), 18.27 MiB | 18.24 MiB/s Receiving objects: 23% (15295/66499), 18.27 MiB | 18.24 MiB/s Receiving objects: 24% (15960/66499), 18.27 MiB | 18.24 MiB/s Receiving objects: 25% (16625/66499), 18.27 MiB | 18.24 MiB/s Receiving objects: 26% (17290/66499), 18.27 MiB | 18.24 MiB/s Receiving objects: 27% (17955/66499), 18.27 MiB | 18.24 MiB/s Receiving objects: 28% (18620/66499), 18.27 MiB | 18.24 MiB/s Receiving objects: 29% (19285/66499), 18.27 MiB | 18.24 MiB/s Receiving objects: 30% (19950/66499), 18.27 MiB | 18.24 MiB/s Receiving objects: 31% (20615/66499), 18.27 MiB | 18.24 MiB/s Receiving objects: 32% (21280/66499), 18.27 MiB | 18.24 MiB/s Receiving objects: 33% (21945/66499), 18.27 MiB | 18.24 MiB/s Receiving objects: 34% (22610/66499), 18.27 MiB | 18.24 MiB/s Receiving objects: 35% (23275/66499), 18.27 MiB | 18.24 MiB/s Receiving objects: 36% (23940/66499), 18.27 MiB | 18.24 MiB/s Receiving objects: 37% (24605/66499), 18.27 MiB | 18.24 MiB/s Receiving objects: 38% (25270/66499), 18.27 MiB | 18.24 MiB/s Receiving objects: 39% (25935/66499), 18.27 MiB | 18.24 MiB/s Receiving objects: 40% (26600/66499), 18.27 MiB | 18.24 MiB/s Receiving objects: 41% (27265/66499), 18.27 MiB | 18.24 MiB/s Receiving objects: 42% (27930/66499), 18.27 MiB | 18.24 MiB/s Receiving objects: 43% (28595/66499), 18.27 MiB | 18.24 MiB/s Receiving objects: 44% (29260/66499), 18.27 MiB | 18.24 MiB/s Receiving objects: 45% (29925/66499), 18.27 MiB | 18.24 MiB/s Receiving objects: 46% (30590/66499), 18.27 MiB | 18.24 MiB/s Receiving objects: 47% (31255/66499), 18.27 MiB | 18.24 MiB/s Receiving objects: 48% (31920/66499), 28.24 MiB | 18.81 MiB/s Receiving objects: 49% (32585/66499), 28.24 MiB | 18.81 MiB/s Receiving objects: 50% (33250/66499), 28.24 MiB | 18.81 MiB/s Receiving objects: 51% (33915/66499), 28.24 MiB | 18.81 MiB/s Receiving objects: 52% (34580/66499), 28.24 MiB | 18.81 MiB/s Receiving objects: 52% (34744/66499), 33.76 MiB | 16.79 MiB/s Receiving objects: 53% (35245/66499), 33.76 MiB | 16.79 MiB/s Receiving objects: 54% (35910/66499), 33.76 MiB | 16.79 MiB/s Receiving objects: 55% (36575/66499), 37.62 MiB | 14.97 MiB/s Receiving objects: 56% (37240/66499), 37.62 MiB | 14.97 MiB/s Receiving objects: 56% (37769/66499), 37.62 MiB | 14.97 MiB/s Receiving objects: 57% (37905/66499), 42.04 MiB | 13.94 MiB/s Receiving objects: 58% (38570/66499), 42.04 MiB | 13.94 MiB/s Receiving objects: 59% (39235/66499), 42.04 MiB | 13.94 MiB/s Receiving objects: 60% (39900/66499), 46.69 MiB | 13.28 MiB/s Receiving objects: 61% (40565/66499), 46.69 MiB | 13.28 MiB/s Receiving objects: 62% (41230/66499), 46.69 MiB | 13.28 MiB/s Receiving objects: 63% (41895/66499), 46.69 MiB | 13.28 MiB/s Receiving objects: 64% (42560/66499), 46.69 MiB | 13.28 MiB/s Receiving objects: 65% (43225/66499), 46.69 MiB | 13.28 MiB/s Receiving objects: 66% (43890/66499), 46.69 MiB | 13.28 MiB/s Receiving objects: 66% (44511/66499), 46.69 MiB | 13.28 MiB/s Receiving objects: 67% (44555/66499), 53.39 MiB | 13.27 MiB/s Receiving objects: 68% (45220/66499), 53.39 MiB | 13.27 MiB/s Receiving objects: 69% (45885/66499), 53.39 MiB | 13.27 MiB/s Receiving objects: 70% (46550/66499), 53.39 MiB | 13.27 MiB/s Receiving objects: 71% (47215/66499), 53.39 MiB | 13.27 MiB/s Receiving objects: 72% (47880/66499), 60.33 MiB | 13.33 MiB/s Receiving objects: 73% (48545/66499), 60.33 MiB | 13.33 MiB/s Receiving objects: 74% (49210/66499), 60.33 MiB | 13.33 MiB/s Receiving objects: 75% (49875/66499), 60.33 MiB | 13.33 MiB/s Receiving objects: 76% (50540/66499), 60.33 MiB | 13.33 MiB/s Receiving objects: 76% (50553/66499), 60.33 MiB | 13.33 MiB/s Receiving objects: 77% (51205/66499), 71.17 MiB | 13.72 MiB/s Receiving objects: 78% (51870/66499), 71.17 MiB | 13.72 MiB/s Receiving objects: 79% (52535/66499), 71.17 MiB | 13.72 MiB/s Receiving objects: 80% (53200/66499), 71.17 MiB | 13.72 MiB/s Receiving objects: 81% (53865/66499), 71.17 MiB | 13.72 MiB/s Receiving objects: 82% (54530/66499), 78.58 MiB | 13.34 MiB/s Receiving objects: 83% (55195/66499), 78.58 MiB | 13.34 MiB/s Receiving objects: 84% (55860/66499), 78.58 MiB | 13.34 MiB/s Receiving objects: 85% (56525/66499), 78.58 MiB | 13.34 MiB/s Receiving objects: 86% (57190/66499), 78.58 MiB | 13.34 MiB/s Receiving objects: 87% (57855/66499), 78.58 MiB | 13.34 MiB/s Receiving objects: 88% (58520/66499), 78.58 MiB | 13.34 MiB/s Receiving objects: 89% (59185/66499), 78.58 MiB | 13.34 MiB/s Receiving objects: 90% (59850/66499), 78.58 MiB | 13.34 MiB/s Receiving objects: 91% (60515/66499), 78.58 MiB | 13.34 MiB/s Receiving objects: 92% (61180/66499), 78.58 MiB | 13.34 MiB/s Receiving objects: 93% (61845/66499), 78.58 MiB | 13.34 MiB/s Receiving objects: 94% (62510/66499), 78.58 MiB | 13.34 MiB/s Receiving objects: 95% (63175/66499), 78.58 MiB | 13.34 MiB/s Receiving objects: 96% (63840/66499), 78.58 MiB | 13.34 MiB/s Receiving objects: 97% (64505/66499), 78.58 MiB | 13.34 MiB/s Receiving objects: 98% (65170/66499), 78.58 MiB | 13.34 MiB/s Receiving objects: 99% (65835/66499), 78.58 MiB | 13.34 MiB/s Receiving objects: 99% (66223/66499), 78.58 MiB | 13.34 MiB/s remote: Total 66499 (delta 7345), reused 7319 (delta 6631), pack-reused 57349 (from 1)
  7. 10.74 s Receiving objects: 100% (66499/66499), 92.64 MiB | 14.24 MiB/s Receiving objects: 100% (66499/66499), 99.33 MiB | 15.93 MiB/s, done.
  8. 13.50 s Resolving deltas: 0% (0/46463) Resolving deltas: 1% (465/46463) Resolving deltas: 2% (930/46463) Resolving deltas: 3% (1394/46463) Resolving deltas: 4% (1859/46463) Resolving deltas: 5% (2325/46463) Resolving deltas: 6% (2788/46463) Resolving deltas: 7% (3254/46463) Resolving deltas: 8% (3718/46463) Resolving deltas: 9% (4182/46463) Resolving deltas: 10% (4647/46463) Resolving deltas: 11% (5111/46463) Resolving deltas: 12% (5577/46463) Resolving deltas: 13% (6041/46463) Resolving deltas: 14% (6505/46463) Resolving deltas: 15% (6971/46463) Resolving deltas: 16% (7435/46463) Resolving deltas: 17% (7899/46463) Resolving deltas: 18% (8364/46463) Resolving deltas: 19% (8828/46463) Resolving deltas: 20% (9293/46463) Resolving deltas: 21% (9759/46463) Resolving deltas: 22% (10222/46463) Resolving deltas: 23% (10687/46463) Resolving deltas: 24% (11152/46463) Resolving deltas: 25% (11616/46463) Resolving deltas: 26% (12081/46463) Resolving deltas: 27% (12546/46463) Resolving deltas: 28% (13010/46463) Resolving deltas: 29% (13475/46463) Resolving deltas: 30% (13939/46463) Resolving deltas: 31% (14404/46463) Resolving deltas: 32% (14869/46463) Resolving deltas: 33% (15333/46463) Resolving deltas: 34% (15798/46463) Resolving deltas: 35% (16263/46463) Resolving deltas: 36% (16727/46463) Resolving deltas: 37% (17192/46463) Resolving deltas: 38% (17656/46463) Resolving deltas: 39% (18121/46463) Resolving deltas: 40% (18586/46463) Resolving deltas: 41% (19050/46463) Resolving deltas: 42% (19515/46463) Resolving deltas: 43% (19980/46463) Resolving deltas: 44% (20444/46463) Resolving deltas: 45% (20909/46463) Resolving deltas: 46% (21373/46463) Resolving deltas: 47% (21838/46463) Resolving deltas: 48% (22303/46463) Resolving deltas: 49% (22767/46463) Resolving deltas: 50% (23232/46463) Resolving deltas: 51% (23697/46463) Resolving deltas: 52% (24161/46463) Resolving deltas: 53% (24626/46463) Resolving deltas: 54% (25091/46463) Resolving deltas: 55% (25555/46463) Resolving deltas: 56% (26020/46463) Resolving deltas: 57% (26484/46463) Resolving deltas: 58% (26949/46463) Resolving deltas: 59% (27414/46463) Resolving deltas: 60% (27878/46463) Resolving deltas: 60% (28311/46463) Resolving deltas: 61% (28343/46463) Resolving deltas: 62% (28808/46463) Resolving deltas: 63% (29272/46463) Resolving deltas: 64% (29737/46463) Resolving deltas: 65% (30201/46463) Resolving deltas: 66% (30666/46463) Resolving deltas: 67% (31131/46463) Resolving deltas: 68% (31595/46463) Resolving deltas: 69% (32060/46463) Resolving deltas: 70% (32525/46463) Resolving deltas: 71% (32989/46463) Resolving deltas: 72% (33454/46463) Resolving deltas: 73% (33920/46463) Resolving deltas: 74% (34384/46463) Resolving deltas: 75% (34848/46463) Resolving deltas: 76% (35312/46463) Resolving deltas: 76% (35321/46463) Resolving deltas: 77% (35777/46463) Resolving deltas: 78% (36242/46463) Resolving deltas: 79% (36706/46463) Resolving deltas: 80% (37171/46463) Resolving deltas: 81% (37636/46463) Resolving deltas: 82% (38100/46463) Resolving deltas: 83% (38565/46463) Resolving deltas: 84% (39029/46463) Resolving deltas: 85% (39494/46463) Resolving deltas: 86% (39960/46463) Resolving deltas: 87% (40423/46463) Resolving deltas: 88% (40888/46463) Resolving deltas: 89% (41353/46463) Resolving deltas: 90% (41817/46463) Resolving deltas: 91% (42282/46463) Resolving deltas: 92% (42746/46463) Resolving deltas: 93% (43211/46463) Resolving deltas: 94% (43676/46463) Resolving deltas: 95% (44140/46463) Resolving deltas: 96% (44605/46463) Resolving deltas: 97% (45070/46463) Resolving deltas: 98% (45534/46463) Resolving deltas: 99% (45999/46463) Resolving deltas: 100% (46463/46463) Resolving deltas: 100% (46463/46463), done.
  9. 15.00 s Fetching commit 6eccc26fe47651addfae2f810918809139129a5c for feynkit ...
  10. 15.00 s $ /nix/store/bcnisk3ydfgv26v2gw3zlky24g00yww2-git-2.54.0/bin/git fetch origin 6eccc26fe47651addfae2f810918809139129a5c
  11. 16.10 s From https://github.com/alphal00p/gammaloop
  12. 16.10 s * branch 6eccc26fe47651addfae2f810918809139129a5c -> FETCH_HEAD
  13. 16.13 s $ /nix/store/9ypz3flqsrl5xl495mm8h645gadjsxi1-coreutils-9.11/bin/timeout --kill-after=15s 7200s /nix/store/bcnisk3ydfgv26v2gw3zlky24g00yww2-git-2.54.0/bin/git -c advice.detachedHead=false checkout 6eccc26fe47651addfae2f810918809139129a5c
  14. 16.47 s HEAD is now at 6eccc26fe fix feynkit tensor bridge integration
  15. 16.49 s $ /nix/store/9ypz3flqsrl5xl495mm8h645gadjsxi1-coreutils-9.11/bin/timeout --kill-after=15s 7200s /nix/store/23zk8sgzamrbmj1fday15szf7f2279s8-nix-2.34.7/bin/nix --extra-experimental-features nix-command --extra-experimental-features flakes --log-format internal-json run .#packages.x86_64-linux.nix-ci-check-gammaloop-nextest-python-api --print-build-logs
  16. 35.04 s
  17. 57.65 s evaluating derivation 'g copying '/nix/store/jirn evaluating derivation 'g copying '/nix/store/jirn evaluating derivation 'g copying '/nix/store/jirn evaluating derivation 'g copying '/nix/store/jirn evaluating derivation 'g copying '/nix/store/jirn evaluating derivation 'g copying '/nix/store/jirn evaluating derivation 'g copying '/nix/store/jirn evaluating derivation 'g copying '/nix/store/jirn evaluating derivation 'g copying '/nix/store/jirn evaluating derivation 'g copying '/nix/store/jirn evaluating derivation 'g copying '/nix/store/jirn evaluating derivation 'g copying '/nix/store/jirn evaluating derivation 'g copying '/nix/store/jirn evaluating derivation 'g copying '/nix/store/jirn evaluating derivation 'g copying '/nix/store/jirn evaluating derivation 'g copying '/nix/store/jirn evaluating derivation 'g copying '/nix/store/jirn evaluating derivation 'g copying '/nix/store/jirn evaluating derivation 'g copying '/nix/store/jirn evaluating derivation 'g copying '/nix/store/jirn evaluating derivation 'g copying '/nix/store/jirn evaluating derivation 'g copying '/nix/store/jirn evaluating derivation 'g copying '/nix/store/jirn evaluating derivation 'g copying '/nix/store/jirn evaluating derivation 'g copying '/nix/store/jirn evaluating derivation 'g copying '/nix/store/jirn evaluating derivation 'g copying '/nix/store/jirn evaluating derivation 'g copying '/nix/store/jirn evaluating derivation 'g querying gammaloop-nexte [0.0 KiB DL] [0/1 built, 0.0 KiB DL] [1/0/1 built, 0.0 KiB DLgammaloop-nextest-python-api> Extracting 1 binary, 1 build script output directory, and 3 linked paths to /build/nextest-archive-FXjMJA
  18. 57.73 s gammaloop-nextest-python-api> Extracted 18 files to /build/nextest-archive-FXjMJA in 0.09s
  19. 57.76 s gammaloop-nextest-python-api> ------------
  20. 57.76 s gammaloop-nextest-python-api> Nextest run ID 1ce1d4c4-a59d-4d86-b44c-3e05e146cbfe with nextest profile: ci_gammaloop
  21. 57.76 s gammaloop-nextest-python-api> Starting 5 tests across 1 binary
  22. 58.30 s gammaloop-nextest-python-api> FAIL [ 0.529s] (2/5) gammaloop-integration-tests::test_python_api python_evaluate_samples_batch_and_momentum_space_have_expected_shape
  23. 58.30 s gammaloop-nextest-python-api> stdout ---
  24. 58.30 s gammaloop-nextest-python-api>
  25. 58.30 s gammaloop-nextest-python-api> running 1 test
  26. 58.30 s gammaloop-nextest-python-api> test python_evaluate_samples_batch_and_momentum_space_have_expected_shape ... FAILED
  27. 58.30 s gammaloop-nextest-python-api>
  28. 58.30 s gammaloop-nextest-python-api> failures:
  29. 58.30 s gammaloop-nextest-python-api>
  30. 58.30 s gammaloop-nextest-python-api> failures:
  31. 58.30 s gammaloop-nextest-python-api> python_evaluate_samples_batch_and_momentum_space_have_expected_shape
  32. 58.30 s gammaloop-nextest-python-api>
  33. 58.30 s gammaloop-nextest-python-api> test result: FAILED. 0 passed; 1 failed; 0 ignored; 0 measured; 4 filtered out; finished in 0.51s
  34. 58.30 s gammaloop-nextest-python-api>
  35. 58.30 s gammaloop-nextest-python-api> stderr ---
  36. 58.30 s gammaloop-nextest-python-api> Error: Python API test subprocess failed.
  37. 58.30 s gammaloop-nextest-python-api> stdout:
  38. 58.30 s gammaloop-nextest-python-api> ┌────────────────────────────────────────────────────────┐
  39. 58.30 s gammaloop-nextest-python-api> │ You are running a restricted Symbolica instance. │
  40. 58.30 s gammaloop-nextest-python-api> │ │
  41. 58.30 s gammaloop-nextest-python-api> │ This mode is only permitted for non-commercial use and │
  42. 58.30 s gammaloop-nextest-python-api> │ is limited to one instance and core per machine. │
  43. 58.30 s gammaloop-nextest-python-api> │ │
  44. 58.30 s gammaloop-nextest-python-api> │ Hobbyists can easily acquire a free license key │
  45. 58.30 s gammaloop-nextest-python-api> │ that unlocks all cores and removes this banner: │
  46. 58.30 s gammaloop-nextest-python-api> │ │
  47. 58.30 s gammaloop-nextest-python-api> │ from symbolica import * │
  48. 58.30 s gammaloop-nextest-python-api> │ request_hobbyist_license('YOUR_NAME', 'YOUR_EMAIL') │
  49. 58.30 s gammaloop-nextest-python-api> │ │
  50. 58.30 s gammaloop-nextest-python-api> │ All other users can obtain a free 30-day trial key: │
  51. 58.30 s gammaloop-nextest-python-api> │ │
  52. 58.30 s gammaloop-nextest-python-api> │ from symbolica import * │
  53. 58.30 s gammaloop-nextest-python-api> │ request_trial_license('NAME', 'EMAIL', 'EMPLOYER') │
  54. 58.30 s gammaloop-nextest-python-api> │ │
  55. 58.30 s gammaloop-nextest-python-api> │ See https://symbolica.io/docs/get_started.html#license │
  56. 58.30 s gammaloop-nextest-python-api> └────────────────────────────────────────────────────────┘
  57. 58.30 s gammaloop-nextest-python-api> ┌───────────────────────────────────────────────────────────────────────────────────────────────────────────┐
  58. 58.30 s gammaloop-nextest-python-api> │ Cannot start new unlicensed Symbolica instance since there is already another one running on the machine. │
  59. 58.30 s gammaloop-nextest-python-api> └───────────────────────────────────────────────────────────────────────────────────────────────────────────┘
  60. 58.30 s gammaloop-nextest-python-api>
  61. 58.30 s gammaloop-nextest-python-api> stderr:
  62. 58.30 s gammaloop-nextest-python-api> ┌───────────────────────────────────┐
  63. 58.30 s gammaloop-nextest-python-api> │ The Symbolica license has expired │
  64. 58.30 s gammaloop-nextest-python-api> └───────────────────────────────────┘
  65. 58.30 s gammaloop-nextest-python-api>
  66. 58.30 s gammaloop-nextest-python-api>
  67. 58.30 s gammaloop-nextest-python-api> Location:
  68. 58.30 s gammaloop-nextest-python-api> tests/tests/test_python_api.rs:157:20
  69. 58.30 s gammaloop-nextest-python-api>
  70. 58.32 s gammaloop-nextest-python-api> FAIL [ 0.557s] (3/5) gammaloop-integration-tests::test_python_api python_evaluate_sample_honors_generate_events_and_observable_snapshots
  71. 58.32 s gammaloop-nextest-python-api> stdout ---
  72. 58.32 s gammaloop-nextest-python-api>
  73. 58.32 s gammaloop-nextest-python-api> running 1 test
  74. 58.32 s gammaloop-nextest-python-api> test python_evaluate_sample_honors_generate_events_and_observable_snapshots ... FAILED
  75. 58.32 s gammaloop-nextest-python-api>
  76. 58.32 s gammaloop-nextest-python-api> failures:
  77. 58.32 s gammaloop-nextest-python-api>
  78. 58.32 s gammaloop-nextest-python-api> failures:
  79. 58.32 s gammaloop-nextest-python-api> python_evaluate_sample_honors_generate_events_and_observable_snapshots
  80. 58.32 s gammaloop-nextest-python-api>
  81. 58.32 s gammaloop-nextest-python-api> test result: FAILED. 0 passed; 1 failed; 0 ignored; 0 measured; 4 filtered out; finished in 0.54s
  82. 58.32 s gammaloop-nextest-python-api>
  83. 58.32 s gammaloop-nextest-python-api> stderr ---
  84. 58.32 s gammaloop-nextest-python-api> Error: Python API test subprocess failed.
  85. 58.32 s gammaloop-nextest-python-api> stdout:
  86. 58.32 s gammaloop-nextest-python-api> ┌────────────────────────────────────────────────────────┐
  87. 58.32 s gammaloop-nextest-python-api> │ You are running a restricted Symbolica instance. │
  88. 58.32 s gammaloop-nextest-python-api> │ │
  89. 58.32 s gammaloop-nextest-python-api> │ This mode is only permitted for non-commercial use and │
  90. 58.32 s gammaloop-nextest-python-api> │ is limited to one instance and core per machine. │
  91. 58.32 s gammaloop-nextest-python-api> │ │
  92. 58.32 s gammaloop-nextest-python-api> │ Hobbyists can easily acquire a free license key │
  93. 58.32 s gammaloop-nextest-python-api> │ that unlocks all cores and removes this banner: │
  94. 58.32 s gammaloop-nextest-python-api> │ │
  95. 58.32 s gammaloop-nextest-python-api> │ from symbolica import * │
  96. 58.32 s gammaloop-nextest-python-api> │ request_hobbyist_license('YOUR_NAME', 'YOUR_EMAIL') │
  97. 58.32 s gammaloop-nextest-python-api> │ │
  98. 58.32 s gammaloop-nextest-python-api> │ All other users can obtain a free 30-day trial key: │
  99. 58.32 s gammaloop-nextest-python-api> │ │
  100. 58.32 s gammaloop-nextest-python-api> │ from symbolica import * │
  101. 58.32 s gammaloop-nextest-python-api> │ request_trial_license('NAME', 'EMAIL', 'EMPLOYER') │
  102. 58.32 s gammaloop-nextest-python-api> │ │
  103. 58.32 s gammaloop-nextest-python-api> │ See https://symbolica.io/docs/get_started.html#license │
  104. 58.32 s gammaloop-nextest-python-api> └────────────────────────────────────────────────────────┘
  105. 58.32 s gammaloop-nextest-python-api> ┌───────────────────────────────────────────────────────────────────────────────────────────────────────────┐
  106. 58.32 s gammaloop-nextest-python-api> │ Cannot start new unlicensed Symbolica instance since there is already another one running on the machine. │
  107. 58.32 s gammaloop-nextest-python-api> └───────────────────────────────────────────────────────────────────────────────────────────────────────────┘
  108. 58.32 s gammaloop-nextest-python-api>
  109. 58.32 s gammaloop-nextest-python-api> stderr:
  110. 58.32 s gammaloop-nextest-python-api> ┌───────────────────────────────────┐
  111. 58.32 s gammaloop-nextest-python-api> │ The Symbolica license has expired │
  112. 58.32 s gammaloop-nextest-python-api> └───────────────────────────────────┘
  113. 58.32 s gammaloop-nextest-python-api>
  114. 58.32 s gammaloop-nextest-python-api>
  115. 58.32 s gammaloop-nextest-python-api> Location:
  116. 58.32 s gammaloop-nextest-python-api> tests/tests/test_python_api.rs:157:20
  117. 58.32 s gammaloop-nextest-python-api>
  118. 58.33 s gammaloop-nextest-python-api> FAIL [ 0.561s] (4/5) gammaloop-integration-tests::test_python_api python_evaluate_sample_preserves_graph_grouping_and_incoming_pdgs
  119. 58.33 s gammaloop-nextest-python-api> stdout ---
  120. 58.33 s gammaloop-nextest-python-api>
  121. 58.33 s gammaloop-nextest-python-api> running 1 test
  122. 58.33 s gammaloop-nextest-python-api> test python_evaluate_sample_preserves_graph_grouping_and_incoming_pdgs ... FAILED
  123. 58.33 s gammaloop-nextest-python-api>
  124. 58.33 s gammaloop-nextest-python-api> failures:
  125. 58.33 s gammaloop-nextest-python-api>
  126. 58.33 s gammaloop-nextest-python-api> failures:
  127. 58.33 s gammaloop-nextest-python-api> python_evaluate_sample_preserves_graph_grouping_and_incoming_pdgs
  128. 58.33 s gammaloop-nextest-python-api>
  129. 58.33 s gammaloop-nextest-python-api> test result: FAILED. 0 passed; 1 failed; 0 ignored; 0 measured; 4 filtered out; finished in 0.54s
  130. 58.33 s gammaloop-nextest-python-api>
  131. 58.33 s gammaloop-nextest-python-api> stderr ---
  132. 58.33 s gammaloop-nextest-python-api> Error: Python API test subprocess failed.
  133. 58.33 s gammaloop-nextest-python-api> stdout:
  134. 58.33 s gammaloop-nextest-python-api> ┌────────────────────────────────────────────────────────┐
  135. 58.33 s gammaloop-nextest-python-api> │ You are running a restricted Symbolica instance. │
  136. 58.33 s gammaloop-nextest-python-api> │ │
  137. 58.33 s gammaloop-nextest-python-api> │ This mode is only permitted for non-commercial use and │
  138. 58.33 s gammaloop-nextest-python-api> │ is limited to one instance and core per machine. │
  139. 58.33 s gammaloop-nextest-python-api> │ │
  140. 58.33 s gammaloop-nextest-python-api> │ Hobbyists can easily acquire a free license key │
  141. 58.33 s gammaloop-nextest-python-api> │ that unlocks all cores and removes this banner: │
  142. 58.33 s gammaloop-nextest-python-api> │ │
  143. 58.33 s gammaloop-nextest-python-api> │ from symbolica import * │
  144. 58.33 s gammaloop-nextest-python-api> │ request_hobbyist_license('YOUR_NAME', 'YOUR_EMAIL') │
  145. 58.33 s gammaloop-nextest-python-api> │ │
  146. 58.33 s gammaloop-nextest-python-api> │ All other users can obtain a free 30-day trial key: │
  147. 58.33 s gammaloop-nextest-python-api> │ │
  148. 58.33 s gammaloop-nextest-python-api> │ from symbolica import * │
  149. 58.33 s gammaloop-nextest-python-api> │ request_trial_license('NAME', 'EMAIL', 'EMPLOYER') │
  150. 58.33 s gammaloop-nextest-python-api> │ │
  151. 58.33 s gammaloop-nextest-python-api> │ See https://symbolica.io/docs/get_started.html#license │
  152. 58.33 s gammaloop-nextest-python-api> └────────────────────────────────────────────────────────┘
  153. 58.33 s gammaloop-nextest-python-api> ┌───────────────────────────────────────────────────────────────────────────────────────────────────────────┐
  154. 58.33 s gammaloop-nextest-python-api> │ Cannot start new unlicensed Symbolica instance since there is already another one running on the machine. │
  155. 58.33 s gammaloop-nextest-python-api> └───────────────────────────────────────────────────────────────────────────────────────────────────────────┘
  156. 58.33 s gammaloop-nextest-python-api>
  157. 58.33 s gammaloop-nextest-python-api> stderr:
  158. 58.33 s gammaloop-nextest-python-api> ┌───────────────────────────────────┐
  159. 58.33 s gammaloop-nextest-python-api> │ The Symbolica license has expired │
  160. 58.33 s gammaloop-nextest-python-api> └───────────────────────────────────┘
  161. 58.33 s gammaloop-nextest-python-api>
  162. 58.33 s gammaloop-nextest-python-api>
  163. 58.33 s gammaloop-nextest-python-api> Location:
  164. 58.33 s gammaloop-nextest-python-api> tests/tests/test_python_api.rs:157:20
  165. 58.33 s gammaloop-nextest-python-api>
  166. 58.71 s gammaloop-nextest-python-api> ------------
  167. 58.71 s gammaloop-nextest-python-api> Summary [ 0.944s] 5 tests run: 2 passed, 3 failed, 0 skipped
  168. 58.71 s gammaloop-nextest-python-api> FAIL [ 0.529s] (2/5) gammaloop-integration-tests::test_python_api python_evaluate_samples_batch_and_momentum_space_have_expected_shape
  169. 58.71 s gammaloop-nextest-python-api> stdout ---
  170. 58.71 s gammaloop-nextest-python-api>
  171. 58.71 s gammaloop-nextest-python-api> running 1 test
  172. 58.71 s gammaloop-nextest-python-api> test python_evaluate_samples_batch_and_momentum_space_have_expected_shape ... FAILED
  173. 58.71 s gammaloop-nextest-python-api>
  174. 58.71 s gammaloop-nextest-python-api> failures:
  175. 58.71 s gammaloop-nextest-python-api>
  176. 58.71 s gammaloop-nextest-python-api> failures:
  177. 58.71 s gammaloop-nextest-python-api> python_evaluate_samples_batch_and_momentum_space_have_expected_shape
  178. 58.71 s gammaloop-nextest-python-api>
  179. 58.71 s gammaloop-nextest-python-api> test result: FAILED. 0 passed; 1 failed; 0 ignored; 0 measured; 4 filtered out; finished in 0.51s
  180. 58.71 s gammaloop-nextest-python-api>
  181. 58.71 s gammaloop-nextest-python-api> stderr ---
  182. 58.71 s gammaloop-nextest-python-api> Error: Python API test subprocess failed.
  183. 58.71 s gammaloop-nextest-python-api> stdout:
  184. 58.71 s gammaloop-nextest-python-api> ┌────────────────────────────────────────────────────────┐
  185. 58.71 s gammaloop-nextest-python-api> │ You are running a restricted Symbolica instance. │
  186. 58.71 s gammaloop-nextest-python-api> │ │
  187. 58.71 s gammaloop-nextest-python-api> │ This mode is only permitted for non-commercial use and │
  188. 58.71 s gammaloop-nextest-python-api> │ is limited to one instance and core per machine. │
  189. 58.71 s gammaloop-nextest-python-api> │ │
  190. 58.71 s gammaloop-nextest-python-api> │ Hobbyists can easily acquire a free license key │
  191. 58.71 s gammaloop-nextest-python-api> │ that unlocks all cores and removes this banner: │
  192. 58.71 s gammaloop-nextest-python-api> │ │
  193. 58.71 s gammaloop-nextest-python-api> │ from symbolica import * │
  194. 58.71 s gammaloop-nextest-python-api> │ request_hobbyist_license('YOUR_NAME', 'YOUR_EMAIL') │
  195. 58.71 s gammaloop-nextest-python-api> │ │
  196. 58.71 s gammaloop-nextest-python-api> │ All other users can obtain a free 30-day trial key: │
  197. 58.71 s gammaloop-nextest-python-api> │ │
  198. 58.71 s gammaloop-nextest-python-api> │ from symbolica import * │
  199. 58.71 s gammaloop-nextest-python-api> │ request_trial_license('NAME', 'EMAIL', 'EMPLOYER') │
  200. 58.71 s gammaloop-nextest-python-api> │ │
  201. 58.71 s gammaloop-nextest-python-api> │ See https://symbolica.io/docs/get_started.html#license │
  202. 58.71 s gammaloop-nextest-python-api> └────────────────────────────────────────────────────────┘
  203. 58.71 s gammaloop-nextest-python-api> ┌───────────────────────────────────────────────────────────────────────────────────────────────────────────┐
  204. 58.71 s gammaloop-nextest-python-api> │ Cannot start new unlicensed Symbolica instance since there is already another one running on the machine. │
  205. 58.71 s gammaloop-nextest-python-api> └───────────────────────────────────────────────────────────────────────────────────────────────────────────┘
  206. 58.71 s gammaloop-nextest-python-api>
  207. 58.71 s gammaloop-nextest-python-api> stderr:
  208. 58.71 s gammaloop-nextest-python-api> ┌───────────────────────────────────┐
  209. 58.71 s gammaloop-nextest-python-api> │ The Symbolica license has expired │
  210. 58.71 s gammaloop-nextest-python-api> └───────────────────────────────────┘
  211. 58.71 s gammaloop-nextest-python-api>
  212. 58.71 s gammaloop-nextest-python-api>
  213. 58.71 s gammaloop-nextest-python-api> Location:
  214. 58.71 s gammaloop-nextest-python-api> tests/tests/test_python_api.rs:157:20
  215. 58.71 s gammaloop-nextest-python-api>
  216. 58.71 s gammaloop-nextest-python-api> FAIL [ 0.557s] (3/5) gammaloop-integration-tests::test_python_api python_evaluate_sample_honors_generate_events_and_observable_snapshots
  217. 58.71 s gammaloop-nextest-python-api> stdout ---
  218. 58.71 s gammaloop-nextest-python-api>
  219. 58.71 s gammaloop-nextest-python-api> running 1 test
  220. 58.71 s gammaloop-nextest-python-api> test python_evaluate_sample_honors_generate_events_and_observable_snapshots ... FAILED
  221. 58.71 s gammaloop-nextest-python-api>
  222. 58.71 s gammaloop-nextest-python-api> failures:
  223. 58.71 s gammaloop-nextest-python-api>
  224. 58.71 s gammaloop-nextest-python-api> failures:
  225. 58.71 s gammaloop-nextest-python-api> python_evaluate_sample_honors_generate_events_and_observable_snapshots
  226. 58.71 s gammaloop-nextest-python-api>
  227. 58.71 s gammaloop-nextest-python-api> test result: FAILED. 0 passed; 1 failed; 0 ignored; 0 measured; 4 filtered out; finished in 0.54s
  228. 58.71 s gammaloop-nextest-python-api>
  229. 58.71 s gammaloop-nextest-python-api> stderr ---
  230. 58.71 s gammaloop-nextest-python-api> Error: Python API test subprocess failed.
  231. 58.71 s gammaloop-nextest-python-api> stdout:
  232. 58.71 s gammaloop-nextest-python-api> ┌────────────────────────────────────────────────────────┐
  233. 58.71 s gammaloop-nextest-python-api> │ You are running a restricted Symbolica instance. │
  234. 58.71 s gammaloop-nextest-python-api> │ │
  235. 58.71 s gammaloop-nextest-python-api> │ This mode is only permitted for non-commercial use and │
  236. 58.71 s gammaloop-nextest-python-api> │ is limited to one instance and core per machine. │
  237. 58.71 s gammaloop-nextest-python-api> │ │
  238. 58.71 s gammaloop-nextest-python-api> │ Hobbyists can easily acquire a free license key │
  239. 58.71 s gammaloop-nextest-python-api> │ that unlocks all cores and removes this banner: │
  240. 58.71 s gammaloop-nextest-python-api> │ │
  241. 58.71 s gammaloop-nextest-python-api> │ from symbolica import * │
  242. 58.71 s gammaloop-nextest-python-api> │ request_hobbyist_license('YOUR_NAME', 'YOUR_EMAIL') │
  243. 58.71 s gammaloop-nextest-python-api> │ │
  244. 58.71 s gammaloop-nextest-python-api> │ All other users can obtain a free 30-day trial key: │
  245. 58.71 s gammaloop-nextest-python-api> │ │
  246. 58.71 s gammaloop-nextest-python-api> │ from symbolica import * │
  247. 58.71 s gammaloop-nextest-python-api> │ request_trial_license('NAME', 'EMAIL', 'EMPLOYER') │
  248. 58.71 s gammaloop-nextest-python-api> │ │
  249. 58.71 s gammaloop-nextest-python-api> │ See https://symbolica.io/docs/get_started.html#license │
  250. 58.71 s gammaloop-nextest-python-api> └────────────────────────────────────────────────────────┘
  251. 58.71 s gammaloop-nextest-python-api> ┌───────────────────────────────────────────────────────────────────────────────────────────────────────────┐
  252. 58.71 s gammaloop-nextest-python-api> │ Cannot start new unlicensed Symbolica instance since there is already another one running on the machine. │
  253. 58.71 s gammaloop-nextest-python-api> └───────────────────────────────────────────────────────────────────────────────────────────────────────────┘
  254. 58.71 s gammaloop-nextest-python-api>
  255. 58.71 s gammaloop-nextest-python-api> stderr:
  256. 58.71 s gammaloop-nextest-python-api> ┌───────────────────────────────────┐
  257. 58.71 s gammaloop-nextest-python-api> │ The Symbolica license has expired │
  258. 58.71 s gammaloop-nextest-python-api> └───────────────────────────────────┘
  259. 58.71 s gammaloop-nextest-python-api>
  260. 58.71 s gammaloop-nextest-python-api>
  261. 58.71 s gammaloop-nextest-python-api> Location:
  262. 58.71 s gammaloop-nextest-python-api> tests/tests/test_python_api.rs:157:20
  263. 58.71 s gammaloop-nextest-python-api>
  264. 58.71 s gammaloop-nextest-python-api> FAIL [ 0.561s] (4/5) gammaloop-integration-tests::test_python_api python_evaluate_sample_preserves_graph_grouping_and_incoming_pdgs
  265. 58.71 s gammaloop-nextest-python-api> stdout ---
  266. 58.71 s gammaloop-nextest-python-api>
  267. 58.71 s gammaloop-nextest-python-api> running 1 test
  268. 58.71 s gammaloop-nextest-python-api> test python_evaluate_sample_preserves_graph_grouping_and_incoming_pdgs ... FAILED
  269. 58.71 s gammaloop-nextest-python-api>
  270. 58.71 s gammaloop-nextest-python-api> failures:
  271. 58.71 s gammaloop-nextest-python-api>
  272. 58.71 s gammaloop-nextest-python-api> failures:
  273. 58.71 s gammaloop-nextest-python-api> python_evaluate_sample_preserves_graph_grouping_and_incoming_pdgs
  274. 58.71 s gammaloop-nextest-python-api>
  275. 58.71 s gammaloop-nextest-python-api> test result: FAILED. 0 passed; 1 failed; 0 ignored; 0 measured; 4 filtered out; finished in 0.54s
  276. 58.71 s gammaloop-nextest-python-api>
  277. 58.71 s gammaloop-nextest-python-api> stderr ---
  278. 58.71 s gammaloop-nextest-python-api> Error: Python API test subprocess failed.
  279. 58.71 s gammaloop-nextest-python-api> stdout:
  280. 58.71 s gammaloop-nextest-python-api> ┌────────────────────────────────────────────────────────┐
  281. 58.71 s gammaloop-nextest-python-api> │ You are running a restricted Symbolica instance. │
  282. 58.71 s gammaloop-nextest-python-api> │ │
  283. 58.71 s gammaloop-nextest-python-api> │ This mode is only permitted for non-commercial use and │
  284. 58.71 s gammaloop-nextest-python-api> │ is limited to one instance and core per machine. │
  285. 58.71 s gammaloop-nextest-python-api> │ │
  286. 58.71 s gammaloop-nextest-python-api> │ Hobbyists can easily acquire a free license key │
  287. 58.71 s gammaloop-nextest-python-api> │ that unlocks all cores and removes this banner: │
  288. 58.71 s gammaloop-nextest-python-api> │ │
  289. 58.71 s gammaloop-nextest-python-api> │ from symbolica import * │
  290. 58.71 s gammaloop-nextest-python-api> │ request_hobbyist_license('YOUR_NAME', 'YOUR_EMAIL') │
  291. 58.71 s gammaloop-nextest-python-api> │ │
  292. 58.71 s gammaloop-nextest-python-api> │ All other users can obtain a free 30-day trial key: │
  293. 58.71 s gammaloop-nextest-python-api> │ │
  294. 58.71 s gammaloop-nextest-python-api> │ from symbolica import * │
  295. 58.71 s gammaloop-nextest-python-api> │ request_trial_license('NAME', 'EMAIL', 'EMPLOYER') │
  296. 58.71 s gammaloop-nextest-python-api> │ │
  297. 58.71 s gammaloop-nextest-python-api> │ See https://symbolica.io/docs/get_started.html#license │
  298. 58.71 s gammaloop-nextest-python-api> └────────────────────────────────────────────────────────┘
  299. 58.71 s gammaloop-nextest-python-api> ┌───────────────────────────────────────────────────────────────────────────────────────────────────────────┐
  300. 58.71 s gammaloop-nextest-python-api> │ Cannot start new unlicensed Symbolica instance since there is already another one running on the machine. │
  301. 58.71 s gammaloop-nextest-python-api> └───────────────────────────────────────────────────────────────────────────────────────────────────────────┘
  302. 58.71 s gammaloop-nextest-python-api>
  303. 58.71 s gammaloop-nextest-python-api> stderr:
  304. 58.71 s gammaloop-nextest-python-api> ┌───────────────────────────────────┐
  305. 58.71 s gammaloop-nextest-python-api> │ The Symbolica license has expired │
  306. 58.71 s gammaloop-nextest-python-api> └───────────────────────────────────┘
  307. 58.71 s gammaloop-nextest-python-api>
  308. 58.71 s gammaloop-nextest-python-api>
  309. 58.71 s gammaloop-nextest-python-api> Location:
  310. 58.71 s gammaloop-nextest-python-api> tests/tests/test_python_api.rs:157:20
  311. 58.71 s gammaloop-nextest-python-api>
  312. 58.74 s gammaloop-nextest-python-api> error: test run failed
  313. 58.78 s gammaloop-nextest-python-api>
  314. 58.78 s gammaloop-nextest-python-api> ========== nextest test summary ==========
  315. 58.78 s gammaloop-nextest-python-api> report: target/nextest/ci_gammaloop/junit.xml
  316. 58.78 s gammaloop-nextest-python-api> tests: 5, failures: 3, errors: 0
  317. 58.78 s gammaloop-nextest-python-api>
  318. 58.78 s gammaloop-nextest-python-api> 1. gammaloop-integration-tests::test_python_api::python_evaluate_samples_batch_and_momentum_space_have_expected_shape
  319. 58.78 s gammaloop-nextest-python-api> failure: test failure with exit code 101
  320. 58.78 s gammaloop-nextest-python-api> Error: Python API test subprocess failed.
  321. 58.78 s gammaloop-nextest-python-api> stdout:
  322. 58.78 s gammaloop-nextest-python-api> ┌────────────────────────────────────────────────────────┐
  323. 58.78 s gammaloop-nextest-python-api> │ You are running a restricted Symbolica instance. │
  324. 58.78 s gammaloop-nextest-python-api> │ │
  325. 58.78 s gammaloop-nextest-python-api> │ This mode is only permitted for non-commercial use and │
  326. 58.78 s gammaloop-nextest-python-api> │ is limited to one instance and core per machine. │
  327. 58.78 s gammaloop-nextest-python-api> │ │
  328. 58.78 s gammaloop-nextest-python-api> │ Hobbyists can easily acquire a free license key │
  329. 58.78 s gammaloop-nextest-python-api> │ that unlocks all cores and removes this banner: │
  330. 58.78 s gammaloop-nextest-python-api> │ │
  331. 58.78 s gammaloop-nextest-python-api> │ from symbolica import * │
  332. 58.78 s gammaloop-nextest-python-api> │ request_hobbyist_license('YOUR_NAME', 'YOUR_EMAIL') │
  333. 58.78 s gammaloop-nextest-python-api> │ │
  334. 58.78 s gammaloop-nextest-python-api> │ All other users can obtain a free 30-day trial key: │
  335. 58.78 s gammaloop-nextest-python-api> │ │
  336. 58.78 s gammaloop-nextest-python-api> │ from symbolica import * │
  337. 58.78 s gammaloop-nextest-python-api> │ request_trial_license('NAME', 'EMAIL', 'EMPLOYER') │
  338. 58.78 s gammaloop-nextest-python-api> │ │
  339. 58.78 s gammaloop-nextest-python-api> │ See https://symbolica.io/docs/get_started.html#license │
  340. 58.78 s gammaloop-nextest-python-api> └────────────────────────────────────────────────────────┘
  341. 58.78 s gammaloop-nextest-python-api> ┌───────────────────────────────────────────────────────────────────────────────────────────────────────────┐
  342. 58.78 s gammaloop-nextest-python-api> │ Cannot start new unlicensed Symbolica instance since there is already another one running on the machine. │
  343. 58.78 s gammaloop-nextest-python-api> └───────────────────────────────────────────────────────────────────────────────────────────────────────────┘
  344. 58.78 s gammaloop-nextest-python-api>
  345. 58.78 s gammaloop-nextest-python-api> stderr:
  346. 58.78 s gammaloop-nextest-python-api> ┌───────────────────────────────────┐
  347. 58.78 s gammaloop-nextest-python-api> │ The Symbolica license has expired │
  348. 58.78 s gammaloop-nextest-python-api> └───────────────────────────────────┘
  349. 58.78 s gammaloop-nextest-python-api>
  350. 58.78 s gammaloop-nextest-python-api>
  351. 58.78 s gammaloop-nextest-python-api> Location:
  352. 58.78 s gammaloop-nextest-python-api> tests/tests/test_python_api.rs:157:20
  353. 58.78 s gammaloop-nextest-python-api> system-out
  354. 58.78 s gammaloop-nextest-python-api> running 1 test
  355. 58.78 s gammaloop-nextest-python-api> test python_evaluate_samples_batch_and_momentum_space_have_expected_shape ... FAILED
  356. 58.78 s gammaloop-nextest-python-api>
  357. 58.78 s gammaloop-nextest-python-api> failures:
  358. 58.78 s gammaloop-nextest-python-api>
  359. 58.78 s gammaloop-nextest-python-api> failures:
  360. 58.78 s gammaloop-nextest-python-api> python_evaluate_samples_batch_and_momentum_space_have_expected_shape
  361. 58.78 s gammaloop-nextest-python-api>
  362. 58.78 s gammaloop-nextest-python-api> test result: FAILED. 0 passed; 1 failed; 0 ignored; 0 measured; 4 filtered out; finished in 0.51s
  363. 58.78 s gammaloop-nextest-python-api> system-err
  364. 58.78 s gammaloop-nextest-python-api> Error: Python API test subprocess failed.
  365. 58.78 s gammaloop-nextest-python-api> stdout:
  366. 58.78 s gammaloop-nextest-python-api> ┌────────────────────────────────────────────────────────┐
  367. 58.78 s gammaloop-nextest-python-api> │ You are running a restricted Symbolica instance. │
  368. 58.78 s gammaloop-nextest-python-api> │ │
  369. 58.78 s gammaloop-nextest-python-api> │ This mode is only permitted for non-commercial use and │
  370. 58.78 s gammaloop-nextest-python-api> │ is limited to one instance and core per machine. │
  371. 58.78 s gammaloop-nextest-python-api> │ │
  372. 58.78 s gammaloop-nextest-python-api> │ Hobbyists can easily acquire a free license key │
  373. 58.78 s gammaloop-nextest-python-api> │ that unlocks all cores and removes this banner: │
  374. 58.78 s gammaloop-nextest-python-api> │ │
  375. 58.78 s gammaloop-nextest-python-api> │ from symbolica import * │
  376. 58.78 s gammaloop-nextest-python-api> │ request_hobbyist_license('YOUR_NAME', 'YOUR_EMAIL') │
  377. 58.78 s gammaloop-nextest-python-api> │ │
  378. 58.78 s gammaloop-nextest-python-api> │ All other users can obtain a free 30-day trial key: │
  379. 58.78 s gammaloop-nextest-python-api> │ │
  380. 58.78 s gammaloop-nextest-python-api> │ from symbolica import * │
  381. 58.78 s gammaloop-nextest-python-api> │ request_trial_license('NAME', 'EMAIL', 'EMPLOYER') │
  382. 58.78 s gammaloop-nextest-python-api> │ │
  383. 58.78 s gammaloop-nextest-python-api> │ See https://symbolica.io/docs/get_started.html#license │
  384. 58.78 s gammaloop-nextest-python-api> └────────────────────────────────────────────────────────┘
  385. 58.78 s gammaloop-nextest-python-api> ┌───────────────────────────────────────────────────────────────────────────────────────────────────────────┐
  386. 58.78 s gammaloop-nextest-python-api> │ Cannot start new unlicensed Symbolica instance since there is already another one running on the machine. │
  387. 58.78 s gammaloop-nextest-python-api> └───────────────────────────────────────────────────────────────────────────────────────────────────────────┘
  388. 58.78 s gammaloop-nextest-python-api>
  389. 58.78 s gammaloop-nextest-python-api> stderr:
  390. 58.78 s gammaloop-nextest-python-api> ┌───────────────────────────────────┐
  391. 58.78 s gammaloop-nextest-python-api> │ The Symbolica license has expired │
  392. 58.78 s gammaloop-nextest-python-api> └───────────────────────────────────┘
  393. 58.78 s gammaloop-nextest-python-api>
  394. 58.78 s gammaloop-nextest-python-api>
  395. 58.78 s gammaloop-nextest-python-api> Location:
  396. 58.78 s gammaloop-nextest-python-api> tests/tests/test_python_api.rs:157:20
  397. 58.78 s gammaloop-nextest-python-api>
  398. 58.78 s gammaloop-nextest-python-api> 2. gammaloop-integration-tests::test_python_api::python_evaluate_sample_honors_generate_events_and_observable_snapshots
  399. 58.78 s gammaloop-nextest-python-api> failure: test failure with exit code 101
  400. 58.78 s gammaloop-nextest-python-api> Error: Python API test subprocess failed.
  401. 58.78 s gammaloop-nextest-python-api> stdout:
  402. 58.78 s gammaloop-nextest-python-api> ┌────────────────────────────────────────────────────────┐
  403. 58.78 s gammaloop-nextest-python-api> │ You are running a restricted Symbolica instance. │
  404. 58.78 s gammaloop-nextest-python-api> │ │
  405. 58.78 s gammaloop-nextest-python-api> │ This mode is only permitted for non-commercial use and │
  406. 58.78 s gammaloop-nextest-python-api> │ is limited to one instance and core per machine. │
  407. 58.78 s gammaloop-nextest-python-api> │ │
  408. 58.78 s gammaloop-nextest-python-api> │ Hobbyists can easily acquire a free license key │
  409. 58.78 s gammaloop-nextest-python-api> │ that unlocks all cores and removes this banner: │
  410. 58.78 s gammaloop-nextest-python-api> │ │
  411. 58.78 s gammaloop-nextest-python-api> │ from symbolica import * │
  412. 58.78 s gammaloop-nextest-python-api> │ request_hobbyist_license('YOUR_NAME', 'YOUR_EMAIL') │
  413. 58.78 s gammaloop-nextest-python-api> │ │
  414. 58.78 s gammaloop-nextest-python-api> │ All other users can obtain a free 30-day trial key: │
  415. 58.78 s gammaloop-nextest-python-api> │ │
  416. 58.78 s gammaloop-nextest-python-api> │ from symbolica import * │
  417. 58.78 s gammaloop-nextest-python-api> │ request_trial_license('NAME', 'EMAIL', 'EMPLOYER') │
  418. 58.78 s gammaloop-nextest-python-api> │ │
  419. 58.78 s gammaloop-nextest-python-api> │ See https://symbolica.io/docs/get_started.html#license │
  420. 58.78 s gammaloop-nextest-python-api> └────────────────────────────────────────────────────────┘
  421. 58.78 s gammaloop-nextest-python-api> ┌───────────────────────────────────────────────────────────────────────────────────────────────────────────┐
  422. 58.78 s gammaloop-nextest-python-api> │ Cannot start new unlicensed Symbolica instance since there is already another one running on the machine. │
  423. 58.78 s gammaloop-nextest-python-api> └───────────────────────────────────────────────────────────────────────────────────────────────────────────┘
  424. 58.78 s gammaloop-nextest-python-api>
  425. 58.78 s gammaloop-nextest-python-api> stderr:
  426. 58.78 s gammaloop-nextest-python-api> ┌───────────────────────────────────┐
  427. 58.78 s gammaloop-nextest-python-api> │ The Symbolica license has expired │
  428. 58.78 s gammaloop-nextest-python-api> └───────────────────────────────────┘
  429. 58.78 s gammaloop-nextest-python-api>
  430. 58.78 s gammaloop-nextest-python-api>
  431. 58.78 s gammaloop-nextest-python-api> Location:
  432. 58.78 s gammaloop-nextest-python-api> tests/tests/test_python_api.rs:157:20
  433. 58.78 s gammaloop-nextest-python-api> system-out
  434. 58.78 s gammaloop-nextest-python-api> running 1 test
  435. 58.78 s gammaloop-nextest-python-api> test python_evaluate_sample_honors_generate_events_and_observable_snapshots ... FAILED
  436. 58.78 s gammaloop-nextest-python-api>
  437. 58.78 s gammaloop-nextest-python-api> failures:
  438. 58.78 s gammaloop-nextest-python-api>
  439. 58.78 s gammaloop-nextest-python-api> failures:
  440. 58.78 s gammaloop-nextest-python-api> python_evaluate_sample_honors_generate_events_and_observable_snapshots
  441. 58.78 s gammaloop-nextest-python-api>
  442. 58.78 s gammaloop-nextest-python-api> test result: FAILED. 0 passed; 1 failed; 0 ignored; 0 measured; 4 filtered out; finished in 0.54s
  443. 58.78 s gammaloop-nextest-python-api> system-err
  444. 58.78 s gammaloop-nextest-python-api> Error: Python API test subprocess failed.
  445. 58.78 s gammaloop-nextest-python-api> stdout:
  446. 58.78 s gammaloop-nextest-python-api> ┌────────────────────────────────────────────────────────┐
  447. 58.78 s gammaloop-nextest-python-api> │ You are running a restricted Symbolica instance. │
  448. 58.78 s gammaloop-nextest-python-api> │ │
  449. 58.78 s gammaloop-nextest-python-api> │ This mode is only permitted for non-commercial use and │
  450. 58.78 s gammaloop-nextest-python-api> │ is limited to one instance and core per machine. │
  451. 58.78 s gammaloop-nextest-python-api> │ │
  452. 58.78 s gammaloop-nextest-python-api> │ Hobbyists can easily acquire a free license key │
  453. 58.78 s gammaloop-nextest-python-api> │ that unlocks all cores and removes this banner: │
  454. 58.78 s gammaloop-nextest-python-api> │ │
  455. 58.78 s gammaloop-nextest-python-api> │ from symbolica import * │
  456. 58.78 s gammaloop-nextest-python-api> │ request_hobbyist_license('YOUR_NAME', 'YOUR_EMAIL') │
  457. 58.78 s gammaloop-nextest-python-api> │ │
  458. 58.78 s gammaloop-nextest-python-api> │ All other users can obtain a free 30-day trial key: │
  459. 58.78 s gammaloop-nextest-python-api> │ │
  460. 58.78 s gammaloop-nextest-python-api> │ from symbolica import * │
  461. 58.78 s gammaloop-nextest-python-api> │ request_trial_license('NAME', 'EMAIL', 'EMPLOYER') │
  462. 58.78 s gammaloop-nextest-python-api> │ │
  463. 58.78 s gammaloop-nextest-python-api> │ See https://symbolica.io/docs/get_started.html#license │
  464. 58.78 s gammaloop-nextest-python-api> └────────────────────────────────────────────────────────┘
  465. 58.78 s gammaloop-nextest-python-api> ┌───────────────────────────────────────────────────────────────────────────────────────────────────────────┐
  466. 58.78 s gammaloop-nextest-python-api> │ Cannot start new unlicensed Symbolica instance since there is already another one running on the machine. │
  467. 58.78 s gammaloop-nextest-python-api> └───────────────────────────────────────────────────────────────────────────────────────────────────────────┘
  468. 58.78 s gammaloop-nextest-python-api>
  469. 58.78 s gammaloop-nextest-python-api> stderr:
  470. 58.78 s gammaloop-nextest-python-api> ┌───────────────────────────────────┐
  471. 58.78 s gammaloop-nextest-python-api> │ The Symbolica license has expired │
  472. 58.78 s gammaloop-nextest-python-api> └───────────────────────────────────┘
  473. 58.78 s gammaloop-nextest-python-api>
  474. 58.78 s gammaloop-nextest-python-api>
  475. 58.78 s gammaloop-nextest-python-api> Location:
  476. 58.78 s gammaloop-nextest-python-api> tests/tests/test_python_api.rs:157:20
  477. 58.78 s gammaloop-nextest-python-api>
  478. 58.78 s gammaloop-nextest-python-api> 3. gammaloop-integration-tests::test_python_api::python_evaluate_sample_preserves_graph_grouping_and_incoming_pdgs
  479. 58.78 s gammaloop-nextest-python-api> failure: test failure with exit code 101
  480. 58.78 s gammaloop-nextest-python-api> Error: Python API test subprocess failed.
  481. 58.78 s gammaloop-nextest-python-api> stdout:
  482. 58.78 s gammaloop-nextest-python-api> ┌────────────────────────────────────────────────────────┐
  483. 58.78 s gammaloop-nextest-python-api> │ You are running a restricted Symbolica instance. │
  484. 58.78 s gammaloop-nextest-python-api> │ │
  485. 58.78 s gammaloop-nextest-python-api> │ This mode is only permitted for non-commercial use and │
  486. 58.78 s gammaloop-nextest-python-api> │ is limited to one instance and core per machine. │
  487. 58.78 s gammaloop-nextest-python-api> │ │
  488. 58.78 s gammaloop-nextest-python-api> │ Hobbyists can easily acquire a free license key │
  489. 58.78 s gammaloop-nextest-python-api> │ that unlocks all cores and removes this banner: │
  490. 58.78 s gammaloop-nextest-python-api> │ │
  491. 58.78 s gammaloop-nextest-python-api> │ from symbolica import * │
  492. 58.78 s gammaloop-nextest-python-api> │ request_hobbyist_license('YOUR_NAME', 'YOUR_EMAIL') │
  493. 58.78 s gammaloop-nextest-python-api> │ │
  494. 58.78 s gammaloop-nextest-python-api> │ All other users can obtain a free 30-day trial key: │
  495. 58.78 s gammaloop-nextest-python-api> │ │
  496. 58.78 s gammaloop-nextest-python-api> │ from symbolica import * │
  497. 58.78 s gammaloop-nextest-python-api> │ request_trial_license('NAME', 'EMAIL', 'EMPLOYER') │
  498. 58.78 s gammaloop-nextest-python-api> │ │
  499. 58.78 s gammaloop-nextest-python-api> │ See https://symbolica.io/docs/get_started.html#license │
  500. 58.78 s gammaloop-nextest-python-api> └────────────────────────────────────────────────────────┘
  501. 58.78 s gammaloop-nextest-python-api> ┌───────────────────────────────────────────────────────────────────────────────────────────────────────────┐
  502. 58.78 s gammaloop-nextest-python-api> │ Cannot start new unlicensed Symbolica instance since there is already another one running on the machine. │
  503. 58.78 s gammaloop-nextest-python-api> └───────────────────────────────────────────────────────────────────────────────────────────────────────────┘
  504. 58.78 s gammaloop-nextest-python-api>
  505. 58.78 s gammaloop-nextest-python-api> stderr:
  506. 58.78 s gammaloop-nextest-python-api> ┌───────────────────────────────────┐
  507. 58.78 s gammaloop-nextest-python-api> │ The Symbolica license has expired │
  508. 58.78 s gammaloop-nextest-python-api> └───────────────────────────────────┘
  509. 58.78 s gammaloop-nextest-python-api>
  510. 58.78 s gammaloop-nextest-python-api>
  511. 58.78 s gammaloop-nextest-python-api> Location:
  512. 58.78 s gammaloop-nextest-python-api> tests/tests/test_python_api.rs:157:20
  513. 58.78 s gammaloop-nextest-python-api> system-out
  514. 58.78 s gammaloop-nextest-python-api> running 1 test
  515. 58.78 s gammaloop-nextest-python-api> test python_evaluate_sample_preserves_graph_grouping_and_incoming_pdgs ... FAILED
  516. 58.78 s gammaloop-nextest-python-api>
  517. 58.78 s gammaloop-nextest-python-api> failures:
  518. 58.78 s gammaloop-nextest-python-api>
  519. 58.78 s gammaloop-nextest-python-api> failures:
  520. 58.78 s gammaloop-nextest-python-api> python_evaluate_sample_preserves_graph_grouping_and_incoming_pdgs
  521. 58.78 s gammaloop-nextest-python-api>
  522. 58.78 s gammaloop-nextest-python-api> test result: FAILED. 0 passed; 1 failed; 0 ignored; 0 measured; 4 filtered out; finished in 0.54s
  523. 58.78 s gammaloop-nextest-python-api> system-err
  524. 58.78 s gammaloop-nextest-python-api> Error: Python API test subprocess failed.
  525. 58.78 s gammaloop-nextest-python-api> stdout:
  526. 58.78 s gammaloop-nextest-python-api> ┌────────────────────────────────────────────────────────┐
  527. 58.78 s gammaloop-nextest-python-api> │ You are running a restricted Symbolica instance. │
  528. 58.78 s gammaloop-nextest-python-api> │ │
  529. 58.78 s gammaloop-nextest-python-api> │ This mode is only permitted for non-commercial use and │
  530. 58.78 s gammaloop-nextest-python-api> │ is limited to one instance and core per machine. │
  531. 58.78 s gammaloop-nextest-python-api> │ │
  532. 58.78 s gammaloop-nextest-python-api> │ Hobbyists can easily acquire a free license key │
  533. 58.78 s gammaloop-nextest-python-api> │ that unlocks all cores and removes this banner: │
  534. 58.78 s gammaloop-nextest-python-api> │ │
  535. 58.78 s gammaloop-nextest-python-api> │ from symbolica import * │
  536. 58.78 s gammaloop-nextest-python-api> │ request_hobbyist_license('YOUR_NAME', 'YOUR_EMAIL') │
  537. 58.78 s gammaloop-nextest-python-api> │ │
  538. 58.78 s gammaloop-nextest-python-api> │ All other users can obtain a free 30-day trial key: │
  539. 58.78 s gammaloop-nextest-python-api> │ │
  540. 58.78 s gammaloop-nextest-python-api> │ from symbolica import * │
  541. 58.78 s gammaloop-nextest-python-api> │ request_trial_license('NAME', 'EMAIL', 'EMPLOYER') │
  542. 58.78 s gammaloop-nextest-python-api> │ │
  543. 58.78 s gammaloop-nextest-python-api> │ See https://symbolica.io/docs/get_started.html#license │
  544. 58.78 s gammaloop-nextest-python-api> └────────────────────────────────────────────────────────┘
  545. 58.78 s gammaloop-nextest-python-api> ┌───────────────────────────────────────────────────────────────────────────────────────────────────────────┐
  546. 58.78 s gammaloop-nextest-python-api> │ Cannot start new unlicensed Symbolica instance since there is already another one running on the machine. │
  547. 58.78 s gammaloop-nextest-python-api> └───────────────────────────────────────────────────────────────────────────────────────────────────────────┘
  548. 58.78 s gammaloop-nextest-python-api>
  549. 58.78 s gammaloop-nextest-python-api> stderr:
  550. 58.78 s gammaloop-nextest-python-api> ┌───────────────────────────────────┐
  551. 58.78 s gammaloop-nextest-python-api> │ The Symbolica license has expired │
  552. 58.78 s gammaloop-nextest-python-api> └───────────────────────────────────┘
  553. 58.78 s gammaloop-nextest-python-api>
  554. 58.78 s gammaloop-nextest-python-api>
  555. 58.78 s gammaloop-nextest-python-api> Location:
  556. 58.78 s gammaloop-nextest-python-api> tests/tests/test_python_api.rs:157:20
  557. 58.78 s gammaloop-nextest-python-api> =========================================
  558. 58.84 s error: Cannot build '/nix/store/fzljqa63rh9s640jcldimpyrcjcnir2c-gammaloop-nextest-python-api.drv'.
  559. 58.84 s Reason: builder failed with exit code 100.
  560. 58.84 s Output paths:
  561. 58.84 s /nix/store/sw1jmzipa5q26jwkkcqa1c6ynssy5rwc-gammaloop-nextest-python-api
  562. 58.84 s Last 541 log lines:
  563. 58.84 s > Extracting 1 binary, 1 build script output directory, and 3 linked paths to /build/nextest-archive-FXjMJA
  564. 58.84 s > Extracted 18 files to /build/nextest-archive-FXjMJA in 0.09s
  565. 58.84 s > ------------
  566. 58.84 s > Nextest run ID 1ce1d4c4-a59d-4d86-b44c-3e05e146cbfe with nextest profile: ci_gammaloop
  567. 58.84 s > Starting 5 tests across 1 binary
  568. 58.84 s > FAIL [ 0.529s] (2/5) gammaloop-integration-tests::test_python_api python_evaluate_samples_batch_and_momentum_space_have_expected_shape
  569. 58.84 s > stdout ---
  570. 58.84 s >
  571. 58.84 s > running 1 test
  572. 58.84 s > test python_evaluate_samples_batch_and_momentum_space_have_expected_shape ... FAILED
  573. 58.84 s >
  574. 58.84 s > failures:
  575. 58.84 s >
  576. 58.84 s > failures:
  577. 58.84 s > python_evaluate_samples_batch_and_momentum_space_have_expected_shape
  578. 58.84 s >
  579. 58.84 s > test result: FAILED. 0 passed; 1 failed; 0 ignored; 0 measured; 4 filtered out; finished in 0.51s
  580. 58.84 s >
  581. 58.84 s > stderr ---
  582. 58.84 s > Error: Python API test subprocess failed.
  583. 58.84 s > stdout:
  584. 58.84 s > ┌────────────────────────────────────────────────────────┐
  585. 58.84 s > │ You are running a restricted Symbolica instance. │
  586. 58.84 s > │ │
  587. 58.84 s > │ This mode is only permitted for non-commercial use and │
  588. 58.84 s > │ is limited to one instance and core per machine. │
  589. 58.84 s > │ │
  590. 58.84 s > │ Hobbyists can easily acquire a free license key │
  591. 58.84 s > │ that unlocks all cores and removes this banner: │
  592. 58.84 s > │ │
  593. 58.84 s > │ from symbolica import * │
  594. 58.84 s > │ request_hobbyist_license('YOUR_NAME', 'YOUR_EMAIL') │
  595. 58.84 s > │ │
  596. 58.84 s > │ All other users can obtain a free 30-day trial key: │
  597. 58.84 s > │ │
  598. 58.84 s > │ from symbolica import * │
  599. 58.84 s > │ request_trial_license('NAME', 'EMAIL', 'EMPLOYER') │
  600. 58.84 s > │ │
  601. 58.84 s > │ See https://symbolica.io/docs/get_started.html#license │
  602. 58.84 s > └────────────────────────────────────────────────────────┘
  603. 58.84 s > ┌───────────────────────────────────────────────────────────────────────────────────────────────────────────┐
  604. 58.84 s > │ Cannot start new unlicensed Symbolica instance since there is already another one running on the machine. │
  605. 58.84 s > └───────────────────────────────────────────────────────────────────────────────────────────────────────────┘
  606. 58.84 s >
  607. 58.84 s > stderr:
  608. 58.84 s > ┌───────────────────────────────────┐
  609. 58.84 s > │ The Symbolica license has expired │
  610. 58.84 s > └───────────────────────────────────┘
  611. 58.84 s >
  612. 58.84 s >
  613. 58.84 s > Location:
  614. 58.84 s > tests/tests/test_python_api.rs:157:20
  615. 58.84 s >
  616. 58.84 s > FAIL [ 0.557s] (3/5) gammaloop-integration-tests::test_python_api python_evaluate_sample_honors_generate_events_and_observable_snapshots
  617. 58.84 s > stdout ---
  618. 58.84 s >
  619. 58.84 s > running 1 test
  620. 58.84 s > test python_evaluate_sample_honors_generate_events_and_observable_snapshots ... FAILED
  621. 58.84 s >
  622. 58.84 s > failures:
  623. 58.84 s >
  624. 58.84 s > failures:
  625. 58.84 s > python_evaluate_sample_honors_generate_events_and_observable_snapshots
  626. 58.84 s >
  627. 58.84 s > test result: FAILED. 0 passed; 1 failed; 0 ignored; 0 measured; 4 filtered out; finished in 0.54s
  628. 58.84 s >
  629. 58.84 s > stderr ---
  630. 58.84 s > Error: Python API test subprocess failed.
  631. 58.84 s > stdout:
  632. 58.84 s > ┌────────────────────────────────────────────────────────┐
  633. 58.84 s > │ You are running a restricted Symbolica instance. │
  634. 58.84 s > │ │
  635. 58.84 s > │ This mode is only permitted for non-commercial use and │
  636. 58.84 s > │ is limited to one instance and core per machine. │
  637. 58.84 s > │ │
  638. 58.84 s > │ Hobbyists can easily acquire a free license key │
  639. 58.84 s > │ that unlocks all cores and removes this banner: │
  640. 58.84 s > │ │
  641. 58.84 s > │ from symbolica import * │
  642. 58.84 s > │ request_hobbyist_license('YOUR_NAME', 'YOUR_EMAIL') │
  643. 58.84 s > │ │
  644. 58.84 s > │ All other users can obtain a free 30-day trial key: │
  645. 58.84 s > │ │
  646. 58.84 s > │ from symbolica import * │
  647. 58.84 s > │ request_trial_license('NAME', 'EMAIL', 'EMPLOYER') │
  648. 58.84 s > │ │
  649. 58.84 s > │ See https://symbolica.io/docs/get_started.html#license │
  650. 58.84 s > └────────────────────────────────────────────────────────┘
  651. 58.84 s > ┌───────────────────────────────────────────────────────────────────────────────────────────────────────────┐
  652. 58.84 s > │ Cannot start new unlicensed Symbolica instance since there is already another one running on the machine. │
  653. 58.84 s > └───────────────────────────────────────────────────────────────────────────────────────────────────────────┘
  654. 58.84 s >
  655. 58.84 s > stderr:
  656. 58.84 s > ┌───────────────────────────────────┐
  657. 58.84 s > │ The Symbolica license has expired │
  658. 58.84 s > └───────────────────────────────────┘
  659. 58.84 s >
  660. 58.84 s >
  661. 58.84 s > Location:
  662. 58.84 s > tests/tests/test_python_api.rs:157:20
  663. 58.84 s >
  664. 58.84 s > FAIL [ 0.561s] (4/5) gammaloop-integration-tests::test_python_api python_evaluate_sample_preserves_graph_grouping_and_incoming_pdgs
  665. 58.84 s > stdout ---
  666. 58.84 s >
  667. 58.84 s > running 1 test
  668. 58.84 s > test python_evaluate_sample_preserves_graph_grouping_and_incoming_pdgs ... FAILED
  669. 58.84 s >
  670. 58.84 s > failures:
  671. 58.84 s >
  672. 58.84 s > failures:
  673. 58.84 s > python_evaluate_sample_preserves_graph_grouping_and_incoming_pdgs
  674. 58.84 s >
  675. 58.84 s > test result: FAILED. 0 passed; 1 failed; 0 ignored; 0 measured; 4 filtered out; finished in 0.54s
  676. 58.84 s >
  677. 58.84 s > stderr ---
  678. 58.84 s > Error: Python API test subprocess failed.
  679. 58.84 s > stdout:
  680. 58.84 s > ┌────────────────────────────────────────────────────────┐
  681. 58.84 s > │ You are running a restricted Symbolica instance. │
  682. 58.84 s > │ │
  683. 58.84 s > │ This mode is only permitted for non-commercial use and │
  684. 58.84 s > │ is limited to one instance and core per machine. │
  685. 58.84 s > │ │
  686. 58.84 s > │ Hobbyists can easily acquire a free license key │
  687. 58.84 s > │ that unlocks all cores and removes this banner: │
  688. 58.84 s > │ │
  689. 58.84 s > │ from symbolica import * │
  690. 58.84 s > │ request_hobbyist_license('YOUR_NAME', 'YOUR_EMAIL') │
  691. 58.84 s > │ │
  692. 58.84 s > │ All other users can obtain a free 30-day trial key: │
  693. 58.84 s > │ │
  694. 58.84 s > │ from symbolica import * │
  695. 58.84 s > │ request_trial_license('NAME', 'EMAIL', 'EMPLOYER') │
  696. 58.84 s > │ │
  697. 58.84 s > │ See https://symbolica.io/docs/get_started.html#license │
  698. 58.84 s > └────────────────────────────────────────────────────────┘
  699. 58.84 s > ┌───────────────────────────────────────────────────────────────────────────────────────────────────────────┐
  700. 58.84 s > │ Cannot start new unlicensed Symbolica instance since there is already another one running on the machine. │
  701. 58.84 s > └───────────────────────────────────────────────────────────────────────────────────────────────────────────┘
  702. 58.84 s >
  703. 58.84 s > stderr:
  704. 58.84 s > ┌───────────────────────────────────┐
  705. 58.84 s > │ The Symbolica license has expired │
  706. 58.84 s > └───────────────────────────────────┘
  707. 58.84 s >
  708. 58.84 s >
  709. 58.84 s > Location:
  710. 58.84 s > tests/tests/test_python_api.rs:157:20
  711. 58.84 s >
  712. 58.84 s > ------------
  713. 58.84 s > Summary [ 0.944s] 5 tests run: 2 passed, 3 failed, 0 skipped
  714. 58.84 s > FAIL [ 0.529s] (2/5) gammaloop-integration-tests::test_python_api python_evaluate_samples_batch_and_momentum_space_have_expected_shape
  715. 58.84 s > stdout ---
  716. 58.84 s >
  717. 58.84 s > running 1 test
  718. 58.84 s > test python_evaluate_samples_batch_and_momentum_space_have_expected_shape ... FAILED
  719. 58.84 s >
  720. 58.84 s > failures:
  721. 58.84 s >
  722. 58.84 s > failures:
  723. 58.84 s > python_evaluate_samples_batch_and_momentum_space_have_expected_shape
  724. 58.84 s >
  725. 58.84 s > test result: FAILED. 0 passed; 1 failed; 0 ignored; 0 measured; 4 filtered out; finished in 0.51s
  726. 58.84 s >
  727. 58.84 s > stderr ---
  728. 58.84 s > Error: Python API test subprocess failed.
  729. 58.84 s > stdout:
  730. 58.84 s > ┌────────────────────────────────────────────────────────┐
  731. 58.84 s > │ You are running a restricted Symbolica instance. │
  732. 58.84 s > │ │
  733. 58.84 s > │ This mode is only permitted for non-commercial use and │
  734. 58.84 s > │ is limited to one instance and core per machine. │
  735. 58.84 s > │ │
  736. 58.84 s > │ Hobbyists can easily acquire a free license key │
  737. 58.84 s > │ that unlocks all cores and removes this banner: │
  738. 58.84 s > │ │
  739. 58.84 s > │ from symbolica import * │
  740. 58.84 s > │ request_hobbyist_license('YOUR_NAME', 'YOUR_EMAIL') │
  741. 58.84 s > │ │
  742. 58.84 s > │ All other users can obtain a free 30-day trial key: │
  743. 58.84 s > │ │
  744. 58.84 s > │ from symbolica import * │
  745. 58.84 s > │ request_trial_license('NAME', 'EMAIL', 'EMPLOYER') │
  746. 58.84 s > │ │
  747. 58.84 s > │ See https://symbolica.io/docs/get_started.html#license │
  748. 58.84 s > └────────────────────────────────────────────────────────┘
  749. 58.84 s > ┌───────────────────────────────────────────────────────────────────────────────────────────────────────────┐
  750. 58.84 s > │ Cannot start new unlicensed Symbolica instance since there is already another one running on the machine. │
  751. 58.84 s > └───────────────────────────────────────────────────────────────────────────────────────────────────────────┘
  752. 58.84 s >
  753. 58.84 s > stderr:
  754. 58.84 s > ┌───────────────────────────────────┐
  755. 58.84 s > │ The Symbolica license has expired │
  756. 58.84 s > └───────────────────────────────────┘
  757. 58.84 s >
  758. 58.84 s >
  759. 58.84 s > Location:
  760. 58.84 s > tests/tests/test_python_api.rs:157:20
  761. 58.84 s >
  762. 58.84 s > FAIL [ 0.557s] (3/5) gammaloop-integration-tests::test_python_api python_evaluate_sample_honors_generate_events_and_observable_snapshots
  763. 58.84 s > stdout ---
  764. 58.84 s >
  765. 58.84 s > running 1 test
  766. 58.84 s > test python_evaluate_sample_honors_generate_events_and_observable_snapshots ... FAILED
  767. 58.84 s >
  768. 58.84 s > failures:
  769. 58.84 s >
  770. 58.84 s > failures:
  771. 58.84 s > python_evaluate_sample_honors_generate_events_and_observable_snapshots
  772. 58.84 s >
  773. 58.84 s > test result: FAILED. 0 passed; 1 failed; 0 ignored; 0 measured; 4 filtered out; finished in 0.54s
  774. 58.84 s >
  775. 58.84 s > stderr ---
  776. 58.84 s > Error: Python API test subprocess failed.
  777. 58.84 s > stdout:
  778. 58.84 s > ┌────────────────────────────────────────────────────────┐
  779. 58.84 s > │ You are running a restricted Symbolica instance. │
  780. 58.84 s > │ │
  781. 58.84 s > │ This mode is only permitted for non-commercial use and │
  782. 58.84 s > │ is limited to one instance and core per machine. │
  783. 58.84 s > │ │
  784. 58.84 s > │ Hobbyists can easily acquire a free license key │
  785. 58.84 s > │ that unlocks all cores and removes this banner: │
  786. 58.84 s > │ │
  787. 58.84 s > │ from symbolica import * │
  788. 58.84 s > │ request_hobbyist_license('YOUR_NAME', 'YOUR_EMAIL') │
  789. 58.84 s > │ │
  790. 58.84 s > │ All other users can obtain a free 30-day trial key: │
  791. 58.84 s > │ │
  792. 58.84 s > │ from symbolica import * │
  793. 58.84 s > │ request_trial_license('NAME', 'EMAIL', 'EMPLOYER') │
  794. 58.84 s > │ │
  795. 58.84 s > │ See https://symbolica.io/docs/get_started.html#license │
  796. 58.84 s > └────────────────────────────────────────────────────────┘
  797. 58.84 s > ┌───────────────────────────────────────────────────────────────────────────────────────────────────────────┐
  798. 58.84 s > │ Cannot start new unlicensed Symbolica instance since there is already another one running on the machine. │
  799. 58.84 s > └───────────────────────────────────────────────────────────────────────────────────────────────────────────┘
  800. 58.84 s >
  801. 58.84 s > stderr:
  802. 58.84 s > ┌───────────────────────────────────┐
  803. 58.84 s > │ The Symbolica license has expired │
  804. 58.84 s > └───────────────────────────────────┘
  805. 58.84 s >
  806. 58.84 s >
  807. 58.84 s > Location:
  808. 58.84 s > tests/tests/test_python_api.rs:157:20
  809. 58.84 s >
  810. 58.84 s > FAIL [ 0.561s] (4/5) gammaloop-integration-tests::test_python_api python_evaluate_sample_preserves_graph_grouping_and_incoming_pdgs
  811. 58.84 s > stdout ---
  812. 58.84 s >
  813. 58.84 s > running 1 test
  814. 58.84 s > test python_evaluate_sample_preserves_graph_grouping_and_incoming_pdgs ... FAILED
  815. 58.84 s >
  816. 58.84 s > failures:
  817. 58.84 s >
  818. 58.84 s > failures:
  819. 58.84 s > python_evaluate_sample_preserves_graph_grouping_and_incoming_pdgs
  820. 58.84 s >
  821. 58.84 s > test result: FAILED. 0 passed; 1 failed; 0 ignored; 0 measured; 4 filtered out; finished in 0.54s
  822. 58.84 s >
  823. 58.84 s > stderr ---
  824. 58.84 s > Error: Python API test subprocess failed.
  825. 58.84 s > stdout:
  826. 58.84 s > ┌────────────────────────────────────────────────────────┐
  827. 58.84 s > │ You are running a restricted Symbolica instance. │
  828. 58.84 s > │ │
  829. 58.84 s > │ This mode is only permitted for non-commercial use and │
  830. 58.84 s > │ is limited to one instance and core per machine. │
  831. 58.84 s > │ │
  832. 58.84 s > │ Hobbyists can easily acquire a free license key │
  833. 58.84 s > │ that unlocks all cores and removes this banner: │
  834. 58.84 s > │ │
  835. 58.84 s > │ from symbolica import * │
  836. 58.84 s > │ request_hobbyist_license('YOUR_NAME', 'YOUR_EMAIL') │
  837. 58.84 s > │ │
  838. 58.84 s > │ All other users can obtain a free 30-day trial key: │
  839. 58.84 s > │ │
  840. 58.84 s > │ from symbolica import * │
  841. 58.84 s > │ request_trial_license('NAME', 'EMAIL', 'EMPLOYER') │
  842. 58.84 s > │ │
  843. 58.84 s > │ See https://symbolica.io/docs/get_started.html#license │
  844. 58.84 s > └────────────────────────────────────────────────────────┘
  845. 58.84 s > ┌───────────────────────────────────────────────────────────────────────────────────────────────────────────┐
  846. 58.84 s > │ Cannot start new unlicensed Symbolica instance since there is already another one running on the machine. │
  847. 58.84 s > └───────────────────────────────────────────────────────────────────────────────────────────────────────────┘
  848. 58.84 s >
  849. 58.84 s > stderr:
  850. 58.84 s > ┌───────────────────────────────────┐
  851. 58.84 s > │ The Symbolica license has expired │
  852. 58.84 s > └───────────────────────────────────┘
  853. 58.84 s >
  854. 58.84 s >
  855. 58.84 s > Location:
  856. 58.84 s > tests/tests/test_python_api.rs:157:20
  857. 58.84 s >
  858. 58.84 s > error: test run failed
  859. 58.84 s >
  860. 58.84 s > ========== nextest test summary ==========
  861. 58.84 s > report: target/nextest/ci_gammaloop/junit.xml
  862. 58.84 s > tests: 5, failures: 3, errors: 0
  863. 58.84 s >
  864. 58.84 s > 1. gammaloop-integration-tests::test_python_api::python_evaluate_samples_batch_and_momentum_space_have_expected_shape
  865. 58.84 s > failure: test failure with exit code 101
  866. 58.84 s > Error: Python API test subprocess failed.
  867. 58.84 s > stdout:
  868. 58.84 s > ┌────────────────────────────────────────────────────────┐
  869. 58.84 s > │ You are running a restricted Symbolica instance. │
  870. 58.84 s > │ │
  871. 58.84 s > │ This mode is only permitted for non-commercial use and │
  872. 58.84 s > │ is limited to one instance and core per machine. │
  873. 58.84 s > │ │
  874. 58.84 s > │ Hobbyists can easily acquire a free license key │
  875. 58.84 s > │ that unlocks all cores and removes this banner: │
  876. 58.84 s > │ │
  877. 58.84 s > │ from symbolica import * │
  878. 58.84 s > │ request_hobbyist_license('YOUR_NAME', 'YOUR_EMAIL') │
  879. 58.84 s > │ │
  880. 58.84 s > │ All other users can obtain a free 30-day trial key: │
  881. 58.84 s > │ │
  882. 58.84 s > │ from symbolica import * │
  883. 58.84 s > │ request_trial_license('NAME', 'EMAIL', 'EMPLOYER') │
  884. 58.84 s > │ │
  885. 58.84 s > │ See https://symbolica.io/docs/get_started.html#license │
  886. 58.84 s > └────────────────────────────────────────────────────────┘
  887. 58.84 s > ┌───────────────────────────────────────────────────────────────────────────────────────────────────────────┐
  888. 58.84 s > │ Cannot start new unlicensed Symbolica instance since there is already another one running on the machine. │
  889. 58.84 s > └───────────────────────────────────────────────────────────────────────────────────────────────────────────┘
  890. 58.84 s >
  891. 58.84 s > stderr:
  892. 58.84 s > ┌───────────────────────────────────┐
  893. 58.84 s > │ The Symbolica license has expired │
  894. 58.84 s > └───────────────────────────────────┘
  895. 58.84 s >
  896. 58.84 s >
  897. 58.84 s > Location:
  898. 58.84 s > tests/tests/test_python_api.rs:157:20
  899. 58.84 s > system-out
  900. 58.84 s > running 1 test
  901. 58.84 s > test python_evaluate_samples_batch_and_momentum_space_have_expected_shape ... FAILED
  902. 58.84 s >
  903. 58.84 s > failures:
  904. 58.84 s >
  905. 58.84 s > failures:
  906. 58.84 s > python_evaluate_samples_batch_and_momentum_space_have_expected_shape
  907. 58.84 s >
  908. 58.84 s > test result: FAILED. 0 passed; 1 failed; 0 ignored; 0 measured; 4 filtered out; finished in 0.51s
  909. 58.84 s > system-err
  910. 58.84 s > Error: Python API test subprocess failed.
  911. 58.84 s > stdout:
  912. 58.84 s > ┌────────────────────────────────────────────────────────┐
  913. 58.84 s > │ You are running a restricted Symbolica instance. │
  914. 58.84 s > │ │
  915. 58.84 s > │ This mode is only permitted for non-commercial use and │
  916. 58.84 s > │ is limited to one instance and core per machine. │
  917. 58.84 s > │ │
  918. 58.84 s > │ Hobbyists can easily acquire a free license key │
  919. 58.84 s > │ that unlocks all cores and removes this banner: │
  920. 58.84 s > │ │
  921. 58.84 s > │ from symbolica import * │
  922. 58.84 s > │ request_hobbyist_license('YOUR_NAME', 'YOUR_EMAIL') │
  923. 58.84 s > │ │
  924. 58.84 s > │ All other users can obtain a free 30-day trial key: │
  925. 58.84 s > │ │
  926. 58.84 s > │ from symbolica import * │
  927. 58.84 s > │ request_trial_license('NAME', 'EMAIL', 'EMPLOYER') │
  928. 58.84 s > │ │
  929. 58.84 s > │ See https://symbolica.io/docs/get_started.html#license │
  930. 58.84 s > └────────────────────────────────────────────────────────┘
  931. 58.84 s > ┌───────────────────────────────────────────────────────────────────────────────────────────────────────────┐
  932. 58.84 s > │ Cannot start new unlicensed Symbolica instance since there is already another one running on the machine. │
  933. 58.84 s > └───────────────────────────────────────────────────────────────────────────────────────────────────────────┘
  934. 58.84 s >
  935. 58.84 s > stderr:
  936. 58.84 s > ┌───────────────────────────────────┐
  937. 58.84 s > │ The Symbolica license has expired │
  938. 58.84 s > └───────────────────────────────────┘
  939. 58.84 s >
  940. 58.84 s >
  941. 58.84 s > Location:
  942. 58.84 s > tests/tests/test_python_api.rs:157:20
  943. 58.84 s >
  944. 58.84 s > 2. gammaloop-integration-tests::test_python_api::python_evaluate_sample_honors_generate_events_and_observable_snapshots
  945. 58.84 s > failure: test failure with exit code 101
  946. 58.84 s > Error: Python API test subprocess failed.
  947. 58.84 s > stdout:
  948. 58.84 s > ┌────────────────────────────────────────────────────────┐
  949. 58.84 s > │ You are running a restricted Symbolica instance. │
  950. 58.84 s > │ │
  951. 58.84 s > │ This mode is only permitted for non-commercial use and │
  952. 58.84 s > │ is limited to one instance and core per machine. │
  953. 58.84 s > │ │
  954. 58.84 s > │ Hobbyists can easily acquire a free license key │
  955. 58.84 s > │ that unlocks all cores and removes this banner: │
  956. 58.84 s > │ │
  957. 58.84 s > │ from symbolica import * │
  958. 58.84 s > │ request_hobbyist_license('YOUR_NAME', 'YOUR_EMAIL') │
  959. 58.84 s > │ │
  960. 58.84 s > │ All other users can obtain a free 30-day trial key: │
  961. 58.84 s > │ │
  962. 58.84 s > │ from symbolica import * │
  963. 58.84 s > │ request_trial_license('NAME', 'EMAIL', 'EMPLOYER') │
  964. 58.84 s > │ │
  965. 58.84 s > │ See https://symbolica.io/docs/get_started.html#license │
  966. 58.84 s > └────────────────────────────────────────────────────────┘
  967. 58.84 s > ┌───────────────────────────────────────────────────────────────────────────────────────────────────────────┐
  968. 58.84 s > │ Cannot start new unlicensed Symbolica instance since there is already another one running on the machine. │
  969. 58.84 s > └───────────────────────────────────────────────────────────────────────────────────────────────────────────┘
  970. 58.84 s >
  971. 58.84 s > stderr:
  972. 58.84 s > ┌───────────────────────────────────┐
  973. 58.84 s > │ The Symbolica license has expired │
  974. 58.84 s > └───────────────────────────────────┘
  975. 58.84 s >
  976. 58.84 s >
  977. 58.84 s > Location:
  978. 58.84 s > tests/tests/test_python_api.rs:157:20
  979. 58.84 s > system-out
  980. 58.84 s > running 1 test
  981. 58.84 s > test python_evaluate_sample_honors_generate_events_and_observable_snapshots ... FAILED
  982. 58.84 s >
  983. 58.84 s > failures:
  984. 58.84 s >
  985. 58.84 s > failures:
  986. 58.84 s > python_evaluate_sample_honors_generate_events_and_observable_snapshots
  987. 58.84 s >
  988. 58.84 s > test result: FAILED. 0 passed; 1 failed; 0 ignored; 0 measured; 4 filtered out; finished in 0.54s
  989. 58.84 s > system-err
  990. 58.84 s > Error: Python API test subprocess failed.
  991. 58.84 s > stdout:
  992. 58.84 s > ┌────────────────────────────────────────────────────────┐
  993. 58.84 s > │ You are running a restricted Symbolica instance. │
  994. 58.84 s > │ │
  995. 58.84 s > │ This mode is only permitted for non-commercial use and │
  996. 58.84 s > │ is limited to one instance and core per machine. │
  997. 58.84 s > │ │
  998. 58.84 s > │ Hobbyists can easily acquire a free license key │
  999. 58.84 s > │ that unlocks all cores and removes this banner: │
  1000. 58.84 s > │ │
  1001. 58.84 s > │ from symbolica import * │
  1002. 58.84 s > │ request_hobbyist_license('YOUR_NAME', 'YOUR_EMAIL') │
  1003. 58.84 s > │ │
  1004. 58.84 s > │ All other users can obtain a free 30-day trial key: │
  1005. 58.84 s > │ │
  1006. 58.84 s > │ from symbolica import * │
  1007. 58.84 s > │ request_trial_license('NAME', 'EMAIL', 'EMPLOYER') │
  1008. 58.84 s > │ │
  1009. 58.84 s > │ See https://symbolica.io/docs/get_started.html#license │
  1010. 58.84 s > └────────────────────────────────────────────────────────┘
  1011. 58.84 s > ┌───────────────────────────────────────────────────────────────────────────────────────────────────────────┐
  1012. 58.84 s > │ Cannot start new unlicensed Symbolica instance since there is already another one running on the machine. │
  1013. 58.84 s > └───────────────────────────────────────────────────────────────────────────────────────────────────────────┘
  1014. 58.84 s >
  1015. 58.84 s > stderr:
  1016. 58.84 s > ┌───────────────────────────────────┐
  1017. 58.84 s > │ The Symbolica license has expired │
  1018. 58.84 s > └───────────────────────────────────┘
  1019. 58.84 s >
  1020. 58.84 s >
  1021. 58.84 s > Location:
  1022. 58.84 s > tests/tests/test_python_api.rs:157:20
  1023. 58.84 s >
  1024. 58.84 s > 3. gammaloop-integration-tests::test_python_api::python_evaluate_sample_preserves_graph_grouping_and_incoming_pdgs
  1025. 58.84 s > failure: test failure with exit code 101
  1026. 58.84 s > Error: Python API test subprocess failed.
  1027. 58.84 s > stdout:
  1028. 58.84 s > ┌────────────────────────────────────────────────────────┐
  1029. 58.84 s > │ You are running a restricted Symbolica instance. │
  1030. 58.84 s > │ │
  1031. 58.84 s > │ This mode is only permitted for non-commercial use and │
  1032. 58.84 s > │ is limited to one instance and core per machine. │
  1033. 58.84 s > │ │
  1034. 58.84 s > │ Hobbyists can easily acquire a free license key │
  1035. 58.84 s > │ that unlocks all cores and removes this banner: │
  1036. 58.84 s > │ │
  1037. 58.84 s > │ from symbolica import * │
  1038. 58.84 s > │ request_hobbyist_license('YOUR_NAME', 'YOUR_EMAIL') │
  1039. 58.84 s > │ │
  1040. 58.84 s > │ All other users can obtain a free 30-day trial key: │
  1041. 58.84 s > │ │
  1042. 58.84 s > │ from symbolica import * │
  1043. 58.84 s > │ request_trial_license('NAME', 'EMAIL', 'EMPLOYER') │
  1044. 58.84 s > │ │
  1045. 58.84 s > │ See https://symbolica.io/docs/get_started.html#license │
  1046. 58.84 s > └────────────────────────────────────────────────────────┘
  1047. 58.84 s > ┌───────────────────────────────────────────────────────────────────────────────────────────────────────────┐
  1048. 58.84 s > │ Cannot start new unlicensed Symbolica instance since there is already another one running on the machine. │
  1049. 58.84 s > └───────────────────────────────────────────────────────────────────────────────────────────────────────────┘
  1050. 58.84 s >
  1051. 58.84 s > stderr:
  1052. 58.84 s > ┌───────────────────────────────────┐
  1053. 58.84 s > │ The Symbolica license has expired │
  1054. 58.84 s > └───────────────────────────────────┘
  1055. 58.84 s >
  1056. 58.84 s >
  1057. 58.84 s > Location:
  1058. 58.84 s > tests/tests/test_python_api.rs:157:20
  1059. 58.84 s > system-out
  1060. 58.84 s > running 1 test
  1061. 58.84 s > test python_evaluate_sample_preserves_graph_grouping_and_incoming_pdgs ... FAILED
  1062. 58.84 s >
  1063. 58.84 s > failures:
  1064. 58.84 s >
  1065. 58.84 s > failures:
  1066. 58.84 s > python_evaluate_sample_preserves_graph_grouping_and_incoming_pdgs
  1067. 58.84 s >
  1068. 58.84 s > test result: FAILED. 0 passed; 1 failed; 0 ignored; 0 measured; 4 filtered out; finished in 0.54s
  1069. 58.84 s > system-err
  1070. 58.84 s > Error: Python API test subprocess failed.
  1071. 58.84 s > stdout:
  1072. 58.84 s > ┌────────────────────────────────────────────────────────┐
  1073. 58.84 s > │ You are running a restricted Symbolica instance. │
  1074. 58.84 s > │ │
  1075. 58.84 s > │ This mode is only permitted for non-commercial use and │
  1076. 58.84 s > │ is limited to one instance and core per machine. │
  1077. 58.84 s > │ │
  1078. 58.84 s > │ Hobbyists can easily acquire a free license key │
  1079. 58.84 s > │ that unlocks all cores and removes this banner: │
  1080. 58.84 s > │ │
  1081. 58.84 s > │ from symbolica import * │
  1082. 58.84 s > │ request_hobbyist_license('YOUR_NAME', 'YOUR_EMAIL') │
  1083. 58.84 s > │ │
  1084. 58.84 s > │ All other users can obtain a free 30-day trial key: │
  1085. 58.84 s > │ │
  1086. 58.84 s > │ from symbolica import * │
  1087. 58.84 s > │ request_trial_license('NAME', 'EMAIL', 'EMPLOYER') │
  1088. 58.84 s > │ │
  1089. 58.84 s > │ See https://symbolica.io/docs/get_started.html#license │
  1090. 58.84 s > └────────────────────────────────────────────────────────┘
  1091. 58.84 s > ┌───────────────────────────────────────────────────────────────────────────────────────────────────────────┐
  1092. 58.84 s > │ Cannot start new unlicensed Symbolica instance since there is already another one running on the machine. │
  1093. 58.84 s > └───────────────────────────────────────────────────────────────────────────────────────────────────────────┘
  1094. 58.84 s >
  1095. 58.84 s > stderr:
  1096. 58.84 s > ┌───────────────────────────────────┐
  1097. 58.84 s > │ The Symbolica license has expired │
  1098. 58.84 s > └───────────────────────────────────┘
  1099. 58.84 s >
  1100. 58.84 s >
  1101. 58.84 s > Location:
  1102. 58.84 s > tests/tests/test_python_api.rs:157:20
  1103. 58.84 s > =========================================
  1104. 58.84 s For full logs, run:
  1105. 58.84 s nix log /nix/store/fzljqa63rh9s640jcldimpyrcjcnir2c-gammaloop-nextest-python-api.drv
  1106. 58.96 s [0 built (1 failed), 0.0Run failed.