test packages.x86_64-linux.nix-ci-check-gammaloop-doctest
0.95 s
$ /nix/store/9ypz3flqsrl5xl495mm8h645gadjsxi1-coreutils-9.11/bin/timeout --kill-after=15s 7200s /nix/store/23zk8sgzamrbmj1fday15szf7f2279s8-nix-2.34.7/bin/nix --extra-experimental-features nix-command --extra-experimental-features flakes flake clone git+https://github.com/alphal00p/gammaloop --dest /tmp/nix-ci-worker/stable-pwd/repo/
0.96 s
Cloning into '/tmp/nix-ci-worker/stable-pwd/repo'...
0.96 s
remote: Enumerating objects: 66383, done.
0.96 s
remote: Counting objects: 0% (1/9055)
remote: Counting objects: 1% (91/9055)
remote: Counting objects: 2% (182/9055)
remote: Counting objects: 3% (272/9055)
remote: Counting objects: 4% (363/9055)
remote: Counting objects: 5% (453/9055)
remote: Counting objects: 6% (544/9055)
remote: Counting objects: 7% (634/9055)
remote: Counting objects: 8% (725/9055)
remote: Counting objects: 9% (815/9055)
remote: Counting objects: 10% (906/9055)
remote: Counting objects: 11% (997/9055)
remote: Counting objects: 12% (1087/9055)
remote: Counting objects: 13% (1178/9055)
remote: Counting objects: 14% (1268/9055)
remote: Counting objects: 15% (1359/9055)
remote: Counting objects: 16% (1449/9055)
remote: Counting objects: 17% (1540/9055)
remote: Counting objects: 18% (1630/9055)
remote: Counting objects: 19% (1721/9055)
remote: Counting objects: 20% (1811/9055)
remote: Counting objects: 21% (1902/9055)
remote: Counting objects: 22% (1993/9055)
remote: Counting objects: 23% (2083/9055)
remote: Counting objects: 24% (2174/9055)
remote: Counting objects: 25% (2264/9055)
remote: Counting objects: 26% (2355/9055)
remote: Counting objects: 27% (2445/9055)
remote: Counting objects: 28% (2536/9055)
remote: Counting objects: 29% (2626/9055)
remote: Counting objects: 30% (2717/9055)
remote: Counting objects: 31% (2808/9055)
remote: Counting objects: 32% (2898/9055)
remote: Counting objects: 33% (2989/9055)
remote: Counting objects: 34% (3079/9055)
remote: Counting objects: 35% (3170/9055)
remote: Counting objects: 36% (3260/9055)
remote: Counting objects: 37% (3351/9055)
remote: Counting objects: 38% (3441/9055)
remote: Counting objects: 39% (3532/9055)
remote: Counting objects: 40% (3622/9055)
remote: Counting objects: 41% (3713/9055)
remote: Counting objects: 42% (3804/9055)
remote: Counting objects: 43% (3894/9055)
remote: Counting objects: 44% (3985/9055)
remote: Counting objects: 45% (4075/9055)
remote: Counting objects: 46% (4166/9055)
remote: Counting objects: 47% (4256/9055)
remote: Counting objects: 48% (4347/9055)
remote: Counting objects: 49% (4437/9055)
remote: Counting objects: 50% (4528/9055)
remote: Counting objects: 51% (4619/9055)
remote: Counting objects: 52% (4709/9055)
remote: Counting objects: 53% (4800/9055)
remote: Counting objects: 54% (4890/9055)
remote: Counting objects: 55% (4981/9055)
remote: Counting objects: 56% (5071/9055)
remote: Counting objects: 57% (5162/9055)
remote: Counting objects: 58% (5252/9055)
remote: Counting objects: 59% (5343/9055)
remote: Counting objects: 60% (5433/9055)
remote: Counting objects: 61% (5524/9055)
remote: Counting objects: 62% (5615/9055)
remote: Counting objects: 63% (5705/9055)
remote: Counting objects: 64% (5796/9055)
remote: Counting objects: 65% (5886/9055)
remote: Counting objects: 66% (5977/9055)
remote: Counting objects: 67% (6067/9055)
remote: Counting objects: 68% (6158/9055)
remote: Counting objects: 69% (6248/9055)
remote: Counting objects: 70% (6339/9055)
remote: Counting objects: 71% (6430/9055)
remote: Counting objects: 72% (6520/9055)
remote: Counting objects: 73% (6611/9055)
remote: Counting objects: 74% (6701/9055)
remote: Counting objects: 75% (6792/9055)
remote: Counting objects: 76% (6882/9055)
remote: Counting objects: 77% (6973/9055)
remote: Counting objects: 78% (7063/9055)
remote: Counting objects: 79% (7154/9055)
remote: Counting objects: 80% (7244/9055)
remote: Counting objects: 81% (7335/9055)
remote: Counting objects: 82% (7426/9055)
remote: Counting objects: 83% (7516/9055)
remote: Counting objects: 84% (7607/9055)
remote: Counting objects: 85% (7697/9055)
remote: Counting objects: 86% (7788/9055)
remote: Counting objects: 87% (7878/9055)
remote: Counting objects: 88% (7969/9055)
remote: Counting objects: 89% (8059/9055)
remote: Counting objects: 90% (8150/9055)
remote: Counting objects: 91% (8241/9055)
remote: Counting objects: 92% (8331/9055)
remote: Counting objects: 93% (8422/9055)
remote: Counting objects: 94% (8512/9055)
remote: Counting objects: 95% (8603/9055)
remote: Counting objects: 96% (8693/9055)
remote: Counting objects: 97% (8784/9055)
remote: Counting objects: 98% (8874/9055)
remote: Counting objects: 99% (8965/9055)
remote: Counting objects: 100% (9055/9055)
remote: Counting objects: 100% (9055/9055), done.
3.10 s
remote: Compressing objects: 0% (1/2136)
remote: Compressing objects: 1% (22/2136)
remote: Compressing objects: 2% (43/2136)
remote: Compressing objects: 3% (65/2136)
remote: Compressing objects: 4% (86/2136)
remote: Compressing objects: 5% (107/2136)
remote: Compressing objects: 6% (129/2136)
remote: Compressing objects: 7% (150/2136)
remote: Compressing objects: 8% (171/2136)
remote: Compressing objects: 9% (193/2136)
remote: Compressing objects: 10% (214/2136)
remote: Compressing objects: 11% (235/2136)
remote: Compressing objects: 12% (257/2136)
remote: Compressing objects: 13% (278/2136)
remote: Compressing objects: 14% (300/2136)
remote: Compressing objects: 15% (321/2136)
remote: Compressing objects: 16% (342/2136)
remote: Compressing objects: 17% (364/2136)
remote: Compressing objects: 18% (385/2136)
remote: Compressing objects: 19% (406/2136)
remote: Compressing objects: 20% (428/2136)
remote: Compressing objects: 21% (449/2136)
remote: Compressing objects: 21% (453/2136)
remote: Compressing objects: 22% (470/2136)
remote: Compressing objects: 23% (492/2136)
remote: Compressing objects: 24% (513/2136)
remote: Compressing objects: 25% (534/2136)
remote: Compressing objects: 26% (556/2136)
remote: Compressing objects: 27% (577/2136)
remote: Compressing objects: 28% (599/2136)
remote: Compressing objects: 29% (620/2136)
remote: Compressing objects: 30% (641/2136)
remote: Compressing objects: 31% (663/2136)
remote: Compressing objects: 31% (676/2136)
remote: Compressing objects: 32% (684/2136)
remote: Compressing objects: 33% (705/2136)
remote: Compressing objects: 34% (727/2136)
remote: Compressing objects: 35% (748/2136)
remote: Compressing objects: 36% (769/2136)
remote: Compressing objects: 37% (791/2136)
remote: Compressing objects: 38% (812/2136)
remote: Compressing objects: 39% (834/2136)
remote: Compressing objects: 40% (855/2136)
remote: Compressing objects: 41% (876/2136)
remote: Compressing objects: 42% (898/2136)
remote: Compressing objects: 43% (919/2136)
remote: Compressing objects: 44% (940/2136)
remote: Compressing objects: 45% (962/2136)
remote: Compressing objects: 46% (983/2136)
remote: Compressing objects: 47% (1004/2136)
remote: Compressing objects: 48% (1026/2136)
remote: Compressing objects: 49% (1047/2136)
remote: Compressing objects: 50% (1068/2136)
remote: Compressing objects: 51% (1090/2136)
remote: Compressing objects: 52% (1111/2136)
remote: Compressing objects: 53% (1133/2136)
remote: Compressing objects: 54% (1154/2136)
remote: Compressing objects: 55% (1175/2136)
remote: Compressing objects: 56% (1197/2136)
remote: Compressing objects: 57% (1218/2136)
remote: Compressing objects: 58% (1239/2136)
remote: Compressing objects: 59% (1261/2136)
remote: Compressing objects: 60% (1282/2136)
remote: Compressing objects: 61% (1303/2136)
remote: Compressing objects: 62% (1325/2136)
remote: Compressing objects: 63% (1346/2136)
remote: Compressing objects: 64% (1368/2136)
remote: Compressing objects: 65% (1389/2136)
remote: Compressing objects: 66% (1410/2136)
remote: Compressing objects: 67% (1432/2136)
remote: Compressing objects: 68% (1453/2136)
remote: Compressing objects: 69% (1474/2136)
remote: Compressing objects: 70% (1496/2136)
remote: Compressing objects: 71% (1517/2136)
remote: Compressing objects: 72% (1538/2136)
remote: Compressing objects: 73% (1560/2136)
remote: Compressing objects: 74% (1581/2136)
remote: Compressing objects: 75% (1602/2136)
remote: Compressing objects: 76% (1624/2136)
remote: Compressing objects: 77% (1645/2136)
remote: Compressing objects: 78% (1667/2136)
remote: Compressing objects: 79% (1688/2136)
remote: Compressing objects: 80% (1709/2136)
remote: Compressing objects: 81% (1731/2136)
remote: Compressing objects: 82% (1752/2136)
remote: Compressing objects: 83% (1773/2136)
remote: Compressing objects: 84% (1795/2136)
remote: Compressing objects: 85% (1816/2136)
remote: Compressing objects: 86% (1837/2136)
remote: Compressing objects: 87% (1859/2136)
remote: Compressing objects: 88% (1880/2136)
remote: Compressing objects: 89% (1902/2136)
remote: Compressing objects: 90% (1923/2136)
remote: Compressing objects: 91% (1944/2136)
remote: Compressing objects: 92% (1966/2136)
remote: Compressing objects: 93% (1987/2136)
remote: Compressing objects: 94% (2008/2136)
remote: Compressing objects: 95% (2030/2136)
remote: Compressing objects: 96% (2051/2136)
remote: Compressing objects: 97% (2072/2136)
remote: Compressing objects: 98% (2094/2136)
remote: Compressing objects: 99% (2115/2136)
remote: Compressing objects: 100% (2136/2136)
remote: Compressing objects: 100% (2136/2136), done.
6.90 s
Receiving objects: 0% (1/66383)
Receiving objects: 1% (664/66383), 740.00 KiB | 1.37 MiB/s
Receiving objects: 2% (1328/66383), 740.00 KiB | 1.37 MiB/s
Receiving objects: 3% (1992/66383), 740.00 KiB | 1.37 MiB/s
Receiving objects: 4% (2656/66383), 740.00 KiB | 1.37 MiB/s
Receiving objects: 5% (3320/66383), 740.00 KiB | 1.37 MiB/s
Receiving objects: 6% (3983/66383), 740.00 KiB | 1.37 MiB/s
Receiving objects: 7% (4647/66383), 740.00 KiB | 1.37 MiB/s
Receiving objects: 7% (4873/66383), 8.80 MiB | 8.62 MiB/s
Receiving objects: 8% (5311/66383), 8.80 MiB | 8.62 MiB/s
Receiving objects: 9% (5975/66383), 8.80 MiB | 8.62 MiB/s
Receiving objects: 10% (6639/66383), 8.80 MiB | 8.62 MiB/s
Receiving objects: 11% (7303/66383), 8.80 MiB | 8.62 MiB/s
Receiving objects: 12% (7966/66383), 8.80 MiB | 8.62 MiB/s
Receiving objects: 13% (8630/66383), 18.29 MiB | 12.02 MiB/s
Receiving objects: 14% (9294/66383), 18.29 MiB | 12.02 MiB/s
Receiving objects: 15% (9958/66383), 18.29 MiB | 12.02 MiB/s
Receiving objects: 16% (10622/66383), 18.29 MiB | 12.02 MiB/s
Receiving objects: 17% (11286/66383), 18.29 MiB | 12.02 MiB/s
Receiving objects: 18% (11949/66383), 18.29 MiB | 12.02 MiB/s
Receiving objects: 19% (12613/66383), 18.29 MiB | 12.02 MiB/s
Receiving objects: 20% (13277/66383), 18.29 MiB | 12.02 MiB/s
Receiving objects: 21% (13941/66383), 18.29 MiB | 12.02 MiB/s
Receiving objects: 22% (14605/66383), 18.29 MiB | 12.02 MiB/s
Receiving objects: 23% (15269/66383), 18.29 MiB | 12.02 MiB/s
Receiving objects: 24% (15932/66383), 18.29 MiB | 12.02 MiB/s
Receiving objects: 25% (16596/66383), 18.29 MiB | 12.02 MiB/s
Receiving objects: 26% (17260/66383), 18.29 MiB | 12.02 MiB/s
Receiving objects: 27% (17924/66383), 18.29 MiB | 12.02 MiB/s
Receiving objects: 28% (18588/66383), 18.29 MiB | 12.02 MiB/s
Receiving objects: 29% (19252/66383), 18.29 MiB | 12.02 MiB/s
Receiving objects: 30% (19915/66383), 18.29 MiB | 12.02 MiB/s
Receiving objects: 31% (20579/66383), 18.29 MiB | 12.02 MiB/s
Receiving objects: 32% (21243/66383), 18.29 MiB | 12.02 MiB/s
Receiving objects: 33% (21907/66383), 18.29 MiB | 12.02 MiB/s
Receiving objects: 34% (22571/66383), 18.29 MiB | 12.02 MiB/s
Receiving objects: 35% (23235/66383), 18.29 MiB | 12.02 MiB/s
Receiving objects: 36% (23898/66383), 18.29 MiB | 12.02 MiB/s
Receiving objects: 37% (24562/66383), 18.29 MiB | 12.02 MiB/s
Receiving objects: 38% (25226/66383), 18.29 MiB | 12.02 MiB/s
Receiving objects: 39% (25890/66383), 18.29 MiB | 12.02 MiB/s
Receiving objects: 40% (26554/66383), 18.29 MiB | 12.02 MiB/s
Receiving objects: 41% (27218/66383), 18.29 MiB | 12.02 MiB/s
Receiving objects: 42% (27881/66383), 18.29 MiB | 12.02 MiB/s
Receiving objects: 43% (28545/66383), 18.29 MiB | 12.02 MiB/s
Receiving objects: 44% (29209/66383), 18.29 MiB | 12.02 MiB/s
Receiving objects: 45% (29873/66383), 18.29 MiB | 12.02 MiB/s
Receiving objects: 46% (30537/66383), 18.29 MiB | 12.02 MiB/s
Receiving objects: 47% (31201/66383), 18.29 MiB | 12.02 MiB/s
Receiving objects: 48% (31864/66383), 18.29 MiB | 12.02 MiB/s
Receiving objects: 49% (32528/66383), 18.29 MiB | 12.02 MiB/s
Receiving objects: 50% (33192/66383), 18.29 MiB | 12.02 MiB/s
Receiving objects: 51% (33856/66383), 18.29 MiB | 12.02 MiB/s
Receiving objects: 52% (34520/66383), 18.29 MiB | 12.02 MiB/s
Receiving objects: 53% (35183/66383), 18.29 MiB | 12.02 MiB/s
Receiving objects: 54% (35847/66383), 18.29 MiB | 12.02 MiB/s
Receiving objects: 55% (36511/66383), 18.29 MiB | 12.02 MiB/s
Receiving objects: 56% (37175/66383), 18.29 MiB | 12.02 MiB/s
Receiving objects: 56% (37193/66383), 18.29 MiB | 12.02 MiB/s
Receiving objects: 57% (37839/66383), 40.49 MiB | 20.03 MiB/s
Receiving objects: 58% (38503/66383), 40.49 MiB | 20.03 MiB/s
Receiving objects: 59% (39166/66383), 40.49 MiB | 20.03 MiB/s
Receiving objects: 60% (39830/66383), 40.49 MiB | 20.03 MiB/s
Receiving objects: 61% (40494/66383), 40.49 MiB | 20.03 MiB/s
Receiving objects: 62% (41158/66383), 40.49 MiB | 20.03 MiB/s
Receiving objects: 63% (41822/66383), 40.49 MiB | 20.03 MiB/s
Receiving objects: 64% (42486/66383), 40.49 MiB | 20.03 MiB/s
Receiving objects: 65% (43149/66383), 40.49 MiB | 20.03 MiB/s
Receiving objects: 66% (43813/66383), 40.49 MiB | 20.03 MiB/s
Receiving objects: 67% (44477/66383), 40.49 MiB | 20.03 MiB/s
Receiving objects: 68% (45141/66383), 40.49 MiB | 20.03 MiB/s
Receiving objects: 69% (45805/66383), 40.49 MiB | 20.03 MiB/s
Receiving objects: 70% (46469/66383), 40.49 MiB | 20.03 MiB/s
Receiving objects: 71% (47132/66383), 58.97 MiB | 23.39 MiB/s
Receiving objects: 72% (47796/66383), 58.97 MiB | 23.39 MiB/s
Receiving objects: 73% (48460/66383), 58.97 MiB | 23.39 MiB/s
Receiving objects: 74% (49124/66383), 58.97 MiB | 23.39 MiB/s
Receiving objects: 75% (49788/66383), 58.97 MiB | 23.39 MiB/s
Receiving objects: 76% (50452/66383), 58.97 MiB | 23.39 MiB/s
Receiving objects: 77% (51115/66383), 58.97 MiB | 23.39 MiB/s
Receiving objects: 78% (51779/66383), 58.97 MiB | 23.39 MiB/s
Receiving objects: 78% (52276/66383), 58.97 MiB | 23.39 MiB/s
Receiving objects: 79% (52443/66383), 58.97 MiB | 23.39 MiB/s
Receiving objects: 80% (53107/66383), 58.97 MiB | 23.39 MiB/s
Receiving objects: 81% (53771/66383), 76.43 MiB | 25.16 MiB/s
Receiving objects: 82% (54435/66383), 76.43 MiB | 25.16 MiB/s
Receiving objects: 83% (55098/66383), 76.43 MiB | 25.16 MiB/s
Receiving objects: 84% (55762/66383), 76.43 MiB | 25.16 MiB/s
Receiving objects: 85% (56426/66383), 76.43 MiB | 25.16 MiB/s
Receiving objects: 86% (57090/66383), 76.43 MiB | 25.16 MiB/s
Receiving objects: 87% (57754/66383), 76.43 MiB | 25.16 MiB/s
Receiving objects: 88% (58418/66383), 76.43 MiB | 25.16 MiB/s
Receiving objects: 89% (59081/66383), 76.43 MiB | 25.16 MiB/s
Receiving objects: 90% (59745/66383), 76.43 MiB | 25.16 MiB/s
Receiving objects: 91% (60409/66383), 76.43 MiB | 25.16 MiB/s
Receiving objects: 92% (61073/66383), 76.43 MiB | 25.16 MiB/s
Receiving objects: 93% (61737/66383), 76.43 MiB | 25.16 MiB/s
Receiving objects: 94% (62401/66383), 76.43 MiB | 25.16 MiB/s
Receiving objects: 95% (63064/66383), 76.43 MiB | 25.16 MiB/s
Receiving objects: 96% (63728/66383), 76.43 MiB | 25.16 MiB/s
Receiving objects: 97% (64392/66383), 76.43 MiB | 25.16 MiB/s
Receiving objects: 98% (65056/66383), 76.43 MiB | 25.16 MiB/s
Receiving objects: 99% (65720/66383), 76.43 MiB | 25.16 MiB/s
remote: Total 66383 (delta 7324), reused 7289 (delta 6632), pack-reused 57328 (from 1)
6.91 s
Receiving objects: 100% (66383/66383), 93.64 MiB | 26.38 MiB/s
Receiving objects: 100% (66383/66383), 98.68 MiB | 26.70 MiB/s, done.
7.99 s
Resolving deltas: 0% (0/46421)
Resolving deltas: 1% (465/46421)
Resolving deltas: 2% (929/46421)
Resolving deltas: 3% (1394/46421)
Resolving deltas: 4% (1857/46421)
Resolving deltas: 5% (2322/46421)
Resolving deltas: 6% (2786/46421)
Resolving deltas: 7% (3250/46421)
Resolving deltas: 8% (3715/46421)
Resolving deltas: 9% (4178/46421)
Resolving deltas: 10% (4643/46421)
Resolving deltas: 11% (5107/46421)
Resolving deltas: 12% (5571/46421)
Resolving deltas: 13% (6036/46421)
Resolving deltas: 14% (6499/46421)
Resolving deltas: 15% (6965/46421)
Resolving deltas: 16% (7428/46421)
Resolving deltas: 17% (7892/46421)
Resolving deltas: 18% (8356/46421)
Resolving deltas: 19% (8820/46421)
Resolving deltas: 20% (9285/46421)
Resolving deltas: 21% (9749/46421)
Resolving deltas: 22% (10213/46421)
Resolving deltas: 23% (10677/46421)
Resolving deltas: 24% (11142/46421)
Resolving deltas: 25% (11606/46421)
Resolving deltas: 26% (12070/46421)
Resolving deltas: 27% (12534/46421)
Resolving deltas: 28% (12998/46421)
Resolving deltas: 29% (13463/46421)
Resolving deltas: 30% (13928/46421)
Resolving deltas: 31% (14392/46421)
Resolving deltas: 32% (14855/46421)
Resolving deltas: 33% (15320/46421)
Resolving deltas: 34% (15784/46421)
Resolving deltas: 35% (16248/46421)
Resolving deltas: 36% (16712/46421)
Resolving deltas: 37% (17178/46421)
Resolving deltas: 38% (17640/46421)
Resolving deltas: 39% (18105/46421)
Resolving deltas: 40% (18569/46421)
Resolving deltas: 41% (19033/46421)
Resolving deltas: 42% (19497/46421)
Resolving deltas: 43% (19962/46421)
Resolving deltas: 44% (20427/46421)
Resolving deltas: 45% (20890/46421)
Resolving deltas: 46% (21355/46421)
Resolving deltas: 47% (21819/46421)
Resolving deltas: 48% (22285/46421)
Resolving deltas: 49% (22747/46421)
Resolving deltas: 50% (23211/46421)
Resolving deltas: 51% (23675/46421)
Resolving deltas: 52% (24140/46421)
Resolving deltas: 53% (24604/46421)
Resolving deltas: 54% (25068/46421)
Resolving deltas: 55% (25534/46421)
Resolving deltas: 56% (25996/46421)
Resolving deltas: 57% (26460/46421)
Resolving deltas: 58% (26925/46421)
Resolving deltas: 59% (27389/46421)
Resolving deltas: 60% (27856/46421)
Resolving deltas: 61% (28317/46421)
Resolving deltas: 62% (28782/46421)
Resolving deltas: 63% (29246/46421)
Resolving deltas: 64% (29710/46421)
Resolving deltas: 65% (30174/46421)
Resolving deltas: 66% (30638/46421)
Resolving deltas: 67% (31103/46421)
Resolving deltas: 68% (31567/46421)
Resolving deltas: 69% (32031/46421)
Resolving deltas: 70% (32495/46421)
Resolving deltas: 71% (32959/46421)
Resolving deltas: 72% (33424/46421)
Resolving deltas: 73% (33888/46421)
Resolving deltas: 74% (34352/46421)
Resolving deltas: 75% (34816/46421)
Resolving deltas: 76% (35280/46421)
Resolving deltas: 77% (35745/46421)
Resolving deltas: 78% (36210/46421)
Resolving deltas: 79% (36673/46421)
Resolving deltas: 80% (37140/46421)
Resolving deltas: 81% (37602/46421)
Resolving deltas: 82% (38066/46421)
Resolving deltas: 83% (38531/46421)
Resolving deltas: 84% (38994/46421)
Resolving deltas: 85% (39458/46421)
Resolving deltas: 86% (39923/46421)
Resolving deltas: 87% (40387/46421)
Resolving deltas: 88% (40851/46421)
Resolving deltas: 89% (41315/46421)
Resolving deltas: 90% (41779/46421)
Resolving deltas: 91% (42244/46421)
Resolving deltas: 91% (42633/46421)
Resolving deltas: 92% (42708/46421)
Resolving deltas: 93% (43172/46421)
Resolving deltas: 94% (43636/46421)
Resolving deltas: 95% (44101/46421)
Resolving deltas: 96% (44566/46421)
Resolving deltas: 97% (45029/46421)
Resolving deltas: 98% (45493/46421)
Resolving deltas: 99% (45958/46421)
Resolving deltas: 100% (46421/46421)
Resolving deltas: 100% (46421/46421), done.
8.49 s
Fetching commit 6eccc26fe47651addfae2f810918809139129a5c for feynkit ...
8.49 s
$ /nix/store/bcnisk3ydfgv26v2gw3zlky24g00yww2-git-2.54.0/bin/git fetch origin 6eccc26fe47651addfae2f810918809139129a5c
8.93 s
From https://github.com/alphal00p/gammaloop
8.93 s
* branch 6eccc26fe47651addfae2f810918809139129a5c -> FETCH_HEAD
8.94 s
$ /nix/store/9ypz3flqsrl5xl495mm8h645gadjsxi1-coreutils-9.11/bin/timeout --kill-after=15s 7200s /nix/store/bcnisk3ydfgv26v2gw3zlky24g00yww2-git-2.54.0/bin/git -c advice.detachedHead=false checkout 6eccc26fe47651addfae2f810918809139129a5c
9.27 s
HEAD is now at 6eccc26fe fix feynkit tensor bridge integration
9.27 s
$ /nix/store/9ypz3flqsrl5xl495mm8h645gadjsxi1-coreutils-9.11/bin/timeout --kill-after=15s 7200s /nix/store/23zk8sgzamrbmj1fday15szf7f2279s8-nix-2.34.7/bin/nix --extra-experimental-features nix-command --extra-experimental-features flakes --log-format internal-json run .#packages.x86_64-linux.nix-ci-check-gammaloop-doctest --print-build-logs
12.67 s
12.71 s
Downloading cached nix-ci-check-gammaloop-doctest from https://cache.nix-ci.com
12.73 s
Downloaded cached nix-ci-check-gammaloop-doctest (1000 B) in 18ms
12.73 s
Progress: 0 of 1 built, 1 of 1 downloaded from cache
16.88 s
evaluating derivation 'g
copying '/nix/store/jirn
evaluating derivation 'g
querying gammaloop-works
[0 /1 built, 0.0 KiB DL]
[1 /0 /1 built, 0.0 KiB DLgammaloop-workspace-doctest> Running phase: unpackPhase
16.89 s
gammaloop-workspace-doctest> unpacking source archive /nix/store/rmhmwzhj8gpw3wldlw9ixs4vb9f9lnaa-source
17.06 s
gammaloop-workspace-doctest> source root is source
17.10 s
gammaloop-workspace-doctest> Running phase: patchPhase
17.10 s
gammaloop-workspace-doctest> Executing configureCargoCommonVars
17.11 s
gammaloop-workspace-doctest> decompressing cargo artifacts from /nix/store/ll9b1in64vh8qki89lybxzjjz809daql-gammaloop-workspace-deps-deps-0.1.0/target.tar.zst to target
19.10 s
gammaloop-workspace-doctest> Running phase: updateAutotoolsGnuConfigScriptsPhase
19.16 s
gammaloop-workspace-doctest> Running phase: configurePhase
19.16 s
gammaloop-workspace-doctest> will append /build/source/.cargo-home/config.toml with contents of /nix/store/5k2rp6i9lv5zqizci840fqwg07lqhf3q-vendor-cargo-deps/config.toml
19.16 s
gammaloop-workspace-doctest> default configurePhase, nothing to do
19.17 s
gammaloop-workspace-doctest> Running phase: buildPhase
19.17 s
gammaloop-workspace-doctest> +++ command cargo --version
19.18 s
gammaloop-workspace-doctest> cargo 1.97.0 (c980f4866 2026-06-30)
19.22 s
gammaloop-workspace-doctest> +++ command cargo test --profile ci-optim --doc --locked --workspace --features gammaloop-tracing-filter/clap,gammaloop-tracing-filter/symbolica,idenso/bincode,idenso/reference-cases,linnet/bincode,linnet/drawing,linnet/rkyv,linnet/serde,linnet/symbolica,spenso-macros/shadowing,spenso/shadowing,symbolica/tracing_max_level_info
19.72 s
gammaloop-workspace-doctest> Compiling pyo3-build-config v0.28.3
19.73 s
gammaloop-workspace-doctest> Compiling phf_shared v0.11.3
19.74 s
gammaloop-workspace-doctest> Compiling getopts v0.2.24
19.74 s
gammaloop-workspace-doctest> Compiling unic-char-range v0.9.0
19.74 s
gammaloop-workspace-doctest> Compiling unic-common v0.9.0
19.74 s
gammaloop-workspace-doctest> Compiling is-macro v0.3.7
19.74 s
gammaloop-workspace-doctest> Compiling rustpython-parser-vendored v0.4.0
19.75 s
gammaloop-workspace-doctest> Compiling rustc-hash v1.1.0
19.75 s
gammaloop-workspace-doctest> Compiling lalrpop-util v0.20.2
19.76 s
gammaloop-workspace-doctest> Compiling symbolica v2.2.0 (https://github.com/symbolica-dev/symbolica?branch=dev#0441bd7a)
19.78 s
gammaloop-workspace-doctest> Compiling gammaloop-tracing-filter-macros v0.1.0 (/build/source/crates/gammaloop-tracing-filter-macros)
19.78 s
gammaloop-workspace-doctest> Compiling unic-ucd-version v0.9.0
19.79 s
gammaloop-workspace-doctest> Compiling vakint v0.1.2 (/build/source/crates/vakint)
19.80 s
gammaloop-workspace-doctest> Compiling unic-char-property v0.9.0
19.83 s
gammaloop-workspace-doctest> Compiling gammalooprs v0.3.4 (/build/source/crates/gammalooprs)
19.84 s
gammaloop-workspace-doctest> Compiling rustc_version v0.4.1
19.84 s
gammaloop-workspace-doctest> Compiling gammaloop-api v0.1.0 (/build/source/crates/gammaloop-api)
19.85 s
gammaloop-workspace-doctest> Compiling bincode v1.3.3
19.85 s
gammaloop-workspace-doctest> Compiling iai-callgrind-runner v0.14.2
19.91 s
gammaloop-workspace-doctest> Compiling phf_generator v0.11.3
19.94 s
gammaloop-workspace-doctest> Compiling phf v0.11.3
19.95 s
gammaloop-workspace-doctest> Compiling unic-ucd-ident v0.9.0
20.08 s
gammaloop-workspace-doctest> Compiling phf_codegen v0.11.3
20.12 s
gammaloop-workspace-doctest> Compiling unic-emoji-char v0.9.0
20.15 s
gammaloop-workspace-doctest> Compiling gungraun-runner v0.18.2
20.16 s
gammaloop-workspace-doctest> Compiling gammaloop-integration-tests v0.1.0 (/build/source/tests)
20.17 s
gammaloop-workspace-doctest> Compiling test-log-core v0.2.20
20.17 s
gammaloop-workspace-doctest> Compiling wait-timeout v0.2.1
20.18 s
gammaloop-workspace-doctest> Compiling bit-vec v0.8.0
20.23 s
gammaloop-workspace-doctest> Compiling unicode_names2_generator v1.3.0
20.29 s
gammaloop-workspace-doctest> Compiling quick-error v1.2.3
20.32 s
gammaloop-workspace-doctest> Compiling iai-callgrind v0.14.2
20.37 s
gammaloop-workspace-doctest> Compiling maplit v1.0.2
20.40 s
gammaloop-workspace-doctest> Compiling rusty-fork v0.3.1
20.44 s
gammaloop-workspace-doctest> Compiling bit-set v0.8.0
20.45 s
gammaloop-workspace-doctest> Compiling rustpython-parser v0.4.0
20.50 s
gammaloop-workspace-doctest> Compiling iai-callgrind-macros v0.5.1
20.61 s
gammaloop-workspace-doctest> Compiling rand_xorshift v0.4.0
20.63 s
gammaloop-workspace-doctest> Compiling console v0.15.11
20.67 s
gammaloop-workspace-doctest> Compiling gungraun-macros v0.8.0
20.73 s
gammaloop-workspace-doctest> Compiling unarray v0.1.4
20.74 s
gammaloop-workspace-doctest> Compiling base64 v0.21.7
20.81 s
gammaloop-workspace-doctest> Compiling proptest v1.11.0
21.08 s
gammaloop-workspace-doctest> Compiling similar-asserts v1.7.0
21.30 s
gammaloop-workspace-doctest> Compiling ron v0.8.1
21.50 s
gammaloop-workspace-doctest> Compiling kurvst v0.1.0 (/build/source/crates/kurvst)
22.21 s
gammaloop-workspace-doctest> Compiling test-log-macros v0.2.20
22.79 s
gammaloop-workspace-doctest> Compiling unicode_names2 v1.3.0
24.56 s
gammaloop-workspace-doctest> Compiling test-log v0.2.20
24.83 s
gammaloop-workspace-doctest> Compiling rustpython-parser-core v0.4.0
25.07 s
gammaloop-workspace-doctest> Compiling rustpython-ast v0.4.0
25.58 s
gammaloop-workspace-doctest> Compiling pyo3-macros-backend v0.28.3
25.66 s
gammaloop-workspace-doctest> Compiling pyo3-ffi v0.28.3
26.09 s
gammaloop-workspace-doctest> Compiling pyo3 v0.28.3
26.15 s
gammaloop-workspace-doctest> Compiling numpy v0.28.0
27.76 s
gammaloop-workspace-doctest> Compiling gungraun v0.18.2
32.06 s
gammaloop-workspace-doctest> Compiling pyo3-macros v0.28.3
35.07 s
gammaloop-workspace-doctest> Compiling pyo3-stub-gen-derive v0.17.2
37.64 s
gammaloop-workspace-doctest> Compiling numerica v2.2.0 (https://github.com/symbolica-dev/symbolica?branch=dev#0441bd7a)
38.31 s
gammaloop-workspace-doctest> Compiling pyo3-stub-gen v0.17.2
40.18 s
gammaloop-workspace-doctest> Compiling graphica v2.1.0 (https://github.com/symbolica-dev/symbolica?branch=dev#0441bd7a)
45.14 s
gammaloop-workspace-doctest> Compiling symbolica-utils v0.1.0 (/build/source/crates/symbolica-utils)
45.26 s
gammaloop-workspace-doctest> Compiling linnet v0.17.0 (/build/source/crates/linnet)
72.24 s
gammaloop-workspace-doctest> Compiling feynkit-model v0.1.0 (/build/source/crates/feynkit-model)
74.00 s
gammaloop-workspace-doctest> Compiling feynkit-ufo v0.1.0 (/build/source/crates/feynkit-ufo)
79.53 s
gammaloop-workspace-doctest> Compiling feynkit-kinematics v0.1.0 (/build/source/crates/feynkit-kinematics)
80.31 s
gammaloop-workspace-doctest> Compiling feynkit-graph v0.1.0 (/build/source/crates/feynkit-graph)
83.30 s
gammaloop-workspace-doctest> Compiling feynkit-cff v0.1.0 (/build/source/crates/feynkit-cff)
215.53 s
gammaloop-workspace-doctest> Compiling spenso-macros v0.3.2 (/build/source/crates/spenso-macros)
217.78 s
gammaloop-workspace-doctest> Compiling gammaloop-workspace-hack v0.1.0 (/build/source/crates/gammaloop-workspace-hack)
217.78 s
gammaloop-workspace-doctest> Compiling spenso v0.6.0 (/build/source/crates/spenso)
225.08 s
gammaloop-workspace-doctest> Compiling idenso v0.3.0 (/build/source/crates/idenso)
225.09 s
gammaloop-workspace-doctest> Compiling gammaloop-tracing-filter v0.1.0 (/build/source/crates/gammaloop-tracing-filter)
230.77 s
gammaloop-workspace-doctest> Compiling spenso-hep-lib v0.1.7 (/build/source/crates/spenso-hep-lib)
230.78 s
gammaloop-workspace-doctest> Compiling feynkit-tensor v0.1.0 (/build/source/crates/feynkit-tensor)
231.12 s
gammaloop-workspace-doctest> Compiling feynkit-generator v0.1.0 (/build/source/crates/feynkit-generator)
231.12 s
gammaloop-workspace-doctest> Compiling spynso3 v0.1.2 (/build/source/crates/spynso3)
238.73 s
gammaloop-workspace-doctest> Compiling feynkit v0.1.0 (/build/source/crates/feynkit)
238.87 s
gammaloop-workspace-doctest> Compiling feynkit-py v0.1.0 (/build/source/crates/feynkit-py)
297.51 s
gammaloop-workspace-doctest> Compiling linnest v0.1.0 (/build/source/crates/linnest)
297.52 s
gammaloop-workspace-doctest> Compiling linnet-py v0.1.0 (/build/source/crates/linnet-py)
428.53 s
gammaloop-workspace-doctest> Finished `ci-optim` profile [optimized] target(s) in 6m 49s
430.09 s
gammaloop-workspace-doctest> warning : the following packages contain code that will be rejected by a future version of Rust: proc-macro-error2 v2.0.1
430.09 s
gammaloop-workspace-doctest> note : to see what the problems were, use the option `--future-incompat-report`, or run `cargo report future-incompatibilities --id 1`
430.09 s
gammaloop-workspace-doctest> Doc-tests feynkit
430.09 s
gammaloop-workspace-doctest>
430.09 s
gammaloop-workspace-doctest> running 0 tests
430.09 s
gammaloop-workspace-doctest>
430.09 s
gammaloop-workspace-doctest> test result: ok. 0 passed; 0 failed; 0 ignored; 0 measured; 0 filtered out; finished in 0.00s
430.09 s
gammaloop-workspace-doctest>
430.09 s
gammaloop-workspace-doctest> Doc-tests feynkit_cff
430.42 s
gammaloop-workspace-doctest>
430.42 s
gammaloop-workspace-doctest> running 1 test
430.42 s
gammaloop-workspace-doctest> test crates/feynkit-cff/src/lib.rs - (line 10) ... ok
430.42 s
gammaloop-workspace-doctest>
430.42 s
gammaloop-workspace-doctest> test result: ok. 1 passed; 0 failed; 0 ignored; 0 measured; 0 filtered out; finished in 0.00s
430.42 s
gammaloop-workspace-doctest>
430.43 s
gammaloop-workspace-doctest> all doctests ran in 1.59s; merged doctests compilation took 1.58s
430.43 s
gammaloop-workspace-doctest> Doc-tests feynkit_generator
430.61 s
gammaloop-workspace-doctest>
430.61 s
gammaloop-workspace-doctest> running 0 tests
430.61 s
gammaloop-workspace-doctest>
430.61 s
gammaloop-workspace-doctest> test result: ok. 0 passed; 0 failed; 0 ignored; 0 measured; 0 filtered out; finished in 0.00s
430.61 s
gammaloop-workspace-doctest>
430.62 s
gammaloop-workspace-doctest> Doc-tests feynkit_graph
430.72 s
gammaloop-workspace-doctest>
430.72 s
gammaloop-workspace-doctest> running 0 tests
430.72 s
gammaloop-workspace-doctest>
430.72 s
gammaloop-workspace-doctest> test result: ok. 0 passed; 0 failed; 0 ignored; 0 measured; 0 filtered out; finished in 0.00s
430.72 s
gammaloop-workspace-doctest>
430.73 s
gammaloop-workspace-doctest> Doc-tests feynkit_kinematics
430.79 s
gammaloop-workspace-doctest>
430.79 s
gammaloop-workspace-doctest> running 0 tests
430.79 s
gammaloop-workspace-doctest>
430.79 s
gammaloop-workspace-doctest> test result: ok. 0 passed; 0 failed; 0 ignored; 0 measured; 0 filtered out; finished in 0.00s
430.79 s
gammaloop-workspace-doctest>
430.80 s
gammaloop-workspace-doctest> Doc-tests feynkit_model
430.91 s
gammaloop-workspace-doctest>
430.91 s
gammaloop-workspace-doctest> running 0 tests
430.91 s
gammaloop-workspace-doctest>
430.91 s
gammaloop-workspace-doctest> test result: ok. 0 passed; 0 failed; 0 ignored; 0 measured; 0 filtered out; finished in 0.00s
430.91 s
gammaloop-workspace-doctest>
430.91 s
gammaloop-workspace-doctest> Doc-tests feynkit_py
431.24 s
gammaloop-workspace-doctest>
431.24 s
gammaloop-workspace-doctest> running 0 tests
431.24 s
gammaloop-workspace-doctest>
431.24 s
gammaloop-workspace-doctest> test result: ok. 0 passed; 0 failed; 0 ignored; 0 measured; 0 filtered out; finished in 0.00s
431.24 s
gammaloop-workspace-doctest>
431.24 s
gammaloop-workspace-doctest> Doc-tests feynkit_tensor
433.33 s
gammaloop-workspace-doctest>
433.33 s
gammaloop-workspace-doctest> running 18 tests
433.33 s
gammaloop-workspace-doctest> test crates/feynkit-tensor/src/reduction.rs - reduction::ContractionOrbit (line 65) - compile ... ok
433.33 s
gammaloop-workspace-doctest> test crates/feynkit-tensor/src/reduction.rs - reduction::FeynmanDiagramTensorExt (line 943) - compile ... ok
433.33 s
gammaloop-workspace-doctest> test crates/feynkit-tensor/src/reduction.rs - reduction::TensorReducer (line 283) - compile ... ok
433.33 s
gammaloop-workspace-doctest> test crates/feynkit-tensor/src/reduction.rs - reduction::TensorReducer::reduce (line 421) - compile ... ok
433.33 s
gammaloop-workspace-doctest> test crates/feynkit-tensor/src/reduction.rs - reduction::TensorReduction (line 202) - compile ... ok
433.33 s
gammaloop-workspace-doctest> test crates/feynkit-tensor/src/reduction.rs - reduction::TensorReduction::expression (line 247) - compile ... ok
433.33 s
gammaloop-workspace-doctest> test crates/feynkit-tensor/src/reduction.rs - reduction::TensorReductionTerm (line 145) - compile ... ok
433.33 s
gammaloop-workspace-doctest> test crates/feynkit-tensor/src/weingarten.rs - weingarten::OrthogonalWeingarten::coefficient (line 309) - compile ... ok
433.33 s
gammaloop-workspace-doctest> test crates/feynkit-tensor/src/weingarten.rs - weingarten::OrthogonalWeingarten::new (line 231) - compile ... ok
433.33 s
gammaloop-workspace-doctest> test crates/feynkit-tensor/src/weingarten.rs - weingarten::OrthogonalWeingarten (line 199) - compile ... ok
433.33 s
gammaloop-workspace-doctest> test crates/feynkit-tensor/src/weingarten.rs - weingarten::OrthogonalWeingarten::for_rank (line 275) - compile ... ok
433.34 s
gammaloop-workspace-doctest> test crates/feynkit-tensor/src/weingarten.rs - weingarten::CosetType (line 34) ... ok
433.34 s
gammaloop-workspace-doctest> test crates/feynkit-tensor/src/weingarten.rs - weingarten::CosetType::between_matchings (line 92) ... ok
433.34 s
gammaloop-workspace-doctest> test crates/feynkit-tensor/src/weingarten.rs - weingarten::CosetType::class_size (line 152) ... ok
433.34 s
gammaloop-workspace-doctest> test crates/feynkit-tensor/src/weingarten.rs - weingarten::CosetType::new (line 55) ... ok
433.34 s
gammaloop-workspace-doctest> test crates/feynkit-tensor/src/reduction.rs - reduction::TensorReducer::distribute_summands (line 391) ... ok
433.41 s
gammaloop-workspace-doctest> test crates/feynkit-tensor/src/weingarten.rs - weingarten::WeingartenError (line 409) ... FAILED
433.41 s
gammaloop-workspace-doctest> test crates/feynkit-tensor/src/weingarten.rs - weingarten::OrthogonalWeingarten::isotropic_pairing_coefficient (line 345) ... FAILED
433.41 s
gammaloop-workspace-doctest>
433.41 s
gammaloop-workspace-doctest> failures:
433.41 s
gammaloop-workspace-doctest>
433.41 s
gammaloop-workspace-doctest> ---- crates/feynkit-tensor/src/weingarten.rs - weingarten::WeingartenError (line 409) stdout ----
433.41 s
gammaloop-workspace-doctest> Test executable failed (terminated by signal).
433.41 s
gammaloop-workspace-doctest>
433.41 s
gammaloop-workspace-doctest> stdout:
433.41 s
gammaloop-workspace-doctest> ┌────────────────────────────────────────────────────────┐
433.41 s
gammaloop-workspace-doctest> │ You are running a restricted Symbolica instance. │
433.41 s
gammaloop-workspace-doctest> │ │
433.41 s
gammaloop-workspace-doctest> │ This mode is only permitted for non-commercial use and │
433.41 s
gammaloop-workspace-doctest> │ is limited to one instance and core per machine. │
433.41 s
gammaloop-workspace-doctest> │ │
433.41 s
gammaloop-workspace-doctest> │ Hobbyists can easily acquire a free license key │
433.41 s
gammaloop-workspace-doctest> │ that unlocks all cores and removes this banner: │
433.41 s
gammaloop-workspace-doctest> │ │
433.41 s
gammaloop-workspace-doctest> │ from symbolica import * │
433.41 s
gammaloop-workspace-doctest> │ request_hobbyist_license('YOUR_NAME', 'YOUR_EMAIL') │
433.41 s
gammaloop-workspace-doctest> │ │
433.41 s
gammaloop-workspace-doctest> │ All other users can obtain a free 30-day trial key: │
433.41 s
gammaloop-workspace-doctest> │ │
433.41 s
gammaloop-workspace-doctest> │ from symbolica import * │
433.41 s
gammaloop-workspace-doctest> │ request_trial_license('NAME', 'EMAIL', 'EMPLOYER') │
433.41 s
gammaloop-workspace-doctest> │ │
433.41 s
gammaloop-workspace-doctest> │ See https://symbolica.io/docs/get_started.html#license │
433.41 s
gammaloop-workspace-doctest> └────────────────────────────────────────────────────────┘
433.41 s
gammaloop-workspace-doctest> ┌───────────────────────────────────────────────────────────────────────────────────────────────────────────┐
433.41 s
gammaloop-workspace-doctest> │ Cannot start new unlicensed Symbolica instance since there is already another one running on the machine. │
433.41 s
gammaloop-workspace-doctest> └───────────────────────────────────────────────────────────────────────────────────────────────────────────┘
433.41 s
gammaloop-workspace-doctest>
433.41 s
gammaloop-workspace-doctest> stderr:
433.41 s
gammaloop-workspace-doctest> ┌───────────────────────────────────┐
433.41 s
gammaloop-workspace-doctest> │ The Symbolica license has expired │
433.41 s
gammaloop-workspace-doctest> └───────────────────────────────────┘
433.41 s
gammaloop-workspace-doctest>
433.41 s
gammaloop-workspace-doctest>
433.41 s
gammaloop-workspace-doctest> ---- crates/feynkit-tensor/src/weingarten.rs - weingarten::OrthogonalWeingarten::isotropic_pairing_coefficient (line 345) stdout ----
433.41 s
gammaloop-workspace-doctest> Test executable failed (terminated by signal).
433.41 s
gammaloop-workspace-doctest>
433.41 s
gammaloop-workspace-doctest> stdout:
433.41 s
gammaloop-workspace-doctest> ┌────────────────────────────────────────────────────────┐
433.41 s
gammaloop-workspace-doctest> │ You are running a restricted Symbolica instance. │
433.41 s
gammaloop-workspace-doctest> │ │
433.41 s
gammaloop-workspace-doctest> │ This mode is only permitted for non-commercial use and │
433.41 s
gammaloop-workspace-doctest> │ is limited to one instance and core per machine. │
433.41 s
gammaloop-workspace-doctest> │ │
433.41 s
gammaloop-workspace-doctest> │ Hobbyists can easily acquire a free license key │
433.41 s
gammaloop-workspace-doctest> │ that unlocks all cores and removes this banner: │
433.41 s
gammaloop-workspace-doctest> │ │
433.41 s
gammaloop-workspace-doctest> │ from symbolica import * │
433.41 s
gammaloop-workspace-doctest> │ request_hobbyist_license('YOUR_NAME', 'YOUR_EMAIL') │
433.41 s
gammaloop-workspace-doctest> │ │
433.41 s
gammaloop-workspace-doctest> │ All other users can obtain a free 30-day trial key: │
433.41 s
gammaloop-workspace-doctest> │ │
433.41 s
gammaloop-workspace-doctest> │ from symbolica import * │
433.41 s
gammaloop-workspace-doctest> │ request_trial_license('NAME', 'EMAIL', 'EMPLOYER') │
433.41 s
gammaloop-workspace-doctest> │ │
433.41 s
gammaloop-workspace-doctest> │ See https://symbolica.io/docs/get_started.html#license │
433.41 s
gammaloop-workspace-doctest> └────────────────────────────────────────────────────────┘
433.41 s
gammaloop-workspace-doctest> ┌───────────────────────────────────────────────────────────────────────────────────────────────────────────┐
433.41 s
gammaloop-workspace-doctest> │ Cannot start new unlicensed Symbolica instance since there is already another one running on the machine. │
433.41 s
gammaloop-workspace-doctest> └───────────────────────────────────────────────────────────────────────────────────────────────────────────┘
433.41 s
gammaloop-workspace-doctest>
433.41 s
gammaloop-workspace-doctest> stderr:
433.41 s
gammaloop-workspace-doctest> ┌───────────────────────────────────┐
433.41 s
gammaloop-workspace-doctest> │ The Symbolica license has expired │
433.41 s
gammaloop-workspace-doctest> └───────────────────────────────────┘
433.41 s
gammaloop-workspace-doctest>
433.41 s
gammaloop-workspace-doctest>
433.41 s
gammaloop-workspace-doctest>
433.41 s
gammaloop-workspace-doctest> failures:
433.41 s
gammaloop-workspace-doctest> crates/feynkit-tensor/src/weingarten.rs - weingarten::OrthogonalWeingarten::isotropic_pairing_coefficient (line 345)
433.41 s
gammaloop-workspace-doctest> crates/feynkit-tensor/src/weingarten.rs - weingarten::WeingartenError (line 409)
433.41 s
gammaloop-workspace-doctest>
433.41 s
gammaloop-workspace-doctest> test result: FAILED. 16 passed; 2 failed; 0 ignored; 0 measured; 0 filtered out; finished in 0.08s
433.41 s
gammaloop-workspace-doctest>
433.42 s
gammaloop-workspace-doctest> all doctests ran in 2.12s; merged doctests compilation took 2.03s
433.43 s
gammaloop-workspace-doctest> error : doctest failed, to rerun pass `-p feynkit-tensor --doc`
433.95 s
error: Cannot build '/nix/store/rib4za6i46s64j5cfq0g9a797kni9p43-gammaloop-workspace-doctest-0.1.0.drv '.
435.12 s
Reason: builder failed with exit code 101 .
435.12 s
Output paths:
435.12 s
/nix/store/bkckfqg8lry0jqf4vwis39l51rxxmsfv-gammaloop-workspace-doctest-0.1.0
435.12 s
Last 241 log lines:
435.12 s
> Running phase: unpackPhase
435.12 s
> unpacking source archive /nix/store/rmhmwzhj8gpw3wldlw9ixs4vb9f9lnaa-source
435.12 s
> source root is source
435.12 s
> Running phase: patchPhase
435.12 s
> Executing configureCargoCommonVars
435.12 s
> decompressing cargo artifacts from /nix/store/ll9b1in64vh8qki89lybxzjjz809daql-gammaloop-workspace-deps-deps-0.1.0/target.tar.zst to target
435.12 s
> Running phase: updateAutotoolsGnuConfigScriptsPhase
435.12 s
> Running phase: configurePhase
435.12 s
> will append /build/source/.cargo-home/config.toml with contents of /nix/store/5k2rp6i9lv5zqizci840fqwg07lqhf3q-vendor-cargo-deps/config.toml
435.12 s
> default configurePhase, nothing to do
435.12 s
> Running phase: buildPhase
435.12 s
> +++ command cargo --version
435.12 s
> cargo 1.97.0 (c980f4866 2026-06-30)
435.12 s
> +++ command cargo test --profile ci-optim --doc --locked --workspace --features gammaloop-tracing-filter/clap,gammaloop-tracing-filter/symbolica,idenso/bincode,idenso/reference-cases,linnet/bincode,linnet/drawing,linnet/rkyv,linnet/serde,linnet/symbolica,spenso-macros/shadowing,spenso/shadowing,symbolica/tracing_max_level_info
435.12 s
> Compiling pyo3-build-config v0.28.3
435.12 s
> Compiling phf_shared v0.11.3
435.12 s
> Compiling getopts v0.2.24
435.12 s
> Compiling unic-char-range v0.9.0
435.12 s
> Compiling unic-common v0.9.0
435.12 s
> Compiling is-macro v0.3.7
435.12 s
> Compiling rustpython-parser-vendored v0.4.0
435.12 s
> Compiling rustc-hash v1.1.0
435.12 s
> Compiling lalrpop-util v0.20.2
435.12 s
> Compiling symbolica v2.2.0 (https://github.com/symbolica-dev/symbolica?branch=dev#0441bd7a)
435.12 s
> Compiling gammaloop-tracing-filter-macros v0.1.0 (/build/source/crates/gammaloop-tracing-filter-macros)
435.12 s
> Compiling unic-ucd-version v0.9.0
435.12 s
> Compiling vakint v0.1.2 (/build/source/crates/vakint)
435.12 s
> Compiling unic-char-property v0.9.0
435.12 s
> Compiling gammalooprs v0.3.4 (/build/source/crates/gammalooprs)
435.12 s
> Compiling rustc_version v0.4.1
435.12 s
> Compiling gammaloop-api v0.1.0 (/build/source/crates/gammaloop-api)
435.12 s
> Compiling bincode v1.3.3
435.12 s
> Compiling iai-callgrind-runner v0.14.2
435.12 s
> Compiling phf_generator v0.11.3
435.12 s
> Compiling phf v0.11.3
435.12 s
> Compiling unic-ucd-ident v0.9.0
435.12 s
> Compiling phf_codegen v0.11.3
435.12 s
> Compiling unic-emoji-char v0.9.0
435.12 s
> Compiling gungraun-runner v0.18.2
435.12 s
> Compiling gammaloop-integration-tests v0.1.0 (/build/source/tests)
435.12 s
> Compiling test-log-core v0.2.20
435.12 s
> Compiling wait-timeout v0.2.1
435.12 s
> Compiling bit-vec v0.8.0
435.12 s
> Compiling unicode_names2_generator v1.3.0
435.12 s
> Compiling quick-error v1.2.3
435.12 s
> Compiling iai-callgrind v0.14.2
435.12 s
> Compiling maplit v1.0.2
435.12 s
> Compiling rusty-fork v0.3.1
435.12 s
> Compiling bit-set v0.8.0
435.12 s
> Compiling rustpython-parser v0.4.0
435.12 s
> Compiling iai-callgrind-macros v0.5.1
435.12 s
> Compiling rand_xorshift v0.4.0
435.12 s
> Compiling console v0.15.11
435.12 s
> Compiling gungraun-macros v0.8.0
435.12 s
> Compiling unarray v0.1.4
435.12 s
> Compiling base64 v0.21.7
435.12 s
> Compiling proptest v1.11.0
435.12 s
> Compiling similar-asserts v1.7.0
435.12 s
> Compiling ron v0.8.1
435.12 s
> Compiling kurvst v0.1.0 (/build/source/crates/kurvst)
435.12 s
> Compiling test-log-macros v0.2.20
435.12 s
> Compiling unicode_names2 v1.3.0
435.12 s
> Compiling test-log v0.2.20
435.12 s
> Compiling rustpython-parser-core v0.4.0
435.12 s
> Compiling rustpython-ast v0.4.0
435.12 s
> Compiling pyo3-macros-backend v0.28.3
435.12 s
> Compiling pyo3-ffi v0.28.3
435.12 s
> Compiling pyo3 v0.28.3
435.12 s
> Compiling numpy v0.28.0
435.12 s
> Compiling gungraun v0.18.2
435.12 s
> Compiling pyo3-macros v0.28.3
435.12 s
> Compiling pyo3-stub-gen-derive v0.17.2
435.12 s
> Compiling numerica v2.2.0 (https://github.com/symbolica-dev/symbolica?branch=dev#0441bd7a)
435.12 s
> Compiling pyo3-stub-gen v0.17.2
435.12 s
> Compiling graphica v2.1.0 (https://github.com/symbolica-dev/symbolica?branch=dev#0441bd7a)
435.12 s
> Compiling symbolica-utils v0.1.0 (/build/source/crates/symbolica-utils)
435.12 s
> Compiling linnet v0.17.0 (/build/source/crates/linnet)
435.12 s
> Compiling feynkit-model v0.1.0 (/build/source/crates/feynkit-model)
435.12 s
> Compiling feynkit-ufo v0.1.0 (/build/source/crates/feynkit-ufo)
435.12 s
> Compiling feynkit-kinematics v0.1.0 (/build/source/crates/feynkit-kinematics)
435.12 s
> Compiling feynkit-graph v0.1.0 (/build/source/crates/feynkit-graph)
435.12 s
> Compiling feynkit-cff v0.1.0 (/build/source/crates/feynkit-cff)
435.12 s
> Compiling spenso-macros v0.3.2 (/build/source/crates/spenso-macros)
435.12 s
> Compiling gammaloop-workspace-hack v0.1.0 (/build/source/crates/gammaloop-workspace-hack)
435.12 s
> Compiling spenso v0.6.0 (/build/source/crates/spenso)
435.12 s
> Compiling idenso v0.3.0 (/build/source/crates/idenso)
435.12 s
> Compiling gammaloop-tracing-filter v0.1.0 (/build/source/crates/gammaloop-tracing-filter)
435.12 s
> Compiling spenso-hep-lib v0.1.7 (/build/source/crates/spenso-hep-lib)
435.12 s
> Compiling feynkit-tensor v0.1.0 (/build/source/crates/feynkit-tensor)
435.12 s
> Compiling feynkit-generator v0.1.0 (/build/source/crates/feynkit-generator)
435.12 s
> Compiling spynso3 v0.1.2 (/build/source/crates/spynso3)
435.12 s
> Compiling feynkit v0.1.0 (/build/source/crates/feynkit)
435.12 s
> Compiling feynkit-py v0.1.0 (/build/source/crates/feynkit-py)
435.12 s
> Compiling linnest v0.1.0 (/build/source/crates/linnest)
435.12 s
> Compiling linnet-py v0.1.0 (/build/source/crates/linnet-py)
435.12 s
> Finished `ci-optim` profile [optimized] target(s) in 6m 49s
435.12 s
> warning : the following packages contain code that will be rejected by a future version of Rust: proc-macro-error2 v2.0.1
435.12 s
> note : to see what the problems were, use the option `--future-incompat-report`, or run `cargo report future-incompatibilities --id 1`
435.12 s
> Doc-tests feynkit
435.12 s
>
435.12 s
> running 0 tests
435.12 s
>
435.12 s
> test result: ok. 0 passed; 0 failed; 0 ignored; 0 measured; 0 filtered out; finished in 0.00s
435.12 s
>
435.12 s
> Doc-tests feynkit_cff
435.12 s
>
435.12 s
> running 1 test
435.12 s
> test crates/feynkit-cff/src/lib.rs - (line 10) ... ok
435.12 s
>
435.12 s
> test result: ok. 1 passed; 0 failed; 0 ignored; 0 measured; 0 filtered out; finished in 0.00s
435.12 s
>
435.12 s
> all doctests ran in 1.59s; merged doctests compilation took 1.58s
435.12 s
> Doc-tests feynkit_generator
435.12 s
>
435.12 s
> running 0 tests
435.12 s
>
435.12 s
> test result: ok. 0 passed; 0 failed; 0 ignored; 0 measured; 0 filtered out; finished in 0.00s
435.12 s
>
435.12 s
> Doc-tests feynkit_graph
435.12 s
>
435.12 s
> running 0 tests
435.12 s
>
435.12 s
> test result: ok. 0 passed; 0 failed; 0 ignored; 0 measured; 0 filtered out; finished in 0.00s
435.12 s
>
435.12 s
> Doc-tests feynkit_kinematics
435.12 s
>
435.12 s
> running 0 tests
435.12 s
>
435.12 s
> test result: ok. 0 passed; 0 failed; 0 ignored; 0 measured; 0 filtered out; finished in 0.00s
435.12 s
>
435.12 s
> Doc-tests feynkit_model
435.12 s
>
435.12 s
> running 0 tests
435.12 s
>
435.12 s
> test result: ok. 0 passed; 0 failed; 0 ignored; 0 measured; 0 filtered out; finished in 0.00s
435.12 s
>
435.12 s
> Doc-tests feynkit_py
435.12 s
>
435.12 s
> running 0 tests
435.12 s
>
435.12 s
> test result: ok. 0 passed; 0 failed; 0 ignored; 0 measured; 0 filtered out; finished in 0.00s
435.12 s
>
435.12 s
> Doc-tests feynkit_tensor
435.12 s
>
435.12 s
> running 18 tests
435.12 s
> test crates/feynkit-tensor/src/reduction.rs - reduction::ContractionOrbit (line 65) - compile ... ok
435.12 s
> test crates/feynkit-tensor/src/reduction.rs - reduction::FeynmanDiagramTensorExt (line 943) - compile ... ok
435.12 s
> test crates/feynkit-tensor/src/reduction.rs - reduction::TensorReducer (line 283) - compile ... ok
435.12 s
> test crates/feynkit-tensor/src/reduction.rs - reduction::TensorReducer::reduce (line 421) - compile ... ok
435.12 s
> test crates/feynkit-tensor/src/reduction.rs - reduction::TensorReduction (line 202) - compile ... ok
435.12 s
> test crates/feynkit-tensor/src/reduction.rs - reduction::TensorReduction::expression (line 247) - compile ... ok
435.12 s
> test crates/feynkit-tensor/src/reduction.rs - reduction::TensorReductionTerm (line 145) - compile ... ok
435.12 s
> test crates/feynkit-tensor/src/weingarten.rs - weingarten::OrthogonalWeingarten::coefficient (line 309) - compile ... ok
435.12 s
> test crates/feynkit-tensor/src/weingarten.rs - weingarten::OrthogonalWeingarten::new (line 231) - compile ... ok
435.12 s
> test crates/feynkit-tensor/src/weingarten.rs - weingarten::OrthogonalWeingarten (line 199) - compile ... ok
435.12 s
> test crates/feynkit-tensor/src/weingarten.rs - weingarten::OrthogonalWeingarten::for_rank (line 275) - compile ... ok
435.12 s
> test crates/feynkit-tensor/src/weingarten.rs - weingarten::CosetType (line 34) ... ok
435.12 s
> test crates/feynkit-tensor/src/weingarten.rs - weingarten::CosetType::between_matchings (line 92) ... ok
435.12 s
> test crates/feynkit-tensor/src/weingarten.rs - weingarten::CosetType::class_size (line 152) ... ok
435.12 s
> test crates/feynkit-tensor/src/weingarten.rs - weingarten::CosetType::new (line 55) ... ok
435.12 s
> test crates/feynkit-tensor/src/reduction.rs - reduction::TensorReducer::distribute_summands (line 391) ... ok
435.12 s
> test crates/feynkit-tensor/src/weingarten.rs - weingarten::WeingartenError (line 409) ... FAILED
435.12 s
> test crates/feynkit-tensor/src/weingarten.rs - weingarten::OrthogonalWeingarten::isotropic_pairing_coefficient (line 345) ... FAILED
435.12 s
>
435.12 s
> failures:
435.12 s
>
435.12 s
> ---- crates/feynkit-tensor/src/weingarten.rs - weingarten::WeingartenError (line 409) stdout ----
435.12 s
> Test executable failed (terminated by signal).
435.12 s
>
435.12 s
> stdout:
435.12 s
> ┌────────────────────────────────────────────────────────┐
435.12 s
> │ You are running a restricted Symbolica instance. │
435.12 s
> │ │
435.12 s
> │ This mode is only permitted for non-commercial use and │
435.12 s
> │ is limited to one instance and core per machine. │
435.12 s
> │ │
435.12 s
> │ Hobbyists can easily acquire a free license key │
435.12 s
> │ that unlocks all cores and removes this banner: │
435.12 s
> │ │
435.12 s
> │ from symbolica import * │
435.12 s
> │ request_hobbyist_license('YOUR_NAME', 'YOUR_EMAIL') │
435.12 s
> │ │
435.12 s
> │ All other users can obtain a free 30-day trial key: │
435.12 s
> │ │
435.12 s
> │ from symbolica import * │
435.12 s
> │ request_trial_license('NAME', 'EMAIL', 'EMPLOYER') │
435.12 s
> │ │
435.12 s
> │ See https://symbolica.io/docs/get_started.html#license │
435.12 s
> └────────────────────────────────────────────────────────┘
435.12 s
> ┌───────────────────────────────────────────────────────────────────────────────────────────────────────────┐
435.12 s
> │ Cannot start new unlicensed Symbolica instance since there is already another one running on the machine. │
435.12 s
> └───────────────────────────────────────────────────────────────────────────────────────────────────────────┘
435.12 s
>
435.12 s
> stderr:
435.12 s
> ┌───────────────────────────────────┐
435.12 s
> │ The Symbolica license has expired │
435.12 s
> └───────────────────────────────────┘
435.12 s
>
435.12 s
>
435.12 s
> ---- crates/feynkit-tensor/src/weingarten.rs - weingarten::OrthogonalWeingarten::isotropic_pairing_coefficient (line 345) stdout ----
435.12 s
> Test executable failed (terminated by signal).
435.12 s
>
435.12 s
> stdout:
435.12 s
> ┌────────────────────────────────────────────────────────┐
435.12 s
> │ You are running a restricted Symbolica instance. │
435.12 s
> │ │
435.12 s
> │ This mode is only permitted for non-commercial use and │
435.12 s
> │ is limited to one instance and core per machine. │
435.12 s
> │ │
435.12 s
> │ Hobbyists can easily acquire a free license key │
435.12 s
> │ that unlocks all cores and removes this banner: │
435.12 s
> │ │
435.12 s
> │ from symbolica import * │
435.12 s
> │ request_hobbyist_license('YOUR_NAME', 'YOUR_EMAIL') │
435.12 s
> │ │
435.12 s
> │ All other users can obtain a free 30-day trial key: │
435.12 s
> │ │
435.12 s
> │ from symbolica import * │
435.12 s
> │ request_trial_license('NAME', 'EMAIL', 'EMPLOYER') │
435.12 s
> │ │
435.12 s
> │ See https://symbolica.io/docs/get_started.html#license │
435.12 s
> └────────────────────────────────────────────────────────┘
435.12 s
> ┌───────────────────────────────────────────────────────────────────────────────────────────────────────────┐
435.12 s
> │ Cannot start new unlicensed Symbolica instance since there is already another one running on the machine. │
435.12 s
> └───────────────────────────────────────────────────────────────────────────────────────────────────────────┘
435.12 s
>
435.12 s
> stderr:
435.12 s
> ┌───────────────────────────────────┐
435.12 s
> │ The Symbolica license has expired │
435.12 s
> └───────────────────────────────────┘
435.12 s
>
435.12 s
>
435.12 s
>
435.12 s
> failures:
435.12 s
> crates/feynkit-tensor/src/weingarten.rs - weingarten::OrthogonalWeingarten::isotropic_pairing_coefficient (line 345)
435.12 s
> crates/feynkit-tensor/src/weingarten.rs - weingarten::WeingartenError (line 409)
435.12 s
>
435.12 s
> test result: FAILED. 16 passed; 2 failed; 0 ignored; 0 measured; 0 filtered out; finished in 0.08s
435.12 s
>
435.12 s
> all doctests ran in 2.12s; merged doctests compilation took 2.03s
435.12 s
> error : doctest failed, to rerun pass `-p feynkit-tensor --doc`
435.12 s
For full logs, run:
435.12 s
nix log /nix/store/rib4za6i46s64j5cfq0g9a797kni9p43-gammaloop-workspace-doctest-0.1.0.drv
435.12 s
[0 built (1 failed ), 0.0 Run failed.