test packages.x86_64-linux.nix-ci-check-gammaloop-doctest

Reproduce this run
Retry Run
  1. 0.13 s $ /nix/store/9ypz3flqsrl5xl495mm8h645gadjsxi1-coreutils-9.11/bin/timeout --kill-after=15s 7200s /nix/store/23zk8sgzamrbmj1fday15szf7f2279s8-nix-2.34.7/bin/nix --extra-experimental-features nix-command --extra-experimental-features flakes flake clone git+https://github.com/alphal00p/gammaloop --dest /tmp/nix-ci-worker/stable-pwd/repo/
  2. 0.14 s Cloning into '/tmp/nix-ci-worker/stable-pwd/repo'...
  3. 1.61 s remote: Enumerating objects: 66383, done.
  4. 1.86 s remote: Counting objects: 0% (1/9055) remote: Counting objects: 1% (91/9055) remote: Counting objects: 2% (182/9055) remote: Counting objects: 3% (272/9055) remote: Counting objects: 4% (363/9055) remote: Counting objects: 5% (453/9055) remote: Counting objects: 6% (544/9055) remote: Counting objects: 7% (634/9055) remote: Counting objects: 8% (725/9055) remote: Counting objects: 9% (815/9055) remote: Counting objects: 10% (906/9055) remote: Counting objects: 11% (997/9055) remote: Counting objects: 12% (1087/9055) remote: Counting objects: 13% (1178/9055) remote: Counting objects: 14% (1268/9055) remote: Counting objects: 15% (1359/9055) remote: Counting objects: 16% (1449/9055) remote: Counting objects: 17% (1540/9055) remote: Counting objects: 18% (1630/9055) remote: Counting objects: 19% (1721/9055) remote: Counting objects: 20% (1811/9055) remote: Counting objects: 21% (1902/9055) remote: Counting objects: 22% (1993/9055) remote: Counting objects: 23% (2083/9055) remote: Counting objects: 24% (2174/9055) remote: Counting objects: 25% (2264/9055) remote: Counting objects: 26% (2355/9055) remote: Counting objects: 27% (2445/9055) remote: Counting objects: 28% (2536/9055) remote: Counting objects: 29% (2626/9055) remote: Counting objects: 30% (2717/9055) remote: Counting objects: 31% (2808/9055) remote: Counting objects: 32% (2898/9055) remote: Counting objects: 33% (2989/9055) remote: Counting objects: 34% (3079/9055) remote: Counting objects: 35% (3170/9055) remote: Counting objects: 36% (3260/9055) remote: Counting objects: 37% (3351/9055) remote: Counting objects: 38% (3441/9055) remote: Counting objects: 39% (3532/9055) remote: Counting objects: 40% (3622/9055) remote: Counting objects: 41% (3713/9055) remote: Counting objects: 42% (3804/9055) remote: Counting objects: 43% (3894/9055) remote: Counting objects: 44% (3985/9055) remote: Counting objects: 45% (4075/9055) remote: Counting objects: 46% (4166/9055) remote: Counting objects: 47% (4256/9055) remote: Counting objects: 48% (4347/9055) remote: Counting objects: 49% (4437/9055) remote: Counting objects: 50% (4528/9055) remote: Counting objects: 51% (4619/9055) remote: Counting objects: 52% (4709/9055) remote: Counting objects: 53% (4800/9055) remote: Counting objects: 54% (4890/9055) remote: Counting objects: 55% (4981/9055) remote: Counting objects: 56% (5071/9055) remote: Counting objects: 57% (5162/9055) remote: Counting objects: 58% (5252/9055) remote: Counting objects: 59% (5343/9055) remote: Counting objects: 60% (5433/9055) remote: Counting objects: 61% (5524/9055) remote: Counting objects: 62% (5615/9055) remote: Counting objects: 63% (5705/9055) remote: Counting objects: 64% (5796/9055) remote: Counting objects: 65% (5886/9055) remote: Counting objects: 66% (5977/9055) remote: Counting objects: 67% (6067/9055) remote: Counting objects: 68% (6158/9055) remote: Counting objects: 69% (6248/9055) remote: Counting objects: 70% (6339/9055) remote: Counting objects: 71% (6430/9055) remote: Counting objects: 72% (6520/9055) remote: Counting objects: 73% (6611/9055) remote: Counting objects: 74% (6701/9055) remote: Counting objects: 75% (6792/9055) remote: Counting objects: 76% (6882/9055) remote: Counting objects: 77% (6973/9055) remote: Counting objects: 78% (7063/9055) remote: Counting objects: 79% (7154/9055) remote: Counting objects: 80% (7244/9055) remote: Counting objects: 81% (7335/9055) remote: Counting objects: 82% (7426/9055) remote: Counting objects: 83% (7516/9055) remote: Counting objects: 84% (7607/9055) remote: Counting objects: 85% (7697/9055) remote: Counting objects: 86% (7788/9055) remote: Counting objects: 87% (7878/9055) remote: Counting objects: 88% (7969/9055) remote: Counting objects: 89% (8059/9055) remote: Counting objects: 90% (8150/9055) remote: Counting objects: 91% (8241/9055) remote: Counting objects: 92% (8331/9055) remote: Counting objects: 93% (8422/9055) remote: Counting objects: 94% (8512/9055) remote: Counting objects: 95% (8603/9055) remote: Counting objects: 96% (8693/9055) remote: Counting objects: 97% (8784/9055) remote: Counting objects: 98% (8874/9055) remote: Counting objects: 99% (8965/9055) remote: Counting objects: 100% (9055/9055) remote: Counting objects: 100% (9055/9055), done.
  5. 4.44 s remote: Compressing objects: 0% (1/2136) remote: Compressing objects: 1% (22/2136) remote: Compressing objects: 2% (43/2136) remote: Compressing objects: 3% (65/2136) remote: Compressing objects: 4% (86/2136) remote: Compressing objects: 5% (107/2136) remote: Compressing objects: 6% (129/2136) remote: Compressing objects: 7% (150/2136) remote: Compressing objects: 8% (171/2136) remote: Compressing objects: 9% (193/2136) remote: Compressing objects: 10% (214/2136) remote: Compressing objects: 11% (235/2136) remote: Compressing objects: 12% (257/2136) remote: Compressing objects: 13% (278/2136) remote: Compressing objects: 14% (300/2136) remote: Compressing objects: 15% (321/2136) remote: Compressing objects: 16% (342/2136) remote: Compressing objects: 17% (364/2136) remote: Compressing objects: 18% (385/2136) remote: Compressing objects: 19% (406/2136) remote: Compressing objects: 20% (428/2136) remote: Compressing objects: 20% (444/2136) remote: Compressing objects: 21% (449/2136) remote: Compressing objects: 22% (470/2136) remote: Compressing objects: 23% (492/2136) remote: Compressing objects: 24% (513/2136) remote: Compressing objects: 25% (534/2136) remote: Compressing objects: 26% (556/2136) remote: Compressing objects: 26% (567/2136) remote: Compressing objects: 27% (577/2136) remote: Compressing objects: 28% (599/2136) remote: Compressing objects: 29% (620/2136) remote: Compressing objects: 30% (641/2136) remote: Compressing objects: 31% (663/2136) remote: Compressing objects: 32% (684/2136) remote: Compressing objects: 33% (705/2136) remote: Compressing objects: 34% (727/2136) remote: Compressing objects: 35% (748/2136) remote: Compressing objects: 36% (769/2136) remote: Compressing objects: 37% (791/2136) remote: Compressing objects: 38% (812/2136) remote: Compressing objects: 39% (834/2136) remote: Compressing objects: 40% (855/2136) remote: Compressing objects: 41% (876/2136) remote: Compressing objects: 42% (898/2136) remote: Compressing objects: 43% (919/2136) remote: Compressing objects: 44% (940/2136) remote: Compressing objects: 45% (962/2136) remote: Compressing objects: 46% (983/2136) remote: Compressing objects: 47% (1004/2136) remote: Compressing objects: 48% (1026/2136) remote: Compressing objects: 49% (1047/2136) remote: Compressing objects: 50% (1068/2136) remote: Compressing objects: 51% (1090/2136) remote: Compressing objects: 52% (1111/2136) remote: Compressing objects: 53% (1133/2136) remote: Compressing objects: 54% (1154/2136) remote: Compressing objects: 55% (1175/2136) remote: Compressing objects: 56% (1197/2136) remote: Compressing objects: 57% (1218/2136) remote: Compressing objects: 58% (1239/2136) remote: Compressing objects: 59% (1261/2136) remote: Compressing objects: 60% (1282/2136) remote: Compressing objects: 61% (1303/2136) remote: Compressing objects: 62% (1325/2136) remote: Compressing objects: 63% (1346/2136) remote: Compressing objects: 64% (1368/2136) remote: Compressing objects: 65% (1389/2136) remote: Compressing objects: 66% (1410/2136) remote: Compressing objects: 67% (1432/2136) remote: Compressing objects: 68% (1453/2136) remote: Compressing objects: 69% (1474/2136) remote: Compressing objects: 70% (1496/2136) remote: Compressing objects: 71% (1517/2136) remote: Compressing objects: 72% (1538/2136) remote: Compressing objects: 73% (1560/2136) remote: Compressing objects: 74% (1581/2136) remote: Compressing objects: 75% (1602/2136) remote: Compressing objects: 76% (1624/2136) remote: Compressing objects: 77% (1645/2136) remote: Compressing objects: 78% (1667/2136) remote: Compressing objects: 79% (1688/2136) remote: Compressing objects: 80% (1709/2136) remote: Compressing objects: 81% (1731/2136) remote: Compressing objects: 82% (1752/2136) remote: Compressing objects: 83% (1773/2136) remote: Compressing objects: 84% (1795/2136) remote: Compressing objects: 85% (1816/2136) remote: Compressing objects: 86% (1837/2136) remote: Compressing objects: 87% (1859/2136) remote: Compressing objects: 88% (1880/2136) remote: Compressing objects: 89% (1902/2136) remote: Compressing objects: 90% (1923/2136) remote: Compressing objects: 91% (1944/2136) remote: Compressing objects: 92% (1966/2136) remote: Compressing objects: 93% (1987/2136) remote: Compressing objects: 94% (2008/2136) remote: Compressing objects: 95% (2030/2136) remote: Compressing objects: 96% (2051/2136) remote: Compressing objects: 97% (2072/2136) remote: Compressing objects: 98% (2094/2136) remote: Compressing objects: 99% (2115/2136) remote: Compressing objects: 100% (2136/2136) remote: Compressing objects: 100% (2136/2136), done.
  6. 7.87 s Receiving objects: 0% (1/66383) Receiving objects: 1% (664/66383) Receiving objects: 2% (1328/66383) Receiving objects: 3% (1992/66383) Receiving objects: 4% (2656/66383) Receiving objects: 5% (3320/66383) Receiving objects: 6% (3983/66383) Receiving objects: 7% (4647/66383) Receiving objects: 8% (5311/66383), 9.09 MiB | 18.17 MiB/s Receiving objects: 9% (5975/66383), 9.09 MiB | 18.17 MiB/s Receiving objects: 10% (6639/66383), 9.09 MiB | 18.17 MiB/s Receiving objects: 11% (7303/66383), 9.09 MiB | 18.17 MiB/s Receiving objects: 12% (7966/66383), 9.09 MiB | 18.17 MiB/s Receiving objects: 13% (8630/66383), 9.09 MiB | 18.17 MiB/s Receiving objects: 14% (9294/66383), 9.09 MiB | 18.17 MiB/s Receiving objects: 15% (9958/66383), 9.09 MiB | 18.17 MiB/s Receiving objects: 16% (10622/66383), 9.09 MiB | 18.17 MiB/s Receiving objects: 17% (11286/66383), 9.09 MiB | 18.17 MiB/s Receiving objects: 18% (11949/66383), 9.09 MiB | 18.17 MiB/s Receiving objects: 19% (12613/66383), 9.09 MiB | 18.17 MiB/s Receiving objects: 20% (13277/66383), 9.09 MiB | 18.17 MiB/s Receiving objects: 20% (13324/66383), 9.09 MiB | 18.17 MiB/s Receiving objects: 21% (13941/66383), 19.91 MiB | 19.91 MiB/s Receiving objects: 22% (14605/66383), 19.91 MiB | 19.91 MiB/s Receiving objects: 23% (15269/66383), 19.91 MiB | 19.91 MiB/s Receiving objects: 24% (15932/66383), 19.91 MiB | 19.91 MiB/s Receiving objects: 25% (16596/66383), 19.91 MiB | 19.91 MiB/s Receiving objects: 26% (17260/66383), 19.91 MiB | 19.91 MiB/s Receiving objects: 27% (17924/66383), 19.91 MiB | 19.91 MiB/s Receiving objects: 28% (18588/66383), 19.91 MiB | 19.91 MiB/s Receiving objects: 29% (19252/66383), 19.91 MiB | 19.91 MiB/s Receiving objects: 30% (19915/66383), 19.91 MiB | 19.91 MiB/s Receiving objects: 31% (20579/66383), 19.91 MiB | 19.91 MiB/s Receiving objects: 32% (21243/66383), 19.91 MiB | 19.91 MiB/s Receiving objects: 33% (21907/66383), 19.91 MiB | 19.91 MiB/s Receiving objects: 34% (22571/66383), 19.91 MiB | 19.91 MiB/s Receiving objects: 35% (23235/66383), 19.91 MiB | 19.91 MiB/s Receiving objects: 36% (23898/66383), 19.91 MiB | 19.91 MiB/s Receiving objects: 37% (24562/66383), 19.91 MiB | 19.91 MiB/s Receiving objects: 38% (25226/66383), 19.91 MiB | 19.91 MiB/s Receiving objects: 39% (25890/66383), 19.91 MiB | 19.91 MiB/s Receiving objects: 40% (26554/66383), 19.91 MiB | 19.91 MiB/s Receiving objects: 41% (27218/66383), 19.91 MiB | 19.91 MiB/s Receiving objects: 42% (27881/66383), 19.91 MiB | 19.91 MiB/s Receiving objects: 43% (28545/66383), 19.91 MiB | 19.91 MiB/s Receiving objects: 44% (29209/66383), 19.91 MiB | 19.91 MiB/s Receiving objects: 45% (29873/66383), 19.91 MiB | 19.91 MiB/s Receiving objects: 46% (30537/66383), 19.91 MiB | 19.91 MiB/s Receiving objects: 47% (31201/66383), 19.91 MiB | 19.91 MiB/s Receiving objects: 48% (31864/66383), 19.91 MiB | 19.91 MiB/s Receiving objects: 49% (32528/66383), 19.91 MiB | 19.91 MiB/s Receiving objects: 50% (33192/66383), 19.91 MiB | 19.91 MiB/s Receiving objects: 51% (33856/66383), 19.91 MiB | 19.91 MiB/s Receiving objects: 52% (34520/66383), 19.91 MiB | 19.91 MiB/s Receiving objects: 53% (35183/66383), 19.91 MiB | 19.91 MiB/s Receiving objects: 54% (35847/66383), 19.91 MiB | 19.91 MiB/s Receiving objects: 55% (36511/66383), 19.91 MiB | 19.91 MiB/s Receiving objects: 56% (37175/66383), 19.91 MiB | 19.91 MiB/s Receiving objects: 57% (37839/66383), 39.12 MiB | 26.08 MiB/s Receiving objects: 58% (38503/66383), 39.12 MiB | 26.08 MiB/s Receiving objects: 59% (39166/66383), 39.12 MiB | 26.08 MiB/s Receiving objects: 60% (39830/66383), 39.12 MiB | 26.08 MiB/s Receiving objects: 61% (40494/66383), 39.12 MiB | 26.08 MiB/s Receiving objects: 62% (41158/66383), 39.12 MiB | 26.08 MiB/s Receiving objects: 63% (41822/66383), 39.12 MiB | 26.08 MiB/s Receiving objects: 64% (42486/66383), 39.12 MiB | 26.08 MiB/s Receiving objects: 65% (43149/66383), 39.12 MiB | 26.08 MiB/s Receiving objects: 66% (43813/66383), 39.12 MiB | 26.08 MiB/s Receiving objects: 67% (44477/66383), 39.12 MiB | 26.08 MiB/s Receiving objects: 67% (44940/66383), 54.19 MiB | 27.09 MiB/s Receiving objects: 68% (45141/66383), 54.19 MiB | 27.09 MiB/s Receiving objects: 69% (45805/66383), 54.19 MiB | 27.09 MiB/s Receiving objects: 70% (46469/66383), 54.19 MiB | 27.09 MiB/s Receiving objects: 71% (47132/66383), 54.19 MiB | 27.09 MiB/s Receiving objects: 72% (47796/66383), 54.19 MiB | 27.09 MiB/s Receiving objects: 73% (48460/66383), 54.19 MiB | 27.09 MiB/s Receiving objects: 74% (49124/66383), 54.19 MiB | 27.09 MiB/s Receiving objects: 75% (49788/66383), 54.19 MiB | 27.09 MiB/s Receiving objects: 76% (50452/66383), 69.51 MiB | 27.80 MiB/s Receiving objects: 77% (51115/66383), 69.51 MiB | 27.80 MiB/s Receiving objects: 78% (51779/66383), 69.51 MiB | 27.80 MiB/s Receiving objects: 79% (52443/66383), 69.51 MiB | 27.80 MiB/s Receiving objects: 80% (53107/66383), 69.51 MiB | 27.80 MiB/s Receiving objects: 81% (53771/66383), 69.51 MiB | 27.80 MiB/s Receiving objects: 82% (54435/66383), 69.51 MiB | 27.80 MiB/s Receiving objects: 83% (55098/66383), 69.51 MiB | 27.80 MiB/s Receiving objects: 84% (55762/66383), 69.51 MiB | 27.80 MiB/s Receiving objects: 85% (56426/66383), 69.51 MiB | 27.80 MiB/s Receiving objects: 86% (57090/66383), 69.51 MiB | 27.80 MiB/s Receiving objects: 87% (57754/66383), 69.51 MiB | 27.80 MiB/s Receiving objects: 88% (58418/66383), 69.51 MiB | 27.80 MiB/s Receiving objects: 89% (59081/66383), 69.51 MiB | 27.80 MiB/s Receiving objects: 90% (59745/66383), 69.51 MiB | 27.80 MiB/s Receiving objects: 91% (60409/66383), 69.51 MiB | 27.80 MiB/s Receiving objects: 92% (61073/66383), 69.51 MiB | 27.80 MiB/s Receiving objects: 93% (61737/66383), 69.51 MiB | 27.80 MiB/s Receiving objects: 94% (62401/66383), 69.51 MiB | 27.80 MiB/s Receiving objects: 94% (62772/66383), 69.51 MiB | 27.80 MiB/s Receiving objects: 95% (63064/66383), 85.27 MiB | 28.42 MiB/s Receiving objects: 96% (63728/66383), 85.27 MiB | 28.42 MiB/s Receiving objects: 97% (64392/66383), 85.27 MiB | 28.42 MiB/s Receiving objects: 98% (65056/66383), 85.27 MiB | 28.42 MiB/s Receiving objects: 99% (65720/66383), 85.27 MiB | 28.42 MiB/s remote: Total 66383 (delta 7324), reused 7289 (delta 6632), pack-reused 57328 (from 1)
  7. 7.88 s Receiving objects: 100% (66383/66383), 85.27 MiB | 28.42 MiB/s Receiving objects: 100% (66383/66383), 98.68 MiB | 28.81 MiB/s, done.
  8. 9.10 s Resolving deltas: 0% (0/46421) Resolving deltas: 1% (466/46421) Resolving deltas: 2% (929/46421) Resolving deltas: 3% (1393/46421) Resolving deltas: 4% (1857/46421) Resolving deltas: 5% (2322/46421) Resolving deltas: 6% (2786/46421) Resolving deltas: 7% (3251/46421) Resolving deltas: 8% (3715/46421) Resolving deltas: 9% (4178/46421) Resolving deltas: 10% (4643/46421) Resolving deltas: 11% (5107/46421) Resolving deltas: 12% (5572/46421) Resolving deltas: 13% (6035/46421) Resolving deltas: 14% (6499/46421) Resolving deltas: 15% (6964/46421) Resolving deltas: 16% (7428/46421) Resolving deltas: 17% (7892/46421) Resolving deltas: 18% (8356/46421) Resolving deltas: 19% (8821/46421) Resolving deltas: 20% (9285/46421) Resolving deltas: 21% (9749/46421) Resolving deltas: 22% (10213/46421) Resolving deltas: 23% (10677/46421) Resolving deltas: 24% (11142/46421) Resolving deltas: 25% (11606/46421) Resolving deltas: 26% (12070/46421) Resolving deltas: 27% (12534/46421) Resolving deltas: 28% (12998/46421) Resolving deltas: 29% (13464/46421) Resolving deltas: 30% (13927/46421) Resolving deltas: 31% (14391/46421) Resolving deltas: 32% (14855/46421) Resolving deltas: 33% (15319/46421) Resolving deltas: 34% (15784/46421) Resolving deltas: 35% (16248/46421) Resolving deltas: 36% (16712/46421) Resolving deltas: 37% (17179/46421) Resolving deltas: 38% (17640/46421) Resolving deltas: 39% (18105/46421) Resolving deltas: 40% (18569/46421) Resolving deltas: 41% (19033/46421) Resolving deltas: 42% (19497/46421) Resolving deltas: 43% (19962/46421) Resolving deltas: 44% (20427/46421) Resolving deltas: 45% (20890/46421) Resolving deltas: 46% (21354/46421) Resolving deltas: 47% (21818/46421) Resolving deltas: 48% (22284/46421) Resolving deltas: 49% (22747/46421) Resolving deltas: 50% (23211/46421) Resolving deltas: 51% (23675/46421) Resolving deltas: 52% (24139/46421) Resolving deltas: 53% (24604/46421) Resolving deltas: 54% (25068/46421) Resolving deltas: 55% (25534/46421) Resolving deltas: 56% (25996/46421) Resolving deltas: 57% (26460/46421) Resolving deltas: 58% (26925/46421) Resolving deltas: 59% (27389/46421) Resolving deltas: 60% (27853/46421) Resolving deltas: 61% (28317/46421) Resolving deltas: 62% (28784/46421) Resolving deltas: 63% (29246/46421) Resolving deltas: 64% (29710/46421) Resolving deltas: 65% (30174/46421) Resolving deltas: 66% (30638/46421) Resolving deltas: 67% (31103/46421) Resolving deltas: 68% (31567/46421) Resolving deltas: 69% (32031/46421) Resolving deltas: 70% (32495/46421) Resolving deltas: 71% (32960/46421) Resolving deltas: 72% (33424/46421) Resolving deltas: 73% (33889/46421) Resolving deltas: 74% (34352/46421) Resolving deltas: 75% (34816/46421) Resolving deltas: 76% (35280/46421) Resolving deltas: 77% (35746/46421) Resolving deltas: 78% (36213/46421) Resolving deltas: 79% (36673/46421) Resolving deltas: 80% (37137/46421) Resolving deltas: 81% (37604/46421) Resolving deltas: 81% (37641/46421) Resolving deltas: 82% (38066/46421) Resolving deltas: 83% (38530/46421) Resolving deltas: 84% (38994/46421) Resolving deltas: 85% (39458/46421) Resolving deltas: 86% (39923/46421) Resolving deltas: 87% (40387/46421) Resolving deltas: 88% (40851/46421) Resolving deltas: 89% (41315/46421) Resolving deltas: 90% (41779/46421) Resolving deltas: 91% (42244/46421) Resolving deltas: 92% (42708/46421) Resolving deltas: 93% (43172/46421) Resolving deltas: 94% (43636/46421) Resolving deltas: 95% (44100/46421) Resolving deltas: 96% (44566/46421) Resolving deltas: 97% (45029/46421) Resolving deltas: 98% (45493/46421) Resolving deltas: 99% (45957/46421) Resolving deltas: 100% (46421/46421) Resolving deltas: 100% (46421/46421), done.
  9. 10.87 s Fetching commit 6eccc26fe47651addfae2f810918809139129a5c for feynkit ...
  10. 10.87 s $ /nix/store/bcnisk3ydfgv26v2gw3zlky24g00yww2-git-2.54.0/bin/git fetch origin 6eccc26fe47651addfae2f810918809139129a5c
  11. 11.36 s From https://github.com/alphal00p/gammaloop
  12. 11.36 s * branch 6eccc26fe47651addfae2f810918809139129a5c -> FETCH_HEAD
  13. 11.38 s $ /nix/store/9ypz3flqsrl5xl495mm8h645gadjsxi1-coreutils-9.11/bin/timeout --kill-after=15s 7200s /nix/store/bcnisk3ydfgv26v2gw3zlky24g00yww2-git-2.54.0/bin/git -c advice.detachedHead=false checkout 6eccc26fe47651addfae2f810918809139129a5c
  14. 11.62 s HEAD is now at 6eccc26fe fix feynkit tensor bridge integration
  15. 11.62 s $ /nix/store/9ypz3flqsrl5xl495mm8h645gadjsxi1-coreutils-9.11/bin/timeout --kill-after=15s 7200s /nix/store/23zk8sgzamrbmj1fday15szf7f2279s8-nix-2.34.7/bin/nix --extra-experimental-features nix-command --extra-experimental-features flakes --log-format internal-json run .#packages.x86_64-linux.nix-ci-check-gammaloop-doctest --print-build-logs
  16. 15.91 s
  17. 16.36 s Downloading cached ShellCheck from https://cache.nix-ci.com
  18. 16.37 s Downloading cached boehm-gc from https://cache.nix-ci.com
  19. 16.37 s Downloading cached busybox from https://cache.nix-ci.com
  20. 16.38 s Downloading cached aws-c-common from https://cache.nix-ci.com
  21. 16.38 s Downloading cached editline-1.17.1-unstable-2025-05 from https://cache.nix-ci.com
  22. 16.38 s Downloading cached libarchive-3.8.8-lib from https://cache.nix-ci.com
  23. 16.38 s Downloading cached libcpuid from https://cache.nix-ci.com
  24. 16.38 s Downloading cached libgit2-1.9.4-lib from https://cache.nix-ci.com
  25. 16.38 s Downloading cached libseccomp-2.6.0-lib from https://cache.nix-ci.com
  26. 16.38 s Downloading cached libsodium-1.0.22-unstable-2026-04 from https://cache.nix-ci.com
  27. 16.38 s Downloading cached lowdown-3.0.1-lib from https://cache.nix-ci.com
  28. 16.38 s Downloading cached s2n-tls from https://cache.nix-ci.com
  29. 16.38 s Downloading cached hwloc-2.14.0-lib from https://cache.nix-ci.com
  30. 16.40 s Downloaded cached editline-1.17.1-unstable-2025-05 (58 KiB) in 26ms
  31. 16.40 s Progress: 0 of 3 built, 1 of 36 downloaded from cache (12 downloading)
  32. 16.40 s Downloaded cached libseccomp-2.6.0-lib (193 KiB) in 28ms
  33. 16.40 s Progress: 0 of 3 built, 2 of 36 downloaded from cache (11 downloading)
  34. 16.41 s Downloaded cached libcpuid (326 KiB) in 34ms
  35. 16.41 s Progress: 0 of 3 built, 3 of 36 downloaded from cache (10 downloading)
  36. 16.42 s Downloaded cached boehm-gc (312 KiB) in 41ms
  37. 16.42 s Progress: 0 of 3 built, 4 of 36 downloaded from cache (9 downloading)
  38. 16.42 s Downloaded cached busybox (230 KiB) in 43ms
  39. 16.42 s Progress: 0 of 3 built, 5 of 36 downloaded from cache (8 downloading)
  40. 16.42 s Downloaded cached aws-c-common (1.1 MiB) in 44ms
  41. 16.42 s Progress: 0 of 3 built, 6 of 36 downloaded from cache (7 downloading)
  42. 16.42 s Downloading cached aws-c-cal from https://cache.nix-ci.com
  43. 16.42 s Downloading cached aws-c-compression from https://cache.nix-ci.com
  44. 16.42 s Downloading cached aws-c-sdkutils from https://cache.nix-ci.com
  45. 16.42 s Downloading cached aws-checksums from https://cache.nix-ci.com
  46. 16.43 s Downloaded cached lowdown-3.0.1-lib (341 KiB) in 55ms
  47. 16.43 s Progress: 0 of 3 built, 7 of 36 downloaded from cache (10 downloading)
  48. 16.43 s Downloaded cached hwloc-2.14.0-lib (459 KiB) in 55ms
  49. 16.43 s Progress: 0 of 3 built, 8 of 36 downloaded from cache (9 downloading)
  50. 16.43 s Downloading cached onetbb from https://cache.nix-ci.com
  51. 16.43 s Downloaded cached libsodium-1.0.22-unstable-2026-04 (666 KiB) in 56ms
  52. 16.43 s Progress: 0 of 3 built, 9 of 36 downloaded from cache (9 downloading)
  53. 16.44 s Downloaded cached libarchive-3.8.8-lib (953 KiB) in 60ms
  54. 16.44 s Progress: 0 of 3 built, 10 of 36 downloaded from cache (8 downloading)
  55. 16.44 s Downloaded cached s2n-tls (1.3 MiB) in 59ms
  56. 16.44 s Progress: 0 of 3 built, 11 of 36 downloaded from cache (7 downloading)
  57. 16.44 s Downloaded cached libgit2-1.9.4-lib (1.6 MiB) in 62ms
  58. 16.44 s Progress: 0 of 3 built, 12 of 36 downloaded from cache (6 downloading)
  59. 16.44 s Downloaded cached aws-checksums (86 KiB) in 20ms
  60. 16.44 s Progress: 0 of 3 built, 13 of 36 downloaded from cache (5 downloading)
  61. 16.44 s Downloaded cached aws-c-compression (31 KiB) in 21ms
  62. 16.44 s Progress: 0 of 3 built, 14 of 36 downloaded from cache (4 downloading)
  63. 16.44 s Downloaded cached aws-c-sdkutils (155 KiB) in 21ms
  64. 16.44 s Progress: 0 of 3 built, 15 of 36 downloaded from cache (3 downloading)
  65. 16.44 s Downloaded cached aws-c-cal (158 KiB) in 22ms
  66. 16.44 s Progress: 0 of 3 built, 16 of 36 downloaded from cache (2 downloading)
  67. 16.44 s Downloading cached aws-c-io from https://cache.nix-ci.com
  68. 16.45 s Downloaded cached ShellCheck (7.5 MiB) in 87ms
  69. 16.45 s Progress: 0 of 3 built, 17 of 36 downloaded from cache (2 downloading)
  70. 16.45 s Downloaded cached onetbb (626 KiB) in 16ms
  71. 16.45 s Progress: 0 of 2 built, 18 of 36 downloaded from cache (1 downloading)
  72. 16.45 s Downloading cached libblake3 from https://cache.nix-ci.com
  73. 16.46 s Downloaded cached aws-c-io (648 KiB) in 19ms
  74. 16.46 s Progress: 0 of 2 built, 19 of 36 downloaded from cache (1 downloading)
  75. 16.46 s Downloading cached aws-c-event-stream from https://cache.nix-ci.com
  76. 16.46 s Downloading cached aws-c-http from https://cache.nix-ci.com
  77. 16.46 s Downloaded cached libblake3 (117 KiB) in 14ms
  78. 16.46 s Progress: 0 of 2 built, 20 of 36 downloaded from cache (2 downloading)
  79. 16.46 s Downloading cached nix-util from https://cache.nix-ci.com
  80. 16.49 s Downloaded cached nix-util (2.4 MiB) in 23ms
  81. 16.49 s Progress: 0 of 2 built, 21 of 36 downloaded from cache (2 downloading)
  82. 16.49 s Downloaded cached aws-c-event-stream (176 KiB) in 24ms
  83. 16.49 s Progress: 0 of 2 built, 22 of 36 downloaded from cache (2 downloading)
  84. 16.49 s Downloading cached nix-nswrapper from https://cache.nix-ci.com
  85. 16.49 s Downloaded cached aws-c-http (641 KiB) in 24ms
  86. 16.49 s Progress: 0 of 2 built, 23 of 36 downloaded from cache (1 downloading)
  87. 16.49 s Downloading cached aws-c-auth from https://cache.nix-ci.com
  88. 16.49 s Downloading cached aws-c-mqtt from https://cache.nix-ci.com
  89. 16.50 s Downloaded cached aws-c-auth (387 KiB) in 14ms
  90. 16.50 s Progress: 0 of 2 built, 24 of 36 downloaded from cache (2 downloading)
  91. 16.50 s Downloading cached aws-c-s3 from https://cache.nix-ci.com
  92. 16.51 s Downloaded cached aws-c-mqtt (557 KiB) in 17ms
  93. 16.51 s Progress: 0 of 2 built, 25 of 36 downloaded from cache (2 downloading)
  94. 16.52 s Downloaded cached aws-c-s3 (384 KiB) in 14ms
  95. 16.52 s Progress: 0 of 2 built, 26 of 36 downloaded from cache (1 downloading)
  96. 16.52 s Downloading cached aws-crt-cpp from https://cache.nix-ci.com
  97. 16.53 s Downloaded cached aws-crt-cpp (979 KiB) in 16ms
  98. 16.54 s Progress: 0 of 2 built, 27 of 36 downloaded from cache (1 downloading)
  99. 16.54 s Downloading cached nix-store from https://cache.nix-ci.com
  100. 16.57 s Downloaded cached nix-store (5.8 MiB) in 33ms
  101. 16.57 s Progress: 0 of 2 built, 28 of 36 downloaded from cache (1 downloading)
  102. 16.57 s Downloading cached nix-fetchers from https://cache.nix-ci.com
  103. 16.57 s Downloading cached nix-main from https://cache.nix-ci.com
  104. 16.59 s Downloaded cached nix-main (393 KiB) in 18ms
  105. 16.59 s Progress: 0 of 2 built, 29 of 36 downloaded from cache (2 downloading)
  106. 16.59 s Downloaded cached nix-fetchers (1.5 MiB) in 19ms
  107. 16.59 s Progress: 0 of 2 built, 30 of 36 downloaded from cache (1 downloading)
  108. 16.59 s Downloading cached nix-expr from https://cache.nix-ci.com
  109. 16.59 s Downloaded cached nix-nswrapper (131 KiB) in 102ms
  110. 16.59 s Progress: 0 of 2 built, 31 of 36 downloaded from cache (1 downloading)
  111. 16.61 s Downloaded cached nix-expr (3.3 MiB) in 23ms
  112. 16.61 s Progress: 0 of 2 built, 32 of 36 downloaded from cache
  113. 16.61 s Downloading cached nix-flake from https://cache.nix-ci.com
  114. 16.63 s Downloaded cached nix-flake (956 KiB) in 15ms
  115. 16.63 s Progress: 0 of 2 built, 33 of 36 downloaded from cache
  116. 16.63 s Downloading cached nix-cmd from https://cache.nix-ci.com
  117. 16.64 s Downloaded cached nix-cmd (1 MiB) in 14ms
  118. 16.64 s Progress: 0 of 2 built, 34 of 36 downloaded from cache
  119. 16.64 s Downloading cached nix from https://cache.nix-ci.com
  120. 16.67 s Downloaded cached nix (3.9 MiB) in 31ms
  121. 16.67 s Progress: 0 of 2 built, 35 of 36 downloaded from cache
  122. 16.67 s Downloading cached nix from https://cache.nix-ci.com
  123. 16.69 s Downloaded cached nix (8848 B) in 14ms
  124. 16.69 s Progress: 0 of 2 built, 36 of 36 downloaded from cache
  125. 17.28 s Building /nix/store/k98jfa8v8vmy9b91bbhdlkd9w1w7nmls-nix-ci-check-gammaloop-doctest.drv
  126. 17.41 s [nix-ci-check-gammaloop-doctest:post-build] Uploading to the NixCI cache: /nix/store/fqv11695ardnsgp4a6dxils8bdvk7ibw-nix-ci-check-gammaloop-doctest
  127. 17.48 s [nix-ci-check-gammaloop-doctest:post-build] warning: 'warn-short-path-literals' is deprecated, use 'lint-short-path-literals = ignore' instead
  128. 17.52 s [nix-ci-check-gammaloop-doctest:post-build] copying 1 paths...
  129. 17.52 s [nix-ci-check-gammaloop-doctest:post-build] copying path '/nix/store/fqv11695ardnsgp4a6dxils8bdvk7ibw-nix-ci-check-gammaloop-doctest' to 'https://cache.nix-ci.com'...
  130. 17.98 s [nix-ci-check-gammaloop-doctest:post-build] warning: 'warn-short-path-literals' is deprecated, use 'lint-short-path-literals = ignore' instead
  131. 19.53 s [nix-ci-check-gammaloop-doctest:post-build] copying 1 paths...
  132. 19.53 s [nix-ci-check-gammaloop-doctest:post-build] copying path '/nix/store/k98jfa8v8vmy9b91bbhdlkd9w1w7nmls-nix-ci-check-gammaloop-doctest.drv' to 'https://cache.nix-ci.com'...
  133. 19.71 s Uploaded nix-ci-check-gammaloop-doctest in 2.3s
  134. 19.71 s Progress: 1 of 2 built, 36 of 36 downloaded from cache
  135. 19.71 s Built nix-ci-check-gammaloop-doctest in 2.4s
  136. 19.71 s Progress: 2 of 2 built, 36 of 36 downloaded from cache
  137. 22.29 s evaluating derivation 'g copying '/nix/store/jirn evaluating derivation 'g querying gammaloop-works [0/1 built, 0.0 KiB DL] [1/0/1 built, 0.0 KiB DLgammaloop-workspace-doctest> Running phase: unpackPhase
  138. 22.32 s gammaloop-workspace-doctest> unpacking source archive /nix/store/rmhmwzhj8gpw3wldlw9ixs4vb9f9lnaa-source
  139. 22.43 s gammaloop-workspace-doctest> source root is source
  140. 22.47 s gammaloop-workspace-doctest> Running phase: patchPhase
  141. 22.47 s gammaloop-workspace-doctest> Executing configureCargoCommonVars
  142. 22.48 s gammaloop-workspace-doctest> decompressing cargo artifacts from /nix/store/ll9b1in64vh8qki89lybxzjjz809daql-gammaloop-workspace-deps-deps-0.1.0/target.tar.zst to target
  143. 23.85 s gammaloop-workspace-doctest> Running phase: updateAutotoolsGnuConfigScriptsPhase
  144. 23.89 s gammaloop-workspace-doctest> Running phase: configurePhase
  145. 23.89 s gammaloop-workspace-doctest> will append /build/source/.cargo-home/config.toml with contents of /nix/store/5k2rp6i9lv5zqizci840fqwg07lqhf3q-vendor-cargo-deps/config.toml
  146. 23.89 s gammaloop-workspace-doctest> default configurePhase, nothing to do
  147. 23.90 s gammaloop-workspace-doctest> Running phase: buildPhase
  148. 23.90 s gammaloop-workspace-doctest> +++ command cargo --version
  149. 23.90 s gammaloop-workspace-doctest> cargo 1.97.0 (c980f4866 2026-06-30)
  150. 23.93 s gammaloop-workspace-doctest> +++ command cargo test --profile ci-optim --doc --locked --workspace --features gammaloop-tracing-filter/clap,gammaloop-tracing-filter/symbolica,idenso/bincode,idenso/reference-cases,linnet/bincode,linnet/drawing,linnet/rkyv,linnet/serde,linnet/symbolica,spenso-macros/shadowing,spenso/shadowing,symbolica/tracing_max_level_info
  151. 24.29 s gammaloop-workspace-doctest> Compiling pyo3-build-config v0.28.3
  152. 24.30 s gammaloop-workspace-doctest> Compiling phf_shared v0.11.3
  153. 24.30 s gammaloop-workspace-doctest> Compiling getopts v0.2.24
  154. 24.30 s gammaloop-workspace-doctest> Compiling unic-char-range v0.9.0
  155. 24.30 s gammaloop-workspace-doctest> Compiling unic-common v0.9.0
  156. 24.31 s gammaloop-workspace-doctest> Compiling is-macro v0.3.7
  157. 24.31 s gammaloop-workspace-doctest> Compiling rustpython-parser-vendored v0.4.0
  158. 24.32 s gammaloop-workspace-doctest> Compiling rustc-hash v1.1.0
  159. 24.32 s gammaloop-workspace-doctest> Compiling lalrpop-util v0.20.2
  160. 24.32 s gammaloop-workspace-doctest> Compiling symbolica v2.2.0 (https://github.com/symbolica-dev/symbolica?branch=dev#0441bd7a)
  161. 24.34 s gammaloop-workspace-doctest> Compiling gammaloop-tracing-filter-macros v0.1.0 (/build/source/crates/gammaloop-tracing-filter-macros)
  162. 24.34 s gammaloop-workspace-doctest> Compiling vakint v0.1.2 (/build/source/crates/vakint)
  163. 24.35 s gammaloop-workspace-doctest> Compiling unic-ucd-version v0.9.0
  164. 24.35 s gammaloop-workspace-doctest> Compiling unic-char-property v0.9.0
  165. 24.36 s gammaloop-workspace-doctest> Compiling gammalooprs v0.3.4 (/build/source/crates/gammalooprs)
  166. 24.38 s gammaloop-workspace-doctest> Compiling rustc_version v0.4.1
  167. 24.39 s gammaloop-workspace-doctest> Compiling gammaloop-api v0.1.0 (/build/source/crates/gammaloop-api)
  168. 24.40 s gammaloop-workspace-doctest> Compiling bincode v1.3.3
  169. 24.41 s gammaloop-workspace-doctest> Compiling phf_generator v0.11.3
  170. 24.45 s gammaloop-workspace-doctest> Compiling phf v0.11.3
  171. 24.45 s gammaloop-workspace-doctest> Compiling unic-ucd-ident v0.9.0
  172. 24.48 s gammaloop-workspace-doctest> Compiling unic-emoji-char v0.9.0
  173. 24.60 s gammaloop-workspace-doctest> Compiling phf_codegen v0.11.3
  174. 24.61 s gammaloop-workspace-doctest> Compiling gungraun-runner v0.18.2
  175. 24.63 s gammaloop-workspace-doctest> Compiling iai-callgrind-runner v0.14.2
  176. 24.65 s gammaloop-workspace-doctest> Compiling gammaloop-integration-tests v0.1.0 (/build/source/tests)
  177. 24.66 s gammaloop-workspace-doctest> Compiling test-log-core v0.2.20
  178. 24.69 s gammaloop-workspace-doctest> Compiling unicode_names2_generator v1.3.0
  179. 24.70 s gammaloop-workspace-doctest> Compiling wait-timeout v0.2.1
  180. 24.71 s gammaloop-workspace-doctest> Compiling quick-error v1.2.3
  181. 24.75 s gammaloop-workspace-doctest> Compiling iai-callgrind v0.14.2
  182. 24.78 s gammaloop-workspace-doctest> Compiling maplit v1.0.2
  183. 24.82 s gammaloop-workspace-doctest> Compiling rustpython-parser v0.4.0
  184. 24.83 s gammaloop-workspace-doctest> Compiling bit-vec v0.8.0
  185. 24.85 s gammaloop-workspace-doctest> Compiling iai-callgrind-macros v0.5.1
  186. 24.86 s gammaloop-workspace-doctest> Compiling rusty-fork v0.3.1
  187. 25.00 s gammaloop-workspace-doctest> Compiling rand_xorshift v0.4.0
  188. 25.07 s gammaloop-workspace-doctest> Compiling gungraun-macros v0.8.0
  189. 25.11 s gammaloop-workspace-doctest> Compiling bit-set v0.8.0
  190. 25.13 s gammaloop-workspace-doctest> Compiling console v0.15.11
  191. 25.21 s gammaloop-workspace-doctest> Compiling unarray v0.1.4
  192. 25.26 s gammaloop-workspace-doctest> Compiling base64 v0.21.7
  193. 25.28 s gammaloop-workspace-doctest> Compiling proptest v1.11.0
  194. 25.57 s gammaloop-workspace-doctest> Compiling ron v0.8.1
  195. 25.82 s gammaloop-workspace-doctest> Compiling similar-asserts v1.7.0
  196. 26.17 s gammaloop-workspace-doctest> Compiling kurvst v0.1.0 (/build/source/crates/kurvst)
  197. 26.84 s gammaloop-workspace-doctest> Compiling test-log-macros v0.2.20
  198. 28.02 s gammaloop-workspace-doctest> Compiling unicode_names2 v1.3.0
  199. 30.12 s gammaloop-workspace-doctest> Compiling test-log v0.2.20
  200. 30.96 s gammaloop-workspace-doctest> Compiling rustpython-parser-core v0.4.0
  201. 31.45 s gammaloop-workspace-doctest> Compiling rustpython-ast v0.4.0
  202. 33.64 s gammaloop-workspace-doctest> Compiling pyo3-ffi v0.28.3
  203. 33.74 s gammaloop-workspace-doctest> Compiling pyo3-macros-backend v0.28.3
  204. 34.80 s gammaloop-workspace-doctest> Compiling pyo3 v0.28.3
  205. 35.95 s gammaloop-workspace-doctest> Compiling numpy v0.28.0
  206. 38.77 s gammaloop-workspace-doctest> Compiling gungraun v0.18.2
  207. 64.31 s gammaloop-workspace-doctest> Compiling pyo3-macros v0.28.3
  208. 73.91 s gammaloop-workspace-doctest> Compiling pyo3-stub-gen-derive v0.17.2
  209. 85.84 s gammaloop-workspace-doctest> Compiling pyo3-stub-gen v0.17.2
  210. 85.98 s gammaloop-workspace-doctest> Compiling numerica v2.2.0 (https://github.com/symbolica-dev/symbolica?branch=dev#0441bd7a)
  211. 92.12 s gammaloop-workspace-doctest> Compiling graphica v2.1.0 (https://github.com/symbolica-dev/symbolica?branch=dev#0441bd7a)
  212. 106.85 s gammaloop-workspace-doctest> Compiling symbolica-utils v0.1.0 (/build/source/crates/symbolica-utils)
  213. 107.14 s gammaloop-workspace-doctest> Compiling linnet v0.17.0 (/build/source/crates/linnet)
  214. 151.07 s gammaloop-workspace-doctest> Compiling feynkit-model v0.1.0 (/build/source/crates/feynkit-model)
  215. 152.81 s gammaloop-workspace-doctest> Compiling feynkit-ufo v0.1.0 (/build/source/crates/feynkit-ufo)
  216. 158.26 s gammaloop-workspace-doctest> Compiling feynkit-kinematics v0.1.0 (/build/source/crates/feynkit-kinematics)
  217. 159.22 s gammaloop-workspace-doctest> Compiling feynkit-graph v0.1.0 (/build/source/crates/feynkit-graph)
  218. 162.06 s gammaloop-workspace-doctest> Compiling feynkit-cff v0.1.0 (/build/source/crates/feynkit-cff)
  219. 415.17 s gammaloop-workspace-doctest> Compiling spenso-macros v0.3.2 (/build/source/crates/spenso-macros)
  220. 415.18 s gammaloop-workspace-doctest> Compiling gammaloop-workspace-hack v0.1.0 (/build/source/crates/gammaloop-workspace-hack)
  221. 415.57 s gammaloop-workspace-doctest> Compiling spenso v0.6.0 (/build/source/crates/spenso)
  222. 422.19 s gammaloop-workspace-doctest> Compiling idenso v0.3.0 (/build/source/crates/idenso)
  223. 424.04 s gammaloop-workspace-doctest> Compiling gammaloop-tracing-filter v0.1.0 (/build/source/crates/gammaloop-tracing-filter)
  224. 425.52 s gammaloop-workspace-doctest> Compiling spenso-hep-lib v0.1.7 (/build/source/crates/spenso-hep-lib)
  225. 425.52 s gammaloop-workspace-doctest> Compiling feynkit-tensor v0.1.0 (/build/source/crates/feynkit-tensor)
  226. 425.74 s gammaloop-workspace-doctest> Compiling feynkit-generator v0.1.0 (/build/source/crates/feynkit-generator)
  227. 425.74 s gammaloop-workspace-doctest> Compiling spynso3 v0.1.2 (/build/source/crates/spynso3)
  228. 430.58 s gammaloop-workspace-doctest> Compiling feynkit-py v0.1.0 (/build/source/crates/feynkit-py)
  229. 431.21 s gammaloop-workspace-doctest> Compiling feynkit v0.1.0 (/build/source/crates/feynkit)
  230. 469.96 s gammaloop-workspace-doctest> Compiling linnest v0.1.0 (/build/source/crates/linnest)
  231. 469.98 s gammaloop-workspace-doctest> Compiling linnet-py v0.1.0 (/build/source/crates/linnet-py)
  232. 646.93 s gammaloop-workspace-doctest> Finished `ci-optim` profile [optimized] target(s) in 10m 22s
  233. 647.11 s gammaloop-workspace-doctest> warning: the following packages contain code that will be rejected by a future version of Rust: proc-macro-error2 v2.0.1
  234. 647.11 s gammaloop-workspace-doctest> note: to see what the problems were, use the option `--future-incompat-report`, or run `cargo report future-incompatibilities --id 1`
  235. 647.16 s gammaloop-workspace-doctest> Doc-tests feynkit
  236. 647.19 s gammaloop-workspace-doctest>
  237. 647.19 s gammaloop-workspace-doctest> running 0 tests
  238. 647.19 s gammaloop-workspace-doctest>
  239. 647.19 s gammaloop-workspace-doctest> test result: ok. 0 passed; 0 failed; 0 ignored; 0 measured; 0 filtered out; finished in 0.00s
  240. 647.19 s gammaloop-workspace-doctest>
  241. 647.20 s gammaloop-workspace-doctest> Doc-tests feynkit_cff
  242. 648.93 s gammaloop-workspace-doctest>
  243. 648.93 s gammaloop-workspace-doctest> running 1 test
  244. 648.93 s gammaloop-workspace-doctest> test crates/feynkit-cff/src/lib.rs - (line 10) ... ok
  245. 648.93 s gammaloop-workspace-doctest>
  246. 648.93 s gammaloop-workspace-doctest> test result: ok. 1 passed; 0 failed; 0 ignored; 0 measured; 0 filtered out; finished in 0.00s
  247. 648.93 s gammaloop-workspace-doctest>
  248. 648.95 s gammaloop-workspace-doctest> all doctests ran in 1.59s; merged doctests compilation took 1.56s
  249. 648.95 s gammaloop-workspace-doctest> Doc-tests feynkit_generator
  250. 649.11 s gammaloop-workspace-doctest>
  251. 649.11 s gammaloop-workspace-doctest> running 0 tests
  252. 649.11 s gammaloop-workspace-doctest>
  253. 649.11 s gammaloop-workspace-doctest> test result: ok. 0 passed; 0 failed; 0 ignored; 0 measured; 0 filtered out; finished in 0.00s
  254. 649.11 s gammaloop-workspace-doctest>
  255. 649.12 s gammaloop-workspace-doctest> Doc-tests feynkit_graph
  256. 649.25 s gammaloop-workspace-doctest>
  257. 649.25 s gammaloop-workspace-doctest> running 0 tests
  258. 649.25 s gammaloop-workspace-doctest>
  259. 649.25 s gammaloop-workspace-doctest> test result: ok. 0 passed; 0 failed; 0 ignored; 0 measured; 0 filtered out; finished in 0.00s
  260. 649.25 s gammaloop-workspace-doctest>
  261. 649.25 s gammaloop-workspace-doctest> Doc-tests feynkit_kinematics
  262. 649.34 s gammaloop-workspace-doctest>
  263. 649.34 s gammaloop-workspace-doctest> running 0 tests
  264. 649.34 s gammaloop-workspace-doctest>
  265. 649.34 s gammaloop-workspace-doctest> test result: ok. 0 passed; 0 failed; 0 ignored; 0 measured; 0 filtered out; finished in 0.00s
  266. 649.34 s gammaloop-workspace-doctest>
  267. 649.34 s gammaloop-workspace-doctest> Doc-tests feynkit_model
  268. 649.48 s gammaloop-workspace-doctest>
  269. 649.48 s gammaloop-workspace-doctest> running 0 tests
  270. 649.48 s gammaloop-workspace-doctest>
  271. 649.48 s gammaloop-workspace-doctest> test result: ok. 0 passed; 0 failed; 0 ignored; 0 measured; 0 filtered out; finished in 0.00s
  272. 649.48 s gammaloop-workspace-doctest>
  273. 649.49 s gammaloop-workspace-doctest> Doc-tests feynkit_py
  274. 649.86 s gammaloop-workspace-doctest>
  275. 649.86 s gammaloop-workspace-doctest> running 0 tests
  276. 649.86 s gammaloop-workspace-doctest>
  277. 649.86 s gammaloop-workspace-doctest> test result: ok. 0 passed; 0 failed; 0 ignored; 0 measured; 0 filtered out; finished in 0.00s
  278. 649.86 s gammaloop-workspace-doctest>
  279. 649.87 s gammaloop-workspace-doctest> Doc-tests feynkit_tensor
  280. 652.42 s gammaloop-workspace-doctest>
  281. 652.42 s gammaloop-workspace-doctest> running 18 tests
  282. 652.44 s gammaloop-workspace-doctest> test crates/feynkit-tensor/src/reduction.rs - reduction::TensorReduction::expression (line 247) - compile ... ok
  283. 652.44 s gammaloop-workspace-doctest> test crates/feynkit-tensor/src/reduction.rs - reduction::TensorReducer::reduce (line 421) - compile ... ok
  284. 652.44 s gammaloop-workspace-doctest> test crates/feynkit-tensor/src/weingarten.rs - weingarten::OrthogonalWeingarten::new (line 231) - compile ... ok
  285. 652.44 s gammaloop-workspace-doctest> test crates/feynkit-tensor/src/reduction.rs - reduction::TensorReducer (line 283) - compile ... ok
  286. 652.44 s gammaloop-workspace-doctest> test crates/feynkit-tensor/src/reduction.rs - reduction::TensorReductionTerm (line 145) - compile ... ok
  287. 652.44 s gammaloop-workspace-doctest> test crates/feynkit-tensor/src/reduction.rs - reduction::TensorReduction (line 202) - compile ... ok
  288. 652.44 s gammaloop-workspace-doctest> test crates/feynkit-tensor/src/weingarten.rs - weingarten::OrthogonalWeingarten (line 199) - compile ... ok
  289. 652.44 s gammaloop-workspace-doctest> test crates/feynkit-tensor/src/reduction.rs - reduction::ContractionOrbit (line 65) - compile ... ok
  290. 652.44 s gammaloop-workspace-doctest> test crates/feynkit-tensor/src/reduction.rs - reduction::FeynmanDiagramTensorExt (line 943) - compile ... ok
  291. 652.44 s gammaloop-workspace-doctest> test crates/feynkit-tensor/src/weingarten.rs - weingarten::OrthogonalWeingarten::coefficient (line 309) - compile ... ok
  292. 652.44 s gammaloop-workspace-doctest> test crates/feynkit-tensor/src/weingarten.rs - weingarten::OrthogonalWeingarten::for_rank (line 275) - compile ... ok
  293. 652.45 s gammaloop-workspace-doctest> test crates/feynkit-tensor/src/reduction.rs - reduction::TensorReducer::distribute_summands (line 391) ... ok
  294. 652.45 s gammaloop-workspace-doctest> test crates/feynkit-tensor/src/weingarten.rs - weingarten::CosetType::between_matchings (line 92) ... ok
  295. 652.45 s gammaloop-workspace-doctest> test crates/feynkit-tensor/src/weingarten.rs - weingarten::CosetType::class_size (line 152) ... ok
  296. 652.45 s gammaloop-workspace-doctest> test crates/feynkit-tensor/src/weingarten.rs - weingarten::CosetType::new (line 55) ... ok
  297. 652.45 s gammaloop-workspace-doctest> test crates/feynkit-tensor/src/weingarten.rs - weingarten::CosetType (line 34) ... ok
  298. 652.45 s gammaloop-workspace-doctest> test crates/feynkit-tensor/src/weingarten.rs - weingarten::OrthogonalWeingarten::isotropic_pairing_coefficient (line 345) ... ok
  299. 652.67 s gammaloop-workspace-doctest> test crates/feynkit-tensor/src/weingarten.rs - weingarten::WeingartenError (line 409) ... FAILED
  300. 652.67 s gammaloop-workspace-doctest>
  301. 652.67 s gammaloop-workspace-doctest> failures:
  302. 652.67 s gammaloop-workspace-doctest>
  303. 652.67 s gammaloop-workspace-doctest> ---- crates/feynkit-tensor/src/weingarten.rs - weingarten::WeingartenError (line 409) stdout ----
  304. 652.67 s gammaloop-workspace-doctest> Test executable failed (terminated by signal).
  305. 652.67 s gammaloop-workspace-doctest>
  306. 652.67 s gammaloop-workspace-doctest> stdout:
  307. 652.67 s gammaloop-workspace-doctest> ┌────────────────────────────────────────────────────────┐
  308. 652.67 s gammaloop-workspace-doctest> │ You are running a restricted Symbolica instance. │
  309. 652.67 s gammaloop-workspace-doctest> │ │
  310. 652.67 s gammaloop-workspace-doctest> │ This mode is only permitted for non-commercial use and │
  311. 652.67 s gammaloop-workspace-doctest> │ is limited to one instance and core per machine. │
  312. 652.67 s gammaloop-workspace-doctest> │ │
  313. 652.67 s gammaloop-workspace-doctest> │ Hobbyists can easily acquire a free license key │
  314. 652.67 s gammaloop-workspace-doctest> │ that unlocks all cores and removes this banner: │
  315. 652.67 s gammaloop-workspace-doctest> │ │
  316. 652.67 s gammaloop-workspace-doctest> │ from symbolica import * │
  317. 652.67 s gammaloop-workspace-doctest> │ request_hobbyist_license('YOUR_NAME', 'YOUR_EMAIL') │
  318. 652.67 s gammaloop-workspace-doctest> │ │
  319. 652.67 s gammaloop-workspace-doctest> │ All other users can obtain a free 30-day trial key: │
  320. 652.67 s gammaloop-workspace-doctest> │ │
  321. 652.67 s gammaloop-workspace-doctest> │ from symbolica import * │
  322. 652.67 s gammaloop-workspace-doctest> │ request_trial_license('NAME', 'EMAIL', 'EMPLOYER') │
  323. 652.67 s gammaloop-workspace-doctest> │ │
  324. 652.67 s gammaloop-workspace-doctest> │ See https://symbolica.io/docs/get_started.html#license │
  325. 652.67 s gammaloop-workspace-doctest> └────────────────────────────────────────────────────────┘
  326. 652.67 s gammaloop-workspace-doctest> ┌───────────────────────────────────────────────────────────────────────────────────────────────────────────┐
  327. 652.67 s gammaloop-workspace-doctest> │ Cannot start new unlicensed Symbolica instance since there is already another one running on the machine. │
  328. 652.67 s gammaloop-workspace-doctest> └───────────────────────────────────────────────────────────────────────────────────────────────────────────┘
  329. 652.67 s gammaloop-workspace-doctest>
  330. 652.67 s gammaloop-workspace-doctest> stderr:
  331. 652.67 s gammaloop-workspace-doctest> ┌───────────────────────────────────┐
  332. 652.67 s gammaloop-workspace-doctest> │ The Symbolica license has expired │
  333. 652.67 s gammaloop-workspace-doctest> └───────────────────────────────────┘
  334. 652.67 s gammaloop-workspace-doctest>
  335. 652.67 s gammaloop-workspace-doctest>
  336. 652.67 s gammaloop-workspace-doctest>
  337. 652.67 s gammaloop-workspace-doctest> failures:
  338. 652.67 s gammaloop-workspace-doctest> crates/feynkit-tensor/src/weingarten.rs - weingarten::WeingartenError (line 409)
  339. 652.67 s gammaloop-workspace-doctest>
  340. 652.67 s gammaloop-workspace-doctest> test result: FAILED. 17 passed; 1 failed; 0 ignored; 0 measured; 0 filtered out; finished in 0.24s
  341. 652.67 s gammaloop-workspace-doctest>
  342. 652.68 s gammaloop-workspace-doctest> all doctests ran in 2.75s; merged doctests compilation took 2.49s
  343. 652.69 s gammaloop-workspace-doctest> error: doctest failed, to rerun pass `-p feynkit-tensor --doc`
  344. 653.12 s error: Cannot build '/nix/store/rib4za6i46s64j5cfq0g9a797kni9p43-gammaloop-workspace-doctest-0.1.0.drv'.
  345. 653.12 s Reason: builder failed with exit code 101.
  346. 653.12 s Output paths:
  347. 653.12 s /nix/store/bkckfqg8lry0jqf4vwis39l51rxxmsfv-gammaloop-workspace-doctest-0.1.0
  348. 653.12 s Last 207 log lines:
  349. 653.12 s > Running phase: unpackPhase
  350. 653.12 s > unpacking source archive /nix/store/rmhmwzhj8gpw3wldlw9ixs4vb9f9lnaa-source
  351. 653.12 s > source root is source
  352. 653.12 s > Running phase: patchPhase
  353. 653.12 s > Executing configureCargoCommonVars
  354. 653.12 s > decompressing cargo artifacts from /nix/store/ll9b1in64vh8qki89lybxzjjz809daql-gammaloop-workspace-deps-deps-0.1.0/target.tar.zst to target
  355. 653.12 s > Running phase: updateAutotoolsGnuConfigScriptsPhase
  356. 653.12 s > Running phase: configurePhase
  357. 653.12 s > will append /build/source/.cargo-home/config.toml with contents of /nix/store/5k2rp6i9lv5zqizci840fqwg07lqhf3q-vendor-cargo-deps/config.toml
  358. 653.12 s > default configurePhase, nothing to do
  359. 653.12 s > Running phase: buildPhase
  360. 653.12 s > +++ command cargo --version
  361. 653.12 s > cargo 1.97.0 (c980f4866 2026-06-30)
  362. 653.12 s > +++ command cargo test --profile ci-optim --doc --locked --workspace --features gammaloop-tracing-filter/clap,gammaloop-tracing-filter/symbolica,idenso/bincode,idenso/reference-cases,linnet/bincode,linnet/drawing,linnet/rkyv,linnet/serde,linnet/symbolica,spenso-macros/shadowing,spenso/shadowing,symbolica/tracing_max_level_info
  363. 653.12 s > Compiling pyo3-build-config v0.28.3
  364. 653.12 s > Compiling phf_shared v0.11.3
  365. 653.12 s > Compiling getopts v0.2.24
  366. 653.12 s > Compiling unic-char-range v0.9.0
  367. 653.12 s > Compiling unic-common v0.9.0
  368. 653.12 s > Compiling is-macro v0.3.7
  369. 653.12 s > Compiling rustpython-parser-vendored v0.4.0
  370. 653.12 s > Compiling rustc-hash v1.1.0
  371. 653.12 s > Compiling lalrpop-util v0.20.2
  372. 653.12 s > Compiling symbolica v2.2.0 (https://github.com/symbolica-dev/symbolica?branch=dev#0441bd7a)
  373. 653.12 s > Compiling gammaloop-tracing-filter-macros v0.1.0 (/build/source/crates/gammaloop-tracing-filter-macros)
  374. 653.12 s > Compiling vakint v0.1.2 (/build/source/crates/vakint)
  375. 653.12 s > Compiling unic-ucd-version v0.9.0
  376. 653.12 s > Compiling unic-char-property v0.9.0
  377. 653.12 s > Compiling gammalooprs v0.3.4 (/build/source/crates/gammalooprs)
  378. 653.12 s > Compiling rustc_version v0.4.1
  379. 653.12 s > Compiling gammaloop-api v0.1.0 (/build/source/crates/gammaloop-api)
  380. 653.12 s > Compiling bincode v1.3.3
  381. 653.12 s > Compiling phf_generator v0.11.3
  382. 653.12 s > Compiling phf v0.11.3
  383. 653.12 s > Compiling unic-ucd-ident v0.9.0
  384. 653.12 s > Compiling unic-emoji-char v0.9.0
  385. 653.12 s > Compiling phf_codegen v0.11.3
  386. 653.12 s > Compiling gungraun-runner v0.18.2
  387. 653.12 s > Compiling iai-callgrind-runner v0.14.2
  388. 653.12 s > Compiling gammaloop-integration-tests v0.1.0 (/build/source/tests)
  389. 653.12 s > Compiling test-log-core v0.2.20
  390. 653.12 s > Compiling unicode_names2_generator v1.3.0
  391. 653.12 s > Compiling wait-timeout v0.2.1
  392. 653.12 s > Compiling quick-error v1.2.3
  393. 653.12 s > Compiling iai-callgrind v0.14.2
  394. 653.12 s > Compiling maplit v1.0.2
  395. 653.12 s > Compiling rustpython-parser v0.4.0
  396. 653.12 s > Compiling bit-vec v0.8.0
  397. 653.12 s > Compiling iai-callgrind-macros v0.5.1
  398. 653.12 s > Compiling rusty-fork v0.3.1
  399. 653.12 s > Compiling rand_xorshift v0.4.0
  400. 653.12 s > Compiling gungraun-macros v0.8.0
  401. 653.12 s > Compiling bit-set v0.8.0
  402. 653.12 s > Compiling console v0.15.11
  403. 653.12 s > Compiling unarray v0.1.4
  404. 653.12 s > Compiling base64 v0.21.7
  405. 653.12 s > Compiling proptest v1.11.0
  406. 653.12 s > Compiling ron v0.8.1
  407. 653.12 s > Compiling similar-asserts v1.7.0
  408. 653.12 s > Compiling kurvst v0.1.0 (/build/source/crates/kurvst)
  409. 653.12 s > Compiling test-log-macros v0.2.20
  410. 653.12 s > Compiling unicode_names2 v1.3.0
  411. 653.12 s > Compiling test-log v0.2.20
  412. 653.12 s > Compiling rustpython-parser-core v0.4.0
  413. 653.12 s > Compiling rustpython-ast v0.4.0
  414. 653.12 s > Compiling pyo3-ffi v0.28.3
  415. 653.12 s > Compiling pyo3-macros-backend v0.28.3
  416. 653.12 s > Compiling pyo3 v0.28.3
  417. 653.12 s > Compiling numpy v0.28.0
  418. 653.12 s > Compiling gungraun v0.18.2
  419. 653.12 s > Compiling pyo3-macros v0.28.3
  420. 653.12 s > Compiling pyo3-stub-gen-derive v0.17.2
  421. 653.12 s > Compiling pyo3-stub-gen v0.17.2
  422. 653.12 s > Compiling numerica v2.2.0 (https://github.com/symbolica-dev/symbolica?branch=dev#0441bd7a)
  423. 653.12 s > Compiling graphica v2.1.0 (https://github.com/symbolica-dev/symbolica?branch=dev#0441bd7a)
  424. 653.12 s > Compiling symbolica-utils v0.1.0 (/build/source/crates/symbolica-utils)
  425. 653.12 s > Compiling linnet v0.17.0 (/build/source/crates/linnet)
  426. 653.12 s > Compiling feynkit-model v0.1.0 (/build/source/crates/feynkit-model)
  427. 653.12 s > Compiling feynkit-ufo v0.1.0 (/build/source/crates/feynkit-ufo)
  428. 653.12 s > Compiling feynkit-kinematics v0.1.0 (/build/source/crates/feynkit-kinematics)
  429. 653.12 s > Compiling feynkit-graph v0.1.0 (/build/source/crates/feynkit-graph)
  430. 653.12 s > Compiling feynkit-cff v0.1.0 (/build/source/crates/feynkit-cff)
  431. 653.12 s > Compiling spenso-macros v0.3.2 (/build/source/crates/spenso-macros)
  432. 653.12 s > Compiling gammaloop-workspace-hack v0.1.0 (/build/source/crates/gammaloop-workspace-hack)
  433. 653.12 s > Compiling spenso v0.6.0 (/build/source/crates/spenso)
  434. 653.12 s > Compiling idenso v0.3.0 (/build/source/crates/idenso)
  435. 653.12 s > Compiling gammaloop-tracing-filter v0.1.0 (/build/source/crates/gammaloop-tracing-filter)
  436. 653.12 s > Compiling spenso-hep-lib v0.1.7 (/build/source/crates/spenso-hep-lib)
  437. 653.12 s > Compiling feynkit-tensor v0.1.0 (/build/source/crates/feynkit-tensor)
  438. 653.12 s > Compiling feynkit-generator v0.1.0 (/build/source/crates/feynkit-generator)
  439. 653.12 s > Compiling spynso3 v0.1.2 (/build/source/crates/spynso3)
  440. 653.12 s > Compiling feynkit-py v0.1.0 (/build/source/crates/feynkit-py)
  441. 653.12 s > Compiling feynkit v0.1.0 (/build/source/crates/feynkit)
  442. 653.12 s > Compiling linnest v0.1.0 (/build/source/crates/linnest)
  443. 653.12 s > Compiling linnet-py v0.1.0 (/build/source/crates/linnet-py)
  444. 653.12 s > Finished `ci-optim` profile [optimized] target(s) in 10m 22s
  445. 653.12 s > warning: the following packages contain code that will be rejected by a future version of Rust: proc-macro-error2 v2.0.1
  446. 653.12 s > note: to see what the problems were, use the option `--future-incompat-report`, or run `cargo report future-incompatibilities --id 1`
  447. 653.12 s > Doc-tests feynkit
  448. 653.12 s >
  449. 653.12 s > running 0 tests
  450. 653.12 s >
  451. 653.12 s > test result: ok. 0 passed; 0 failed; 0 ignored; 0 measured; 0 filtered out; finished in 0.00s
  452. 653.12 s >
  453. 653.12 s > Doc-tests feynkit_cff
  454. 653.12 s >
  455. 653.12 s > running 1 test
  456. 653.12 s > test crates/feynkit-cff/src/lib.rs - (line 10) ... ok
  457. 653.12 s >
  458. 653.12 s > test result: ok. 1 passed; 0 failed; 0 ignored; 0 measured; 0 filtered out; finished in 0.00s
  459. 653.12 s >
  460. 653.12 s > all doctests ran in 1.59s; merged doctests compilation took 1.56s
  461. 653.12 s > Doc-tests feynkit_generator
  462. 653.12 s >
  463. 653.12 s > running 0 tests
  464. 653.12 s >
  465. 653.12 s > test result: ok. 0 passed; 0 failed; 0 ignored; 0 measured; 0 filtered out; finished in 0.00s
  466. 653.12 s >
  467. 653.12 s > Doc-tests feynkit_graph
  468. 653.12 s >
  469. 653.12 s > running 0 tests
  470. 653.12 s >
  471. 653.12 s > test result: ok. 0 passed; 0 failed; 0 ignored; 0 measured; 0 filtered out; finished in 0.00s
  472. 653.12 s >
  473. 653.12 s > Doc-tests feynkit_kinematics
  474. 653.12 s >
  475. 653.12 s > running 0 tests
  476. 653.12 s >
  477. 653.12 s > test result: ok. 0 passed; 0 failed; 0 ignored; 0 measured; 0 filtered out; finished in 0.00s
  478. 653.12 s >
  479. 653.12 s > Doc-tests feynkit_model
  480. 653.12 s >
  481. 653.12 s > running 0 tests
  482. 653.12 s >
  483. 653.12 s > test result: ok. 0 passed; 0 failed; 0 ignored; 0 measured; 0 filtered out; finished in 0.00s
  484. 653.12 s >
  485. 653.12 s > Doc-tests feynkit_py
  486. 653.12 s >
  487. 653.12 s > running 0 tests
  488. 653.12 s >
  489. 653.12 s > test result: ok. 0 passed; 0 failed; 0 ignored; 0 measured; 0 filtered out; finished in 0.00s
  490. 653.12 s >
  491. 653.12 s > Doc-tests feynkit_tensor
  492. 653.12 s >
  493. 653.12 s > running 18 tests
  494. 653.12 s > test crates/feynkit-tensor/src/reduction.rs - reduction::TensorReduction::expression (line 247) - compile ... ok
  495. 653.12 s > test crates/feynkit-tensor/src/reduction.rs - reduction::TensorReducer::reduce (line 421) - compile ... ok
  496. 653.12 s > test crates/feynkit-tensor/src/weingarten.rs - weingarten::OrthogonalWeingarten::new (line 231) - compile ... ok
  497. 653.12 s > test crates/feynkit-tensor/src/reduction.rs - reduction::TensorReducer (line 283) - compile ... ok
  498. 653.12 s > test crates/feynkit-tensor/src/reduction.rs - reduction::TensorReductionTerm (line 145) - compile ... ok
  499. 653.12 s > test crates/feynkit-tensor/src/reduction.rs - reduction::TensorReduction (line 202) - compile ... ok
  500. 653.12 s > test crates/feynkit-tensor/src/weingarten.rs - weingarten::OrthogonalWeingarten (line 199) - compile ... ok
  501. 653.12 s > test crates/feynkit-tensor/src/reduction.rs - reduction::ContractionOrbit (line 65) - compile ... ok
  502. 653.12 s > test crates/feynkit-tensor/src/reduction.rs - reduction::FeynmanDiagramTensorExt (line 943) - compile ... ok
  503. 653.12 s > test crates/feynkit-tensor/src/weingarten.rs - weingarten::OrthogonalWeingarten::coefficient (line 309) - compile ... ok
  504. 653.12 s > test crates/feynkit-tensor/src/weingarten.rs - weingarten::OrthogonalWeingarten::for_rank (line 275) - compile ... ok
  505. 653.12 s > test crates/feynkit-tensor/src/reduction.rs - reduction::TensorReducer::distribute_summands (line 391) ... ok
  506. 653.12 s > test crates/feynkit-tensor/src/weingarten.rs - weingarten::CosetType::between_matchings (line 92) ... ok
  507. 653.12 s > test crates/feynkit-tensor/src/weingarten.rs - weingarten::CosetType::class_size (line 152) ... ok
  508. 653.12 s > test crates/feynkit-tensor/src/weingarten.rs - weingarten::CosetType::new (line 55) ... ok
  509. 653.12 s > test crates/feynkit-tensor/src/weingarten.rs - weingarten::CosetType (line 34) ... ok
  510. 653.12 s > test crates/feynkit-tensor/src/weingarten.rs - weingarten::OrthogonalWeingarten::isotropic_pairing_coefficient (line 345) ... ok
  511. 653.12 s > test crates/feynkit-tensor/src/weingarten.rs - weingarten::WeingartenError (line 409) ... FAILED
  512. 653.12 s >
  513. 653.12 s > failures:
  514. 653.12 s >
  515. 653.12 s > ---- crates/feynkit-tensor/src/weingarten.rs - weingarten::WeingartenError (line 409) stdout ----
  516. 653.12 s > Test executable failed (terminated by signal).
  517. 653.12 s >
  518. 653.12 s > stdout:
  519. 653.12 s > ┌────────────────────────────────────────────────────────┐
  520. 653.12 s > │ You are running a restricted Symbolica instance. │
  521. 653.12 s > │ │
  522. 653.12 s > │ This mode is only permitted for non-commercial use and │
  523. 653.12 s > │ is limited to one instance and core per machine. │
  524. 653.12 s > │ │
  525. 653.12 s > │ Hobbyists can easily acquire a free license key │
  526. 653.12 s > │ that unlocks all cores and removes this banner: │
  527. 653.12 s > │ │
  528. 653.12 s > │ from symbolica import * │
  529. 653.12 s > │ request_hobbyist_license('YOUR_NAME', 'YOUR_EMAIL') │
  530. 653.12 s > │ │
  531. 653.12 s > │ All other users can obtain a free 30-day trial key: │
  532. 653.12 s > │ │
  533. 653.12 s > │ from symbolica import * │
  534. 653.12 s > │ request_trial_license('NAME', 'EMAIL', 'EMPLOYER') │
  535. 653.12 s > │ │
  536. 653.12 s > │ See https://symbolica.io/docs/get_started.html#license │
  537. 653.12 s > └────────────────────────────────────────────────────────┘
  538. 653.12 s > ┌───────────────────────────────────────────────────────────────────────────────────────────────────────────┐
  539. 653.12 s > │ Cannot start new unlicensed Symbolica instance since there is already another one running on the machine. │
  540. 653.12 s > └───────────────────────────────────────────────────────────────────────────────────────────────────────────┘
  541. 653.12 s >
  542. 653.12 s > stderr:
  543. 653.12 s > ┌───────────────────────────────────┐
  544. 653.12 s > │ The Symbolica license has expired │
  545. 653.12 s > └───────────────────────────────────┘
  546. 653.12 s >
  547. 653.12 s >
  548. 653.12 s >
  549. 653.12 s > failures:
  550. 653.12 s > crates/feynkit-tensor/src/weingarten.rs - weingarten::WeingartenError (line 409)
  551. 653.12 s >
  552. 653.12 s > test result: FAILED. 17 passed; 1 failed; 0 ignored; 0 measured; 0 filtered out; finished in 0.24s
  553. 653.12 s >
  554. 653.12 s > all doctests ran in 2.75s; merged doctests compilation took 2.49s
  555. 653.12 s > error: doctest failed, to rerun pass `-p feynkit-tensor --doc`
  556. 653.12 s For full logs, run:
  557. 653.12 s nix log /nix/store/rib4za6i46s64j5cfq0g9a797kni9p43-gammaloop-workspace-doctest-0.1.0.drv
  558. 653.22 s [0 built (1 failed), 0.0Run failed.