build packages.x86_64-linux.crate-deps-gammalooprs
0.59 s
$ /nix/store/9ypz3flqsrl5xl495mm8h645gadjsxi1-coreutils-9.11/bin/timeout --kill-after=15s 7200s /nix/store/23zk8sgzamrbmj1fday15szf7f2279s8-nix-2.34.7/bin/nix --extra-experimental-features nix-command --extra-experimental-features flakes --log-format internal-json build --no-link --print-out-paths git+https://github.com/alphal00p/gammaloop?ref=feynkit&rev=fb38e1406170d8a69c2ea39345f5d1fbe2eaecf9&shallow=1#packages.x86_64-linux.crate-deps-gammalooprs --print-build-logs
6.63 s
8.17 s
Downloading cached source from https://cache.nix-ci.com
8.21 s
Downloading cached gammaloop-crate-feynkit-kinematics-dependency-deps from https://cache.nix-ci.com
8.21 s
Downloading cached gammaloop-crate-feynkit-model-dependency-deps from https://cache.nix-ci.com
8.21 s
Downloading cached gammaloop-crate-gammaloop-tracing-filter-dependency-deps from https://cache.nix-ci.com
8.21 s
Downloading cached gammaloop-crate-gammaloop-tracing-filter-macros-dependency-deps from https://cache.nix-ci.com
8.21 s
Downloading cached gammaloop-crate-idenso-dependency-deps from https://cache.nix-ci.com
8.21 s
Downloading cached gammaloop-crate-linnet-dependency-deps from https://cache.nix-ci.com
8.21 s
Downloading cached gammaloop-crate-spenso-dependency-deps from https://cache.nix-ci.com
8.21 s
Downloading cached gammaloop-crate-spenso-macros-dependency-deps from https://cache.nix-ci.com
8.21 s
Downloading cached gammaloop-crate-symbolica-utils-dependency-deps from https://cache.nix-ci.com
8.21 s
Downloading cached gammaloop-crate-vakint-dependency-deps from https://cache.nix-ci.com
8.21 s
Building /nix/store/yymny6c4dwdp63iinxrbdi2pkpcaik3j-gammaloop-ci-consumer-gammalooprs-Cargo.toml.drv
8.22 s
Downloading cached source from https://cache.nix-ci.com
8.22 s
Downloading cached source from https://cache.nix-ci.com
8.22 s
Downloading cached source from https://cache.nix-ci.com
8.25 s
Building /nix/store/iga07jcci87cqgq32n43yd39qgq50ixy-gammaloop-ci-consumer-feynkit-generator-Cargo.toml.drv
8.26 s
Building /nix/store/6qfq54srd0ills7lb277ddvgdf2l8vrf-gammaloop-ci-consumer-gammalooprs-Cargo.toml.drv
8.28 s
Building /nix/store/2r4r75qga4bncqgwzgj7bpjsi4qsrv4q-gammaloop-ci-consumer-spenso-hep-lib-Cargo.toml.drv
8.29 s
[gammaloop-ci-consumer-gammalooprs-Cargo.toml:post-build] Uploading to the NixCI cache: /nix/store/35yd4wk6vcgrf27la41cds8fshkmm797-gammaloop-ci-consumer-gammalooprs-Cargo.toml
8.33 s
[gammaloop-ci-consumer-gammalooprs-Cargo.toml:post-build] warning: 'warn-short-path-literals' is deprecated, use 'lint-short-path-literals = ignore' instead
8.41 s
Downloaded cached source (1.8 MiB) in 183ms
8.43 s
Downloaded cached source (3.3 MiB) in 208ms
8.46 s
[gammaloop-ci-consumer-gammalooprs-Cargo.toml:post-build] copying 0 paths...
8.51 s
[gammaloop-ci-consumer-gammalooprs-Cargo.toml:post-build] warning: 'warn-short-path-literals' is deprecated, use 'lint-short-path-literals = ignore' instead
8.65 s
Downloaded cached source (20.3 MiB) in 478ms
8.67 s
[gammaloop-ci-consumer-gammalooprs-Cargo.toml:post-build] copying 0 paths...
8.68 s
Uploaded gammaloop-ci-consumer-gammalooprs-Cargo.toml in 394ms
8.68 s
Progress: 1 of 30 built (3 building), 0 of 18 downloaded from cache (14 downloading)
8.68 s
Built gammaloop-ci-consumer-gammalooprs-Cargo.toml in 473ms
8.68 s
Progress: 1 of 29 built (3 building), 1 of 18 downloaded from cache (13 downloading)
8.68 s
Progress: 1 of 29 built (3 building), 2 of 18 downloaded from cache (12 downloading)
8.68 s
Progress: 1 of 29 built (3 building), 3 of 18 downloaded from cache (11 downloading)
8.70 s
[gammaloop-ci-consumer-feynkit-generator-Cargo.toml:post-build] Uploading to the NixCI cache: /nix/store/gm7rmydyfagq1xq2ip06j8kzj2aks6fk-gammaloop-ci-consumer-feynkit-generator-Cargo.toml
8.74 s
[gammaloop-ci-consumer-feynkit-generator-Cargo.toml:post-build] warning: 'warn-short-path-literals' is deprecated, use 'lint-short-path-literals = ignore' instead
8.81 s
Downloaded cached source (16 MiB) in 582ms
8.87 s
[gammaloop-ci-consumer-feynkit-generator-Cargo.toml:post-build] copying 0 paths...
8.93 s
[gammaloop-ci-consumer-feynkit-generator-Cargo.toml:post-build] warning: 'warn-short-path-literals' is deprecated, use 'lint-short-path-literals = ignore' instead
9.07 s
[gammaloop-ci-consumer-feynkit-generator-Cargo.toml:post-build] copying 0 paths...
9.08 s
Uploaded gammaloop-ci-consumer-feynkit-generator-Cargo.toml in 394ms
9.08 s
Progress: 2 of 30 built (2 building), 3 of 18 downloaded from cache (11 downloading)
9.08 s
Built gammaloop-ci-consumer-feynkit-generator-Cargo.toml in 833ms
9.10 s
[gammaloop-ci-consumer-gammalooprs-Cargo.toml:post-build] Uploading to the NixCI cache: /nix/store/ngjkq98nqnal003ii6j384r28wg4kvlb-gammaloop-ci-consumer-gammalooprs-Cargo.toml
9.15 s
[gammaloop-ci-consumer-gammalooprs-Cargo.toml:post-build] warning: 'warn-short-path-literals' is deprecated, use 'lint-short-path-literals = ignore' instead
9.27 s
[gammaloop-ci-consumer-gammalooprs-Cargo.toml:post-build] copying 0 paths...
9.33 s
[gammaloop-ci-consumer-gammalooprs-Cargo.toml:post-build] warning: 'warn-short-path-literals' is deprecated, use 'lint-short-path-literals = ignore' instead
9.47 s
[gammaloop-ci-consumer-gammalooprs-Cargo.toml:post-build] copying 0 paths...
9.48 s
Uploaded gammaloop-ci-consumer-gammalooprs-Cargo.toml in 397ms
9.48 s
Progress: 3 of 31 built (1 building), 3 of 18 downloaded from cache (11 downloading)
9.48 s
Built gammaloop-ci-consumer-gammalooprs-Cargo.toml in 1.2s
9.51 s
[gammaloop-ci-consumer-spenso-hep-lib-Cargo.toml:post-build] Uploading to the NixCI cache: /nix/store/iv2ypszyfv8w6d3wc1y8mdw6dyi4lvmk-gammaloop-ci-consumer-spenso-hep-lib-Cargo.toml
9.55 s
[gammaloop-ci-consumer-spenso-hep-lib-Cargo.toml:post-build] warning: 'warn-short-path-literals' is deprecated, use 'lint-short-path-literals = ignore' instead
9.68 s
[gammaloop-ci-consumer-spenso-hep-lib-Cargo.toml:post-build] copying 0 paths...
9.73 s
[gammaloop-ci-consumer-spenso-hep-lib-Cargo.toml:post-build] warning: 'warn-short-path-literals' is deprecated, use 'lint-short-path-literals = ignore' instead
9.87 s
[gammaloop-ci-consumer-spenso-hep-lib-Cargo.toml:post-build] copying 0 paths...
9.89 s
Uploaded gammaloop-ci-consumer-spenso-hep-lib-Cargo.toml in 395ms
9.89 s
Progress: 4 of 32 built, 3 of 18 downloaded from cache (11 downloading)
9.89 s
Built gammaloop-ci-consumer-spenso-hep-lib-Cargo.toml in 1.6s
9.89 s
Progress: 4 of 26 built, 4 of 18 downloaded from cache (10 downloading)
31.41 s
Downloaded cached gammaloop-crate-gammaloop-tracing-filter-dependency-deps (334.8 MiB) in 23.1s
31.45 s
Progress: 4 of 25 built, 5 of 18 downloaded from cache (9 downloading)
31.49 s
Downloaded cached gammaloop-crate-symbolica-utils-dependency-deps (316.2 MiB) in 23.2s
31.49 s
Progress: 4 of 24 built, 6 of 18 downloaded from cache (8 downloading)
33.82 s
Downloaded cached gammaloop-crate-idenso-dependency-deps (339.2 MiB) in 25.6s
33.82 s
Progress: 4 of 23 built, 7 of 18 downloaded from cache (7 downloading)
35.03 s
Downloaded cached gammaloop-crate-spenso-dependency-deps (334.7 MiB) in 26.8s
35.03 s
Progress: 4 of 22 built, 8 of 18 downloaded from cache (6 downloading)
35.69 s
Downloaded cached gammaloop-crate-gammaloop-tracing-filter-macros-dependency-deps (316.7 MiB) in 27.4s
35.69 s
Progress: 4 of 21 built, 9 of 18 downloaded from cache (5 downloading)
36.31 s
Downloaded cached gammaloop-crate-feynkit-kinematics-dependency-deps (324.3 MiB) in 28.1s
36.31 s
Progress: 4 of 20 built, 10 of 18 downloaded from cache (4 downloading)
37.72 s
Downloaded cached gammaloop-crate-vakint-dependency-deps (337.3 MiB) in 29.5s
37.76 s
Progress: 4 of 19 built, 11 of 18 downloaded from cache (3 downloading)
38.61 s
Downloaded cached gammaloop-crate-feynkit-model-dependency-deps (411.5 MiB) in 30.3s
38.61 s
Progress: 4 of 18 built, 12 of 18 downloaded from cache (2 downloading)
38.61 s
Downloading cached gammaloop-crate-feynkit-cff-dependency-deps from https://cache.nix-ci.com
38.61 s
Downloading cached gammaloop-crate-feynkit-generator-dependency-inputs from https://cache.nix-ci.com
38.61 s
Downloading cached gammaloop-crate-feynkit-graph-dependency-deps from https://cache.nix-ci.com
38.92 s
Downloaded cached gammaloop-crate-linnet-dependency-deps (324.5 MiB) in 30.7s
38.92 s
Progress: 4 of 17 built, 13 of 18 downloaded from cache (4 downloading)
45.40 s
Downloaded cached gammaloop-crate-spenso-macros-dependency-deps (317 MiB) in 37.1s
45.44 s
Progress: 4 of 16 built, 14 of 18 downloaded from cache (3 downloading)
45.44 s
Downloading cached gammaloop-crate-spenso-hep-lib-dependency-inputs from https://cache.nix-ci.com
48.38 s
Downloaded cached gammaloop-crate-feynkit-graph-dependency-deps (423.8 MiB) in 9.7s
48.38 s
Progress: 4 of 15 built, 15 of 18 downloaded from cache (3 downloading)
50.82 s
Downloaded cached gammaloop-crate-feynkit-generator-dependency-inputs (1.6 GiB) in 12.2s
50.86 s
Progress: 4 of 14 built, 16 of 18 downloaded from cache (2 downloading)
50.98 s
Building /nix/store/a11753sv3gw6h4w5nb9g4q85q368pjgl-gammaloop-crate-feynkit-generator-dependency-deps-0.1.0.drv
51.05 s
[gammaloop-crate-feynkit-generator-dependency-deps] Phase: unpackPhase
51.06 s
[gammaloop-crate-feynkit-generator-dependency-deps] unpacking source archive /nix/store/m82rm9f9bfi2an6l0q9mv7q53v2zvnik-source
51.07 s
[gammaloop-crate-feynkit-generator-dependency-deps] source root is source
51.08 s
[gammaloop-crate-feynkit-generator-dependency-deps] Phase: patchPhase
51.15 s
[gammaloop-crate-feynkit-generator-dependency-deps] Executing configureCargoCommonVars
51.16 s
[gammaloop-crate-feynkit-generator-dependency-deps] copying cargo artifacts from /nix/store/aznnnzx8d5ilrrava53zs68i16yqzcvn-gammaloop-crate-feynkit-generator-dependency-inputs/target to target
51.16 s
[gammaloop-crate-feynkit-generator-dependency-deps] will deep copy artifacts (instead of symlinking) as requested
51.97 s
Downloaded cached gammaloop-crate-feynkit-cff-dependency-deps (424.7 MiB) in 13.3s
51.98 s
Progress: 4 of 13 built (1 building), 17 of 18 downloaded from cache (1 downloading)
52.09 s
[gammaloop-crate-feynkit-generator-dependency-deps] Phase: updateAutotoolsGnuConfigScriptsPhase
52.12 s
[gammaloop-crate-feynkit-generator-dependency-deps] Phase: configurePhase
52.12 s
[gammaloop-crate-feynkit-generator-dependency-deps] will append /build/source/.cargo-home/config.toml with contents of /nix/store/1sigmg52bb61pfngmk9k8wq5fz9r7bf1-vendor-cargo-deps/config.toml
52.13 s
[gammaloop-crate-feynkit-generator-dependency-deps] default configurePhase, nothing to do
52.13 s
[gammaloop-crate-feynkit-generator-dependency-deps] Phase: buildPhase
52.15 s
[gammaloop-crate-feynkit-generator-dependency-deps] +++ command cargo --version
52.15 s
[gammaloop-crate-feynkit-generator-dependency-deps] cargo 1.97.0 (c980f4866 2026-06-30)
52.15 s
[gammaloop-crate-feynkit-generator-dependency-deps] +++ command cargo build --profile ci-optim --offline -p gammaloop-ci-consumer-feynkit-generator -p gammaloop-workspace-hack --features symbolica/tracing_max_level_info
52.41 s
[gammaloop-crate-feynkit-generator-dependency-deps] Compiling spenso-macros v0.3.2 (/build/source/crates/spenso-macros)
52.42 s
[gammaloop-crate-feynkit-generator-dependency-deps] Compiling spenso v0.6.0 (/build/source/crates/spenso)
52.42 s
[gammaloop-crate-feynkit-generator-dependency-deps] Compiling idenso v0.3.0 (/build/source/crates/idenso)
52.68 s
[gammaloop-crate-feynkit-generator-dependency-deps] Compiling feynkit-generator v0.1.0 (/build/source/crates/feynkit-generator)
52.74 s
[gammaloop-crate-feynkit-generator-dependency-deps] error[E0433] : cannot find `network` in `spenso`
52.74 s
[gammaloop-crate-feynkit-generator-dependency-deps] --> crates/feynkit-generator/src/generation.rs:30:5
52.74 s
[gammaloop-crate-feynkit-generator-dependency-deps] |
52.74 s
[gammaloop-crate-feynkit-generator-dependency-deps] 30 | network::library::symbolic::ETS,
52.74 s
[gammaloop-crate-feynkit-generator-dependency-deps] | ^^^^^^^ could not find `network` in `spenso`
52.74 s
[gammaloop-crate-feynkit-generator-dependency-deps]
52.74 s
[gammaloop-crate-feynkit-generator-dependency-deps] error[E0433] : cannot find `structure` in `spenso`
52.74 s
[gammaloop-crate-feynkit-generator-dependency-deps] --> crates/feynkit-generator/src/generation.rs:31:5
52.74 s
[gammaloop-crate-feynkit-generator-dependency-deps] |
52.74 s
[gammaloop-crate-feynkit-generator-dependency-deps] 31 | structure::representation::{Minkowski, RepName},
52.74 s
[gammaloop-crate-feynkit-generator-dependency-deps] | ^^^^^^^^^ could not find `structure` in `spenso`
52.74 s
[gammaloop-crate-feynkit-generator-dependency-deps]
52.74 s
[gammaloop-crate-feynkit-generator-dependency-deps] error[E0432] : unresolved imports `idenso::color`, `idenso::dirac`, `idenso::epsilon`, `idenso::representations`
52.74 s
[gammaloop-crate-feynkit-generator-dependency-deps] --> crates/feynkit-generator/src/generation.rs:19:5
52.74 s
[gammaloop-crate-feynkit-generator-dependency-deps] |
52.74 s
[gammaloop-crate-feynkit-generator-dependency-deps] 19 | color::CS,
52.74 s
[gammaloop-crate-feynkit-generator-dependency-deps] | ^^^^^ could not find `color` in `idenso`
52.74 s
[gammaloop-crate-feynkit-generator-dependency-deps] 20 | dirac::{AGS, PS},
52.74 s
[gammaloop-crate-feynkit-generator-dependency-deps] | ^^^^^ could not find `dirac` in `idenso`
52.74 s
[gammaloop-crate-feynkit-generator-dependency-deps] 21 | epsilon::EPSILON_SYMBOL,
52.74 s
[gammaloop-crate-feynkit-generator-dependency-deps] | ^^^^^^^ could not find `epsilon` in `idenso`
52.74 s
[gammaloop-crate-feynkit-generator-dependency-deps] 22 | representations::{Bispinor, ColorAdjoint, ColorFundamental, ColorSextet},
52.74 s
[gammaloop-crate-feynkit-generator-dependency-deps] | ^^^^^^^^^^^^^^^ could not find `representations` in `idenso`
52.74 s
[gammaloop-crate-feynkit-generator-dependency-deps]
53.30 s
[gammaloop-crate-feynkit-generator-dependency-deps] Some errors have detailed explanations: E0432, E0433.
53.30 s
[gammaloop-crate-feynkit-generator-dependency-deps] For more information about an error, try `rustc --explain E0432`.
53.31 s
[gammaloop-crate-feynkit-generator-dependency-deps] error : could not compile `feynkit-generator` (lib) due to 3 previous errors
53.54 s
Progress: 4 of 12 built (1 failed), 17 of 18 downloaded from cache (1 downloading)
53.54 s
Failed to build gammaloop-crate-feynkit-generator-dependency-deps after 2.5s
53.55 s
error: Cannot build '/nix/store/a11753sv3gw6h4w5nb9g4q85q368pjgl-gammaloop-crate-feynkit-generator-dependency-deps-0.1.0.drv '.
53.55 s
Reason: builder failed with exit code 101 .
53.55 s
Output paths:
53.55 s
/nix/store/j3y5sfxxp93cbs9hipvm0i32pmn1awy2-gammaloop-crate-feynkit-generator-dependency-deps-0.1.0
53.55 s
Last 46 log lines:
53.55 s
> Running phase: unpackPhase
53.55 s
> unpacking source archive /nix/store/m82rm9f9bfi2an6l0q9mv7q53v2zvnik-source
53.55 s
> source root is source
53.55 s
> Running phase: patchPhase
53.55 s
> Executing configureCargoCommonVars
53.55 s
> copying cargo artifacts from /nix/store/aznnnzx8d5ilrrava53zs68i16yqzcvn-gammaloop-crate-feynkit-generator-dependency-inputs/target to target
53.55 s
> will deep copy artifacts (instead of symlinking) as requested
53.55 s
> Running phase: updateAutotoolsGnuConfigScriptsPhase
53.55 s
> Running phase: configurePhase
53.55 s
> will append /build/source/.cargo-home/config.toml with contents of /nix/store/1sigmg52bb61pfngmk9k8wq5fz9r7bf1-vendor-cargo-deps/config.toml
53.55 s
> default configurePhase, nothing to do
53.55 s
> Running phase: buildPhase
53.55 s
> +++ command cargo --version
53.55 s
> cargo 1.97.0 (c980f4866 2026-06-30)
53.55 s
> +++ command cargo build --profile ci-optim --offline -p gammaloop-ci-consumer-feynkit-generator -p gammaloop-workspace-hack --features symbolica/tracing_max_level_info
53.55 s
> Compiling spenso-macros v0.3.2 (/build/source/crates/spenso-macros)
53.55 s
> Compiling spenso v0.6.0 (/build/source/crates/spenso)
53.55 s
> Compiling idenso v0.3.0 (/build/source/crates/idenso)
53.55 s
> Compiling feynkit-generator v0.1.0 (/build/source/crates/feynkit-generator)
53.55 s
> error[E0433] : cannot find `network` in `spenso`
53.55 s
> --> crates/feynkit-generator/src/generation.rs:30:5
53.55 s
> |
53.55 s
> 30 | network::library::symbolic::ETS,
53.55 s
> | ^^^^^^^ could not find `network` in `spenso`
53.55 s
>
53.55 s
> error[E0433] : cannot find `structure` in `spenso`
53.55 s
> --> crates/feynkit-generator/src/generation.rs:31:5
53.55 s
> |
53.55 s
> 31 | structure::representation::{Minkowski, RepName},
53.55 s
> | ^^^^^^^^^ could not find `structure` in `spenso`
53.55 s
>
53.55 s
> error[E0432] : unresolved imports `idenso::color`, `idenso::dirac`, `idenso::epsilon`, `idenso::representations`
53.55 s
> --> crates/feynkit-generator/src/generation.rs:19:5
53.55 s
> |
53.55 s
> 19 | color::CS,
53.55 s
> | ^^^^^ could not find `color` in `idenso`
53.55 s
> 20 | dirac::{AGS, PS},
53.55 s
> | ^^^^^ could not find `dirac` in `idenso`
53.55 s
> 21 | epsilon::EPSILON_SYMBOL,
53.55 s
> | ^^^^^^^ could not find `epsilon` in `idenso`
53.55 s
> 22 | representations::{Bispinor, ColorAdjoint, ColorFundamental, ColorSextet},
53.55 s
> | ^^^^^^^^^^^^^^^ could not find `representations` in `idenso`
53.55 s
>
53.55 s
> Some errors have detailed explanations: E0432, E0433.
53.55 s
> For more information about an error, try `rustc --explain E0432`.
53.55 s
> error : could not compile `feynkit-generator` (lib) due to 3 previous errors
53.55 s
For full logs, run:
53.55 s
nix log /nix/store/a11753sv3gw6h4w5nb9g4q85q368pjgl-gammaloop-crate-feynkit-generator-dependency-deps-0.1.0.drv
53.55 s
error: Cannot build '/nix/store/a0qkx7xvn5av1x24bggs4f3w00qrjv3b-gammaloop-crate-gammalooprs-dependency-deps-inputs.drv '.
53.55 s
Reason: 1 dependency failed .
53.55 s
Output paths:
53.55 s
/nix/store/v8zpd12gpcna32syp2c3m57gqq9zwr04-gammaloop-crate-gammalooprs-dependency-deps-inputs
53.55 s
error: Cannot build '/nix/store/r5h1y5gdqlsgpy9hvy7llvswa93ncy1q-gammaloop-crate-gammalooprs-dependency-inputs.drv '.
53.55 s
Reason: 1 dependency failed .
53.55 s
Output paths:
53.55 s
/nix/store/4kiazx2jzr2fv9v4kd76dw0qazh9df5m-gammaloop-crate-gammalooprs-dependency-inputs
55.42 s
Downloaded cached gammaloop-crate-spenso-hep-lib-dependency-inputs (1.2 GiB) in 9.9s
55.42 s
error: Build failed due to failed dependency
55.42 s
error: Cannot build '/nix/store/xyyasa8bmk7z24pgvbdscd0bcq63rbr6-gammaloop-crate-gammalooprs-dependency-deps-0.1.0.drv '.
55.42 s
Reason: 1 dependency failed .
55.42 s
Output paths:
55.42 s
/nix/store/mqmz1c6x83s0zm2w30wl9ygmzjq17lr1-gammaloop-crate-gammalooprs-dependency-deps-0.1.0
55.42 s
error: Build failed due to failed dependency
55.42 s
error: Cannot build '/nix/store/8f7ddlc54i6nad2k88wx06pb872cxfcn-nix-ci-artifact-barrier-crate-deps-gammalooprs.drv '.
55.42 s
Reason: 1 dependency failed .
55.42 s
Output paths:
55.42 s
/nix/store/s0kflmlb7535i6qv61hw7szmf99ny4wc-nix-ci-artifact-barrier-crate-deps-gammalooprs
55.42 s
Build failed due to failed dependency
55.48 s
Build failed.