1. 0.59 s $ /nix/store/9ypz3flqsrl5xl495mm8h645gadjsxi1-coreutils-9.11/bin/timeout --kill-after=15s 7200s /nix/store/23zk8sgzamrbmj1fday15szf7f2279s8-nix-2.34.7/bin/nix --extra-experimental-features nix-command --extra-experimental-features flakes --log-format internal-json build --no-link --print-out-paths git+https://github.com/alphal00p/gammaloop?ref=feynkit&rev=fb38e1406170d8a69c2ea39345f5d1fbe2eaecf9&shallow=1#packages.x86_64-linux.crate-deps-gammalooprs --print-build-logs
  2. 6.63 s
  3. 8.17 s Downloading cached source from https://cache.nix-ci.com
  4. 8.21 s Downloading cached gammaloop-crate-feynkit-kinematics-dependency-deps from https://cache.nix-ci.com
  5. 8.21 s Downloading cached gammaloop-crate-feynkit-model-dependency-deps from https://cache.nix-ci.com
  6. 8.21 s Downloading cached gammaloop-crate-gammaloop-tracing-filter-dependency-deps from https://cache.nix-ci.com
  7. 8.21 s Downloading cached gammaloop-crate-gammaloop-tracing-filter-macros-dependency-deps from https://cache.nix-ci.com
  8. 8.21 s Downloading cached gammaloop-crate-idenso-dependency-deps from https://cache.nix-ci.com
  9. 8.21 s Downloading cached gammaloop-crate-linnet-dependency-deps from https://cache.nix-ci.com
  10. 8.21 s Downloading cached gammaloop-crate-spenso-dependency-deps from https://cache.nix-ci.com
  11. 8.21 s Downloading cached gammaloop-crate-spenso-macros-dependency-deps from https://cache.nix-ci.com
  12. 8.21 s Downloading cached gammaloop-crate-symbolica-utils-dependency-deps from https://cache.nix-ci.com
  13. 8.21 s Downloading cached gammaloop-crate-vakint-dependency-deps from https://cache.nix-ci.com
  14. 8.21 s Building /nix/store/yymny6c4dwdp63iinxrbdi2pkpcaik3j-gammaloop-ci-consumer-gammalooprs-Cargo.toml.drv
  15. 8.22 s Downloading cached source from https://cache.nix-ci.com
  16. 8.22 s Downloading cached source from https://cache.nix-ci.com
  17. 8.22 s Downloading cached source from https://cache.nix-ci.com
  18. 8.25 s Building /nix/store/iga07jcci87cqgq32n43yd39qgq50ixy-gammaloop-ci-consumer-feynkit-generator-Cargo.toml.drv
  19. 8.26 s Building /nix/store/6qfq54srd0ills7lb277ddvgdf2l8vrf-gammaloop-ci-consumer-gammalooprs-Cargo.toml.drv
  20. 8.28 s Building /nix/store/2r4r75qga4bncqgwzgj7bpjsi4qsrv4q-gammaloop-ci-consumer-spenso-hep-lib-Cargo.toml.drv
  21. 8.29 s [gammaloop-ci-consumer-gammalooprs-Cargo.toml:post-build] Uploading to the NixCI cache: /nix/store/35yd4wk6vcgrf27la41cds8fshkmm797-gammaloop-ci-consumer-gammalooprs-Cargo.toml
  22. 8.33 s [gammaloop-ci-consumer-gammalooprs-Cargo.toml:post-build] warning: 'warn-short-path-literals' is deprecated, use 'lint-short-path-literals = ignore' instead
  23. 8.41 s Downloaded cached source (1.8 MiB) in 183ms
  24. 8.43 s Downloaded cached source (3.3 MiB) in 208ms
  25. 8.46 s [gammaloop-ci-consumer-gammalooprs-Cargo.toml:post-build] copying 0 paths...
  26. 8.51 s [gammaloop-ci-consumer-gammalooprs-Cargo.toml:post-build] warning: 'warn-short-path-literals' is deprecated, use 'lint-short-path-literals = ignore' instead
  27. 8.65 s Downloaded cached source (20.3 MiB) in 478ms
  28. 8.67 s [gammaloop-ci-consumer-gammalooprs-Cargo.toml:post-build] copying 0 paths...
  29. 8.68 s Uploaded gammaloop-ci-consumer-gammalooprs-Cargo.toml in 394ms
  30. 8.68 s Progress: 1 of 30 built (3 building), 0 of 18 downloaded from cache (14 downloading)
  31. 8.68 s Built gammaloop-ci-consumer-gammalooprs-Cargo.toml in 473ms
  32. 8.68 s Progress: 1 of 29 built (3 building), 1 of 18 downloaded from cache (13 downloading)
  33. 8.68 s Progress: 1 of 29 built (3 building), 2 of 18 downloaded from cache (12 downloading)
  34. 8.68 s Progress: 1 of 29 built (3 building), 3 of 18 downloaded from cache (11 downloading)
  35. 8.70 s [gammaloop-ci-consumer-feynkit-generator-Cargo.toml:post-build] Uploading to the NixCI cache: /nix/store/gm7rmydyfagq1xq2ip06j8kzj2aks6fk-gammaloop-ci-consumer-feynkit-generator-Cargo.toml
  36. 8.74 s [gammaloop-ci-consumer-feynkit-generator-Cargo.toml:post-build] warning: 'warn-short-path-literals' is deprecated, use 'lint-short-path-literals = ignore' instead
  37. 8.81 s Downloaded cached source (16 MiB) in 582ms
  38. 8.87 s [gammaloop-ci-consumer-feynkit-generator-Cargo.toml:post-build] copying 0 paths...
  39. 8.93 s [gammaloop-ci-consumer-feynkit-generator-Cargo.toml:post-build] warning: 'warn-short-path-literals' is deprecated, use 'lint-short-path-literals = ignore' instead
  40. 9.07 s [gammaloop-ci-consumer-feynkit-generator-Cargo.toml:post-build] copying 0 paths...
  41. 9.08 s Uploaded gammaloop-ci-consumer-feynkit-generator-Cargo.toml in 394ms
  42. 9.08 s Progress: 2 of 30 built (2 building), 3 of 18 downloaded from cache (11 downloading)
  43. 9.08 s Built gammaloop-ci-consumer-feynkit-generator-Cargo.toml in 833ms
  44. 9.10 s [gammaloop-ci-consumer-gammalooprs-Cargo.toml:post-build] Uploading to the NixCI cache: /nix/store/ngjkq98nqnal003ii6j384r28wg4kvlb-gammaloop-ci-consumer-gammalooprs-Cargo.toml
  45. 9.15 s [gammaloop-ci-consumer-gammalooprs-Cargo.toml:post-build] warning: 'warn-short-path-literals' is deprecated, use 'lint-short-path-literals = ignore' instead
  46. 9.27 s [gammaloop-ci-consumer-gammalooprs-Cargo.toml:post-build] copying 0 paths...
  47. 9.33 s [gammaloop-ci-consumer-gammalooprs-Cargo.toml:post-build] warning: 'warn-short-path-literals' is deprecated, use 'lint-short-path-literals = ignore' instead
  48. 9.47 s [gammaloop-ci-consumer-gammalooprs-Cargo.toml:post-build] copying 0 paths...
  49. 9.48 s Uploaded gammaloop-ci-consumer-gammalooprs-Cargo.toml in 397ms
  50. 9.48 s Progress: 3 of 31 built (1 building), 3 of 18 downloaded from cache (11 downloading)
  51. 9.48 s Built gammaloop-ci-consumer-gammalooprs-Cargo.toml in 1.2s
  52. 9.51 s [gammaloop-ci-consumer-spenso-hep-lib-Cargo.toml:post-build] Uploading to the NixCI cache: /nix/store/iv2ypszyfv8w6d3wc1y8mdw6dyi4lvmk-gammaloop-ci-consumer-spenso-hep-lib-Cargo.toml
  53. 9.55 s [gammaloop-ci-consumer-spenso-hep-lib-Cargo.toml:post-build] warning: 'warn-short-path-literals' is deprecated, use 'lint-short-path-literals = ignore' instead
  54. 9.68 s [gammaloop-ci-consumer-spenso-hep-lib-Cargo.toml:post-build] copying 0 paths...
  55. 9.73 s [gammaloop-ci-consumer-spenso-hep-lib-Cargo.toml:post-build] warning: 'warn-short-path-literals' is deprecated, use 'lint-short-path-literals = ignore' instead
  56. 9.87 s [gammaloop-ci-consumer-spenso-hep-lib-Cargo.toml:post-build] copying 0 paths...
  57. 9.89 s Uploaded gammaloop-ci-consumer-spenso-hep-lib-Cargo.toml in 395ms
  58. 9.89 s Progress: 4 of 32 built, 3 of 18 downloaded from cache (11 downloading)
  59. 9.89 s Built gammaloop-ci-consumer-spenso-hep-lib-Cargo.toml in 1.6s
  60. 9.89 s Progress: 4 of 26 built, 4 of 18 downloaded from cache (10 downloading)
  61. 31.41 s Downloaded cached gammaloop-crate-gammaloop-tracing-filter-dependency-deps (334.8 MiB) in 23.1s
  62. 31.45 s Progress: 4 of 25 built, 5 of 18 downloaded from cache (9 downloading)
  63. 31.49 s Downloaded cached gammaloop-crate-symbolica-utils-dependency-deps (316.2 MiB) in 23.2s
  64. 31.49 s Progress: 4 of 24 built, 6 of 18 downloaded from cache (8 downloading)
  65. 33.82 s Downloaded cached gammaloop-crate-idenso-dependency-deps (339.2 MiB) in 25.6s
  66. 33.82 s Progress: 4 of 23 built, 7 of 18 downloaded from cache (7 downloading)
  67. 35.03 s Downloaded cached gammaloop-crate-spenso-dependency-deps (334.7 MiB) in 26.8s
  68. 35.03 s Progress: 4 of 22 built, 8 of 18 downloaded from cache (6 downloading)
  69. 35.69 s Downloaded cached gammaloop-crate-gammaloop-tracing-filter-macros-dependency-deps (316.7 MiB) in 27.4s
  70. 35.69 s Progress: 4 of 21 built, 9 of 18 downloaded from cache (5 downloading)
  71. 36.31 s Downloaded cached gammaloop-crate-feynkit-kinematics-dependency-deps (324.3 MiB) in 28.1s
  72. 36.31 s Progress: 4 of 20 built, 10 of 18 downloaded from cache (4 downloading)
  73. 37.72 s Downloaded cached gammaloop-crate-vakint-dependency-deps (337.3 MiB) in 29.5s
  74. 37.76 s Progress: 4 of 19 built, 11 of 18 downloaded from cache (3 downloading)
  75. 38.61 s Downloaded cached gammaloop-crate-feynkit-model-dependency-deps (411.5 MiB) in 30.3s
  76. 38.61 s Progress: 4 of 18 built, 12 of 18 downloaded from cache (2 downloading)
  77. 38.61 s Downloading cached gammaloop-crate-feynkit-cff-dependency-deps from https://cache.nix-ci.com
  78. 38.61 s Downloading cached gammaloop-crate-feynkit-generator-dependency-inputs from https://cache.nix-ci.com
  79. 38.61 s Downloading cached gammaloop-crate-feynkit-graph-dependency-deps from https://cache.nix-ci.com
  80. 38.92 s Downloaded cached gammaloop-crate-linnet-dependency-deps (324.5 MiB) in 30.7s
  81. 38.92 s Progress: 4 of 17 built, 13 of 18 downloaded from cache (4 downloading)
  82. 45.40 s Downloaded cached gammaloop-crate-spenso-macros-dependency-deps (317 MiB) in 37.1s
  83. 45.44 s Progress: 4 of 16 built, 14 of 18 downloaded from cache (3 downloading)
  84. 45.44 s Downloading cached gammaloop-crate-spenso-hep-lib-dependency-inputs from https://cache.nix-ci.com
  85. 48.38 s Downloaded cached gammaloop-crate-feynkit-graph-dependency-deps (423.8 MiB) in 9.7s
  86. 48.38 s Progress: 4 of 15 built, 15 of 18 downloaded from cache (3 downloading)
  87. 50.82 s Downloaded cached gammaloop-crate-feynkit-generator-dependency-inputs (1.6 GiB) in 12.2s
  88. 50.86 s Progress: 4 of 14 built, 16 of 18 downloaded from cache (2 downloading)
  89. 50.98 s Building /nix/store/a11753sv3gw6h4w5nb9g4q85q368pjgl-gammaloop-crate-feynkit-generator-dependency-deps-0.1.0.drv
  90. 51.05 s [gammaloop-crate-feynkit-generator-dependency-deps] Phase: unpackPhase
  91. 51.06 s [gammaloop-crate-feynkit-generator-dependency-deps] unpacking source archive /nix/store/m82rm9f9bfi2an6l0q9mv7q53v2zvnik-source
  92. 51.07 s [gammaloop-crate-feynkit-generator-dependency-deps] source root is source
  93. 51.08 s [gammaloop-crate-feynkit-generator-dependency-deps] Phase: patchPhase
  94. 51.15 s [gammaloop-crate-feynkit-generator-dependency-deps] Executing configureCargoCommonVars
  95. 51.16 s [gammaloop-crate-feynkit-generator-dependency-deps] copying cargo artifacts from /nix/store/aznnnzx8d5ilrrava53zs68i16yqzcvn-gammaloop-crate-feynkit-generator-dependency-inputs/target to target
  96. 51.16 s [gammaloop-crate-feynkit-generator-dependency-deps] will deep copy artifacts (instead of symlinking) as requested
  97. 51.97 s Downloaded cached gammaloop-crate-feynkit-cff-dependency-deps (424.7 MiB) in 13.3s
  98. 51.98 s Progress: 4 of 13 built (1 building), 17 of 18 downloaded from cache (1 downloading)
  99. 52.09 s [gammaloop-crate-feynkit-generator-dependency-deps] Phase: updateAutotoolsGnuConfigScriptsPhase
  100. 52.12 s [gammaloop-crate-feynkit-generator-dependency-deps] Phase: configurePhase
  101. 52.12 s [gammaloop-crate-feynkit-generator-dependency-deps] will append /build/source/.cargo-home/config.toml with contents of /nix/store/1sigmg52bb61pfngmk9k8wq5fz9r7bf1-vendor-cargo-deps/config.toml
  102. 52.13 s [gammaloop-crate-feynkit-generator-dependency-deps] default configurePhase, nothing to do
  103. 52.13 s [gammaloop-crate-feynkit-generator-dependency-deps] Phase: buildPhase
  104. 52.15 s [gammaloop-crate-feynkit-generator-dependency-deps] +++ command cargo --version
  105. 52.15 s [gammaloop-crate-feynkit-generator-dependency-deps] cargo 1.97.0 (c980f4866 2026-06-30)
  106. 52.15 s [gammaloop-crate-feynkit-generator-dependency-deps] +++ command cargo build --profile ci-optim --offline -p gammaloop-ci-consumer-feynkit-generator -p gammaloop-workspace-hack --features symbolica/tracing_max_level_info
  107. 52.41 s [gammaloop-crate-feynkit-generator-dependency-deps] Compiling spenso-macros v0.3.2 (/build/source/crates/spenso-macros)
  108. 52.42 s [gammaloop-crate-feynkit-generator-dependency-deps] Compiling spenso v0.6.0 (/build/source/crates/spenso)
  109. 52.42 s [gammaloop-crate-feynkit-generator-dependency-deps] Compiling idenso v0.3.0 (/build/source/crates/idenso)
  110. 52.68 s [gammaloop-crate-feynkit-generator-dependency-deps] Compiling feynkit-generator v0.1.0 (/build/source/crates/feynkit-generator)
  111. 52.74 s [gammaloop-crate-feynkit-generator-dependency-deps] error[E0433]: cannot find `network` in `spenso`
  112. 52.74 s [gammaloop-crate-feynkit-generator-dependency-deps] --> crates/feynkit-generator/src/generation.rs:30:5
  113. 52.74 s [gammaloop-crate-feynkit-generator-dependency-deps] |
  114. 52.74 s [gammaloop-crate-feynkit-generator-dependency-deps] 30 | network::library::symbolic::ETS,
  115. 52.74 s [gammaloop-crate-feynkit-generator-dependency-deps] | ^^^^^^^ could not find `network` in `spenso`
  116. 52.74 s [gammaloop-crate-feynkit-generator-dependency-deps]
  117. 52.74 s [gammaloop-crate-feynkit-generator-dependency-deps] error[E0433]: cannot find `structure` in `spenso`
  118. 52.74 s [gammaloop-crate-feynkit-generator-dependency-deps] --> crates/feynkit-generator/src/generation.rs:31:5
  119. 52.74 s [gammaloop-crate-feynkit-generator-dependency-deps] |
  120. 52.74 s [gammaloop-crate-feynkit-generator-dependency-deps] 31 | structure::representation::{Minkowski, RepName},
  121. 52.74 s [gammaloop-crate-feynkit-generator-dependency-deps] | ^^^^^^^^^ could not find `structure` in `spenso`
  122. 52.74 s [gammaloop-crate-feynkit-generator-dependency-deps]
  123. 52.74 s [gammaloop-crate-feynkit-generator-dependency-deps] error[E0432]: unresolved imports `idenso::color`, `idenso::dirac`, `idenso::epsilon`, `idenso::representations`
  124. 52.74 s [gammaloop-crate-feynkit-generator-dependency-deps] --> crates/feynkit-generator/src/generation.rs:19:5
  125. 52.74 s [gammaloop-crate-feynkit-generator-dependency-deps] |
  126. 52.74 s [gammaloop-crate-feynkit-generator-dependency-deps] 19 | color::CS,
  127. 52.74 s [gammaloop-crate-feynkit-generator-dependency-deps] | ^^^^^ could not find `color` in `idenso`
  128. 52.74 s [gammaloop-crate-feynkit-generator-dependency-deps] 20 | dirac::{AGS, PS},
  129. 52.74 s [gammaloop-crate-feynkit-generator-dependency-deps] | ^^^^^ could not find `dirac` in `idenso`
  130. 52.74 s [gammaloop-crate-feynkit-generator-dependency-deps] 21 | epsilon::EPSILON_SYMBOL,
  131. 52.74 s [gammaloop-crate-feynkit-generator-dependency-deps] | ^^^^^^^ could not find `epsilon` in `idenso`
  132. 52.74 s [gammaloop-crate-feynkit-generator-dependency-deps] 22 | representations::{Bispinor, ColorAdjoint, ColorFundamental, ColorSextet},
  133. 52.74 s [gammaloop-crate-feynkit-generator-dependency-deps] | ^^^^^^^^^^^^^^^ could not find `representations` in `idenso`
  134. 52.74 s [gammaloop-crate-feynkit-generator-dependency-deps]
  135. 53.30 s [gammaloop-crate-feynkit-generator-dependency-deps] Some errors have detailed explanations: E0432, E0433.
  136. 53.30 s [gammaloop-crate-feynkit-generator-dependency-deps] For more information about an error, try `rustc --explain E0432`.
  137. 53.31 s [gammaloop-crate-feynkit-generator-dependency-deps] error: could not compile `feynkit-generator` (lib) due to 3 previous errors
  138. 53.54 s Progress: 4 of 12 built (1 failed), 17 of 18 downloaded from cache (1 downloading)
  139. 53.54 s Failed to build gammaloop-crate-feynkit-generator-dependency-deps after 2.5s
  140. 53.55 s error: Cannot build '/nix/store/a11753sv3gw6h4w5nb9g4q85q368pjgl-gammaloop-crate-feynkit-generator-dependency-deps-0.1.0.drv'.
  141. 53.55 s Reason: builder failed with exit code 101.
  142. 53.55 s Output paths:
  143. 53.55 s /nix/store/j3y5sfxxp93cbs9hipvm0i32pmn1awy2-gammaloop-crate-feynkit-generator-dependency-deps-0.1.0
  144. 53.55 s Last 46 log lines:
  145. 53.55 s > Running phase: unpackPhase
  146. 53.55 s > unpacking source archive /nix/store/m82rm9f9bfi2an6l0q9mv7q53v2zvnik-source
  147. 53.55 s > source root is source
  148. 53.55 s > Running phase: patchPhase
  149. 53.55 s > Executing configureCargoCommonVars
  150. 53.55 s > copying cargo artifacts from /nix/store/aznnnzx8d5ilrrava53zs68i16yqzcvn-gammaloop-crate-feynkit-generator-dependency-inputs/target to target
  151. 53.55 s > will deep copy artifacts (instead of symlinking) as requested
  152. 53.55 s > Running phase: updateAutotoolsGnuConfigScriptsPhase
  153. 53.55 s > Running phase: configurePhase
  154. 53.55 s > will append /build/source/.cargo-home/config.toml with contents of /nix/store/1sigmg52bb61pfngmk9k8wq5fz9r7bf1-vendor-cargo-deps/config.toml
  155. 53.55 s > default configurePhase, nothing to do
  156. 53.55 s > Running phase: buildPhase
  157. 53.55 s > +++ command cargo --version
  158. 53.55 s > cargo 1.97.0 (c980f4866 2026-06-30)
  159. 53.55 s > +++ command cargo build --profile ci-optim --offline -p gammaloop-ci-consumer-feynkit-generator -p gammaloop-workspace-hack --features symbolica/tracing_max_level_info
  160. 53.55 s > Compiling spenso-macros v0.3.2 (/build/source/crates/spenso-macros)
  161. 53.55 s > Compiling spenso v0.6.0 (/build/source/crates/spenso)
  162. 53.55 s > Compiling idenso v0.3.0 (/build/source/crates/idenso)
  163. 53.55 s > Compiling feynkit-generator v0.1.0 (/build/source/crates/feynkit-generator)
  164. 53.55 s > error[E0433]: cannot find `network` in `spenso`
  165. 53.55 s > --> crates/feynkit-generator/src/generation.rs:30:5
  166. 53.55 s > |
  167. 53.55 s > 30 | network::library::symbolic::ETS,
  168. 53.55 s > | ^^^^^^^ could not find `network` in `spenso`
  169. 53.55 s >
  170. 53.55 s > error[E0433]: cannot find `structure` in `spenso`
  171. 53.55 s > --> crates/feynkit-generator/src/generation.rs:31:5
  172. 53.55 s > |
  173. 53.55 s > 31 | structure::representation::{Minkowski, RepName},
  174. 53.55 s > | ^^^^^^^^^ could not find `structure` in `spenso`
  175. 53.55 s >
  176. 53.55 s > error[E0432]: unresolved imports `idenso::color`, `idenso::dirac`, `idenso::epsilon`, `idenso::representations`
  177. 53.55 s > --> crates/feynkit-generator/src/generation.rs:19:5
  178. 53.55 s > |
  179. 53.55 s > 19 | color::CS,
  180. 53.55 s > | ^^^^^ could not find `color` in `idenso`
  181. 53.55 s > 20 | dirac::{AGS, PS},
  182. 53.55 s > | ^^^^^ could not find `dirac` in `idenso`
  183. 53.55 s > 21 | epsilon::EPSILON_SYMBOL,
  184. 53.55 s > | ^^^^^^^ could not find `epsilon` in `idenso`
  185. 53.55 s > 22 | representations::{Bispinor, ColorAdjoint, ColorFundamental, ColorSextet},
  186. 53.55 s > | ^^^^^^^^^^^^^^^ could not find `representations` in `idenso`
  187. 53.55 s >
  188. 53.55 s > Some errors have detailed explanations: E0432, E0433.
  189. 53.55 s > For more information about an error, try `rustc --explain E0432`.
  190. 53.55 s > error: could not compile `feynkit-generator` (lib) due to 3 previous errors
  191. 53.55 s For full logs, run:
  192. 53.55 s nix log /nix/store/a11753sv3gw6h4w5nb9g4q85q368pjgl-gammaloop-crate-feynkit-generator-dependency-deps-0.1.0.drv
  193. 53.55 s error: Cannot build '/nix/store/a0qkx7xvn5av1x24bggs4f3w00qrjv3b-gammaloop-crate-gammalooprs-dependency-deps-inputs.drv'.
  194. 53.55 s Reason: 1 dependency failed.
  195. 53.55 s Output paths:
  196. 53.55 s /nix/store/v8zpd12gpcna32syp2c3m57gqq9zwr04-gammaloop-crate-gammalooprs-dependency-deps-inputs
  197. 53.55 s error: Cannot build '/nix/store/r5h1y5gdqlsgpy9hvy7llvswa93ncy1q-gammaloop-crate-gammalooprs-dependency-inputs.drv'.
  198. 53.55 s Reason: 1 dependency failed.
  199. 53.55 s Output paths:
  200. 53.55 s /nix/store/4kiazx2jzr2fv9v4kd76dw0qazh9df5m-gammaloop-crate-gammalooprs-dependency-inputs
  201. 55.42 s Downloaded cached gammaloop-crate-spenso-hep-lib-dependency-inputs (1.2 GiB) in 9.9s
  202. 55.42 s error: Build failed due to failed dependency
  203. 55.42 s error: Cannot build '/nix/store/xyyasa8bmk7z24pgvbdscd0bcq63rbr6-gammaloop-crate-gammalooprs-dependency-deps-0.1.0.drv'.
  204. 55.42 s Reason: 1 dependency failed.
  205. 55.42 s Output paths:
  206. 55.42 s /nix/store/mqmz1c6x83s0zm2w30wl9ygmzjq17lr1-gammaloop-crate-gammalooprs-dependency-deps-0.1.0
  207. 55.42 s error: Build failed due to failed dependency
  208. 55.42 s error: Cannot build '/nix/store/8f7ddlc54i6nad2k88wx06pb872cxfcn-nix-ci-artifact-barrier-crate-deps-gammalooprs.drv'.
  209. 55.42 s Reason: 1 dependency failed.
  210. 55.42 s Output paths:
  211. 55.42 s /nix/store/s0kflmlb7535i6qv61hw7szmf99ny4wc-nix-ci-artifact-barrier-crate-deps-gammalooprs
  212. 55.42 s Build failed due to failed dependency
  213. 55.48 s Build failed.