build packages.x86_64-linux.crate-test-dependencies-feynkit-generator

Reproduce this run
Original Run
  1. 0.65 s $ /nix/store/9ypz3flqsrl5xl495mm8h645gadjsxi1-coreutils-9.11/bin/timeout --kill-after=15s 7200s /nix/store/23zk8sgzamrbmj1fday15szf7f2279s8-nix-2.34.7/bin/nix --extra-experimental-features nix-command --extra-experimental-features flakes --log-format internal-json build --no-link --print-out-paths git+https://github.com/alphal00p/gammaloop?ref=feynkit&rev=fb38e1406170d8a69c2ea39345f5d1fbe2eaecf9&shallow=1#packages.x86_64-linux.crate-test-dependencies-feynkit-generator --print-build-logs
  2. 0.68 s error (ignored): SQLite database '/var/cache/nix-ci-worker/eval-cache-v6/d10ce4938209fe4f32d9c5b1659a0fe00356cec49093978d863298df1dd4e2f8.sqlite' is busy
  3. 2.20 s
  4. 2.83 s Downloading cached gammaloop-ci-test-binary-dependencies-4f00f4b0073ce06e-Cargo.toml from https://cache.nix-ci.com
  5. 2.83 s Downloaded cached gammaloop-ci-test-binary-dependencies-4f00f4b0073ce06e-Cargo.toml (808 B) in 5ms
  6. 2.85 s Building /nix/store/ymz99csnmzyg0rn8jhhdffb0vr01gjsw-gammaloop-ci-test-dependencies-4f00f4b0073ce06e-Cargo.toml.drv
  7. 2.96 s Building /nix/store/z5lalnpws06yxxy9sxc39cv6hwb7s2y5-gammaloop-crate-test-dependencies-4f00f4b0073ce06e-inputs.drv
  8. 2.96 s Progress: 0 of 5 built (2 building), 1 of 1 downloaded from cache
  9. 2.97 s [gammaloop-ci-test-dependencies-4f00f4b0073ce06e-Cargo.toml:post-build] Uploading to the NixCI cache: /nix/store/nknj9kv2p0516wwcqvrrqsjxqf09ic4v-gammaloop-ci-test-dependencies-4f00f4b0073ce06e-Cargo.toml
  10. 3.01 s [gammaloop-ci-test-dependencies-4f00f4b0073ce06e-Cargo.toml:post-build] warning: 'warn-short-path-literals' is deprecated, use 'lint-short-path-literals = ignore' instead
  11. 3.04 s [gammaloop-ci-test-dependencies-4f00f4b0073ce06e-Cargo.toml:post-build] copying 0 paths...
  12. 3.09 s [gammaloop-ci-test-dependencies-4f00f4b0073ce06e-Cargo.toml:post-build] warning: 'warn-short-path-literals' is deprecated, use 'lint-short-path-literals = ignore' instead
  13. 3.14 s [gammaloop-ci-test-dependencies-4f00f4b0073ce06e-Cargo.toml:post-build] copying 0 paths...
  14. 3.15 s Uploaded gammaloop-ci-test-dependencies-4f00f4b0073ce06e-Cargo.toml in 190ms
  15. 3.15 s Progress: 1 of 6 built (1 building), 1 of 1 downloaded from cache
  16. 3.15 s Built gammaloop-ci-test-dependencies-4f00f4b0073ce06e-Cargo.toml in 299ms
  17. 11.42 s [gammaloop-crate-test-dependencies-4f00f4b0073ce06e-inputs:post-build] Uploading to the NixCI cache: /nix/store/j2ww0si0ra45b4lkwykfw5kf71kf0rmw-gammaloop-crate-test-dependencies-4f00f4b0073ce06e-inputs
  18. 11.89 s [gammaloop-crate-test-dependencies-4f00f4b0073ce06e-inputs:post-build] warning: 'warn-short-path-literals' is deprecated, use 'lint-short-path-literals = ignore' instead
  19. 12.00 s [gammaloop-crate-test-dependencies-4f00f4b0073ce06e-inputs:post-build] copying 1 paths...
  20. 12.00 s [gammaloop-crate-test-dependencies-4f00f4b0073ce06e-inputs:post-build] copying path '/nix/store/j2ww0si0ra45b4lkwykfw5kf71kf0rmw-gammaloop-crate-test-dependencies-4f00f4b0073ce06e-inputs' to 'https://cache.nix-ci.com'...
  21. 88.42 s [gammaloop-crate-test-dependencies-4f00f4b0073ce06e-inputs:post-build] warning: 'warn-short-path-literals' is deprecated, use 'lint-short-path-literals = ignore' instead
  22. 88.66 s [gammaloop-crate-test-dependencies-4f00f4b0073ce06e-inputs:post-build] copying 0 paths...
  23. 88.95 s Uploaded gammaloop-crate-test-dependencies-4f00f4b0073ce06e-inputs in 1m17s
  24. 88.95 s Progress: 2 of 5 built, 1 of 1 downloaded from cache
  25. 88.95 s Built gammaloop-crate-test-dependencies-4f00f4b0073ce06e-inputs in 1m25s
  26. 89.06 s Building /nix/store/7irahmlyqhb90nw05kal3bnsf9m7am2d-gammaloop-crate-test-dependencies-4f00f4b0073ce06e-deps-0.1.0.drv
  27. 89.13 s [gammaloop-crate-test-dependencies-4f00f4b0073ce06e-deps] Phase: unpackPhase
  28. 89.13 s [gammaloop-crate-test-dependencies-4f00f4b0073ce06e-deps] unpacking source archive /nix/store/6p6c3fvj4nyq06zx87kg79fy8zllfliy-source
  29. 89.43 s [gammaloop-crate-test-dependencies-4f00f4b0073ce06e-deps] source root is source
  30. 89.46 s [gammaloop-crate-test-dependencies-4f00f4b0073ce06e-deps] Phase: patchPhase
  31. 89.89 s [gammaloop-crate-test-dependencies-4f00f4b0073ce06e-deps] Executing configureCargoCommonVars
  32. 89.90 s [gammaloop-crate-test-dependencies-4f00f4b0073ce06e-deps] copying cargo artifacts from /nix/store/j2ww0si0ra45b4lkwykfw5kf71kf0rmw-gammaloop-crate-test-dependencies-4f00f4b0073ce06e-inputs/target to target
  33. 89.90 s [gammaloop-crate-test-dependencies-4f00f4b0073ce06e-deps] will deep copy artifacts (instead of symlinking) as requested
  34. 102.83 s [gammaloop-crate-test-dependencies-4f00f4b0073ce06e-deps] Phase: updateAutotoolsGnuConfigScriptsPhase
  35. 103.40 s [gammaloop-crate-test-dependencies-4f00f4b0073ce06e-deps] Phase: configurePhase
  36. 103.40 s [gammaloop-crate-test-dependencies-4f00f4b0073ce06e-deps] will append /build/source/.cargo-home/config.toml with contents of /nix/store/1sigmg52bb61pfngmk9k8wq5fz9r7bf1-vendor-cargo-deps/config.toml
  37. 103.40 s [gammaloop-crate-test-dependencies-4f00f4b0073ce06e-deps] default configurePhase, nothing to do
  38. 103.40 s [gammaloop-crate-test-dependencies-4f00f4b0073ce06e-deps] Phase: buildPhase
  39. 103.40 s [gammaloop-crate-test-dependencies-4f00f4b0073ce06e-deps] +++ command cargo --version
  40. 103.40 s [gammaloop-crate-test-dependencies-4f00f4b0073ce06e-deps] cargo 1.97.0 (c980f4866 2026-06-30)
  41. 103.40 s [gammaloop-crate-test-dependencies-4f00f4b0073ce06e-deps] +++ command cargo build --profile ci-optim --offline -p gammaloop-ci-test-dependencies-4f00f4b0073ce06e -p gammaloop-workspace-hack --features linnet/bincode,linnet/drawing,linnet/serde,linnet/symbolica,symbolica/tracing_max_level_info --lib
  42. 103.43 s [gammaloop-crate-test-dependencies-4f00f4b0073ce06e-deps] Compiling spenso-macros v0.3.2 (/build/source/crates/spenso-macros)
  43. 103.69 s [gammaloop-crate-test-dependencies-4f00f4b0073ce06e-deps] Compiling spenso v0.6.0 (/build/source/crates/spenso)
  44. 103.72 s [gammaloop-crate-test-dependencies-4f00f4b0073ce06e-deps] Compiling idenso v0.3.0 (/build/source/crates/idenso)
  45. 103.74 s [gammaloop-crate-test-dependencies-4f00f4b0073ce06e-deps] Compiling feynkit-generator v0.1.0 (/build/source/crates/feynkit-generator)
  46. 103.84 s [gammaloop-crate-test-dependencies-4f00f4b0073ce06e-deps] error[E0433]: cannot find `network` in `spenso`
  47. 103.84 s [gammaloop-crate-test-dependencies-4f00f4b0073ce06e-deps] --> crates/feynkit-generator/src/generation.rs:30:5
  48. 103.84 s [gammaloop-crate-test-dependencies-4f00f4b0073ce06e-deps] |
  49. 103.84 s [gammaloop-crate-test-dependencies-4f00f4b0073ce06e-deps] 30 | network::library::symbolic::ETS,
  50. 103.84 s [gammaloop-crate-test-dependencies-4f00f4b0073ce06e-deps] | ^^^^^^^ could not find `network` in `spenso`
  51. 103.84 s [gammaloop-crate-test-dependencies-4f00f4b0073ce06e-deps]
  52. 103.84 s [gammaloop-crate-test-dependencies-4f00f4b0073ce06e-deps] error[E0433]: cannot find `structure` in `spenso`
  53. 103.84 s [gammaloop-crate-test-dependencies-4f00f4b0073ce06e-deps] --> crates/feynkit-generator/src/generation.rs:31:5
  54. 103.84 s [gammaloop-crate-test-dependencies-4f00f4b0073ce06e-deps] |
  55. 103.84 s [gammaloop-crate-test-dependencies-4f00f4b0073ce06e-deps] 31 | structure::representation::{Minkowski, RepName},
  56. 103.84 s [gammaloop-crate-test-dependencies-4f00f4b0073ce06e-deps] | ^^^^^^^^^ could not find `structure` in `spenso`
  57. 103.84 s [gammaloop-crate-test-dependencies-4f00f4b0073ce06e-deps]
  58. 103.84 s [gammaloop-crate-test-dependencies-4f00f4b0073ce06e-deps] error[E0432]: unresolved imports `idenso::color`, `idenso::dirac`, `idenso::epsilon`, `idenso::representations`
  59. 103.84 s [gammaloop-crate-test-dependencies-4f00f4b0073ce06e-deps] --> crates/feynkit-generator/src/generation.rs:19:5
  60. 103.84 s [gammaloop-crate-test-dependencies-4f00f4b0073ce06e-deps] |
  61. 103.84 s [gammaloop-crate-test-dependencies-4f00f4b0073ce06e-deps] 19 | color::CS,
  62. 103.84 s [gammaloop-crate-test-dependencies-4f00f4b0073ce06e-deps] | ^^^^^ could not find `color` in `idenso`
  63. 103.84 s [gammaloop-crate-test-dependencies-4f00f4b0073ce06e-deps] 20 | dirac::{AGS, PS},
  64. 103.84 s [gammaloop-crate-test-dependencies-4f00f4b0073ce06e-deps] | ^^^^^ could not find `dirac` in `idenso`
  65. 103.84 s [gammaloop-crate-test-dependencies-4f00f4b0073ce06e-deps] 21 | epsilon::EPSILON_SYMBOL,
  66. 103.84 s [gammaloop-crate-test-dependencies-4f00f4b0073ce06e-deps] | ^^^^^^^ could not find `epsilon` in `idenso`
  67. 103.84 s [gammaloop-crate-test-dependencies-4f00f4b0073ce06e-deps] 22 | representations::{Bispinor, ColorAdjoint, ColorFundamental, ColorSextet},
  68. 103.84 s [gammaloop-crate-test-dependencies-4f00f4b0073ce06e-deps] | ^^^^^^^^^^^^^^^ could not find `representations` in `idenso`
  69. 103.84 s [gammaloop-crate-test-dependencies-4f00f4b0073ce06e-deps]
  70. 104.55 s [gammaloop-crate-test-dependencies-4f00f4b0073ce06e-deps] Some errors have detailed explanations: E0432, E0433.
  71. 104.55 s [gammaloop-crate-test-dependencies-4f00f4b0073ce06e-deps] For more information about an error, try `rustc --explain E0432`.
  72. 104.56 s [gammaloop-crate-test-dependencies-4f00f4b0073ce06e-deps] error: could not compile `feynkit-generator` (lib) due to 3 previous errors
  73. 104.93 s Progress: 2 of 4 built (1 failed), 1 of 1 downloaded from cache
  74. 104.93 s Failed to build gammaloop-crate-test-dependencies-4f00f4b0073ce06e-deps after 15.8s
  75. 104.93 s error: Cannot build '/nix/store/7irahmlyqhb90nw05kal3bnsf9m7am2d-gammaloop-crate-test-dependencies-4f00f4b0073ce06e-deps-0.1.0.drv'.
  76. 104.93 s Reason: builder failed with exit code 101.
  77. 104.93 s Output paths:
  78. 104.93 s /nix/store/qf4czyssl5c28n19irf674h0jknsv59x-gammaloop-crate-test-dependencies-4f00f4b0073ce06e-deps-0.1.0
  79. 104.93 s Last 46 log lines:
  80. 104.93 s > Running phase: unpackPhase
  81. 104.93 s > unpacking source archive /nix/store/6p6c3fvj4nyq06zx87kg79fy8zllfliy-source
  82. 104.93 s > source root is source
  83. 104.93 s > Running phase: patchPhase
  84. 104.93 s > Executing configureCargoCommonVars
  85. 104.93 s > copying cargo artifacts from /nix/store/j2ww0si0ra45b4lkwykfw5kf71kf0rmw-gammaloop-crate-test-dependencies-4f00f4b0073ce06e-inputs/target to target
  86. 104.93 s > will deep copy artifacts (instead of symlinking) as requested
  87. 104.93 s > Running phase: updateAutotoolsGnuConfigScriptsPhase
  88. 104.93 s > Running phase: configurePhase
  89. 104.93 s > will append /build/source/.cargo-home/config.toml with contents of /nix/store/1sigmg52bb61pfngmk9k8wq5fz9r7bf1-vendor-cargo-deps/config.toml
  90. 104.93 s > default configurePhase, nothing to do
  91. 104.93 s > Running phase: buildPhase
  92. 104.93 s > +++ command cargo --version
  93. 104.93 s > cargo 1.97.0 (c980f4866 2026-06-30)
  94. 104.93 s > +++ command cargo build --profile ci-optim --offline -p gammaloop-ci-test-dependencies-4f00f4b0073ce06e -p gammaloop-workspace-hack --features linnet/bincode,linnet/drawing,linnet/serde,linnet/symbolica,symbolica/tracing_max_level_info --lib
  95. 104.93 s > Compiling spenso-macros v0.3.2 (/build/source/crates/spenso-macros)
  96. 104.93 s > Compiling spenso v0.6.0 (/build/source/crates/spenso)
  97. 104.93 s > Compiling idenso v0.3.0 (/build/source/crates/idenso)
  98. 104.93 s > Compiling feynkit-generator v0.1.0 (/build/source/crates/feynkit-generator)
  99. 104.93 s > error[E0433]: cannot find `network` in `spenso`
  100. 104.93 s > --> crates/feynkit-generator/src/generation.rs:30:5
  101. 104.93 s > |
  102. 104.93 s > 30 | network::library::symbolic::ETS,
  103. 104.93 s > | ^^^^^^^ could not find `network` in `spenso`
  104. 104.93 s >
  105. 104.93 s > error[E0433]: cannot find `structure` in `spenso`
  106. 104.93 s > --> crates/feynkit-generator/src/generation.rs:31:5
  107. 104.93 s > |
  108. 104.93 s > 31 | structure::representation::{Minkowski, RepName},
  109. 104.93 s > | ^^^^^^^^^ could not find `structure` in `spenso`
  110. 104.93 s >
  111. 104.93 s > error[E0432]: unresolved imports `idenso::color`, `idenso::dirac`, `idenso::epsilon`, `idenso::representations`
  112. 104.93 s > --> crates/feynkit-generator/src/generation.rs:19:5
  113. 104.93 s > |
  114. 104.93 s > 19 | color::CS,
  115. 104.93 s > | ^^^^^ could not find `color` in `idenso`
  116. 104.93 s > 20 | dirac::{AGS, PS},
  117. 104.93 s > | ^^^^^ could not find `dirac` in `idenso`
  118. 104.93 s > 21 | epsilon::EPSILON_SYMBOL,
  119. 104.93 s > | ^^^^^^^ could not find `epsilon` in `idenso`
  120. 104.93 s > 22 | representations::{Bispinor, ColorAdjoint, ColorFundamental, ColorSextet},
  121. 104.93 s > | ^^^^^^^^^^^^^^^ could not find `representations` in `idenso`
  122. 104.93 s >
  123. 104.93 s > Some errors have detailed explanations: E0432, E0433.
  124. 104.93 s > For more information about an error, try `rustc --explain E0432`.
  125. 104.93 s > error: could not compile `feynkit-generator` (lib) due to 3 previous errors
  126. 104.93 s For full logs, run:
  127. 104.93 s nix log /nix/store/7irahmlyqhb90nw05kal3bnsf9m7am2d-gammaloop-crate-test-dependencies-4f00f4b0073ce06e-deps-0.1.0.drv
  128. 104.93 s error: Cannot build '/nix/store/s4pifkj8kjfqq4ydnq4i7mlp10rchyii-nix-ci-artifact-barrier-crate-test-dependencies-feynkit-generator.drv'.
  129. 104.93 s Reason: 1 dependency failed.
  130. 104.93 s Output paths:
  131. 104.93 s /nix/store/n0rxxjh7z95zqqlbxvyk0dwzia9aiiib-nix-ci-artifact-barrier-crate-test-dependencies-feynkit-generator
  132. 104.94 s Build failed due to failed dependency
  133. 105.09 s Build failed.