build packages.x86_64-linux.crate-test-dependencies-feynkit-generator

Reproduce this run
Retry Run
  1. 0.73 s $ /nix/store/9ypz3flqsrl5xl495mm8h645gadjsxi1-coreutils-9.11/bin/timeout --kill-after=15s 7200s /nix/store/23zk8sgzamrbmj1fday15szf7f2279s8-nix-2.34.7/bin/nix --extra-experimental-features nix-command --extra-experimental-features flakes --log-format internal-json build --no-link --print-out-paths git+https://github.com/alphal00p/gammaloop?ref=feynkit&rev=fb38e1406170d8a69c2ea39345f5d1fbe2eaecf9&shallow=1#packages.x86_64-linux.crate-test-dependencies-feynkit-generator --print-build-logs
  2. 1.65 s error (ignored): SQLite database '/var/cache/nix-ci-worker/eval-cache-v6/d10ce4938209fe4f32d9c5b1659a0fe00356cec49093978d863298df1dd4e2f8.sqlite' is busy
  3. 3.74 s
  4. 4.75 s Downloading cached gammaloop-ci-test-binary-dependencies-4f00f4b0073ce06e-Cargo.toml from https://cache.nix-ci.com
  5. 4.78 s Downloaded cached gammaloop-ci-test-binary-dependencies-4f00f4b0073ce06e-Cargo.toml (808 B) in 30ms
  6. 4.80 s Building /nix/store/ymz99csnmzyg0rn8jhhdffb0vr01gjsw-gammaloop-ci-test-dependencies-4f00f4b0073ce06e-Cargo.toml.drv
  7. 4.81 s Progress: 0 of 6 built (1 building), 1 of 3 downloaded from cache (1 downloading)
  8. 4.81 s Downloading cached gammaloop-crate-test-dependencies-dd93152a31ddbf22-inputs from https://cache.nix-ci.com
  9. 4.88 s [gammaloop-ci-test-dependencies-4f00f4b0073ce06e-Cargo.toml:post-build] Uploading to the NixCI cache: /nix/store/nknj9kv2p0516wwcqvrrqsjxqf09ic4v-gammaloop-ci-test-dependencies-4f00f4b0073ce06e-Cargo.toml
  10. 4.93 s [gammaloop-ci-test-dependencies-4f00f4b0073ce06e-Cargo.toml:post-build] warning: 'warn-short-path-literals' is deprecated, use 'lint-short-path-literals = ignore' instead
  11. 5.03 s [gammaloop-ci-test-dependencies-4f00f4b0073ce06e-Cargo.toml:post-build] copying 0 paths...
  12. 5.11 s [gammaloop-ci-test-dependencies-4f00f4b0073ce06e-Cargo.toml:post-build] warning: 'warn-short-path-literals' is deprecated, use 'lint-short-path-literals = ignore' instead
  13. 5.25 s [gammaloop-ci-test-dependencies-4f00f4b0073ce06e-Cargo.toml:post-build] copying 0 paths...
  14. 5.27 s Uploaded gammaloop-ci-test-dependencies-4f00f4b0073ce06e-Cargo.toml in 411ms
  15. 5.27 s Progress: 1 of 6 built, 1 of 3 downloaded from cache (1 downloading)
  16. 5.27 s Built gammaloop-ci-test-dependencies-4f00f4b0073ce06e-Cargo.toml in 469ms
  17. 22.28 s Downloaded cached gammaloop-crate-test-dependencies-dd93152a31ddbf22-inputs (1.8 GiB) in 17.4s
  18. 22.32 s Progress: 1 of 5 built, 2 of 3 downloaded from cache
  19. 22.32 s Downloading cached gammaloop-crate-test-dependencies-dd93152a31ddbf22-deps from https://cache.nix-ci.com
  20. 22.52 s Downloaded cached gammaloop-crate-test-dependencies-dd93152a31ddbf22-deps (2.9 MiB) in 196ms
  21. 22.52 s Progress: 1 of 5 built, 3 of 3 downloaded from cache
  22. 23.41 s Building /nix/store/z5lalnpws06yxxy9sxc39cv6hwb7s2y5-gammaloop-crate-test-dependencies-4f00f4b0073ce06e-inputs.drv
  23. 35.79 s [gammaloop-crate-test-dependencies-4f00f4b0073ce06e-inputs:post-build] Uploading to the NixCI cache: /nix/store/j2ww0si0ra45b4lkwykfw5kf71kf0rmw-gammaloop-crate-test-dependencies-4f00f4b0073ce06e-inputs
  24. 36.40 s [gammaloop-crate-test-dependencies-4f00f4b0073ce06e-inputs:post-build] warning: 'warn-short-path-literals' is deprecated, use 'lint-short-path-literals = ignore' instead
  25. 36.52 s [gammaloop-crate-test-dependencies-4f00f4b0073ce06e-inputs:post-build] copying 1 paths...
  26. 36.52 s [gammaloop-crate-test-dependencies-4f00f4b0073ce06e-inputs:post-build] copying path '/nix/store/j2ww0si0ra45b4lkwykfw5kf71kf0rmw-gammaloop-crate-test-dependencies-4f00f4b0073ce06e-inputs' to 'https://cache.nix-ci.com'...
  27. 226.54 s [gammaloop-crate-test-dependencies-4f00f4b0073ce06e-inputs:post-build] warning: 'warn-short-path-literals' is deprecated, use 'lint-short-path-literals = ignore' instead
  28. 226.88 s [gammaloop-crate-test-dependencies-4f00f4b0073ce06e-inputs:post-build] copying 1 paths...
  29. 226.88 s [gammaloop-crate-test-dependencies-4f00f4b0073ce06e-inputs:post-build] copying path '/nix/store/z5lalnpws06yxxy9sxc39cv6hwb7s2y5-gammaloop-crate-test-dependencies-4f00f4b0073ce06e-inputs.drv' to 'https://cache.nix-ci.com'...
  30. 227.34 s Uploaded gammaloop-crate-test-dependencies-4f00f4b0073ce06e-inputs in 3m11s
  31. 227.35 s Progress: 2 of 5 built, 3 of 3 downloaded from cache
  32. 227.35 s Built gammaloop-crate-test-dependencies-4f00f4b0073ce06e-inputs in 3m23s
  33. 227.45 s Building /nix/store/7irahmlyqhb90nw05kal3bnsf9m7am2d-gammaloop-crate-test-dependencies-4f00f4b0073ce06e-deps-0.1.0.drv
  34. 227.66 s [gammaloop-crate-test-dependencies-4f00f4b0073ce06e-deps] Phase: unpackPhase
  35. 227.66 s [gammaloop-crate-test-dependencies-4f00f4b0073ce06e-deps] unpacking source archive /nix/store/6p6c3fvj4nyq06zx87kg79fy8zllfliy-source
  36. 227.68 s [gammaloop-crate-test-dependencies-4f00f4b0073ce06e-deps] source root is source
  37. 227.69 s [gammaloop-crate-test-dependencies-4f00f4b0073ce06e-deps] Phase: patchPhase
  38. 228.09 s [gammaloop-crate-test-dependencies-4f00f4b0073ce06e-deps] Executing configureCargoCommonVars
  39. 228.10 s [gammaloop-crate-test-dependencies-4f00f4b0073ce06e-deps] copying cargo artifacts from /nix/store/j2ww0si0ra45b4lkwykfw5kf71kf0rmw-gammaloop-crate-test-dependencies-4f00f4b0073ce06e-inputs/target to target
  40. 228.10 s [gammaloop-crate-test-dependencies-4f00f4b0073ce06e-deps] will deep copy artifacts (instead of symlinking) as requested
  41. 229.37 s [gammaloop-crate-test-dependencies-4f00f4b0073ce06e-deps] Phase: updateAutotoolsGnuConfigScriptsPhase
  42. 229.41 s [gammaloop-crate-test-dependencies-4f00f4b0073ce06e-deps] Phase: configurePhase
  43. 229.42 s [gammaloop-crate-test-dependencies-4f00f4b0073ce06e-deps] will append /build/source/.cargo-home/config.toml with contents of /nix/store/1sigmg52bb61pfngmk9k8wq5fz9r7bf1-vendor-cargo-deps/config.toml
  44. 229.42 s [gammaloop-crate-test-dependencies-4f00f4b0073ce06e-deps] default configurePhase, nothing to do
  45. 229.42 s [gammaloop-crate-test-dependencies-4f00f4b0073ce06e-deps] Phase: buildPhase
  46. 229.42 s [gammaloop-crate-test-dependencies-4f00f4b0073ce06e-deps] +++ command cargo --version
  47. 229.43 s [gammaloop-crate-test-dependencies-4f00f4b0073ce06e-deps] cargo 1.97.0 (c980f4866 2026-06-30)
  48. 229.43 s [gammaloop-crate-test-dependencies-4f00f4b0073ce06e-deps] +++ command cargo build --profile ci-optim --offline -p gammaloop-ci-test-dependencies-4f00f4b0073ce06e -p gammaloop-workspace-hack --features linnet/bincode,linnet/drawing,linnet/serde,linnet/symbolica,symbolica/tracing_max_level_info --lib
  49. 229.96 s [gammaloop-crate-test-dependencies-4f00f4b0073ce06e-deps] Compiling spenso-macros v0.3.2 (/build/source/crates/spenso-macros)
  50. 230.19 s [gammaloop-crate-test-dependencies-4f00f4b0073ce06e-deps] Compiling spenso v0.6.0 (/build/source/crates/spenso)
  51. 230.22 s [gammaloop-crate-test-dependencies-4f00f4b0073ce06e-deps] Compiling idenso v0.3.0 (/build/source/crates/idenso)
  52. 230.24 s [gammaloop-crate-test-dependencies-4f00f4b0073ce06e-deps] Compiling feynkit-generator v0.1.0 (/build/source/crates/feynkit-generator)
  53. 230.35 s [gammaloop-crate-test-dependencies-4f00f4b0073ce06e-deps] error[E0433]: cannot find `network` in `spenso`
  54. 230.35 s [gammaloop-crate-test-dependencies-4f00f4b0073ce06e-deps] --> crates/feynkit-generator/src/generation.rs:30:5
  55. 230.35 s [gammaloop-crate-test-dependencies-4f00f4b0073ce06e-deps] |
  56. 230.35 s [gammaloop-crate-test-dependencies-4f00f4b0073ce06e-deps] 30 | network::library::symbolic::ETS,
  57. 230.35 s [gammaloop-crate-test-dependencies-4f00f4b0073ce06e-deps] | ^^^^^^^ could not find `network` in `spenso`
  58. 230.35 s [gammaloop-crate-test-dependencies-4f00f4b0073ce06e-deps]
  59. 230.35 s [gammaloop-crate-test-dependencies-4f00f4b0073ce06e-deps] error[E0433]: cannot find `structure` in `spenso`
  60. 230.35 s [gammaloop-crate-test-dependencies-4f00f4b0073ce06e-deps] --> crates/feynkit-generator/src/generation.rs:31:5
  61. 230.35 s [gammaloop-crate-test-dependencies-4f00f4b0073ce06e-deps] |
  62. 230.35 s [gammaloop-crate-test-dependencies-4f00f4b0073ce06e-deps] 31 | structure::representation::{Minkowski, RepName},
  63. 230.35 s [gammaloop-crate-test-dependencies-4f00f4b0073ce06e-deps] | ^^^^^^^^^ could not find `structure` in `spenso`
  64. 230.35 s [gammaloop-crate-test-dependencies-4f00f4b0073ce06e-deps]
  65. 230.35 s [gammaloop-crate-test-dependencies-4f00f4b0073ce06e-deps] error[E0432]: unresolved imports `idenso::color`, `idenso::dirac`, `idenso::epsilon`, `idenso::representations`
  66. 230.35 s [gammaloop-crate-test-dependencies-4f00f4b0073ce06e-deps] --> crates/feynkit-generator/src/generation.rs:19:5
  67. 230.35 s [gammaloop-crate-test-dependencies-4f00f4b0073ce06e-deps] |
  68. 230.35 s [gammaloop-crate-test-dependencies-4f00f4b0073ce06e-deps] 19 | color::CS,
  69. 230.35 s [gammaloop-crate-test-dependencies-4f00f4b0073ce06e-deps] | ^^^^^ could not find `color` in `idenso`
  70. 230.35 s [gammaloop-crate-test-dependencies-4f00f4b0073ce06e-deps] 20 | dirac::{AGS, PS},
  71. 230.35 s [gammaloop-crate-test-dependencies-4f00f4b0073ce06e-deps] | ^^^^^ could not find `dirac` in `idenso`
  72. 230.35 s [gammaloop-crate-test-dependencies-4f00f4b0073ce06e-deps] 21 | epsilon::EPSILON_SYMBOL,
  73. 230.35 s [gammaloop-crate-test-dependencies-4f00f4b0073ce06e-deps] | ^^^^^^^ could not find `epsilon` in `idenso`
  74. 230.35 s [gammaloop-crate-test-dependencies-4f00f4b0073ce06e-deps] 22 | representations::{Bispinor, ColorAdjoint, ColorFundamental, ColorSextet},
  75. 230.35 s [gammaloop-crate-test-dependencies-4f00f4b0073ce06e-deps] | ^^^^^^^^^^^^^^^ could not find `representations` in `idenso`
  76. 230.35 s [gammaloop-crate-test-dependencies-4f00f4b0073ce06e-deps]
  77. 231.21 s [gammaloop-crate-test-dependencies-4f00f4b0073ce06e-deps] Some errors have detailed explanations: E0432, E0433.
  78. 231.21 s [gammaloop-crate-test-dependencies-4f00f4b0073ce06e-deps] For more information about an error, try `rustc --explain E0432`.
  79. 231.24 s [gammaloop-crate-test-dependencies-4f00f4b0073ce06e-deps] error: could not compile `feynkit-generator` (lib) due to 3 previous errors
  80. 231.64 s Progress: 2 of 4 built (1 failed), 3 of 3 downloaded from cache
  81. 231.71 s Failed to build gammaloop-crate-test-dependencies-4f00f4b0073ce06e-deps after 4.2s
  82. 231.71 s error: Cannot build '/nix/store/7irahmlyqhb90nw05kal3bnsf9m7am2d-gammaloop-crate-test-dependencies-4f00f4b0073ce06e-deps-0.1.0.drv'.
  83. 231.71 s Reason: builder failed with exit code 101.
  84. 231.71 s Output paths:
  85. 231.71 s /nix/store/qf4czyssl5c28n19irf674h0jknsv59x-gammaloop-crate-test-dependencies-4f00f4b0073ce06e-deps-0.1.0
  86. 231.71 s Last 46 log lines:
  87. 231.71 s > Running phase: unpackPhase
  88. 231.71 s > unpacking source archive /nix/store/6p6c3fvj4nyq06zx87kg79fy8zllfliy-source
  89. 231.71 s > source root is source
  90. 231.71 s > Running phase: patchPhase
  91. 231.71 s > Executing configureCargoCommonVars
  92. 231.71 s > copying cargo artifacts from /nix/store/j2ww0si0ra45b4lkwykfw5kf71kf0rmw-gammaloop-crate-test-dependencies-4f00f4b0073ce06e-inputs/target to target
  93. 231.71 s > will deep copy artifacts (instead of symlinking) as requested
  94. 231.71 s > Running phase: updateAutotoolsGnuConfigScriptsPhase
  95. 231.71 s > Running phase: configurePhase
  96. 231.71 s > will append /build/source/.cargo-home/config.toml with contents of /nix/store/1sigmg52bb61pfngmk9k8wq5fz9r7bf1-vendor-cargo-deps/config.toml
  97. 231.71 s > default configurePhase, nothing to do
  98. 231.71 s > Running phase: buildPhase
  99. 231.71 s > +++ command cargo --version
  100. 231.71 s > cargo 1.97.0 (c980f4866 2026-06-30)
  101. 231.71 s > +++ command cargo build --profile ci-optim --offline -p gammaloop-ci-test-dependencies-4f00f4b0073ce06e -p gammaloop-workspace-hack --features linnet/bincode,linnet/drawing,linnet/serde,linnet/symbolica,symbolica/tracing_max_level_info --lib
  102. 231.71 s > Compiling spenso-macros v0.3.2 (/build/source/crates/spenso-macros)
  103. 231.71 s > Compiling spenso v0.6.0 (/build/source/crates/spenso)
  104. 231.71 s > Compiling idenso v0.3.0 (/build/source/crates/idenso)
  105. 231.71 s > Compiling feynkit-generator v0.1.0 (/build/source/crates/feynkit-generator)
  106. 231.71 s > error[E0433]: cannot find `network` in `spenso`
  107. 231.71 s > --> crates/feynkit-generator/src/generation.rs:30:5
  108. 231.71 s > |
  109. 231.71 s > 30 | network::library::symbolic::ETS,
  110. 231.71 s > | ^^^^^^^ could not find `network` in `spenso`
  111. 231.71 s >
  112. 231.71 s > error[E0433]: cannot find `structure` in `spenso`
  113. 231.71 s > --> crates/feynkit-generator/src/generation.rs:31:5
  114. 231.71 s > |
  115. 231.71 s > 31 | structure::representation::{Minkowski, RepName},
  116. 231.71 s > | ^^^^^^^^^ could not find `structure` in `spenso`
  117. 231.71 s >
  118. 231.71 s > error[E0432]: unresolved imports `idenso::color`, `idenso::dirac`, `idenso::epsilon`, `idenso::representations`
  119. 231.71 s > --> crates/feynkit-generator/src/generation.rs:19:5
  120. 231.71 s > |
  121. 231.71 s > 19 | color::CS,
  122. 231.71 s > | ^^^^^ could not find `color` in `idenso`
  123. 231.71 s > 20 | dirac::{AGS, PS},
  124. 231.71 s > | ^^^^^ could not find `dirac` in `idenso`
  125. 231.71 s > 21 | epsilon::EPSILON_SYMBOL,
  126. 231.71 s > | ^^^^^^^ could not find `epsilon` in `idenso`
  127. 231.71 s > 22 | representations::{Bispinor, ColorAdjoint, ColorFundamental, ColorSextet},
  128. 231.71 s > | ^^^^^^^^^^^^^^^ could not find `representations` in `idenso`
  129. 231.71 s >
  130. 231.71 s > Some errors have detailed explanations: E0432, E0433.
  131. 231.71 s > For more information about an error, try `rustc --explain E0432`.
  132. 231.71 s > error: could not compile `feynkit-generator` (lib) due to 3 previous errors
  133. 231.71 s For full logs, run:
  134. 231.71 s nix log /nix/store/7irahmlyqhb90nw05kal3bnsf9m7am2d-gammaloop-crate-test-dependencies-4f00f4b0073ce06e-deps-0.1.0.drv
  135. 231.71 s error: Cannot build '/nix/store/s4pifkj8kjfqq4ydnq4i7mlp10rchyii-nix-ci-artifact-barrier-crate-test-dependencies-feynkit-generator.drv'.
  136. 231.71 s Reason: 1 dependency failed.
  137. 231.71 s Output paths:
  138. 231.71 s /nix/store/n0rxxjh7z95zqqlbxvyk0dwzia9aiiib-nix-ci-artifact-barrier-crate-test-dependencies-feynkit-generator
  139. 231.71 s Build failed due to failed dependency
  140. 231.80 s Build failed.