0.73 s
$ /nix/store/9ypz3flqsrl5xl495mm8h645gadjsxi1-coreutils-9.11/bin/timeout --kill-after=15s 7200s /nix/store/23zk8sgzamrbmj1fday15szf7f2279s8-nix-2.34.7/bin/nix --extra-experimental-features nix-command --extra-experimental-features flakes --log-format internal-json build --no-link --print-out-paths git+https://github.com/alphal00p/gammaloop?ref=feynkit&rev=fb38e1406170d8a69c2ea39345f5d1fbe2eaecf9&shallow=1#packages.x86_64-linux.crate-test-dependencies-feynkit-generator --print-build-logs
1.65 s
error (ignored): SQLite database '/var/cache/nix-ci-worker/eval-cache-v6/d10ce4938209fe4f32d9c5b1659a0fe00356cec49093978d863298df1dd4e2f8.sqlite ' is busy
3.74 s
4.75 s
Downloading cached gammaloop-ci-test-binary-dependencies-4f00f4b0073ce06e-Cargo.toml from https://cache.nix-ci.com
4.78 s
Downloaded cached gammaloop-ci-test-binary-dependencies-4f00f4b0073ce06e-Cargo.toml (808 B) in 30ms
4.80 s
Building /nix/store/ymz99csnmzyg0rn8jhhdffb0vr01gjsw-gammaloop-ci-test-dependencies-4f00f4b0073ce06e-Cargo.toml.drv
4.81 s
Progress: 0 of 6 built (1 building), 1 of 3 downloaded from cache (1 downloading)
4.81 s
Downloading cached gammaloop-crate-test-dependencies-dd93152a31ddbf22-inputs from https://cache.nix-ci.com
4.88 s
[gammaloop-ci-test-dependencies-4f00f4b0073ce06e-Cargo.toml:post-build] Uploading to the NixCI cache: /nix/store/nknj9kv2p0516wwcqvrrqsjxqf09ic4v-gammaloop-ci-test-dependencies-4f00f4b0073ce06e-Cargo.toml
4.93 s
[gammaloop-ci-test-dependencies-4f00f4b0073ce06e-Cargo.toml:post-build] warning: 'warn-short-path-literals' is deprecated, use 'lint-short-path-literals = ignore' instead
5.03 s
[gammaloop-ci-test-dependencies-4f00f4b0073ce06e-Cargo.toml:post-build] copying 0 paths...
5.11 s
[gammaloop-ci-test-dependencies-4f00f4b0073ce06e-Cargo.toml:post-build] warning: 'warn-short-path-literals' is deprecated, use 'lint-short-path-literals = ignore' instead
5.25 s
[gammaloop-ci-test-dependencies-4f00f4b0073ce06e-Cargo.toml:post-build] copying 0 paths...
5.27 s
Uploaded gammaloop-ci-test-dependencies-4f00f4b0073ce06e-Cargo.toml in 411ms
5.27 s
Progress: 1 of 6 built, 1 of 3 downloaded from cache (1 downloading)
5.27 s
Built gammaloop-ci-test-dependencies-4f00f4b0073ce06e-Cargo.toml in 469ms
22.28 s
Downloaded cached gammaloop-crate-test-dependencies-dd93152a31ddbf22-inputs (1.8 GiB) in 17.4s
22.32 s
Progress: 1 of 5 built, 2 of 3 downloaded from cache
22.32 s
Downloading cached gammaloop-crate-test-dependencies-dd93152a31ddbf22-deps from https://cache.nix-ci.com
22.52 s
Downloaded cached gammaloop-crate-test-dependencies-dd93152a31ddbf22-deps (2.9 MiB) in 196ms
22.52 s
Progress: 1 of 5 built, 3 of 3 downloaded from cache
23.41 s
Building /nix/store/z5lalnpws06yxxy9sxc39cv6hwb7s2y5-gammaloop-crate-test-dependencies-4f00f4b0073ce06e-inputs.drv
35.79 s
[gammaloop-crate-test-dependencies-4f00f4b0073ce06e-inputs:post-build] Uploading to the NixCI cache: /nix/store/j2ww0si0ra45b4lkwykfw5kf71kf0rmw-gammaloop-crate-test-dependencies-4f00f4b0073ce06e-inputs
36.40 s
[gammaloop-crate-test-dependencies-4f00f4b0073ce06e-inputs:post-build] warning: 'warn-short-path-literals' is deprecated, use 'lint-short-path-literals = ignore' instead
36.52 s
[gammaloop-crate-test-dependencies-4f00f4b0073ce06e-inputs:post-build] copying 1 paths...
36.52 s
[gammaloop-crate-test-dependencies-4f00f4b0073ce06e-inputs:post-build] copying path '/nix/store/j2ww0si0ra45b4lkwykfw5kf71kf0rmw-gammaloop-crate-test-dependencies-4f00f4b0073ce06e-inputs' to 'https://cache.nix-ci.com'...
226.54 s
[gammaloop-crate-test-dependencies-4f00f4b0073ce06e-inputs:post-build] warning: 'warn-short-path-literals' is deprecated, use 'lint-short-path-literals = ignore' instead
226.88 s
[gammaloop-crate-test-dependencies-4f00f4b0073ce06e-inputs:post-build] copying 1 paths...
226.88 s
[gammaloop-crate-test-dependencies-4f00f4b0073ce06e-inputs:post-build] copying path '/nix/store/z5lalnpws06yxxy9sxc39cv6hwb7s2y5-gammaloop-crate-test-dependencies-4f00f4b0073ce06e-inputs.drv' to 'https://cache.nix-ci.com'...
227.34 s
Uploaded gammaloop-crate-test-dependencies-4f00f4b0073ce06e-inputs in 3m11s
227.35 s
Progress: 2 of 5 built, 3 of 3 downloaded from cache
227.35 s
Built gammaloop-crate-test-dependencies-4f00f4b0073ce06e-inputs in 3m23s
227.45 s
Building /nix/store/7irahmlyqhb90nw05kal3bnsf9m7am2d-gammaloop-crate-test-dependencies-4f00f4b0073ce06e-deps-0.1.0.drv
227.66 s
[gammaloop-crate-test-dependencies-4f00f4b0073ce06e-deps] Phase: unpackPhase
227.66 s
[gammaloop-crate-test-dependencies-4f00f4b0073ce06e-deps] unpacking source archive /nix/store/6p6c3fvj4nyq06zx87kg79fy8zllfliy-source
227.68 s
[gammaloop-crate-test-dependencies-4f00f4b0073ce06e-deps] source root is source
227.69 s
[gammaloop-crate-test-dependencies-4f00f4b0073ce06e-deps] Phase: patchPhase
228.09 s
[gammaloop-crate-test-dependencies-4f00f4b0073ce06e-deps] Executing configureCargoCommonVars
228.10 s
[gammaloop-crate-test-dependencies-4f00f4b0073ce06e-deps] copying cargo artifacts from /nix/store/j2ww0si0ra45b4lkwykfw5kf71kf0rmw-gammaloop-crate-test-dependencies-4f00f4b0073ce06e-inputs/target to target
228.10 s
[gammaloop-crate-test-dependencies-4f00f4b0073ce06e-deps] will deep copy artifacts (instead of symlinking) as requested
229.37 s
[gammaloop-crate-test-dependencies-4f00f4b0073ce06e-deps] Phase: updateAutotoolsGnuConfigScriptsPhase
229.41 s
[gammaloop-crate-test-dependencies-4f00f4b0073ce06e-deps] Phase: configurePhase
229.42 s
[gammaloop-crate-test-dependencies-4f00f4b0073ce06e-deps] will append /build/source/.cargo-home/config.toml with contents of /nix/store/1sigmg52bb61pfngmk9k8wq5fz9r7bf1-vendor-cargo-deps/config.toml
229.42 s
[gammaloop-crate-test-dependencies-4f00f4b0073ce06e-deps] default configurePhase, nothing to do
229.42 s
[gammaloop-crate-test-dependencies-4f00f4b0073ce06e-deps] Phase: buildPhase
229.42 s
[gammaloop-crate-test-dependencies-4f00f4b0073ce06e-deps] +++ command cargo --version
229.43 s
[gammaloop-crate-test-dependencies-4f00f4b0073ce06e-deps] cargo 1.97.0 (c980f4866 2026-06-30)
229.43 s
[gammaloop-crate-test-dependencies-4f00f4b0073ce06e-deps] +++ command cargo build --profile ci-optim --offline -p gammaloop-ci-test-dependencies-4f00f4b0073ce06e -p gammaloop-workspace-hack --features linnet/bincode,linnet/drawing,linnet/serde,linnet/symbolica,symbolica/tracing_max_level_info --lib
229.96 s
[gammaloop-crate-test-dependencies-4f00f4b0073ce06e-deps] Compiling spenso-macros v0.3.2 (/build/source/crates/spenso-macros)
230.19 s
[gammaloop-crate-test-dependencies-4f00f4b0073ce06e-deps] Compiling spenso v0.6.0 (/build/source/crates/spenso)
230.22 s
[gammaloop-crate-test-dependencies-4f00f4b0073ce06e-deps] Compiling idenso v0.3.0 (/build/source/crates/idenso)
230.24 s
[gammaloop-crate-test-dependencies-4f00f4b0073ce06e-deps] Compiling feynkit-generator v0.1.0 (/build/source/crates/feynkit-generator)
230.35 s
[gammaloop-crate-test-dependencies-4f00f4b0073ce06e-deps] error[E0433] : cannot find `network` in `spenso`
230.35 s
[gammaloop-crate-test-dependencies-4f00f4b0073ce06e-deps] --> crates/feynkit-generator/src/generation.rs:30:5
230.35 s
[gammaloop-crate-test-dependencies-4f00f4b0073ce06e-deps] |
230.35 s
[gammaloop-crate-test-dependencies-4f00f4b0073ce06e-deps] 30 | network::library::symbolic::ETS,
230.35 s
[gammaloop-crate-test-dependencies-4f00f4b0073ce06e-deps] | ^^^^^^^ could not find `network` in `spenso`
230.35 s
[gammaloop-crate-test-dependencies-4f00f4b0073ce06e-deps]
230.35 s
[gammaloop-crate-test-dependencies-4f00f4b0073ce06e-deps] error[E0433] : cannot find `structure` in `spenso`
230.35 s
[gammaloop-crate-test-dependencies-4f00f4b0073ce06e-deps] --> crates/feynkit-generator/src/generation.rs:31:5
230.35 s
[gammaloop-crate-test-dependencies-4f00f4b0073ce06e-deps] |
230.35 s
[gammaloop-crate-test-dependencies-4f00f4b0073ce06e-deps] 31 | structure::representation::{Minkowski, RepName},
230.35 s
[gammaloop-crate-test-dependencies-4f00f4b0073ce06e-deps] | ^^^^^^^^^ could not find `structure` in `spenso`
230.35 s
[gammaloop-crate-test-dependencies-4f00f4b0073ce06e-deps]
230.35 s
[gammaloop-crate-test-dependencies-4f00f4b0073ce06e-deps] error[E0432] : unresolved imports `idenso::color`, `idenso::dirac`, `idenso::epsilon`, `idenso::representations`
230.35 s
[gammaloop-crate-test-dependencies-4f00f4b0073ce06e-deps] --> crates/feynkit-generator/src/generation.rs:19:5
230.35 s
[gammaloop-crate-test-dependencies-4f00f4b0073ce06e-deps] |
230.35 s
[gammaloop-crate-test-dependencies-4f00f4b0073ce06e-deps] 19 | color::CS,
230.35 s
[gammaloop-crate-test-dependencies-4f00f4b0073ce06e-deps] | ^^^^^ could not find `color` in `idenso`
230.35 s
[gammaloop-crate-test-dependencies-4f00f4b0073ce06e-deps] 20 | dirac::{AGS, PS},
230.35 s
[gammaloop-crate-test-dependencies-4f00f4b0073ce06e-deps] | ^^^^^ could not find `dirac` in `idenso`
230.35 s
[gammaloop-crate-test-dependencies-4f00f4b0073ce06e-deps] 21 | epsilon::EPSILON_SYMBOL,
230.35 s
[gammaloop-crate-test-dependencies-4f00f4b0073ce06e-deps] | ^^^^^^^ could not find `epsilon` in `idenso`
230.35 s
[gammaloop-crate-test-dependencies-4f00f4b0073ce06e-deps] 22 | representations::{Bispinor, ColorAdjoint, ColorFundamental, ColorSextet},
230.35 s
[gammaloop-crate-test-dependencies-4f00f4b0073ce06e-deps] | ^^^^^^^^^^^^^^^ could not find `representations` in `idenso`
230.35 s
[gammaloop-crate-test-dependencies-4f00f4b0073ce06e-deps]
231.21 s
[gammaloop-crate-test-dependencies-4f00f4b0073ce06e-deps] Some errors have detailed explanations: E0432, E0433.
231.21 s
[gammaloop-crate-test-dependencies-4f00f4b0073ce06e-deps] For more information about an error, try `rustc --explain E0432`.
231.24 s
[gammaloop-crate-test-dependencies-4f00f4b0073ce06e-deps] error : could not compile `feynkit-generator` (lib) due to 3 previous errors
231.64 s
Progress: 2 of 4 built (1 failed), 3 of 3 downloaded from cache
231.71 s
Failed to build gammaloop-crate-test-dependencies-4f00f4b0073ce06e-deps after 4.2s
231.71 s
error: Cannot build '/nix/store/7irahmlyqhb90nw05kal3bnsf9m7am2d-gammaloop-crate-test-dependencies-4f00f4b0073ce06e-deps-0.1.0.drv '.
231.71 s
Reason: builder failed with exit code 101 .
231.71 s
Output paths:
231.71 s
/nix/store/qf4czyssl5c28n19irf674h0jknsv59x-gammaloop-crate-test-dependencies-4f00f4b0073ce06e-deps-0.1.0
231.71 s
Last 46 log lines:
231.71 s
> Running phase: unpackPhase
231.71 s
> unpacking source archive /nix/store/6p6c3fvj4nyq06zx87kg79fy8zllfliy-source
231.71 s
> source root is source
231.71 s
> Running phase: patchPhase
231.71 s
> Executing configureCargoCommonVars
231.71 s
> copying cargo artifacts from /nix/store/j2ww0si0ra45b4lkwykfw5kf71kf0rmw-gammaloop-crate-test-dependencies-4f00f4b0073ce06e-inputs/target to target
231.71 s
> will deep copy artifacts (instead of symlinking) as requested
231.71 s
> Running phase: updateAutotoolsGnuConfigScriptsPhase
231.71 s
> Running phase: configurePhase
231.71 s
> will append /build/source/.cargo-home/config.toml with contents of /nix/store/1sigmg52bb61pfngmk9k8wq5fz9r7bf1-vendor-cargo-deps/config.toml
231.71 s
> default configurePhase, nothing to do
231.71 s
> Running phase: buildPhase
231.71 s
> +++ command cargo --version
231.71 s
> cargo 1.97.0 (c980f4866 2026-06-30)
231.71 s
> +++ command cargo build --profile ci-optim --offline -p gammaloop-ci-test-dependencies-4f00f4b0073ce06e -p gammaloop-workspace-hack --features linnet/bincode,linnet/drawing,linnet/serde,linnet/symbolica,symbolica/tracing_max_level_info --lib
231.71 s
> Compiling spenso-macros v0.3.2 (/build/source/crates/spenso-macros)
231.71 s
> Compiling spenso v0.6.0 (/build/source/crates/spenso)
231.71 s
> Compiling idenso v0.3.0 (/build/source/crates/idenso)
231.71 s
> Compiling feynkit-generator v0.1.0 (/build/source/crates/feynkit-generator)
231.71 s
> error[E0433] : cannot find `network` in `spenso`
231.71 s
> --> crates/feynkit-generator/src/generation.rs:30:5
231.71 s
> |
231.71 s
> 30 | network::library::symbolic::ETS,
231.71 s
> | ^^^^^^^ could not find `network` in `spenso`
231.71 s
>
231.71 s
> error[E0433] : cannot find `structure` in `spenso`
231.71 s
> --> crates/feynkit-generator/src/generation.rs:31:5
231.71 s
> |
231.71 s
> 31 | structure::representation::{Minkowski, RepName},
231.71 s
> | ^^^^^^^^^ could not find `structure` in `spenso`
231.71 s
>
231.71 s
> error[E0432] : unresolved imports `idenso::color`, `idenso::dirac`, `idenso::epsilon`, `idenso::representations`
231.71 s
> --> crates/feynkit-generator/src/generation.rs:19:5
231.71 s
> |
231.71 s
> 19 | color::CS,
231.71 s
> | ^^^^^ could not find `color` in `idenso`
231.71 s
> 20 | dirac::{AGS, PS},
231.71 s
> | ^^^^^ could not find `dirac` in `idenso`
231.71 s
> 21 | epsilon::EPSILON_SYMBOL,
231.71 s
> | ^^^^^^^ could not find `epsilon` in `idenso`
231.71 s
> 22 | representations::{Bispinor, ColorAdjoint, ColorFundamental, ColorSextet},
231.71 s
> | ^^^^^^^^^^^^^^^ could not find `representations` in `idenso`
231.71 s
>
231.71 s
> Some errors have detailed explanations: E0432, E0433.
231.71 s
> For more information about an error, try `rustc --explain E0432`.
231.71 s
> error : could not compile `feynkit-generator` (lib) due to 3 previous errors
231.71 s
For full logs, run:
231.71 s
nix log /nix/store/7irahmlyqhb90nw05kal3bnsf9m7am2d-gammaloop-crate-test-dependencies-4f00f4b0073ce06e-deps-0.1.0.drv
231.71 s
error: Cannot build '/nix/store/s4pifkj8kjfqq4ydnq4i7mlp10rchyii-nix-ci-artifact-barrier-crate-test-dependencies-feynkit-generator.drv '.
231.71 s
Reason: 1 dependency failed .
231.71 s
Output paths:
231.71 s
/nix/store/n0rxxjh7z95zqqlbxvyk0dwzia9aiiib-nix-ci-artifact-barrier-crate-test-dependencies-feynkit-generator
231.71 s
Build failed due to failed dependency
231.80 s
Build failed.