test packages.x86_64-linux.nix-ci-check-gammaloop-nextest-integration

Reproduce this run
Original Run
  1. 0.00 s $ /nix/store/61685rbaxmpigwi3z23i33sv3jyfl70q-coreutils-9.11/bin/timeout --kill-after=15s 7200s /nix/store/wknkybkzrc16r11vk5vrykh4wmw7a353-nix-2.34.8/bin/nix --extra-experimental-features nix-command --extra-experimental-features flakes flake clone git+https://github.com/alphal00p/gammaloop --dest /tmp/nix-ci-worker/stable-pwd/repo/
  2. 0.07 s Cloning into '/tmp/nix-ci-worker/stable-pwd/repo'...
  3. 2.16 s remote: Enumerating objects: 90319 remote: Enumerating objects: 99402, done.
  4. 2.39 s remote: Counting objects: 0% (1/9083) remote: Counting objects: 1% (91/9083) remote: Counting objects: 2% (182/9083) remote: Counting objects: 3% (273/9083) remote: Counting objects: 4% (364/9083) remote: Counting objects: 5% (455/9083) remote: Counting objects: 6% (545/9083) remote: Counting objects: 7% (636/9083) remote: Counting objects: 8% (727/9083) remote: Counting objects: 9% (818/9083) remote: Counting objects: 10% (909/9083) remote: Counting objects: 11% (1000/9083) remote: Counting objects: 12% (1090/9083) remote: Counting objects: 13% (1181/9083) remote: Counting objects: 14% (1272/9083) remote: Counting objects: 15% (1363/9083) remote: Counting objects: 16% (1454/9083) remote: Counting objects: 17% (1545/9083) remote: Counting objects: 18% (1635/9083) remote: Counting objects: 19% (1726/9083) remote: Counting objects: 20% (1817/9083) remote: Counting objects: 21% (1908/9083) remote: Counting objects: 22% (1999/9083) remote: Counting objects: 23% (2090/9083) remote: Counting objects: 24% (2180/9083) remote: Counting objects: 25% (2271/9083) remote: Counting objects: 26% (2362/9083) remote: Counting objects: 27% (2453/9083) remote: Counting objects: 28% (2544/9083) remote: Counting objects: 29% (2635/9083) remote: Counting objects: 30% (2725/9083) remote: Counting objects: 31% (2816/9083) remote: Counting objects: 32% (2907/9083) remote: Counting objects: 33% (2998/9083) remote: Counting objects: 34% (3089/9083) remote: Counting objects: 35% (3180/9083) remote: Counting objects: 36% (3270/9083) remote: Counting objects: 37% (3361/9083) remote: Counting objects: 38% (3452/9083) remote: Counting objects: 39% (3543/9083) remote: Counting objects: 40% (3634/9083) remote: Counting objects: 41% (3725/9083) remote: Counting objects: 42% (3815/9083) remote: Counting objects: 43% (3906/9083) remote: Counting objects: 44% (3997/9083) remote: Counting objects: 45% (4088/9083) remote: Counting objects: 46% (4179/9083) remote: Counting objects: 47% (4270/9083) remote: Counting objects: 48% (4360/9083) remote: Counting objects: 49% (4451/9083) remote: Counting objects: 50% (4542/9083) remote: Counting objects: 51% (4633/9083) remote: Counting objects: 52% (4724/9083) remote: Counting objects: 53% (4814/9083) remote: Counting objects: 54% (4905/9083) remote: Counting objects: 55% (4996/9083) remote: Counting objects: 56% (5087/9083) remote: Counting objects: 57% (5178/9083) remote: Counting objects: 58% (5269/9083) remote: Counting objects: 59% (5359/9083) remote: Counting objects: 60% (5450/9083) remote: Counting objects: 61% (5541/9083) remote: Counting objects: 62% (5632/9083) remote: Counting objects: 63% (5723/9083) remote: Counting objects: 64% (5814/9083) remote: Counting objects: 65% (5904/9083) remote: Counting objects: 66% (5995/9083) remote: Counting objects: 67% (6086/9083) remote: Counting objects: 68% (6177/9083) remote: Counting objects: 69% (6268/9083) remote: Counting objects: 70% (6359/9083) remote: Counting objects: 71% (6449/9083) remote: Counting objects: 72% (6540/9083) remote: Counting objects: 73% (6631/9083) remote: Counting objects: 74% (6722/9083) remote: Counting objects: 75% (6813/9083) remote: Counting objects: 76% (6904/9083) remote: Counting objects: 77% (6994/9083) remote: Counting objects: 78% (7085/9083) remote: Counting objects: 79% (7176/9083) remote: Counting objects: 80% (7267/9083) remote: Counting objects: 81% (7358/9083) remote: Counting objects: 82% (7449/9083) remote: Counting objects: 83% (7539/9083) remote: Counting objects: 84% (7630/9083) remote: Counting objects: 85% (7721/9083) remote: Counting objects: 86% (7812/9083) remote: Counting objects: 87% (7903/9083) remote: Counting objects: 88% (7994/9083) remote: Counting objects: 89% (8084/9083) remote: Counting objects: 90% (8175/9083) remote: Counting objects: 91% (8266/9083) remote: Counting objects: 92% (8357/9083) remote: Counting objects: 93% (8448/9083) remote: Counting objects: 94% (8539/9083) remote: Counting objects: 95% (8629/9083) remote: Counting objects: 96% (8720/9083) remote: Counting objects: 97% (8811/9083) remote: Counting objects: 98% (8902/9083) remote: Counting objects: 99% (8993/9083) remote: Counting objects: 100% (9083/9083) remote: Counting objects: 100% (9083/9083), done.
  5. 4.49 s remote: Compressing objects: 0% (1/1895) remote: Compressing objects: 1% (19/1895) remote: Compressing objects: 2% (38/1895) remote: Compressing objects: 3% (57/1895) remote: Compressing objects: 4% (76/1895) remote: Compressing objects: 5% (95/1895) remote: Compressing objects: 6% (114/1895) remote: Compressing objects: 7% (133/1895) remote: Compressing objects: 8% (152/1895) remote: Compressing objects: 8% (155/1895) remote: Compressing objects: 9% (171/1895) remote: Compressing objects: 10% (190/1895) remote: Compressing objects: 11% (209/1895) remote: Compressing objects: 12% (228/1895) remote: Compressing objects: 13% (247/1895) remote: Compressing objects: 14% (266/1895) remote: Compressing objects: 15% (285/1895) remote: Compressing objects: 16% (304/1895) remote: Compressing objects: 17% (323/1895) remote: Compressing objects: 18% (342/1895) remote: Compressing objects: 19% (361/1895) remote: Compressing objects: 20% (379/1895) remote: Compressing objects: 21% (398/1895) remote: Compressing objects: 22% (417/1895) remote: Compressing objects: 22% (435/1895) remote: Compressing objects: 23% (436/1895) remote: Compressing objects: 24% (455/1895) remote: Compressing objects: 25% (474/1895) remote: Compressing objects: 26% (493/1895) remote: Compressing objects: 27% (512/1895) remote: Compressing objects: 28% (531/1895) remote: Compressing objects: 29% (550/1895) remote: Compressing objects: 30% (569/1895) remote: Compressing objects: 31% (588/1895) remote: Compressing objects: 32% (607/1895) remote: Compressing objects: 33% (626/1895) remote: Compressing objects: 34% (645/1895) remote: Compressing objects: 35% (664/1895) remote: Compressing objects: 36% (683/1895) remote: Compressing objects: 37% (702/1895) remote: Compressing objects: 38% (721/1895) remote: Compressing objects: 39% (740/1895) remote: Compressing objects: 40% (758/1895) remote: Compressing objects: 41% (777/1895) remote: Compressing objects: 42% (796/1895) remote: Compressing objects: 43% (815/1895) remote: Compressing objects: 44% (834/1895) remote: Compressing objects: 45% (853/1895) remote: Compressing objects: 46% (872/1895) remote: Compressing objects: 47% (891/1895) remote: Compressing objects: 48% (910/1895) remote: Compressing objects: 49% (929/1895) remote: Compressing objects: 50% (948/1895) remote: Compressing objects: 51% (967/1895) remote: Compressing objects: 52% (986/1895) remote: Compressing objects: 53% (1005/1895) remote: Compressing objects: 54% (1024/1895) remote: Compressing objects: 55% (1043/1895) remote: Compressing objects: 56% (1062/1895) remote: Compressing objects: 57% (1081/1895) remote: Compressing objects: 58% (1100/1895) remote: Compressing objects: 59% (1119/1895) remote: Compressing objects: 60% (1137/1895) remote: Compressing objects: 61% (1156/1895) remote: Compressing objects: 62% (1175/1895) remote: Compressing objects: 63% (1194/1895) remote: Compressing objects: 64% (1213/1895) remote: Compressing objects: 65% (1232/1895) remote: Compressing objects: 66% (1251/1895) remote: Compressing objects: 67% (1270/1895) remote: Compressing objects: 68% (1289/1895) remote: Compressing objects: 69% (1308/1895) remote: Compressing objects: 70% (1327/1895) remote: Compressing objects: 71% (1346/1895) remote: Compressing objects: 72% (1365/1895) remote: Compressing objects: 73% (1384/1895) remote: Compressing objects: 74% (1403/1895) remote: Compressing objects: 75% (1422/1895) remote: Compressing objects: 76% (1441/1895) remote: Compressing objects: 77% (1460/1895) remote: Compressing objects: 78% (1479/1895) remote: Compressing objects: 79% (1498/1895) remote: Compressing objects: 80% (1516/1895) remote: Compressing objects: 81% (1535/1895) remote: Compressing objects: 82% (1554/1895) remote: Compressing objects: 83% (1573/1895) remote: Compressing objects: 84% (1592/1895) remote: Compressing objects: 85% (1611/1895) remote: Compressing objects: 86% (1630/1895) remote: Compressing objects: 87% (1649/1895) remote: Compressing objects: 88% (1668/1895) remote: Compressing objects: 89% (1687/1895) remote: Compressing objects: 90% (1706/1895) remote: Compressing objects: 91% (1725/1895) remote: Compressing objects: 92% (1744/1895) remote: Compressing objects: 93% (1763/1895) remote: Compressing objects: 94% (1782/1895) remote: Compressing objects: 95% (1801/1895) remote: Compressing objects: 96% (1820/1895) remote: Compressing objects: 97% (1839/1895) remote: Compressing objects: 98% (1858/1895) remote: Compressing objects: 99% (1877/1895) remote: Compressing objects: 100% (1895/1895) remote: Compressing objects: 100% (1895/1895), done.
  6. 15.68 s Receiving objects: 0% (1/99402) Receiving objects: 1% (995/99402) Receiving objects: 2% (1989/99402) Receiving objects: 3% (2983/99402) Receiving objects: 4% (3977/99402) Receiving objects: 5% (4971/99402), 8.71 MiB | 17.41 MiB/s Receiving objects: 6% (5965/99402), 8.71 MiB | 17.41 MiB/s Receiving objects: 7% (6959/99402), 8.71 MiB | 17.41 MiB/s Receiving objects: 8% (7953/99402), 8.71 MiB | 17.41 MiB/s Receiving objects: 9% (8947/99402), 8.71 MiB | 17.41 MiB/s Receiving objects: 10% (9941/99402), 8.71 MiB | 17.41 MiB/s Receiving objects: 11% (10935/99402), 8.71 MiB | 17.41 MiB/s Receiving objects: 12% (11929/99402), 8.71 MiB | 17.41 MiB/s Receiving objects: 13% (12923/99402), 8.71 MiB | 17.41 MiB/s Receiving objects: 13% (13214/99402), 19.79 MiB | 19.77 MiB/s Receiving objects: 14% (13917/99402), 19.79 MiB | 19.77 MiB/s Receiving objects: 15% (14911/99402), 19.79 MiB | 19.77 MiB/s Receiving objects: 16% (15905/99402), 19.79 MiB | 19.77 MiB/s Receiving objects: 17% (16899/99402), 19.79 MiB | 19.77 MiB/s Receiving objects: 18% (17893/99402), 19.79 MiB | 19.77 MiB/s Receiving objects: 19% (18887/99402), 19.79 MiB | 19.77 MiB/s Receiving objects: 20% (19881/99402), 19.79 MiB | 19.77 MiB/s Receiving objects: 21% (20875/99402), 19.79 MiB | 19.77 MiB/s Receiving objects: 22% (21869/99402), 19.79 MiB | 19.77 MiB/s Receiving objects: 23% (22863/99402), 19.79 MiB | 19.77 MiB/s Receiving objects: 24% (23857/99402), 19.79 MiB | 19.77 MiB/s Receiving objects: 25% (24851/99402), 19.79 MiB | 19.77 MiB/s Receiving objects: 26% (25845/99402), 19.79 MiB | 19.77 MiB/s Receiving objects: 27% (26839/99402), 19.79 MiB | 19.77 MiB/s Receiving objects: 28% (27833/99402), 19.79 MiB | 19.77 MiB/s Receiving objects: 29% (28827/99402), 19.79 MiB | 19.77 MiB/s Receiving objects: 30% (29821/99402), 19.79 MiB | 19.77 MiB/s Receiving objects: 31% (30815/99402), 19.79 MiB | 19.77 MiB/s Receiving objects: 32% (31809/99402), 19.79 MiB | 19.77 MiB/s Receiving objects: 33% (32803/99402), 19.79 MiB | 19.77 MiB/s Receiving objects: 34% (33797/99402), 19.79 MiB | 19.77 MiB/s Receiving objects: 35% (34791/99402), 19.79 MiB | 19.77 MiB/s Receiving objects: 36% (35785/99402), 33.99 MiB | 22.64 MiB/s Receiving objects: 37% (36779/99402), 33.99 MiB | 22.64 MiB/s Receiving objects: 38% (37773/99402), 33.99 MiB | 22.64 MiB/s Receiving objects: 39% (38767/99402), 33.99 MiB | 22.64 MiB/s Receiving objects: 40% (39761/99402), 33.99 MiB | 22.64 MiB/s Receiving objects: 40% (40523/99402), 48.18 MiB | 24.05 MiB/s Receiving objects: 41% (40755/99402), 48.18 MiB | 24.05 MiB/s Receiving objects: 42% (41749/99402), 48.18 MiB | 24.05 MiB/s Receiving objects: 43% (42743/99402), 48.18 MiB | 24.05 MiB/s Receiving objects: 44% (43737/99402), 48.18 MiB | 24.05 MiB/s Receiving objects: 45% (44731/99402), 48.18 MiB | 24.05 MiB/s Receiving objects: 46% (45725/99402), 48.18 MiB | 24.05 MiB/s Receiving objects: 47% (46719/99402), 48.18 MiB | 24.05 MiB/s Receiving objects: 48% (47713/99402), 48.18 MiB | 24.05 MiB/s Receiving objects: 49% (48707/99402), 48.18 MiB | 24.05 MiB/s Receiving objects: 50% (49701/99402), 62.46 MiB | 24.95 MiB/s Receiving objects: 51% (50696/99402), 62.46 MiB | 24.95 MiB/s Receiving objects: 52% (51690/99402), 62.46 MiB | 24.95 MiB/s Receiving objects: 52% (52088/99402), 62.46 MiB | 24.95 MiB/s Receiving objects: 53% (52684/99402), 75.20 MiB | 25.04 MiB/s Receiving objects: 54% (53678/99402), 75.20 MiB | 25.04 MiB/s Receiving objects: 55% (54672/99402), 75.20 MiB | 25.04 MiB/s Receiving objects: 56% (55666/99402), 75.20 MiB | 25.04 MiB/s Receiving objects: 57% (56660/99402), 75.20 MiB | 25.04 MiB/s Receiving objects: 57% (57095/99402), 110.86 MiB | 27.68 MiB/s Receiving objects: 57% (57209/99402), 125.97 MiB | 27.88 MiB/s Receiving objects: 57% (57620/99402), 177.32 MiB | 31.42 MiB/s Receiving objects: 58% (57654/99402), 177.32 MiB | 31.42 MiB/s Receiving objects: 59% (58648/99402), 177.32 MiB | 31.42 MiB/s Receiving objects: 60% (59642/99402), 177.32 MiB | 31.42 MiB/s Receiving objects: 61% (60636/99402), 177.32 MiB | 31.42 MiB/s Receiving objects: 62% (61630/99402), 177.32 MiB | 31.42 MiB/s Receiving objects: 63% (62624/99402), 177.32 MiB | 31.42 MiB/s Receiving objects: 64% (63618/99402), 193.59 MiB | 31.89 MiB/s Receiving objects: 64% (64601/99402), 193.59 MiB | 31.89 MiB/s Receiving objects: 65% (64612/99402), 193.59 MiB | 31.89 MiB/s Receiving objects: 66% (65606/99402), 210.26 MiB | 32.41 MiB/s Receiving objects: 67% (66600/99402), 210.26 MiB | 32.41 MiB/s Receiving objects: 68% (67594/99402), 210.26 MiB | 32.41 MiB/s Receiving objects: 69% (68588/99402), 210.26 MiB | 32.41 MiB/s Receiving objects: 70% (69582/99402), 210.26 MiB | 32.41 MiB/s Receiving objects: 71% (70576/99402), 210.26 MiB | 32.41 MiB/s Receiving objects: 72% (71570/99402), 210.26 MiB | 32.41 MiB/s Receiving objects: 73% (72564/99402), 210.26 MiB | 32.41 MiB/s Receiving objects: 74% (73558/99402), 210.26 MiB | 32.41 MiB/s Receiving objects: 75% (74552/99402), 210.26 MiB | 32.41 MiB/s Receiving objects: 76% (75546/99402), 210.26 MiB | 32.41 MiB/s Receiving objects: 77% (76540/99402), 226.61 MiB | 33.12 MiB/s Receiving objects: 77% (76761/99402), 226.61 MiB | 33.12 MiB/s Receiving objects: 78% (77534/99402), 243.46 MiB | 33.63 MiB/s Receiving objects: 79% (78528/99402), 243.46 MiB | 33.63 MiB/s Receiving objects: 80% (79522/99402), 243.46 MiB | 33.63 MiB/s Receiving objects: 81% (80516/99402), 260.21 MiB | 32.68 MiB/s Receiving objects: 82% (81510/99402), 260.21 MiB | 32.68 MiB/s Receiving objects: 83% (82504/99402), 260.21 MiB | 32.68 MiB/s Receiving objects: 84% (83498/99402), 260.21 MiB | 32.68 MiB/s Receiving objects: 84% (84268/99402), 260.21 MiB | 32.68 MiB/s Receiving objects: 85% (84492/99402), 277.09 MiB | 33.05 MiB/s Receiving objects: 86% (85486/99402), 277.09 MiB | 33.05 MiB/s Receiving objects: 87% (86480/99402), 277.09 MiB | 33.05 MiB/s Receiving objects: 88% (87474/99402), 277.09 MiB | 33.05 MiB/s Receiving objects: 88% (88295/99402), 311.86 MiB | 33.25 MiB/s Receiving objects: 89% (88468/99402), 311.86 MiB | 33.25 MiB/s Receiving objects: 90% (89462/99402), 328.96 MiB | 33.22 MiB/s Receiving objects: 90% (90227/99402), 328.96 MiB | 33.22 MiB/s Receiving objects: 91% (90456/99402), 328.96 MiB | 33.22 MiB/s Receiving objects: 92% (91450/99402), 328.96 MiB | 33.22 MiB/s Receiving objects: 93% (92444/99402), 328.96 MiB | 33.22 MiB/s Receiving objects: 94% (93438/99402), 328.96 MiB | 33.22 MiB/s Receiving objects: 95% (94432/99402), 328.96 MiB | 33.22 MiB/s Receiving objects: 96% (95426/99402), 328.96 MiB | 33.22 MiB/s Receiving objects: 97% (96420/99402), 328.96 MiB | 33.22 MiB/s Receiving objects: 98% (97414/99402), 328.96 MiB | 33.22 MiB/s Receiving objects: 99% (98408/99402), 328.96 MiB | 33.22 MiB/s remote: Total 99402 (delta 7892), reused 7206 (delta 7183), pack-reused 90319 (from 3)
  7. 15.68 s Receiving objects: 100% (99402/99402), 345.99 MiB | 33.38 MiB/s Receiving objects: 100% (99402/99402), 348.06 MiB | 31.13 MiB/s, done.
  8. 16.81 s Resolving deltas: 0% (0/65529) Resolving deltas: 1% (656/65529) Resolving deltas: 2% (1312/65529) Resolving deltas: 3% (1966/65529) Resolving deltas: 4% (2622/65529) Resolving deltas: 5% (3277/65529) Resolving deltas: 6% (3932/65529) Resolving deltas: 7% (4588/65529) Resolving deltas: 8% (5243/65529) Resolving deltas: 9% (5898/65529) Resolving deltas: 10% (6553/65529) Resolving deltas: 11% (7209/65529) Resolving deltas: 12% (7864/65529) Resolving deltas: 13% (8521/65529) Resolving deltas: 14% (9175/65529) Resolving deltas: 15% (9830/65529) Resolving deltas: 16% (10485/65529) Resolving deltas: 17% (11140/65529) Resolving deltas: 18% (11796/65529) Resolving deltas: 19% (12451/65529) Resolving deltas: 20% (13106/65529) Resolving deltas: 21% (13762/65529) Resolving deltas: 22% (14417/65529) Resolving deltas: 23% (15073/65529) Resolving deltas: 24% (15728/65529) Resolving deltas: 25% (16383/65529) Resolving deltas: 26% (17038/65529) Resolving deltas: 27% (17693/65529) Resolving deltas: 28% (18349/65529) Resolving deltas: 29% (19004/65529) Resolving deltas: 30% (19661/65529) Resolving deltas: 31% (20314/65529) Resolving deltas: 32% (20970/65529) Resolving deltas: 33% (21626/65529) Resolving deltas: 34% (22280/65529) Resolving deltas: 35% (22936/65529) Resolving deltas: 36% (23591/65529) Resolving deltas: 37% (24246/65529) Resolving deltas: 38% (24902/65529) Resolving deltas: 39% (25557/65529) Resolving deltas: 40% (26212/65529) Resolving deltas: 41% (26867/65529) Resolving deltas: 42% (27523/65529) Resolving deltas: 43% (28179/65529) Resolving deltas: 44% (28833/65529) Resolving deltas: 45% (29489/65529) Resolving deltas: 46% (30144/65529) Resolving deltas: 47% (30799/65529) Resolving deltas: 48% (31454/65529) Resolving deltas: 49% (32110/65529) Resolving deltas: 50% (32765/65529) Resolving deltas: 51% (33421/65529) Resolving deltas: 52% (34076/65529) Resolving deltas: 53% (34731/65529) Resolving deltas: 54% (35386/65529) Resolving deltas: 55% (36041/65529) Resolving deltas: 56% (36699/65529) Resolving deltas: 57% (37352/65529) Resolving deltas: 58% (38007/65529) Resolving deltas: 59% (38663/65529) Resolving deltas: 60% (39318/65529) Resolving deltas: 61% (39974/65529) Resolving deltas: 62% (40628/65529) Resolving deltas: 63% (41286/65529) Resolving deltas: 64% (41939/65529) Resolving deltas: 65% (42594/65529) Resolving deltas: 66% (43250/65529) Resolving deltas: 67% (43905/65529) Resolving deltas: 68% (44561/65529) Resolving deltas: 69% (45216/65529) Resolving deltas: 70% (45871/65529) Resolving deltas: 71% (46526/65529) Resolving deltas: 72% (47181/65529) Resolving deltas: 73% (47837/65529) Resolving deltas: 74% (48492/65529) Resolving deltas: 75% (49147/65529) Resolving deltas: 76% (49803/65529) Resolving deltas: 77% (50458/65529) Resolving deltas: 78% (51114/65529) Resolving deltas: 79% (51769/65529) Resolving deltas: 80% (52424/65529) Resolving deltas: 81% (53079/65529) Resolving deltas: 82% (53734/65529) Resolving deltas: 83% (54390/65529) Resolving deltas: 84% (55045/65529) Resolving deltas: 85% (55701/65529) Resolving deltas: 86% (56355/65529) Resolving deltas: 86% (56614/65529) Resolving deltas: 87% (57011/65529) Resolving deltas: 88% (57666/65529) Resolving deltas: 89% (58321/65529) Resolving deltas: 90% (58977/65529) Resolving deltas: 91% (59632/65529) Resolving deltas: 92% (60287/65529) Resolving deltas: 93% (60942/65529) Resolving deltas: 94% (61598/65529) Resolving deltas: 95% (62255/65529) Resolving deltas: 96% (62909/65529) Resolving deltas: 97% (63564/65529) Resolving deltas: 98% (64219/65529) Resolving deltas: 99% (64874/65529) Resolving deltas: 100% (65529/65529) Resolving deltas: 100% (65529/65529), done.
  9. 17.38 s Fetching commit 2165f0f37ccf61cea8bf9d12822c6ab8a71e86fa for finite_T_and_mu ...
  10. 17.38 s $ /nix/store/5vpcfsdx1lcnlb2y4k7xyc74shp5qwbh-git-2.54.0/bin/git fetch origin 2165f0f37ccf61cea8bf9d12822c6ab8a71e86fa
  11. 17.79 s From https://github.com/alphal00p/gammaloop
  12. 17.79 s * branch 2165f0f37ccf61cea8bf9d12822c6ab8a71e86fa -> FETCH_HEAD
  13. 17.80 s $ /nix/store/61685rbaxmpigwi3z23i33sv3jyfl70q-coreutils-9.11/bin/timeout --kill-after=15s 7200s /nix/store/5vpcfsdx1lcnlb2y4k7xyc74shp5qwbh-git-2.54.0/bin/git -c advice.detachedHead=false checkout 2165f0f37ccf61cea8bf9d12822c6ab8a71e86fa
  14. 18.08 s HEAD is now at 2165f0f37 add NLO cool quark matter EOS example
  15. 18.09 s $ /nix/store/61685rbaxmpigwi3z23i33sv3jyfl70q-coreutils-9.11/bin/timeout --kill-after=15s 7200s /nix/store/wknkybkzrc16r11vk5vrykh4wmw7a353-nix-2.34.8/bin/nix --extra-experimental-features nix-command --extra-experimental-features flakes --log-format internal-json run .#packages.x86_64-linux.nix-ci-check-gammaloop-nextest-integration --print-build-logs
  16. 18.19 s
  17. 22.73 s evaluating derivation 'g copying '/nix/store/avn8 evaluating derivation 'g copying '/nix/store/avn8 evaluating derivation 'g copying '/nix/store/avn8 evaluating derivation 'g copying '/nix/store/avn8 evaluating derivation 'g copying '/nix/store/avn8 evaluating derivation 'g copying '/nix/store/avn8 evaluating derivation 'g [0/1 built] [1/0/1 built] building ggammaloop-nextest-integration> Extracting 13 binaries, 1 build script output directory, and 3 linked paths to /build/nextest-archive-TYYMRs
  18. 25.01 s gammaloop-nextest-integration> Extracted 30 files to /build/nextest-archive-TYYMRs in 2.29s
  19. 25.03 s gammaloop-nextest-integration> ------------
  20. 25.03 s gammaloop-nextest-integration> Nextest run ID 272608ad-6703-4890-9244-2c54ded5bfec with nextest profile: ci_gammaloop
  21. 25.03 s gammaloop-nextest-integration> Starting 170 tests across 13 binaries (209 tests skipped, including 208 tests via profile.ci_gammaloop.default-filter)
  22. 118.96 s gammaloop-nextest-integration> FAIL [ 3.252s] ( 55/170) gammaloop-integration-tests::test_runs aa_aa::important::aa_aa_local_inspect_backend_consistency
  23. 118.96 s gammaloop-nextest-integration> stdout ---
  24. 118.96 s gammaloop-nextest-integration>
  25. 118.96 s gammaloop-nextest-integration> running 1 test
  26. 118.96 s gammaloop-nextest-integration> test aa_aa::important::aa_aa_local_inspect_backend_consistency ... FAILED
  27. 118.96 s gammaloop-nextest-integration>
  28. 118.96 s gammaloop-nextest-integration> failures:
  29. 118.96 s gammaloop-nextest-integration>
  30. 118.96 s gammaloop-nextest-integration> failures:
  31. 118.96 s gammaloop-nextest-integration> aa_aa::important::aa_aa_local_inspect_backend_consistency
  32. 118.96 s gammaloop-nextest-integration>
  33. 118.96 s gammaloop-nextest-integration> test result: FAILED. 0 passed; 1 failed; 0 ignored; 0 measured; 274 filtered out; finished in 3.23s
  34. 118.96 s gammaloop-nextest-integration>
  35. 118.96 s gammaloop-nextest-integration> stderr ---
  36. 118.96 s gammaloop-nextest-integration> [2026-09-16 22:38:29.075] @gammaloop_api::se... INFO : Running command import model sm-default.json
  37. 118.96 s gammaloop-nextest-integration> [2026-09-16 22:38:29.075] @import::model INFO : Loading built-in JSON model sm-default
  38. 118.96 s gammaloop-nextest-integration> [2026-09-16 22:38:29.098] @gammalooprs::model INFO : The following 15 external parameters were forced to zero by the restriction card:
  39. 118.96 s gammaloop-nextest-integration> lamWS, AWS, rhoWS, etaWS, ymc, yme, ymm, MC, Me, MM, WTau, muQ, muLe, muLmu, muLtau
  40. 118.96 s gammaloop-nextest-integration> [2026-09-16 22:38:29.098] @gammalooprs::model INFO : The following 34 vertex rules were removed by the restriction card:
  41. 118.96 s gammaloop-nextest-integration> V_82 -> (c~, d, G+) | V_83 -> (t~, d, G+) | V_84 -> (c~, s, G+) | V_85 -> (t~, s, G+) | V_86 -> (u~, b, G+) | V_87 -> (c~, b, G+) | V_90 -> (c~, d, W+) | V_91 -> (t~, d, W+) | V_92 -> (u~, s, W+) | V_94 -> (t~, s, W+) | V_95 -> (u~, b, W+) | V_96 -> (c~, b, W+) | V_101 -> (e+, e-, G0) | V_102 -> (mu+, mu-, G0) | V_104 -> (e+, e-, H) | V_105 -> (mu+, mu-, H) | V_110 -> (ve~, e-, G+) | V_111 -> (vm~, mu-, G+) | V_116 -> (b~, u, G-) | V_117 -> (d~, c, G-) | V_118 -> (s~, c, G-) | V_119 -> (b~, c, G-) | V_120 -> (d~, t, G-) | V_121 -> (s~, t, G-) | V_124 -> (s~, u, W-) | V_125 -> (b~, u, W-) | V_126 -> (d~, c, W-) | V_128 -> (b~, c, W-) | V_129 -> (d~, t, W-) | V_130 -> (s~, t, W-) | V_138 -> (c~, c, G0) | V_140 -> (c~, c, H) | V_145 -> (e+, ve, G-) | V_146 -> (mu+, vm, G-)
  42. 118.96 s gammaloop-nextest-integration> [2026-09-16 22:38:29.098] @gammalooprs::model INFO : The following 36 couplings were removed by the restriction card:
  43. 118.96 s gammaloop-nextest-integration> GC_13, GC_14, GC_16, GC_17, GC_18, GC_19, GC_20, GC_22, GC_23, GC_24, GC_25, GC_26, GC_28, GC_29, GC_42, GC_43, GC_44, GC_46, GC_47, GC_48, GC_84, GC_85, GC_86, GC_87, GC_88, GC_89, GC_90, GC_91, GC_92, GC_93, GC_101, GC_102, GC_103, GC_105, GC_106, GC_107
  44. 118.96 s gammaloop-nextest-integration> [2026-09-16 22:38:29.099] @gammaloop_api::se... INFO : Running command run set_model_parameters
  45. 118.96 s gammaloop-nextest-integration> [2026-09-16 22:38:29.099] @gammaloop_api::se... INFO : Starting command block set_model_parameters
  46. 118.96 s gammaloop-nextest-integration> [2026-09-16 22:38:29.099] @gammaloop_api::se... INFO : Running command set model MT=173.0
  47. 118.96 s gammaloop-nextest-integration> [2026-09-16 22:38:29.104] @gammaloop_api::se... INFO : Running command set model WT=0.0
  48. 118.96 s gammaloop-nextest-integration> [2026-09-16 22:38:29.109] @gammaloop_api::se... INFO : Running command set model ymt=173.0
  49. 118.96 s gammaloop-nextest-integration> [2026-09-16 22:38:29.114] @gammaloop_api::se... INFO : Running command set model aS=0.118
  50. 118.96 s gammaloop-nextest-integration> [2026-09-16 22:38:29.119] @gammaloop_api::se... INFO : Running command set model aEWM1=137.036
  51. 118.96 s gammaloop-nextest-integration> [2026-09-16 22:38:29.123] @gammaloop_api::se... INFO : Running command set model Gf=1.166390e-05
  52. 118.96 s gammaloop-nextest-integration> [2026-09-16 22:38:29.128] @gammaloop_api::se... INFO : Running command set model MZ=91.188
  53. 118.96 s gammaloop-nextest-integration> [2026-09-16 22:38:29.134] @gammaloop_api::se... INFO : Running command set global string '
  54. 118.96 s gammaloop-nextest-integration> [global.generation.compile]
  55. 118.96 s gammaloop-nextest-integration> compilation_mode = "symjit"
  56. 118.96 s gammaloop-nextest-integration> optimization_level = "O0"
  57. 118.96 s gammaloop-nextest-integration> fast_math = false
  58. 118.96 s gammaloop-nextest-integration> [...]
  59. 118.96 s gammaloop-nextest-integration> [2026-09-16 22:38:29.135] @gammaloop_api::se... INFO : Running command import graphs ./examples/cli/aa_aa/1L/aa_aa_1L.dot -p aa_aa_all_helicities -i 1L_ppmm -o
  60. 118.96 s gammaloop-nextest-integration> [2026-09-16 22:38:29.135] @commands::import INFO : Loading graphs from '/build/source/examples/cli/aa_aa/1L/aa_aa_1L.dot'
  61. 118.96 s gammaloop-nextest-integration> [2026-09-16 22:38:29.146] @gammaloop_api::se... INFO : Running command generate existing -p aa_aa_all_helicities
  62. 118.96 s gammaloop-nextest-integration> The application panicked (crashed).
  63. 118.96 s gammaloop-nextest-integration> Message: label _func_power_ not found
  64. 118.96 s gammaloop-nextest-integration> Location: /nix/store/n9w914kh1cm59xx3spcs831cdyb56m32-vendor-cargo-deps/c19b7c6f923b580ac259164a89f2577984ad5ab09ee9d583b888f934adbbe8d0/symjit-2.25.6/src/symjit/assembler.rs:77
  65. 118.96 s gammaloop-nextest-integration>
  66. 118.96 s gammaloop-nextest-integration> ━━━━━━━━━━━━━━━━━━━━━━━━━━━━━━━━━━ BACKTRACE ━━━━━━━━━━━━━━━━━━━━━━━━━━━━━━━━━━━
  67. 118.96 s gammaloop-nextest-integration> 1: <color_eyre[51793ea62743adbd]::config::PanicHook>::panic_report<unknown>
  68. 118.96 s gammaloop-nextest-integration> at <unknown source file>:<unknown line>
  69. 118.96 s gammaloop-nextest-integration> 2: <color_eyre[51793ea62743adbd]::config::PanicHook>::into_panic_hook::{closure#0}<unknown>
  70. 118.96 s gammaloop-nextest-integration> at <unknown source file>:<unknown line>
  71. 118.96 s gammaloop-nextest-integration> 3: std[bcb96dfbba0ab899]::panicking::panic_with_hook<unknown>
  72. 118.96 s gammaloop-nextest-integration> at <unknown source file>:<unknown line>
  73. 118.96 s gammaloop-nextest-integration> 4: std[bcb96dfbba0ab899]::panicking::panic_handler::{closure#0}<unknown>
  74. 118.96 s gammaloop-nextest-integration> at <unknown source file>:<unknown line>
  75. 118.96 s gammaloop-nextest-integration> 5: std[bcb96dfbba0ab899]::sys::backtrace::__rust_end_short_backtrace::<std[bcb96dfbba0ab899]::panicking::panic_handler::{closure#0}, !><unknown>
  76. 118.96 s gammaloop-nextest-integration> at <unknown source file>:<unknown line>
  77. 118.96 s gammaloop-nextest-integration> 6: __rustc[6c289b9f9c454d21]::rust_begin_unwind<unknown>
  78. 118.96 s gammaloop-nextest-integration> at <unknown source file>:<unknown line>
  79. 118.96 s gammaloop-nextest-integration> 7: core[940e698046960fd5]::panicking::panic_fmt<unknown>
  80. 118.96 s gammaloop-nextest-integration> at <unknown source file>:<unknown line>
  81. 118.96 s gammaloop-nextest-integration> 8: <symjit[e408de789c333cd]::symjit::assembler::Assembler>::apply_jumps<unknown>
  82. 118.96 s gammaloop-nextest-integration> at <unknown source file>:<unknown line>
  83. 118.96 s gammaloop-nextest-integration> 9: <symjit[e408de789c333cd]::symjit::builder::Builder>::compile_from_mir::<symjit[e408de789c333cd]::symjit::amd::complex::AmdComplexGenerator><unknown>
  84. 118.96 s gammaloop-nextest-integration> at <unknown source file>:<unknown line>
  85. 118.96 s gammaloop-nextest-integration> 10: <symjit[e408de789c333cd]::symjit::runnable::Application>::compile_ty<unknown>
  86. 118.96 s gammaloop-nextest-integration> at <unknown source file>:<unknown line>
  87. 118.96 s gammaloop-nextest-integration> 11: <symjit[e408de789c333cd]::symjit::runnable::Application>::with_mir<unknown>
  88. 118.96 s gammaloop-nextest-integration> at <unknown source file>:<unknown line>
  89. 118.96 s gammaloop-nextest-integration> 12: <symjit[e408de789c333cd]::symjit::composer::DirectTranslator as symjit[e408de789c333cd]::symjit::composer::Composer>::compile<unknown>
  90. 118.96 s gammaloop-nextest-integration> at <unknown source file>:<unknown line>
  91. 118.96 s gammaloop-nextest-integration> 13: <symjit[e408de789c333cd]::symjit::compiler::Translator as symjit[e408de789c333cd]::symjit::composer::Composer>::compile<unknown>
  92. 118.96 s gammaloop-nextest-integration> at <unknown source file>:<unknown line>
  93. 118.96 s gammaloop-nextest-integration> 14: <numerica[124dab8567f4861e]::domains::float::complex::Complex<f64> as symbolica[10e259bab675d243]::evaluate::backend::JITCompiledNumber>::jit_compile<unknown>
  94. 118.96 s gammaloop-nextest-integration> at <unknown source file>:<unknown line>
  95. 118.96 s gammaloop-nextest-integration> 15: <symbolica[10e259bab675d243]::evaluate::evaluator::ExpressionEvaluator<numerica[124dab8567f4861e]::domains::float::complex::Complex<f64>>>::jit_compile<unknown>
  96. 118.96 s gammaloop-nextest-integration> at <unknown source file>:<unknown line>
  97. 118.96 s gammaloop-nextest-integration> 16: <gammalooprs[917cbd3df9e68f8f]::integrands::process::evaluators::GenericEvaluator>::activate_symjit<unknown>
  98. 118.96 s gammaloop-nextest-integration> at <unknown source file>:<unknown line>
  99. 118.96 s gammaloop-nextest-integration> 17: <gammalooprs[917cbd3df9e68f8f]::integrands::process::amplitude::AmplitudeIntegrand>::prepare_runtime_backends_after_generation_with_compile_times<unknown>
  100. 118.96 s gammaloop-nextest-integration> at <unknown source file>:<unknown line>
  101. 118.96 s gammaloop-nextest-integration> 18: <gammalooprs[917cbd3df9e68f8f]::processes::amplitude::Amplitude>::build_integrand<unknown>
  102. 118.96 s gammaloop-nextest-integration> at <unknown source file>:<unknown line>
  103. 118.96 s gammaloop-nextest-integration> 19: <gammalooprs[917cbd3df9e68f8f]::processes::process::Process>::generate_integrands<unknown>
  104. 118.96 s gammaloop-nextest-integration> at <unknown source file>:<unknown line>
  105. 118.96 s gammaloop-nextest-integration> 20: <gammaloop_api[9ebf6628f97aeb57]::state::State>::generate_integrand<unknown>
  106. 118.96 s gammaloop-nextest-integration> at <unknown source file>:<unknown line>
  107. 118.96 s gammaloop-nextest-integration> 21: <gammaloop_api[9ebf6628f97aeb57]::commands::generate::Generate>::run::<&std[bcb96dfbba0ab899]::path::PathBuf><unknown>
  108. 118.96 s gammaloop-nextest-integration> at <unknown source file>:<unknown line>
  109. 118.96 s gammaloop-nextest-integration> 22: <gammaloop_api[9ebf6628f97aeb57]::commands::Commands>::run<unknown>
  110. 118.96 s gammaloop-nextest-integration> at <unknown source file>:<unknown line>
  111. 118.96 s gammaloop-nextest-integration> 23: <gammaloop_api[9ebf6628f97aeb57]::session::CliSession>::execute_prepared<unknown>
  112. 118.96 s gammaloop-nextest-integration> at <unknown source file>:<unknown line>
  113. 118.96 s gammaloop-nextest-integration> 24: <gammaloop_api[9ebf6628f97aeb57]::session::CliSession>::execute_command<unknown>
  114. 118.96 s gammaloop-nextest-integration> at <unknown source file>:<unknown line>
  115. 118.96 s gammaloop-nextest-integration> 25: <gammaloop_integration_tests[191607b70c61cd5a]::CLIState>::run_command<unknown>
  116. 118.96 s gammaloop-nextest-integration> at <unknown source file>:<unknown line>
  117. 118.96 s gammaloop-nextest-integration> 26: test_runs[9b7e2dc2dc4f29b0]::aa_aa::generate_aa_aa_helicity_family<unknown>
  118. 118.96 s gammaloop-nextest-integration> at <unknown source file>:<unknown line>
  119. 118.96 s gammaloop-nextest-integration> 27: <test_runs[9b7e2dc2dc4f29b0]::aa_aa::important::aa_aa_local_inspect_backend_consistency::{closure#0} as core[940e698046960fd5]::ops::function::FnOnce<()>>::call_once<unknown>
  120. 118.96 s gammaloop-nextest-integration> at <unknown source file>:<unknown line>
  121. 118.96 s gammaloop-nextest-integration> 28: serial_test[cd99724524a2f1c0]::serial_code_lock::local_serial_core_with_return::<(), eyre[cb2fd339c0c40fca]::Report><unknown>
  122. 118.96 s gammaloop-nextest-integration> at <unknown source file>:<unknown line>
  123. 118.96 s gammaloop-nextest-integration> 29: <test_runs[9b7e2dc2dc4f29b0]::aa_aa::important::aa_aa_local_inspect_backend_consistency::{closure#0} as core[940e698046960fd5]::ops::function::FnOnce<()>>::call_once<unknown>
  124. 118.96 s gammaloop-nextest-integration> at <unknown source file>:<unknown line>
  125. 118.96 s gammaloop-nextest-integration> 30: test[75d6903177b1d7e9]::__rust_begin_short_backtrace::<core[940e698046960fd5]::result::Result<(), alloc[2ea6bcb46fca0c42]::string::String>, fn() -> core[940e698046960fd5]::result::Result<(), alloc[2ea6bcb46fca0c42]::string::String>><unknown>
  126. 118.96 s gammaloop-nextest-integration> at <unknown source file>:<unknown line>
  127. 118.96 s gammaloop-nextest-integration> 31: test[75d6903177b1d7e9]::run_test::{closure#0}<unknown>
  128. 118.96 s gammaloop-nextest-integration> at <unknown source file>:<unknown line>
  129. 118.96 s gammaloop-nextest-integration> 32: std[bcb96dfbba0ab899]::sys::backtrace::__rust_begin_short_backtrace::<test[75d6903177b1d7e9]::run_test::{closure#1}, ()><unknown>
  130. 118.96 s gammaloop-nextest-integration> at <unknown source file>:<unknown line>
  131. 118.97 s gammaloop-nextest-integration> 33: <std[bcb96dfbba0ab899]::thread::lifecycle::spawn_unchecked<test[75d6903177b1d7e9]::run_test::{closure#1}, ()>::{closure#1} as core[940e698046960fd5]::ops::function::FnOnce<()>>::call_once::{shim:vtable#0}<unknown>
  132. 118.97 s gammaloop-nextest-integration> at <unknown source file>:<unknown line>
  133. 118.97 s gammaloop-nextest-integration> 34: <std[bcb96dfbba0ab899]::sys::thread::unix::Thread>::new::thread_start<unknown>
  134. 118.97 s gammaloop-nextest-integration> at <unknown source file>:<unknown line>
  135. 118.97 s gammaloop-nextest-integration> 35: start_thread<unknown>
  136. 118.97 s gammaloop-nextest-integration> at <unknown source file>:<unknown line>
  137. 118.97 s gammaloop-nextest-integration> 36: __clone3<unknown>
  138. 118.97 s gammaloop-nextest-integration> at <unknown source file>:<unknown line>
  139. 118.97 s gammaloop-nextest-integration>
  140. 118.97 s gammaloop-nextest-integration> Run with COLORBT_SHOW_HIDDEN=1 environment variable to disable frame filtering.
  141. 118.97 s gammaloop-nextest-integration> Run with RUST_BACKTRACE=full to include source snippets.
  142. 118.97 s gammaloop-nextest-integration> Warning: SpanTrace capture is Unsupported.
  143. 118.97 s gammaloop-nextest-integration> Ensure that you've setup a tracing-error ErrorLayer and the semver versions are compatible
  144. 118.97 s gammaloop-nextest-integration>
  145. 184.12 s gammaloop-nextest-integration> FAIL [ 4.721s] (159/170) gammaloop-integration-tests::uv thermal_sunrise_uv
  146. 184.12 s gammaloop-nextest-integration> stdout ---
  147. 184.12 s gammaloop-nextest-integration>
  148. 184.12 s gammaloop-nextest-integration> running 1 test
  149. 184.12 s gammaloop-nextest-integration> test thermal_sunrise_uv ... FAILED
  150. 184.12 s gammaloop-nextest-integration>
  151. 184.12 s gammaloop-nextest-integration> failures:
  152. 184.12 s gammaloop-nextest-integration>
  153. 184.12 s gammaloop-nextest-integration> failures:
  154. 184.12 s gammaloop-nextest-integration> thermal_sunrise_uv
  155. 184.12 s gammaloop-nextest-integration>
  156. 184.12 s gammaloop-nextest-integration> test result: FAILED. 0 passed; 1 failed; 0 ignored; 0 measured; 31 filtered out; finished in 4.70s
  157. 184.12 s gammaloop-nextest-integration>
  158. 184.12 s gammaloop-nextest-integration> stderr ---
  159. 184.12 s gammaloop-nextest-integration> [2026-09-16 22:39:32.781] @gammaloop_api::se... INFO : Running command run generate
  160. 184.12 s gammaloop-nextest-integration> [2026-09-16 22:39:32.781] @gammaloop_api::se... INFO : Starting command block generate
  161. 184.12 s gammaloop-nextest-integration> [2026-09-16 22:39:32.781] @gammaloop_api::se... INFO : Running command import model sm-default.json
  162. 184.12 s gammaloop-nextest-integration> [2026-09-16 22:39:32.781] @import::model INFO : Loading built-in JSON model sm-default
  163. 184.12 s gammaloop-nextest-integration> [2026-09-16 22:39:32.808] @gammalooprs::model INFO : The following 15 external parameters were forced to zero by the restriction card:
  164. 184.12 s gammaloop-nextest-integration> lamWS, AWS, rhoWS, etaWS, ymc, yme, ymm, MC, Me, MM, WTau, muQ, muLe, muLmu, muLtau
  165. 184.12 s gammaloop-nextest-integration> [2026-09-16 22:39:32.808] @gammalooprs::model INFO : The following 34 vertex rules were removed by the restriction card:
  166. 184.12 s gammaloop-nextest-integration> V_82 -> (c~, d, G+) | V_83 -> (t~, d, G+) | V_84 -> (c~, s, G+) | V_85 -> (t~, s, G+) | V_86 -> (u~, b, G+) | V_87 -> (c~, b, G+) | V_90 -> (c~, d, W+) | V_91 -> (t~, d, W+) | V_92 -> (u~, s, W+) | V_94 -> (t~, s, W+) | V_95 -> (u~, b, W+) | V_96 -> (c~, b, W+) | V_101 -> (e+, e-, G0) | V_102 -> (mu+, mu-, G0) | V_104 -> (e+, e-, H) | V_105 -> (mu+, mu-, H) | V_110 -> (ve~, e-, G+) | V_111 -> (vm~, mu-, G+) | V_116 -> (b~, u, G-) | V_117 -> (d~, c, G-) | V_118 -> (s~, c, G-) | V_119 -> (b~, c, G-) | V_120 -> (d~, t, G-) | V_121 -> (s~, t, G-) | V_124 -> (s~, u, W-) | V_125 -> (b~, u, W-) | V_126 -> (d~, c, W-) | V_128 -> (b~, c, W-) | V_129 -> (d~, t, W-) | V_130 -> (s~, t, W-) | V_138 -> (c~, c, G0) | V_140 -> (c~, c, H) | V_145 -> (e+, ve, G-) | V_146 -> (mu+, vm, G-)
  167. 184.12 s gammaloop-nextest-integration> [2026-09-16 22:39:32.808] @gammalooprs::model INFO : The following 36 couplings were removed by the restriction card:
  168. 184.12 s gammaloop-nextest-integration> GC_13, GC_14, GC_16, GC_17, GC_18, GC_19, GC_20, GC_22, GC_23, GC_24, GC_25, GC_26, GC_28, GC_29, GC_42, GC_43, GC_44, GC_46, GC_47, GC_48, GC_84, GC_85, GC_86, GC_87, GC_88, GC_89, GC_90, GC_91, GC_92, GC_93, GC_101, GC_102, GC_103, GC_105, GC_106, GC_107
  169. 184.12 s gammaloop-nextest-integration> [2026-09-16 22:39:32.808] @gammaloop_api::se... INFO : Running command remove processes
  170. 184.12 s gammaloop-nextest-integration> [2026-09-16 22:39:32.808] @gammaloop_api::se... INFO : Running command generate amp {} > {} [{2}] | g u
  171. 184.12 s gammaloop-nextest-integration> --numerator-grouping group_identical_graphs_up_to_scalar_rescaling
  172. 184.12 s gammaloop-nextest-integration> --max-n-bridges 0
  173. 184.12 s gammaloop-nextest-integration> --number-of-factorized-loop-subtopologies 1 1
  174. 184.12 s gammaloop-nextest-integration> --number-of-anticommutating-loops 1 1
  175. 184.12 s gammaloop-nextest-integration> [...]
  176. 184.12 s gammaloop-nextest-integration> [2026-09-16 22:39:32.809] @feyngen::diagram_... INFO : 0s | Δ=0s | Starting Feynman graph generation with Symbolica...
  177. 184.12 s gammaloop-nextest-integration> [2026-09-16 22:39:32.810] @feyngen::diagram_... INFO : 0s | Δ=0s | Number of graphs resulting from Symbolica generation: 3
  178. 184.12 s gammaloop-nextest-integration> [2026-09-16 22:39:32.811] @feyngen::diagram_... INFO : 0s | Δ=0s | Number of graphs retained after removal of vetoed topologies: 2
  179. 184.12 s gammaloop-nextest-integration> [2026-09-16 22:39:32.814] @feyngen::diagram_... INFO : 0s | Δ=0s | Number of graphs after vertex info assignment: 2
  180. 184.12 s gammaloop-nextest-integration> [2026-09-16 22:39:32.814] @feyngen::diagram_... INFO : 0s | Δ=0s | Number of graphs after all complete graphs filters are applied: 2
  181. 184.12 s gammaloop-nextest-integration> [2026-09-16 22:39:32.817] @feyngen::diagram_... INFO : 0s | Δ=0s | Number of graphs after closed anticommutating chains analysis: 1
  182. 184.12 s gammaloop-nextest-integration> [2026-09-16 22:39:32.817] @feyngen::diagram_... INFO : 0s | Δ=0s | Number of graphs after symmetrization of external states: 1
  183. 184.12 s gammaloop-nextest-integration> [2026-09-16 22:39:32.820] @feyngen::diagram_... INFO : 0s | Δ=0s | Number of graphs after canonization of vertices, edges and flows (graph labels assigned here): 1
  184. 184.12 s gammaloop-nextest-integration> [2026-09-16 22:39:32.845] @feyngen::diagram_... INFO : 0s | Δ=0s | Number of graphs after numerator-aware grouping with strategy 'up to a scalar rescaling': 1 (1 isomorphically unique graph, 0 color zero, 0 lorentz zero, 0 grouped and 0 cancellation)
  185. 184.12 s gammaloop-nextest-integration> [2026-09-16 22:39:32.845] @feyngen::diagram_... INFO : ( Sum of the symmetry factors from each graph generated = -1/2 )
  186. 184.12 s gammaloop-nextest-integration> [2026-09-16 22:39:32.846] @commands::generate INFO : Generated amplitude 1 graphs.
  187. 184.12 s gammaloop-nextest-integration> [2026-09-16 22:39:32.846] @commands::generate INFO : Only diagram generation was requested, skipping integrand generation. You can generate integrands later using the 'generate existing <options>' command.
  188. 184.12 s gammaloop-nextest-integration> [2026-09-16 22:39:32.846] @gammaloop_api::se... INFO : Running command generate
  189. 184.12 s gammaloop-nextest-integration> The application panicked (crashed).
  190. 184.12 s gammaloop-nextest-integration> Message: label _func_power_ not found
  191. 184.12 s gammaloop-nextest-integration> Location: /nix/store/n9w914kh1cm59xx3spcs831cdyb56m32-vendor-cargo-deps/c19b7c6f923b580ac259164a89f2577984ad5ab09ee9d583b888f934adbbe8d0/symjit-2.25.6/src/symjit/assembler.rs:77
  192. 184.12 s gammaloop-nextest-integration>
  193. 184.12 s gammaloop-nextest-integration> ━━━━━━━━━━━━━━━━━━━━━━━━━━━━━━━━━━ BACKTRACE ━━━━━━━━━━━━━━━━━━━━━━━━━━━━━━━━━━━
  194. 184.12 s gammaloop-nextest-integration> 1: <color_eyre[51793ea62743adbd]::config::PanicHook>::panic_report<unknown>
  195. 184.12 s gammaloop-nextest-integration> at <unknown source file>:<unknown line>
  196. 184.12 s gammaloop-nextest-integration> 2: <color_eyre[51793ea62743adbd]::config::PanicHook>::into_panic_hook::{closure#0}<unknown>
  197. 184.12 s gammaloop-nextest-integration> at <unknown source file>:<unknown line>
  198. 184.12 s gammaloop-nextest-integration> 3: std[bcb96dfbba0ab899]::panicking::panic_with_hook<unknown>
  199. 184.12 s gammaloop-nextest-integration> at <unknown source file>:<unknown line>
  200. 184.12 s gammaloop-nextest-integration> 4: std[bcb96dfbba0ab899]::panicking::panic_handler::{closure#0}<unknown>
  201. 184.12 s gammaloop-nextest-integration> at <unknown source file>:<unknown line>
  202. 184.12 s gammaloop-nextest-integration> 5: std[bcb96dfbba0ab899]::sys::backtrace::__rust_end_short_backtrace::<std[bcb96dfbba0ab899]::panicking::panic_handler::{closure#0}, !><unknown>
  203. 184.12 s gammaloop-nextest-integration> at <unknown source file>:<unknown line>
  204. 184.12 s gammaloop-nextest-integration> 6: __rustc[6c289b9f9c454d21]::rust_begin_unwind<unknown>
  205. 184.12 s gammaloop-nextest-integration> at <unknown source file>:<unknown line>
  206. 184.12 s gammaloop-nextest-integration> 7: core[940e698046960fd5]::panicking::panic_fmt<unknown>
  207. 184.12 s gammaloop-nextest-integration> at <unknown source file>:<unknown line>
  208. 184.12 s gammaloop-nextest-integration> 8: <symjit[e408de789c333cd]::symjit::assembler::Assembler>::apply_jumps<unknown>
  209. 184.12 s gammaloop-nextest-integration> at <unknown source file>:<unknown line>
  210. 184.12 s gammaloop-nextest-integration> 9: <symjit[e408de789c333cd]::symjit::builder::Builder>::compile_from_mir::<symjit[e408de789c333cd]::symjit::amd::complex::AmdComplexGenerator><unknown>
  211. 184.12 s gammaloop-nextest-integration> at <unknown source file>:<unknown line>
  212. 184.12 s gammaloop-nextest-integration> 10: <symjit[e408de789c333cd]::symjit::runnable::Application>::compile_ty<unknown>
  213. 184.12 s gammaloop-nextest-integration> at <unknown source file>:<unknown line>
  214. 184.12 s gammaloop-nextest-integration> 11: <symjit[e408de789c333cd]::symjit::runnable::Application>::with_mir<unknown>
  215. 184.12 s gammaloop-nextest-integration> at <unknown source file>:<unknown line>
  216. 184.12 s gammaloop-nextest-integration> 12: <symjit[e408de789c333cd]::symjit::composer::DirectTranslator as symjit[e408de789c333cd]::symjit::composer::Composer>::compile<unknown>
  217. 184.12 s gammaloop-nextest-integration> at <unknown source file>:<unknown line>
  218. 184.12 s gammaloop-nextest-integration> 13: <symjit[e408de789c333cd]::symjit::compiler::Translator as symjit[e408de789c333cd]::symjit::composer::Composer>::compile<unknown>
  219. 184.12 s gammaloop-nextest-integration> at <unknown source file>:<unknown line>
  220. 184.12 s gammaloop-nextest-integration> 14: <numerica[124dab8567f4861e]::domains::float::complex::Complex<f64> as symbolica[10e259bab675d243]::evaluate::backend::JITCompiledNumber>::jit_compile<unknown>
  221. 184.12 s gammaloop-nextest-integration> at <unknown source file>:<unknown line>
  222. 184.12 s gammaloop-nextest-integration> 15: <symbolica[10e259bab675d243]::evaluate::evaluator::ExpressionEvaluator<numerica[124dab8567f4861e]::domains::float::complex::Complex<f64>>>::jit_compile<unknown>
  223. 184.12 s gammaloop-nextest-integration> at <unknown source file>:<unknown line>
  224. 184.12 s gammaloop-nextest-integration> 16: <gammalooprs[917cbd3df9e68f8f]::integrands::process::evaluators::GenericEvaluator>::activate_symjit<unknown>
  225. 184.12 s gammaloop-nextest-integration> at <unknown source file>:<unknown line>
  226. 184.12 s gammaloop-nextest-integration> 17: <gammalooprs[917cbd3df9e68f8f]::integrands::process::amplitude::AmplitudeIntegrand>::prepare_runtime_backends_after_generation_with_compile_times<unknown>
  227. 184.12 s gammaloop-nextest-integration> at <unknown source file>:<unknown line>
  228. 184.12 s gammaloop-nextest-integration> 18: <gammalooprs[917cbd3df9e68f8f]::processes::amplitude::Amplitude>::build_integrand<unknown>
  229. 184.12 s gammaloop-nextest-integration> at <unknown source file>:<unknown line>
  230. 184.12 s gammaloop-nextest-integration> 19: <gammalooprs[917cbd3df9e68f8f]::processes::process::Process>::generate_integrands<unknown>
  231. 184.12 s gammaloop-nextest-integration> at <unknown source file>:<unknown line>
  232. 184.12 s gammaloop-nextest-integration> 20: <gammalooprs[917cbd3df9e68f8f]::processes::ProcessList>::generate_integrands<unknown>
  233. 184.12 s gammaloop-nextest-integration> at <unknown source file>:<unknown line>
  234. 184.12 s gammaloop-nextest-integration> 21: <gammaloop_api[9ebf6628f97aeb57]::state::State>::generate_integrands<unknown>
  235. 184.12 s gammaloop-nextest-integration> at <unknown source file>:<unknown line>
  236. 184.12 s gammaloop-nextest-integration> 22: <gammaloop_api[9ebf6628f97aeb57]::commands::generate::Generate>::run::<&std[bcb96dfbba0ab899]::path::PathBuf><unknown>
  237. 184.12 s gammaloop-nextest-integration> at <unknown source file>:<unknown line>
  238. 184.12 s gammaloop-nextest-integration> 23: <gammaloop_api[9ebf6628f97aeb57]::commands::Commands>::run<unknown>
  239. 184.12 s gammaloop-nextest-integration> at <unknown source file>:<unknown line>
  240. 184.12 s gammaloop-nextest-integration> 24: <gammaloop_api[9ebf6628f97aeb57]::session::CliSession>::execute_prepared<unknown>
  241. 184.12 s gammaloop-nextest-integration> at <unknown source file>:<unknown line>
  242. 184.12 s gammaloop-nextest-integration> 25: <gammaloop_api[9ebf6628f97aeb57]::session::CliSession>::execute_prepared_commands<unknown>
  243. 184.12 s gammaloop-nextest-integration> at <unknown source file>:<unknown line>
  244. 184.12 s gammaloop-nextest-integration> 26: <gammaloop_api[9ebf6628f97aeb57]::session::CliSession>::execute_prepared<unknown>
  245. 184.12 s gammaloop-nextest-integration> at <unknown source file>:<unknown line>
  246. 184.12 s gammaloop-nextest-integration> 27: <gammaloop_api[9ebf6628f97aeb57]::session::CliSession>::execute_command<unknown>
  247. 184.12 s gammaloop-nextest-integration> at <unknown source file>:<unknown line>
  248. 184.12 s gammaloop-nextest-integration> 28: <gammaloop_integration_tests[191607b70c61cd5a]::CLIState>::run_command<unknown>
  249. 184.12 s gammaloop-nextest-integration> at <unknown source file>:<unknown line>
  250. 184.12 s gammaloop-nextest-integration> 29: uv[3c7454ef256d6487]::run_single_integrated_uv_case<unknown>
  251. 184.12 s gammaloop-nextest-integration> at <unknown source file>:<unknown line>
  252. 184.12 s gammaloop-nextest-integration> 30: <uv[3c7454ef256d6487]::thermal_sunrise_uv::{closure#0} as core[940e698046960fd5]::ops::function::FnOnce<()>>::call_once<unknown>
  253. 184.12 s gammaloop-nextest-integration> at <unknown source file>:<unknown line>
  254. 184.12 s gammaloop-nextest-integration> 31: test[75d6903177b1d7e9]::__rust_begin_short_backtrace::<core[940e698046960fd5]::result::Result<(), alloc[2ea6bcb46fca0c42]::string::String>, fn() -> core[940e698046960fd5]::result::Result<(), alloc[2ea6bcb46fca0c42]::string::String>><unknown>
  255. 184.12 s gammaloop-nextest-integration> at <unknown source file>:<unknown line>
  256. 184.12 s gammaloop-nextest-integration> 32: test[75d6903177b1d7e9]::run_test::{closure#0}<unknown>
  257. 184.12 s gammaloop-nextest-integration> at <unknown source file>:<unknown line>
  258. 184.12 s gammaloop-nextest-integration> 33: std[bcb96dfbba0ab899]::sys::backtrace::__rust_begin_short_backtrace::<test[75d6903177b1d7e9]::run_test::{closure#1}, ()><unknown>
  259. 184.12 s gammaloop-nextest-integration> at <unknown source file>:<unknown line>
  260. 184.12 s gammaloop-nextest-integration> 34: <std[bcb96dfbba0ab899]::thread::lifecycle::spawn_unchecked<test[75d6903177b1d7e9]::run_test::{closure#1}, ()>::{closure#1} as core[940e698046960fd5]::ops::function::FnOnce<()>>::call_once::{shim:vtable#0}<unknown>
  261. 184.12 s gammaloop-nextest-integration> at <unknown source file>:<unknown line>
  262. 184.12 s gammaloop-nextest-integration> 35: <std[bcb96dfbba0ab899]::sys::thread::unix::Thread>::new::thread_start<unknown>
  263. 184.12 s gammaloop-nextest-integration> at <unknown source file>:<unknown line>
  264. 184.12 s gammaloop-nextest-integration> 36: start_thread<unknown>
  265. 184.12 s gammaloop-nextest-integration> at <unknown source file>:<unknown line>
  266. 184.12 s gammaloop-nextest-integration> 37: __clone3<unknown>
  267. 184.12 s gammaloop-nextest-integration> at <unknown source file>:<unknown line>
  268. 184.12 s gammaloop-nextest-integration>
  269. 184.12 s gammaloop-nextest-integration> Run with COLORBT_SHOW_HIDDEN=1 environment variable to disable frame filtering.
  270. 184.12 s gammaloop-nextest-integration> Run with RUST_BACKTRACE=full to include source snippets.
  271. 184.12 s gammaloop-nextest-integration> Warning: SpanTrace capture is Unsupported.
  272. 184.12 s gammaloop-nextest-integration> Ensure that you've setup a tracing-error ErrorLayer and the semver versions are compatible
  273. 184.12 s gammaloop-nextest-integration>
  274. 257.31 s gammaloop-nextest-integration> ------------
  275. 257.31 s gammaloop-nextest-integration> Summary [ 232.283s] 170 tests run: 168 passed, 2 failed, 209 skipped
  276. 257.31 s gammaloop-nextest-integration> FAIL [ 3.252s] ( 55/170) gammaloop-integration-tests::test_runs aa_aa::important::aa_aa_local_inspect_backend_consistency
  277. 257.31 s gammaloop-nextest-integration> stdout ---
  278. 257.32 s gammaloop-nextest-integration>
  279. 257.32 s gammaloop-nextest-integration> running 1 test
  280. 257.32 s gammaloop-nextest-integration> test aa_aa::important::aa_aa_local_inspect_backend_consistency ... FAILED
  281. 257.32 s gammaloop-nextest-integration>
  282. 257.32 s gammaloop-nextest-integration> failures:
  283. 257.32 s gammaloop-nextest-integration>
  284. 257.32 s gammaloop-nextest-integration> failures:
  285. 257.32 s gammaloop-nextest-integration> aa_aa::important::aa_aa_local_inspect_backend_consistency
  286. 257.32 s gammaloop-nextest-integration>
  287. 257.32 s gammaloop-nextest-integration> test result: FAILED. 0 passed; 1 failed; 0 ignored; 0 measured; 274 filtered out; finished in 3.23s
  288. 257.32 s gammaloop-nextest-integration>
  289. 257.32 s gammaloop-nextest-integration> stderr ---
  290. 257.32 s gammaloop-nextest-integration> [2026-09-16 22:38:29.075] @gammaloop_api::se... INFO : Running command import model sm-default.json
  291. 257.32 s gammaloop-nextest-integration> [2026-09-16 22:38:29.075] @import::model INFO : Loading built-in JSON model sm-default
  292. 257.32 s gammaloop-nextest-integration> [2026-09-16 22:38:29.098] @gammalooprs::model INFO : The following 15 external parameters were forced to zero by the restriction card:
  293. 257.32 s gammaloop-nextest-integration> lamWS, AWS, rhoWS, etaWS, ymc, yme, ymm, MC, Me, MM, WTau, muQ, muLe, muLmu, muLtau
  294. 257.32 s gammaloop-nextest-integration> [2026-09-16 22:38:29.098] @gammalooprs::model INFO : The following 34 vertex rules were removed by the restriction card:
  295. 257.32 s gammaloop-nextest-integration> V_82 -> (c~, d, G+) | V_83 -> (t~, d, G+) | V_84 -> (c~, s, G+) | V_85 -> (t~, s, G+) | V_86 -> (u~, b, G+) | V_87 -> (c~, b, G+) | V_90 -> (c~, d, W+) | V_91 -> (t~, d, W+) | V_92 -> (u~, s, W+) | V_94 -> (t~, s, W+) | V_95 -> (u~, b, W+) | V_96 -> (c~, b, W+) | V_101 -> (e+, e-, G0) | V_102 -> (mu+, mu-, G0) | V_104 -> (e+, e-, H) | V_105 -> (mu+, mu-, H) | V_110 -> (ve~, e-, G+) | V_111 -> (vm~, mu-, G+) | V_116 -> (b~, u, G-) | V_117 -> (d~, c, G-) | V_118 -> (s~, c, G-) | V_119 -> (b~, c, G-) | V_120 -> (d~, t, G-) | V_121 -> (s~, t, G-) | V_124 -> (s~, u, W-) | V_125 -> (b~, u, W-) | V_126 -> (d~, c, W-) | V_128 -> (b~, c, W-) | V_129 -> (d~, t, W-) | V_130 -> (s~, t, W-) | V_138 -> (c~, c, G0) | V_140 -> (c~, c, H) | V_145 -> (e+, ve, G-) | V_146 -> (mu+, vm, G-)
  296. 257.32 s gammaloop-nextest-integration> [2026-09-16 22:38:29.098] @gammalooprs::model INFO : The following 36 couplings were removed by the restriction card:
  297. 257.32 s gammaloop-nextest-integration> GC_13, GC_14, GC_16, GC_17, GC_18, GC_19, GC_20, GC_22, GC_23, GC_24, GC_25, GC_26, GC_28, GC_29, GC_42, GC_43, GC_44, GC_46, GC_47, GC_48, GC_84, GC_85, GC_86, GC_87, GC_88, GC_89, GC_90, GC_91, GC_92, GC_93, GC_101, GC_102, GC_103, GC_105, GC_106, GC_107
  298. 257.32 s gammaloop-nextest-integration> [2026-09-16 22:38:29.099] @gammaloop_api::se... INFO : Running command run set_model_parameters
  299. 257.32 s gammaloop-nextest-integration> [2026-09-16 22:38:29.099] @gammaloop_api::se... INFO : Starting command block set_model_parameters
  300. 257.32 s gammaloop-nextest-integration> [2026-09-16 22:38:29.099] @gammaloop_api::se... INFO : Running command set model MT=173.0
  301. 257.32 s gammaloop-nextest-integration> [2026-09-16 22:38:29.104] @gammaloop_api::se... INFO : Running command set model WT=0.0
  302. 257.32 s gammaloop-nextest-integration> [2026-09-16 22:38:29.109] @gammaloop_api::se... INFO : Running command set model ymt=173.0
  303. 257.32 s gammaloop-nextest-integration> [2026-09-16 22:38:29.114] @gammaloop_api::se... INFO : Running command set model aS=0.118
  304. 257.32 s gammaloop-nextest-integration> [2026-09-16 22:38:29.119] @gammaloop_api::se... INFO : Running command set model aEWM1=137.036
  305. 257.32 s gammaloop-nextest-integration> [2026-09-16 22:38:29.123] @gammaloop_api::se... INFO : Running command set model Gf=1.166390e-05
  306. 257.32 s gammaloop-nextest-integration> [2026-09-16 22:38:29.128] @gammaloop_api::se... INFO : Running command set model MZ=91.188
  307. 257.32 s gammaloop-nextest-integration> [2026-09-16 22:38:29.134] @gammaloop_api::se... INFO : Running command set global string '
  308. 257.32 s gammaloop-nextest-integration> [global.generation.compile]
  309. 257.32 s gammaloop-nextest-integration> compilation_mode = "symjit"
  310. 257.32 s gammaloop-nextest-integration> optimization_level = "O0"
  311. 257.32 s gammaloop-nextest-integration> fast_math = false
  312. 257.32 s gammaloop-nextest-integration> [...]
  313. 257.32 s gammaloop-nextest-integration> [2026-09-16 22:38:29.135] @gammaloop_api::se... INFO : Running command import graphs ./examples/cli/aa_aa/1L/aa_aa_1L.dot -p aa_aa_all_helicities -i 1L_ppmm -o
  314. 257.32 s gammaloop-nextest-integration> [2026-09-16 22:38:29.135] @commands::import INFO : Loading graphs from '/build/source/examples/cli/aa_aa/1L/aa_aa_1L.dot'
  315. 257.32 s gammaloop-nextest-integration> [2026-09-16 22:38:29.146] @gammaloop_api::se... INFO : Running command generate existing -p aa_aa_all_helicities
  316. 257.32 s gammaloop-nextest-integration> The application panicked (crashed).
  317. 257.32 s gammaloop-nextest-integration> Message: label _func_power_ not found
  318. 257.32 s gammaloop-nextest-integration> Location: /nix/store/n9w914kh1cm59xx3spcs831cdyb56m32-vendor-cargo-deps/c19b7c6f923b580ac259164a89f2577984ad5ab09ee9d583b888f934adbbe8d0/symjit-2.25.6/src/symjit/assembler.rs:77
  319. 257.32 s gammaloop-nextest-integration>
  320. 257.32 s gammaloop-nextest-integration> ━━━━━━━━━━━━━━━━━━━━━━━━━━━━━━━━━━ BACKTRACE ━━━━━━━━━━━━━━━━━━━━━━━━━━━━━━━━━━━
  321. 257.32 s gammaloop-nextest-integration> 1: <color_eyre[51793ea62743adbd]::config::PanicHook>::panic_report<unknown>
  322. 257.32 s gammaloop-nextest-integration> at <unknown source file>:<unknown line>
  323. 257.32 s gammaloop-nextest-integration> 2: <color_eyre[51793ea62743adbd]::config::PanicHook>::into_panic_hook::{closure#0}<unknown>
  324. 257.32 s gammaloop-nextest-integration> at <unknown source file>:<unknown line>
  325. 257.32 s gammaloop-nextest-integration> 3: std[bcb96dfbba0ab899]::panicking::panic_with_hook<unknown>
  326. 257.32 s gammaloop-nextest-integration> at <unknown source file>:<unknown line>
  327. 257.32 s gammaloop-nextest-integration> 4: std[bcb96dfbba0ab899]::panicking::panic_handler::{closure#0}<unknown>
  328. 257.32 s gammaloop-nextest-integration> at <unknown source file>:<unknown line>
  329. 257.32 s gammaloop-nextest-integration> 5: std[bcb96dfbba0ab899]::sys::backtrace::__rust_end_short_backtrace::<std[bcb96dfbba0ab899]::panicking::panic_handler::{closure#0}, !><unknown>
  330. 257.32 s gammaloop-nextest-integration> at <unknown source file>:<unknown line>
  331. 257.32 s gammaloop-nextest-integration> 6: __rustc[6c289b9f9c454d21]::rust_begin_unwind<unknown>
  332. 257.32 s gammaloop-nextest-integration> at <unknown source file>:<unknown line>
  333. 257.32 s gammaloop-nextest-integration> 7: core[940e698046960fd5]::panicking::panic_fmt<unknown>
  334. 257.32 s gammaloop-nextest-integration> at <unknown source file>:<unknown line>
  335. 257.32 s gammaloop-nextest-integration> 8: <symjit[e408de789c333cd]::symjit::assembler::Assembler>::apply_jumps<unknown>
  336. 257.32 s gammaloop-nextest-integration> at <unknown source file>:<unknown line>
  337. 257.32 s gammaloop-nextest-integration> 9: <symjit[e408de789c333cd]::symjit::builder::Builder>::compile_from_mir::<symjit[e408de789c333cd]::symjit::amd::complex::AmdComplexGenerator><unknown>
  338. 257.32 s gammaloop-nextest-integration> at <unknown source file>:<unknown line>
  339. 257.32 s gammaloop-nextest-integration> 10: <symjit[e408de789c333cd]::symjit::runnable::Application>::compile_ty<unknown>
  340. 257.32 s gammaloop-nextest-integration> at <unknown source file>:<unknown line>
  341. 257.32 s gammaloop-nextest-integration> 11: <symjit[e408de789c333cd]::symjit::runnable::Application>::with_mir<unknown>
  342. 257.32 s gammaloop-nextest-integration> at <unknown source file>:<unknown line>
  343. 257.32 s gammaloop-nextest-integration> 12: <symjit[e408de789c333cd]::symjit::composer::DirectTranslator as symjit[e408de789c333cd]::symjit::composer::Composer>::compile<unknown>
  344. 257.32 s gammaloop-nextest-integration> at <unknown source file>:<unknown line>
  345. 257.32 s gammaloop-nextest-integration> 13: <symjit[e408de789c333cd]::symjit::compiler::Translator as symjit[e408de789c333cd]::symjit::composer::Composer>::compile<unknown>
  346. 257.32 s gammaloop-nextest-integration> at <unknown source file>:<unknown line>
  347. 257.32 s gammaloop-nextest-integration> 14: <numerica[124dab8567f4861e]::domains::float::complex::Complex<f64> as symbolica[10e259bab675d243]::evaluate::backend::JITCompiledNumber>::jit_compile<unknown>
  348. 257.32 s gammaloop-nextest-integration> at <unknown source file>:<unknown line>
  349. 257.32 s gammaloop-nextest-integration> 15: <symbolica[10e259bab675d243]::evaluate::evaluator::ExpressionEvaluator<numerica[124dab8567f4861e]::domains::float::complex::Complex<f64>>>::jit_compile<unknown>
  350. 257.32 s gammaloop-nextest-integration> at <unknown source file>:<unknown line>
  351. 257.32 s gammaloop-nextest-integration> 16: <gammalooprs[917cbd3df9e68f8f]::integrands::process::evaluators::GenericEvaluator>::activate_symjit<unknown>
  352. 257.32 s gammaloop-nextest-integration> at <unknown source file>:<unknown line>
  353. 257.32 s gammaloop-nextest-integration> 17: <gammalooprs[917cbd3df9e68f8f]::integrands::process::amplitude::AmplitudeIntegrand>::prepare_runtime_backends_after_generation_with_compile_times<unknown>
  354. 257.32 s gammaloop-nextest-integration> at <unknown source file>:<unknown line>
  355. 257.32 s gammaloop-nextest-integration> 18: <gammalooprs[917cbd3df9e68f8f]::processes::amplitude::Amplitude>::build_integrand<unknown>
  356. 257.32 s gammaloop-nextest-integration> at <unknown source file>:<unknown line>
  357. 257.32 s gammaloop-nextest-integration> 19: <gammalooprs[917cbd3df9e68f8f]::processes::process::Process>::generate_integrands<unknown>
  358. 257.32 s gammaloop-nextest-integration> at <unknown source file>:<unknown line>
  359. 257.32 s gammaloop-nextest-integration> 20: <gammaloop_api[9ebf6628f97aeb57]::state::State>::generate_integrand<unknown>
  360. 257.32 s gammaloop-nextest-integration> at <unknown source file>:<unknown line>
  361. 257.32 s gammaloop-nextest-integration> 21: <gammaloop_api[9ebf6628f97aeb57]::commands::generate::Generate>::run::<&std[bcb96dfbba0ab899]::path::PathBuf><unknown>
  362. 257.32 s gammaloop-nextest-integration> at <unknown source file>:<unknown line>
  363. 257.32 s gammaloop-nextest-integration> 22: <gammaloop_api[9ebf6628f97aeb57]::commands::Commands>::run<unknown>
  364. 257.32 s gammaloop-nextest-integration> at <unknown source file>:<unknown line>
  365. 257.32 s gammaloop-nextest-integration> 23: <gammaloop_api[9ebf6628f97aeb57]::session::CliSession>::execute_prepared<unknown>
  366. 257.32 s gammaloop-nextest-integration> at <unknown source file>:<unknown line>
  367. 257.32 s gammaloop-nextest-integration> 24: <gammaloop_api[9ebf6628f97aeb57]::session::CliSession>::execute_command<unknown>
  368. 257.32 s gammaloop-nextest-integration> at <unknown source file>:<unknown line>
  369. 257.32 s gammaloop-nextest-integration> 25: <gammaloop_integration_tests[191607b70c61cd5a]::CLIState>::run_command<unknown>
  370. 257.32 s gammaloop-nextest-integration> at <unknown source file>:<unknown line>
  371. 257.32 s gammaloop-nextest-integration> 26: test_runs[9b7e2dc2dc4f29b0]::aa_aa::generate_aa_aa_helicity_family<unknown>
  372. 257.32 s gammaloop-nextest-integration> at <unknown source file>:<unknown line>
  373. 257.32 s gammaloop-nextest-integration> 27: <test_runs[9b7e2dc2dc4f29b0]::aa_aa::important::aa_aa_local_inspect_backend_consistency::{closure#0} as core[940e698046960fd5]::ops::function::FnOnce<()>>::call_once<unknown>
  374. 257.32 s gammaloop-nextest-integration> at <unknown source file>:<unknown line>
  375. 257.32 s gammaloop-nextest-integration> 28: serial_test[cd99724524a2f1c0]::serial_code_lock::local_serial_core_with_return::<(), eyre[cb2fd339c0c40fca]::Report><unknown>
  376. 257.32 s gammaloop-nextest-integration> at <unknown source file>:<unknown line>
  377. 257.32 s gammaloop-nextest-integration> 29: <test_runs[9b7e2dc2dc4f29b0]::aa_aa::important::aa_aa_local_inspect_backend_consistency::{closure#0} as core[940e698046960fd5]::ops::function::FnOnce<()>>::call_once<unknown>
  378. 257.32 s gammaloop-nextest-integration> at <unknown source file>:<unknown line>
  379. 257.32 s gammaloop-nextest-integration> 30: test[75d6903177b1d7e9]::__rust_begin_short_backtrace::<core[940e698046960fd5]::result::Result<(), alloc[2ea6bcb46fca0c42]::string::String>, fn() -> core[940e698046960fd5]::result::Result<(), alloc[2ea6bcb46fca0c42]::string::String>><unknown>
  380. 257.32 s gammaloop-nextest-integration> at <unknown source file>:<unknown line>
  381. 257.32 s gammaloop-nextest-integration> 31: test[75d6903177b1d7e9]::run_test::{closure#0}<unknown>
  382. 257.32 s gammaloop-nextest-integration> at <unknown source file>:<unknown line>
  383. 257.32 s gammaloop-nextest-integration> 32: std[bcb96dfbba0ab899]::sys::backtrace::__rust_begin_short_backtrace::<test[75d6903177b1d7e9]::run_test::{closure#1}, ()><unknown>
  384. 257.32 s gammaloop-nextest-integration> at <unknown source file>:<unknown line>
  385. 257.32 s gammaloop-nextest-integration> 33: <std[bcb96dfbba0ab899]::thread::lifecycle::spawn_unchecked<test[75d6903177b1d7e9]::run_test::{closure#1}, ()>::{closure#1} as core[940e698046960fd5]::ops::function::FnOnce<()>>::call_once::{shim:vtable#0}<unknown>
  386. 257.32 s gammaloop-nextest-integration> at <unknown source file>:<unknown line>
  387. 257.32 s gammaloop-nextest-integration> 34: <std[bcb96dfbba0ab899]::sys::thread::unix::Thread>::new::thread_start<unknown>
  388. 257.32 s gammaloop-nextest-integration> at <unknown source file>:<unknown line>
  389. 257.32 s gammaloop-nextest-integration> 35: start_thread<unknown>
  390. 257.32 s gammaloop-nextest-integration> at <unknown source file>:<unknown line>
  391. 257.32 s gammaloop-nextest-integration> 36: __clone3<unknown>
  392. 257.32 s gammaloop-nextest-integration> at <unknown source file>:<unknown line>
  393. 257.32 s gammaloop-nextest-integration>
  394. 257.32 s gammaloop-nextest-integration> Run with COLORBT_SHOW_HIDDEN=1 environment variable to disable frame filtering.
  395. 257.32 s gammaloop-nextest-integration> Run with RUST_BACKTRACE=full to include source snippets.
  396. 257.32 s gammaloop-nextest-integration> Warning: SpanTrace capture is Unsupported.
  397. 257.32 s gammaloop-nextest-integration> Ensure that you've setup a tracing-error ErrorLayer and the semver versions are compatible
  398. 257.32 s gammaloop-nextest-integration>
  399. 257.32 s gammaloop-nextest-integration> FAIL [ 4.721s] (159/170) gammaloop-integration-tests::uv thermal_sunrise_uv
  400. 257.32 s gammaloop-nextest-integration> stdout ---
  401. 257.32 s gammaloop-nextest-integration>
  402. 257.32 s gammaloop-nextest-integration> running 1 test
  403. 257.32 s gammaloop-nextest-integration> test thermal_sunrise_uv ... FAILED
  404. 257.32 s gammaloop-nextest-integration>
  405. 257.32 s gammaloop-nextest-integration> failures:
  406. 257.32 s gammaloop-nextest-integration>
  407. 257.32 s gammaloop-nextest-integration> failures:
  408. 257.32 s gammaloop-nextest-integration> thermal_sunrise_uv
  409. 257.32 s gammaloop-nextest-integration>
  410. 257.32 s gammaloop-nextest-integration> test result: FAILED. 0 passed; 1 failed; 0 ignored; 0 measured; 31 filtered out; finished in 4.70s
  411. 257.32 s gammaloop-nextest-integration>
  412. 257.32 s gammaloop-nextest-integration> stderr ---
  413. 257.32 s gammaloop-nextest-integration> [2026-09-16 22:39:32.781] @gammaloop_api::se... INFO : Running command run generate
  414. 257.32 s gammaloop-nextest-integration> [2026-09-16 22:39:32.781] @gammaloop_api::se... INFO : Starting command block generate
  415. 257.32 s gammaloop-nextest-integration> [2026-09-16 22:39:32.781] @gammaloop_api::se... INFO : Running command import model sm-default.json
  416. 257.32 s gammaloop-nextest-integration> [2026-09-16 22:39:32.781] @import::model INFO : Loading built-in JSON model sm-default
  417. 257.32 s gammaloop-nextest-integration> [2026-09-16 22:39:32.808] @gammalooprs::model INFO : The following 15 external parameters were forced to zero by the restriction card:
  418. 257.32 s gammaloop-nextest-integration> lamWS, AWS, rhoWS, etaWS, ymc, yme, ymm, MC, Me, MM, WTau, muQ, muLe, muLmu, muLtau
  419. 257.32 s gammaloop-nextest-integration> [2026-09-16 22:39:32.808] @gammalooprs::model INFO : The following 34 vertex rules were removed by the restriction card:
  420. 257.32 s gammaloop-nextest-integration> V_82 -> (c~, d, G+) | V_83 -> (t~, d, G+) | V_84 -> (c~, s, G+) | V_85 -> (t~, s, G+) | V_86 -> (u~, b, G+) | V_87 -> (c~, b, G+) | V_90 -> (c~, d, W+) | V_91 -> (t~, d, W+) | V_92 -> (u~, s, W+) | V_94 -> (t~, s, W+) | V_95 -> (u~, b, W+) | V_96 -> (c~, b, W+) | V_101 -> (e+, e-, G0) | V_102 -> (mu+, mu-, G0) | V_104 -> (e+, e-, H) | V_105 -> (mu+, mu-, H) | V_110 -> (ve~, e-, G+) | V_111 -> (vm~, mu-, G+) | V_116 -> (b~, u, G-) | V_117 -> (d~, c, G-) | V_118 -> (s~, c, G-) | V_119 -> (b~, c, G-) | V_120 -> (d~, t, G-) | V_121 -> (s~, t, G-) | V_124 -> (s~, u, W-) | V_125 -> (b~, u, W-) | V_126 -> (d~, c, W-) | V_128 -> (b~, c, W-) | V_129 -> (d~, t, W-) | V_130 -> (s~, t, W-) | V_138 -> (c~, c, G0) | V_140 -> (c~, c, H) | V_145 -> (e+, ve, G-) | V_146 -> (mu+, vm, G-)
  421. 257.32 s gammaloop-nextest-integration> [2026-09-16 22:39:32.808] @gammalooprs::model INFO : The following 36 couplings were removed by the restriction card:
  422. 257.32 s gammaloop-nextest-integration> GC_13, GC_14, GC_16, GC_17, GC_18, GC_19, GC_20, GC_22, GC_23, GC_24, GC_25, GC_26, GC_28, GC_29, GC_42, GC_43, GC_44, GC_46, GC_47, GC_48, GC_84, GC_85, GC_86, GC_87, GC_88, GC_89, GC_90, GC_91, GC_92, GC_93, GC_101, GC_102, GC_103, GC_105, GC_106, GC_107
  423. 257.32 s gammaloop-nextest-integration> [2026-09-16 22:39:32.808] @gammaloop_api::se... INFO : Running command remove processes
  424. 257.32 s gammaloop-nextest-integration> [2026-09-16 22:39:32.808] @gammaloop_api::se... INFO : Running command generate amp {} > {} [{2}] | g u
  425. 257.32 s gammaloop-nextest-integration> --numerator-grouping group_identical_graphs_up_to_scalar_rescaling
  426. 257.32 s gammaloop-nextest-integration> --max-n-bridges 0
  427. 257.32 s gammaloop-nextest-integration> --number-of-factorized-loop-subtopologies 1 1
  428. 257.32 s gammaloop-nextest-integration> --number-of-anticommutating-loops 1 1
  429. 257.32 s gammaloop-nextest-integration> [...]
  430. 257.32 s gammaloop-nextest-integration> [2026-09-16 22:39:32.809] @feyngen::diagram_... INFO : 0s | Δ=0s | Starting Feynman graph generation with Symbolica...
  431. 257.32 s gammaloop-nextest-integration> [2026-09-16 22:39:32.810] @feyngen::diagram_... INFO : 0s | Δ=0s | Number of graphs resulting from Symbolica generation: 3
  432. 257.32 s gammaloop-nextest-integration> [2026-09-16 22:39:32.811] @feyngen::diagram_... INFO : 0s | Δ=0s | Number of graphs retained after removal of vetoed topologies: 2
  433. 257.32 s gammaloop-nextest-integration> [2026-09-16 22:39:32.814] @feyngen::diagram_... INFO : 0s | Δ=0s | Number of graphs after vertex info assignment: 2
  434. 257.32 s gammaloop-nextest-integration> [2026-09-16 22:39:32.814] @feyngen::diagram_... INFO : 0s | Δ=0s | Number of graphs after all complete graphs filters are applied: 2
  435. 257.32 s gammaloop-nextest-integration> [2026-09-16 22:39:32.817] @feyngen::diagram_... INFO : 0s | Δ=0s | Number of graphs after closed anticommutating chains analysis: 1
  436. 257.32 s gammaloop-nextest-integration> [2026-09-16 22:39:32.817] @feyngen::diagram_... INFO : 0s | Δ=0s | Number of graphs after symmetrization of external states: 1
  437. 257.32 s gammaloop-nextest-integration> [2026-09-16 22:39:32.820] @feyngen::diagram_... INFO : 0s | Δ=0s | Number of graphs after canonization of vertices, edges and flows (graph labels assigned here): 1
  438. 257.32 s gammaloop-nextest-integration> [2026-09-16 22:39:32.845] @feyngen::diagram_... INFO : 0s | Δ=0s | Number of graphs after numerator-aware grouping with strategy 'up to a scalar rescaling': 1 (1 isomorphically unique graph, 0 color zero, 0 lorentz zero, 0 grouped and 0 cancellation)
  439. 257.32 s gammaloop-nextest-integration> [2026-09-16 22:39:32.845] @feyngen::diagram_... INFO : ( Sum of the symmetry factors from each graph generated = -1/2 )
  440. 257.32 s gammaloop-nextest-integration> [2026-09-16 22:39:32.846] @commands::generate INFO : Generated amplitude 1 graphs.
  441. 257.32 s gammaloop-nextest-integration> [2026-09-16 22:39:32.846] @commands::generate INFO : Only diagram generation was requested, skipping integrand generation. You can generate integrands later using the 'generate existing <options>' command.
  442. 257.32 s gammaloop-nextest-integration> [2026-09-16 22:39:32.846] @gammaloop_api::se... INFO : Running command generate
  443. 257.32 s gammaloop-nextest-integration> The application panicked (crashed).
  444. 257.32 s gammaloop-nextest-integration> Message: label _func_power_ not found
  445. 257.32 s gammaloop-nextest-integration> Location: /nix/store/n9w914kh1cm59xx3spcs831cdyb56m32-vendor-cargo-deps/c19b7c6f923b580ac259164a89f2577984ad5ab09ee9d583b888f934adbbe8d0/symjit-2.25.6/src/symjit/assembler.rs:77
  446. 257.32 s gammaloop-nextest-integration>
  447. 257.32 s gammaloop-nextest-integration> ━━━━━━━━━━━━━━━━━━━━━━━━━━━━━━━━━━ BACKTRACE ━━━━━━━━━━━━━━━━━━━━━━━━━━━━━━━━━━━
  448. 257.32 s gammaloop-nextest-integration> 1: <color_eyre[51793ea62743adbd]::config::PanicHook>::panic_report<unknown>
  449. 257.32 s gammaloop-nextest-integration> at <unknown source file>:<unknown line>
  450. 257.32 s gammaloop-nextest-integration> 2: <color_eyre[51793ea62743adbd]::config::PanicHook>::into_panic_hook::{closure#0}<unknown>
  451. 257.32 s gammaloop-nextest-integration> at <unknown source file>:<unknown line>
  452. 257.32 s gammaloop-nextest-integration> 3: std[bcb96dfbba0ab899]::panicking::panic_with_hook<unknown>
  453. 257.32 s gammaloop-nextest-integration> at <unknown source file>:<unknown line>
  454. 257.32 s gammaloop-nextest-integration> 4: std[bcb96dfbba0ab899]::panicking::panic_handler::{closure#0}<unknown>
  455. 257.32 s gammaloop-nextest-integration> at <unknown source file>:<unknown line>
  456. 257.32 s gammaloop-nextest-integration> 5: std[bcb96dfbba0ab899]::sys::backtrace::__rust_end_short_backtrace::<std[bcb96dfbba0ab899]::panicking::panic_handler::{closure#0}, !><unknown>
  457. 257.32 s gammaloop-nextest-integration> at <unknown source file>:<unknown line>
  458. 257.32 s gammaloop-nextest-integration> 6: __rustc[6c289b9f9c454d21]::rust_begin_unwind<unknown>
  459. 257.32 s gammaloop-nextest-integration> at <unknown source file>:<unknown line>
  460. 257.32 s gammaloop-nextest-integration> 7: core[940e698046960fd5]::panicking::panic_fmt<unknown>
  461. 257.32 s gammaloop-nextest-integration> at <unknown source file>:<unknown line>
  462. 257.32 s gammaloop-nextest-integration> 8: <symjit[e408de789c333cd]::symjit::assembler::Assembler>::apply_jumps<unknown>
  463. 257.32 s gammaloop-nextest-integration> at <unknown source file>:<unknown line>
  464. 257.32 s gammaloop-nextest-integration> 9: <symjit[e408de789c333cd]::symjit::builder::Builder>::compile_from_mir::<symjit[e408de789c333cd]::symjit::amd::complex::AmdComplexGenerator><unknown>
  465. 257.32 s gammaloop-nextest-integration> at <unknown source file>:<unknown line>
  466. 257.32 s gammaloop-nextest-integration> 10: <symjit[e408de789c333cd]::symjit::runnable::Application>::compile_ty<unknown>
  467. 257.32 s gammaloop-nextest-integration> at <unknown source file>:<unknown line>
  468. 257.32 s gammaloop-nextest-integration> 11: <symjit[e408de789c333cd]::symjit::runnable::Application>::with_mir<unknown>
  469. 257.32 s gammaloop-nextest-integration> at <unknown source file>:<unknown line>
  470. 257.32 s gammaloop-nextest-integration> 12: <symjit[e408de789c333cd]::symjit::composer::DirectTranslator as symjit[e408de789c333cd]::symjit::composer::Composer>::compile<unknown>
  471. 257.32 s gammaloop-nextest-integration> at <unknown source file>:<unknown line>
  472. 257.32 s gammaloop-nextest-integration> 13: <symjit[e408de789c333cd]::symjit::compiler::Translator as symjit[e408de789c333cd]::symjit::composer::Composer>::compile<unknown>
  473. 257.32 s gammaloop-nextest-integration> at <unknown source file>:<unknown line>
  474. 257.32 s gammaloop-nextest-integration> 14: <numerica[124dab8567f4861e]::domains::float::complex::Complex<f64> as symbolica[10e259bab675d243]::evaluate::backend::JITCompiledNumber>::jit_compile<unknown>
  475. 257.32 s gammaloop-nextest-integration> at <unknown source file>:<unknown line>
  476. 257.32 s gammaloop-nextest-integration> 15: <symbolica[10e259bab675d243]::evaluate::evaluator::ExpressionEvaluator<numerica[124dab8567f4861e]::domains::float::complex::Complex<f64>>>::jit_compile<unknown>
  477. 257.32 s gammaloop-nextest-integration> at <unknown source file>:<unknown line>
  478. 257.32 s gammaloop-nextest-integration> 16: <gammalooprs[917cbd3df9e68f8f]::integrands::process::evaluators::GenericEvaluator>::activate_symjit<unknown>
  479. 257.32 s gammaloop-nextest-integration> at <unknown source file>:<unknown line>
  480. 257.32 s gammaloop-nextest-integration> 17: <gammalooprs[917cbd3df9e68f8f]::integrands::process::amplitude::AmplitudeIntegrand>::prepare_runtime_backends_after_generation_with_compile_times<unknown>
  481. 257.32 s gammaloop-nextest-integration> at <unknown source file>:<unknown line>
  482. 257.32 s gammaloop-nextest-integration> 18: <gammalooprs[917cbd3df9e68f8f]::processes::amplitude::Amplitude>::build_integrand<unknown>
  483. 257.32 s gammaloop-nextest-integration> at <unknown source file>:<unknown line>
  484. 257.32 s gammaloop-nextest-integration> 19: <gammalooprs[917cbd3df9e68f8f]::processes::process::Process>::generate_integrands<unknown>
  485. 257.32 s gammaloop-nextest-integration> at <unknown source file>:<unknown line>
  486. 257.32 s gammaloop-nextest-integration> 20: <gammalooprs[917cbd3df9e68f8f]::processes::ProcessList>::generate_integrands<unknown>
  487. 257.32 s gammaloop-nextest-integration> at <unknown source file>:<unknown line>
  488. 257.32 s gammaloop-nextest-integration> 21: <gammaloop_api[9ebf6628f97aeb57]::state::State>::generate_integrands<unknown>
  489. 257.32 s gammaloop-nextest-integration> at <unknown source file>:<unknown line>
  490. 257.32 s gammaloop-nextest-integration> 22: <gammaloop_api[9ebf6628f97aeb57]::commands::generate::Generate>::run::<&std[bcb96dfbba0ab899]::path::PathBuf><unknown>
  491. 257.32 s gammaloop-nextest-integration> at <unknown source file>:<unknown line>
  492. 257.32 s gammaloop-nextest-integration> 23: <gammaloop_api[9ebf6628f97aeb57]::commands::Commands>::run<unknown>
  493. 257.32 s gammaloop-nextest-integration> at <unknown source file>:<unknown line>
  494. 257.32 s gammaloop-nextest-integration> 24: <gammaloop_api[9ebf6628f97aeb57]::session::CliSession>::execute_prepared<unknown>
  495. 257.32 s gammaloop-nextest-integration> at <unknown source file>:<unknown line>
  496. 257.32 s gammaloop-nextest-integration> 25: <gammaloop_api[9ebf6628f97aeb57]::session::CliSession>::execute_prepared_commands<unknown>
  497. 257.32 s gammaloop-nextest-integration> at <unknown source file>:<unknown line>
  498. 257.32 s gammaloop-nextest-integration> 26: <gammaloop_api[9ebf6628f97aeb57]::session::CliSession>::execute_prepared<unknown>
  499. 257.32 s gammaloop-nextest-integration> at <unknown source file>:<unknown line>
  500. 257.32 s gammaloop-nextest-integration> 27: <gammaloop_api[9ebf6628f97aeb57]::session::CliSession>::execute_command<unknown>
  501. 257.32 s gammaloop-nextest-integration> at <unknown source file>:<unknown line>
  502. 257.32 s gammaloop-nextest-integration> 28: <gammaloop_integration_tests[191607b70c61cd5a]::CLIState>::run_command<unknown>
  503. 257.32 s gammaloop-nextest-integration> at <unknown source file>:<unknown line>
  504. 257.32 s gammaloop-nextest-integration> 29: uv[3c7454ef256d6487]::run_single_integrated_uv_case<unknown>
  505. 257.32 s gammaloop-nextest-integration> at <unknown source file>:<unknown line>
  506. 257.32 s gammaloop-nextest-integration> 30: <uv[3c7454ef256d6487]::thermal_sunrise_uv::{closure#0} as core[940e698046960fd5]::ops::function::FnOnce<()>>::call_once<unknown>
  507. 257.32 s gammaloop-nextest-integration> at <unknown source file>:<unknown line>
  508. 257.32 s gammaloop-nextest-integration> 31: test[75d6903177b1d7e9]::__rust_begin_short_backtrace::<core[940e698046960fd5]::result::Result<(), alloc[2ea6bcb46fca0c42]::string::String>, fn() -> core[940e698046960fd5]::result::Result<(), alloc[2ea6bcb46fca0c42]::string::String>><unknown>
  509. 257.32 s gammaloop-nextest-integration> at <unknown source file>:<unknown line>
  510. 257.32 s gammaloop-nextest-integration> 32: test[75d6903177b1d7e9]::run_test::{closure#0}<unknown>
  511. 257.32 s gammaloop-nextest-integration> at <unknown source file>:<unknown line>
  512. 257.32 s gammaloop-nextest-integration> 33: std[bcb96dfbba0ab899]::sys::backtrace::__rust_begin_short_backtrace::<test[75d6903177b1d7e9]::run_test::{closure#1}, ()><unknown>
  513. 257.32 s gammaloop-nextest-integration> at <unknown source file>:<unknown line>
  514. 257.32 s gammaloop-nextest-integration> 34: <std[bcb96dfbba0ab899]::thread::lifecycle::spawn_unchecked<test[75d6903177b1d7e9]::run_test::{closure#1}, ()>::{closure#1} as core[940e698046960fd5]::ops::function::FnOnce<()>>::call_once::{shim:vtable#0}<unknown>
  515. 257.32 s gammaloop-nextest-integration> at <unknown source file>:<unknown line>
  516. 257.32 s gammaloop-nextest-integration> 35: <std[bcb96dfbba0ab899]::sys::thread::unix::Thread>::new::thread_start<unknown>
  517. 257.32 s gammaloop-nextest-integration> at <unknown source file>:<unknown line>
  518. 257.32 s gammaloop-nextest-integration> 36: start_thread<unknown>
  519. 257.32 s gammaloop-nextest-integration> at <unknown source file>:<unknown line>
  520. 257.32 s gammaloop-nextest-integration> 37: __clone3<unknown>
  521. 257.32 s gammaloop-nextest-integration> at <unknown source file>:<unknown line>
  522. 257.32 s gammaloop-nextest-integration>
  523. 257.32 s gammaloop-nextest-integration> Run with COLORBT_SHOW_HIDDEN=1 environment variable to disable frame filtering.
  524. 257.32 s gammaloop-nextest-integration> Run with RUST_BACKTRACE=full to include source snippets.
  525. 257.32 s gammaloop-nextest-integration> Warning: SpanTrace capture is Unsupported.
  526. 257.32 s gammaloop-nextest-integration> Ensure that you've setup a tracing-error ErrorLayer and the semver versions are compatible
  527. 257.32 s gammaloop-nextest-integration>
  528. 257.44 s gammaloop-nextest-integration> error: test run failed
  529. 257.46 s gammaloop-nextest-integration>
  530. 257.46 s gammaloop-nextest-integration> ========== nextest test summary ==========
  531. 257.46 s gammaloop-nextest-integration> report: target/nextest/ci_gammaloop/junit.xml
  532. 257.46 s gammaloop-nextest-integration> tests: 170, failures: 2, errors: 0
  533. 257.46 s gammaloop-nextest-integration>
  534. 257.46 s gammaloop-nextest-integration> 1. gammaloop-integration-tests::test_runs::aa_aa::important::aa_aa_local_inspect_backend_consistency
  535. 257.46 s gammaloop-nextest-integration> failure: test failure with exit code 101
  536. 257.46 s gammaloop-nextest-integration> system-out
  537. 257.46 s gammaloop-nextest-integration> running 1 test
  538. 257.46 s gammaloop-nextest-integration> test aa_aa::important::aa_aa_local_inspect_backend_consistency ... FAILED
  539. 257.46 s gammaloop-nextest-integration>
  540. 257.46 s gammaloop-nextest-integration> failures:
  541. 257.46 s gammaloop-nextest-integration>
  542. 257.46 s gammaloop-nextest-integration> failures:
  543. 257.46 s gammaloop-nextest-integration> aa_aa::important::aa_aa_local_inspect_backend_consistency
  544. 257.46 s gammaloop-nextest-integration>
  545. 257.46 s gammaloop-nextest-integration> test result: FAILED. 0 passed; 1 failed; 0 ignored; 0 measured; 274 filtered out; finished in 3.23s
  546. 257.46 s gammaloop-nextest-integration> system-err
  547. 257.46 s gammaloop-nextest-integration> [2026-09-16 22:38:29.075] @gammaloop_api::se... INFO : Running command import model sm-default.json
  548. 257.46 s gammaloop-nextest-integration> [2026-09-16 22:38:29.075] @import::model INFO : Loading built-in JSON model sm-default
  549. 257.46 s gammaloop-nextest-integration> [2026-09-16 22:38:29.098] @gammalooprs::model INFO : The following 15 external parameters were forced to zero by the restriction card:
  550. 257.46 s gammaloop-nextest-integration> lamWS, AWS, rhoWS, etaWS, ymc, yme, ymm, MC, Me, MM, WTau, muQ, muLe, muLmu, muLtau
  551. 257.46 s gammaloop-nextest-integration> [2026-09-16 22:38:29.098] @gammalooprs::model INFO : The following 34 vertex rules were removed by the restriction card:
  552. 257.46 s gammaloop-nextest-integration> V_82 -> (c~, d, G+) | V_83 -> (t~, d, G+) | V_84 -> (c~, s, G+) | V_85 -> (t~, s, G+) | V_86 -> (u~, b, G+) | V_87 -> (c~, b, G+) | V_90 -> (c~, d, W+) | V_91 -> (t~, d, W+) | V_92 -> (u~, s, W+) | V_94 -> (t~, s, W+) | V_95 -> (u~, b, W+) | V_96 -> (c~, b, W+) | V_101 -> (e+, e-, G0) | V_102 -> (mu+, mu-, G0) | V_104 -> (e+, e-, H) | V_105 -> (mu+, mu-, H) | V_110 -> (ve~, e-, G+) | V_111 -> (vm~, mu-, G+) | V_116 -> (b~, u, G-) | V_117 -> (d~, c, G-) | V_118 -> (s~, c, G-) | V_119 -> (b~, c, G-) | V_120 -> (d~, t, G-) | V_121 -> (s~, t, G-) | V_124 -> (s~, u, W-) | V_125 -> (b~, u, W-) | V_126 -> (d~, c, W-) | V_128 -> (b~, c, W-) | V_129 -> (d~, t, W-) | V_130 -> (s~, t, W-) | V_138 -> (c~, c, G0) | V_140 -> (c~, c, H) | V_145 -> (e+, ve, G-) | V_146 -> (mu+, vm, G-)
  553. 257.46 s gammaloop-nextest-integration> [2026-09-16 22:38:29.098] @gammalooprs::model INFO : The following 36 couplings were removed by the restriction card:
  554. 257.46 s gammaloop-nextest-integration> GC_13, GC_14, GC_16, GC_17, GC_18, GC_19, GC_20, GC_22, GC_23, GC_24, GC_25, GC_26, GC_28, GC_29, GC_42, GC_43, GC_44, GC_46, GC_47, GC_48, GC_84, GC_85, GC_86, GC_87, GC_88, GC_89, GC_90, GC_91, GC_92, GC_93, GC_101, GC_102, GC_103, GC_105, GC_106, GC_107
  555. 257.46 s gammaloop-nextest-integration> [2026-09-16 22:38:29.099] @gammaloop_api::se... INFO : Running command run set_model_parameters
  556. 257.46 s gammaloop-nextest-integration> [2026-09-16 22:38:29.099] @gammaloop_api::se... INFO : Starting command block set_model_parameters
  557. 257.46 s gammaloop-nextest-integration> [2026-09-16 22:38:29.099] @gammaloop_api::se... INFO : Running command set model MT=173.0
  558. 257.46 s gammaloop-nextest-integration> [2026-09-16 22:38:29.104] @gammaloop_api::se... INFO : Running command set model WT=0.0
  559. 257.46 s gammaloop-nextest-integration> [2026-09-16 22:38:29.109] @gammaloop_api::se... INFO : Running command set model ymt=173.0
  560. 257.46 s gammaloop-nextest-integration> [2026-09-16 22:38:29.114] @gammaloop_api::se... INFO : Running command set model aS=0.118
  561. 257.46 s gammaloop-nextest-integration> [2026-09-16 22:38:29.119] @gammaloop_api::se... INFO : Running command set model aEWM1=137.036
  562. 257.46 s gammaloop-nextest-integration> [2026-09-16 22:38:29.123] @gammaloop_api::se... INFO : Running command set model Gf=1.166390e-05
  563. 257.46 s gammaloop-nextest-integration> [2026-09-16 22:38:29.128] @gammaloop_api::se... INFO : Running command set model MZ=91.188
  564. 257.46 s gammaloop-nextest-integration> [2026-09-16 22:38:29.134] @gammaloop_api::se... INFO : Running command set global string '
  565. 257.46 s gammaloop-nextest-integration> [global.generation.compile]
  566. 257.46 s gammaloop-nextest-integration> compilation_mode = "symjit"
  567. 257.46 s gammaloop-nextest-integration> optimization_level = "O0"
  568. 257.46 s gammaloop-nextest-integration> fast_math = false
  569. 257.46 s gammaloop-nextest-integration> [...]
  570. 257.46 s gammaloop-nextest-integration> [2026-09-16 22:38:29.135] @gammaloop_api::se... INFO : Running command import graphs ./examples/cli/aa_aa/1L/aa_aa_1L.dot -p aa_aa_all_helicities -i 1L_ppmm -o
  571. 257.46 s gammaloop-nextest-integration> [2026-09-16 22:38:29.135] @commands::import INFO : Loading graphs from '/build/source/examples/cli/aa_aa/1L/aa_aa_1L.dot'
  572. 257.46 s gammaloop-nextest-integration> [2026-09-16 22:38:29.146] @gammaloop_api::se... INFO : Running command generate existing -p aa_aa_all_helicities
  573. 257.46 s gammaloop-nextest-integration> The application panicked (crashed).
  574. 257.46 s gammaloop-nextest-integration> Message: label _func_power_ not found
  575. 257.46 s gammaloop-nextest-integration> Location: /nix/store/n9w914kh1cm59xx3spcs831cdyb56m32-vendor-cargo-deps/c19b7c6f923b580ac259164a89f2577984ad5ab09ee9d583b888f934adbbe8d0/symjit-2.25.6/src/symjit/assembler.rs:77
  576. 257.46 s gammaloop-nextest-integration>
  577. 257.46 s gammaloop-nextest-integration> ━━━━━━━━━━━━━━━━━━━━━━━━━━━━━━━━━━ BACKTRACE ━━━━━━━━━━━━━━━━━━━━━━━━━━━━━━━━━━━
  578. 257.46 s gammaloop-nextest-integration> 1: <color_eyre[51793ea62743adbd]::config::PanicHook>::panic_report<unknown>
  579. 257.46 s gammaloop-nextest-integration> at <unknown source file>:<unknown line>
  580. 257.46 s gammaloop-nextest-integration> 2: <color_eyre[51793ea62743adbd]::config::PanicHook>::into_panic_hook::{closure#0}<unknown>
  581. 257.46 s gammaloop-nextest-integration> at <unknown source file>:<unknown line>
  582. 257.46 s gammaloop-nextest-integration> 3: std[bcb96dfbba0ab899]::panicking::panic_with_hook<unknown>
  583. 257.46 s gammaloop-nextest-integration> at <unknown source file>:<unknown line>
  584. 257.46 s gammaloop-nextest-integration> 4: std[bcb96dfbba0ab899]::panicking::panic_handler::{closure#0}<unknown>
  585. 257.46 s gammaloop-nextest-integration> at <unknown source file>:<unknown line>
  586. 257.46 s gammaloop-nextest-integration> 5: std[bcb96dfbba0ab899]::sys::backtrace::__rust_end_short_backtrace::<std[bcb96dfbba0ab899]::panicking::panic_handler::{closure#0}, !><unknown>
  587. 257.46 s gammaloop-nextest-integration> at <unknown source file>:<unknown line>
  588. 257.46 s gammaloop-nextest-integration> 6: __rustc[6c289b9f9c454d21]::rust_begin_unwind<unknown>
  589. 257.46 s gammaloop-nextest-integration> at <unknown source file>:<unknown line>
  590. 257.46 s gammaloop-nextest-integration> 7: core[940e698046960fd5]::panicking::panic_fmt<unknown>
  591. 257.46 s gammaloop-nextest-integration> at <unknown source file>:<unknown line>
  592. 257.47 s gammaloop-nextest-integration> 8: <symjit[e408de789c333cd]::symjit::assembler::Assembler>::apply_jumps<unknown>
  593. 257.47 s gammaloop-nextest-integration> at <unknown source file>:<unknown line>
  594. 257.47 s gammaloop-nextest-integration> 9: <symjit[e408de789c333cd]::symjit::builder::Builder>::compile_from_mir::<symjit[e408de789c333cd]::symjit::amd::complex::AmdComplexGenerator><unknown>
  595. 257.47 s gammaloop-nextest-integration> at <unknown source file>:<unknown line>
  596. 257.47 s gammaloop-nextest-integration> 10: <symjit[e408de789c333cd]::symjit::runnable::Application>::compile_ty<unknown>
  597. 257.47 s gammaloop-nextest-integration> at <unknown source file>:<unknown line>
  598. 257.47 s gammaloop-nextest-integration> 11: <symjit[e408de789c333cd]::symjit::runnable::Application>::with_mir<unknown>
  599. 257.47 s gammaloop-nextest-integration> at <unknown source file>:<unknown line>
  600. 257.47 s gammaloop-nextest-integration> 12: <symjit[e408de789c333cd]::symjit::composer::DirectTranslator as symjit[e408de789c333cd]::symjit::composer::Composer>::compile<unknown>
  601. 257.47 s gammaloop-nextest-integration> at <unknown source file>:<unknown line>
  602. 257.47 s gammaloop-nextest-integration> 13: <symjit[e408de789c333cd]::symjit::compiler::Translator as symjit[e408de789c333cd]::symjit::composer::Composer>::compile<unknown>
  603. 257.47 s gammaloop-nextest-integration> at <unknown source file>:<unknown line>
  604. 257.47 s gammaloop-nextest-integration> 14: <numerica[124dab8567f4861e]::domains::float::complex::Complex<f64> as symbolica[10e259bab675d243]::evaluate::backend::JITCompiledNumber>::jit_compile<unknown>
  605. 257.47 s gammaloop-nextest-integration> at <unknown source file>:<unknown line>
  606. 257.47 s gammaloop-nextest-integration> 15: <symbolica[10e259bab675d243]::evaluate::evaluator::ExpressionEvaluator<numerica[124dab8567f4861e]::domains::float::complex::Complex<f64>>>::jit_compile<unknown>
  607. 257.47 s gammaloop-nextest-integration> at <unknown source file>:<unknown line>
  608. 257.47 s gammaloop-nextest-integration> 16: <gammalooprs[917cbd3df9e68f8f]::integrands::process::evaluators::GenericEvaluator>::activate_symjit<unknown>
  609. 257.47 s gammaloop-nextest-integration> at <unknown source file>:<unknown line>
  610. 257.47 s gammaloop-nextest-integration> 17: <gammalooprs[917cbd3df9e68f8f]::integrands::process::amplitude::AmplitudeIntegrand>::prepare_runtime_backends_after_generation_with_compile_times<unknown>
  611. 257.47 s gammaloop-nextest-integration> at <unknown source file>:<unknown line>
  612. 257.47 s gammaloop-nextest-integration> 18: <gammalooprs[917cbd3df9e68f8f]::processes::amplitude::Amplitude>::build_integrand<unknown>
  613. 257.47 s gammaloop-nextest-integration> at <unknown source file>:<unknown line>
  614. 257.47 s gammaloop-nextest-integration> 19: <gammalooprs[917cbd3df9e68f8f]::processes::process::Process>::generate_integrands<unknown>
  615. 257.47 s gammaloop-nextest-integration> at <unknown source file>:<unknown line>
  616. 257.47 s gammaloop-nextest-integration> 20: <gammaloop_api[9ebf6628f97aeb57]::state::State>::generate_integrand<unknown>
  617. 257.47 s gammaloop-nextest-integration> at <unknown source file>:<unknown line>
  618. 257.47 s gammaloop-nextest-integration> 21: <gammaloop_api[9ebf6628f97aeb57]::commands::generate::Generate>::run::<&std[bcb96dfbba0ab899]::path::PathBuf><unknown>
  619. 257.47 s gammaloop-nextest-integration> at <unknown source file>:<unknown line>
  620. 257.47 s gammaloop-nextest-integration> 22: <gammaloop_api[9ebf6628f97aeb57]::commands::Commands>::run<unknown>
  621. 257.47 s gammaloop-nextest-integration> at <unknown source file>:<unknown line>
  622. 257.47 s gammaloop-nextest-integration> 23: <gammaloop_api[9ebf6628f97aeb57]::session::CliSession>::execute_prepared<unknown>
  623. 257.47 s gammaloop-nextest-integration> at <unknown source file>:<unknown line>
  624. 257.47 s gammaloop-nextest-integration> 24: <gammaloop_api[9ebf6628f97aeb57]::session::CliSession>::execute_command<unknown>
  625. 257.47 s gammaloop-nextest-integration> at <unknown source file>:<unknown line>
  626. 257.47 s gammaloop-nextest-integration> 25: <gammaloop_integration_tests[191607b70c61cd5a]::CLIState>::run_command<unknown>
  627. 257.47 s gammaloop-nextest-integration> at <unknown source file>:<unknown line>
  628. 257.47 s gammaloop-nextest-integration> 26: test_runs[9b7e2dc2dc4f29b0]::aa_aa::generate_aa_aa_helicity_family<unknown>
  629. 257.47 s gammaloop-nextest-integration> at <unknown source file>:<unknown line>
  630. 257.47 s gammaloop-nextest-integration> 27: <test_runs[9b7e2dc2dc4f29b0]::aa_aa::important::aa_aa_local_inspect_backend_consistency::{closure#0} as core[940e698046960fd5]::ops::function::FnOnce<()>>::call_once<unknown>
  631. 257.47 s gammaloop-nextest-integration> at <unknown source file>:<unknown line>
  632. 257.47 s gammaloop-nextest-integration> 28: serial_test[cd99724524a2f1c0]::serial_code_lock::local_serial_core_with_return::<(), eyre[cb2fd339c0c40fca]::Report><unknown>
  633. 257.47 s gammaloop-nextest-integration> at <unknown source file>:<unknown line>
  634. 257.47 s gammaloop-nextest-integration> 29: <test_runs[9b7e2dc2dc4f29b0]::aa_aa::important::aa_aa_local_inspect_backend_consistency::{closure#0} as core[940e698046960fd5]::ops::function::FnOnce<()>>::call_once<unknown>
  635. 257.47 s gammaloop-nextest-integration> at <unknown source file>:<unknown line>
  636. 257.47 s gammaloop-nextest-integration> 30: test[75d6903177b1d7e9]::__rust_begin_short_backtrace::<core[940e698046960fd5]::result::Result<(), alloc[2ea6bcb46fca0c42]::string::String>, fn() -> core[940e698046960fd5]::result::Result<(), alloc[2ea6bcb46fca0c42]::string::String>><unknown>
  637. 257.47 s gammaloop-nextest-integration> at <unknown source file>:<unknown line>
  638. 257.47 s gammaloop-nextest-integration> 31: test[75d6903177b1d7e9]::run_test::{closure#0}<unknown>
  639. 257.47 s gammaloop-nextest-integration> at <unknown source file>:<unknown line>
  640. 257.47 s gammaloop-nextest-integration> 32: std[bcb96dfbba0ab899]::sys::backtrace::__rust_begin_short_backtrace::<test[75d6903177b1d7e9]::run_test::{closure#1}, ()><unknown>
  641. 257.47 s gammaloop-nextest-integration> at <unknown source file>:<unknown line>
  642. 257.47 s gammaloop-nextest-integration> 33: <std[bcb96dfbba0ab899]::thread::lifecycle::spawn_unchecked<test[75d6903177b1d7e9]::run_test::{closure#1}, ()>::{closure#1} as core[940e698046960fd5]::ops::function::FnOnce<()>>::call_once::{shim:vtable#0}<unknown>
  643. 257.47 s gammaloop-nextest-integration> at <unknown source file>:<unknown line>
  644. 257.47 s gammaloop-nextest-integration> 34: <std[bcb96dfbba0ab899]::sys::thread::unix::Thread>::new::thread_start<unknown>
  645. 257.47 s gammaloop-nextest-integration> at <unknown source file>:<unknown line>
  646. 257.47 s gammaloop-nextest-integration> 35: start_thread<unknown>
  647. 257.47 s gammaloop-nextest-integration> at <unknown source file>:<unknown line>
  648. 257.47 s gammaloop-nextest-integration> 36: __clone3<unknown>
  649. 257.47 s gammaloop-nextest-integration> at <unknown source file>:<unknown line>
  650. 257.47 s gammaloop-nextest-integration>
  651. 257.47 s gammaloop-nextest-integration> Run with COLORBT_SHOW_HIDDEN=1 environment variable to disable frame filtering.
  652. 257.47 s gammaloop-nextest-integration> Run with RUST_BACKTRACE=full to include source snippets.
  653. 257.47 s gammaloop-nextest-integration> Warning: SpanTrace capture is Unsupported.
  654. 257.47 s gammaloop-nextest-integration> Ensure that you've setup a tracing-error ErrorLayer and the semver versions are compatible
  655. 257.47 s gammaloop-nextest-integration>
  656. 257.47 s gammaloop-nextest-integration> 2. gammaloop-integration-tests::uv::thermal_sunrise_uv
  657. 257.47 s gammaloop-nextest-integration> failure: test failure with exit code 101
  658. 257.47 s gammaloop-nextest-integration> system-out
  659. 257.47 s gammaloop-nextest-integration> running 1 test
  660. 257.47 s gammaloop-nextest-integration> test thermal_sunrise_uv ... FAILED
  661. 257.47 s gammaloop-nextest-integration>
  662. 257.47 s gammaloop-nextest-integration> failures:
  663. 257.47 s gammaloop-nextest-integration>
  664. 257.47 s gammaloop-nextest-integration> failures:
  665. 257.47 s gammaloop-nextest-integration> thermal_sunrise_uv
  666. 257.47 s gammaloop-nextest-integration>
  667. 257.47 s gammaloop-nextest-integration> test result: FAILED. 0 passed; 1 failed; 0 ignored; 0 measured; 31 filtered out; finished in 4.70s
  668. 257.47 s gammaloop-nextest-integration> system-err
  669. 257.47 s gammaloop-nextest-integration> [2026-09-16 22:39:32.781] @gammaloop_api::se... INFO : Running command run generate
  670. 257.47 s gammaloop-nextest-integration> [2026-09-16 22:39:32.781] @gammaloop_api::se... INFO : Starting command block generate
  671. 257.47 s gammaloop-nextest-integration> [2026-09-16 22:39:32.781] @gammaloop_api::se... INFO : Running command import model sm-default.json
  672. 257.47 s gammaloop-nextest-integration> [2026-09-16 22:39:32.781] @import::model INFO : Loading built-in JSON model sm-default
  673. 257.47 s gammaloop-nextest-integration> [2026-09-16 22:39:32.808] @gammalooprs::model INFO : The following 15 external parameters were forced to zero by the restriction card:
  674. 257.47 s gammaloop-nextest-integration> lamWS, AWS, rhoWS, etaWS, ymc, yme, ymm, MC, Me, MM, WTau, muQ, muLe, muLmu, muLtau
  675. 257.47 s gammaloop-nextest-integration> [2026-09-16 22:39:32.808] @gammalooprs::model INFO : The following 34 vertex rules were removed by the restriction card:
  676. 257.47 s gammaloop-nextest-integration> V_82 -> (c~, d, G+) | V_83 -> (t~, d, G+) | V_84 -> (c~, s, G+) | V_85 -> (t~, s, G+) | V_86 -> (u~, b, G+) | V_87 -> (c~, b, G+) | V_90 -> (c~, d, W+) | V_91 -> (t~, d, W+) | V_92 -> (u~, s, W+) | V_94 -> (t~, s, W+) | V_95 -> (u~, b, W+) | V_96 -> (c~, b, W+) | V_101 -> (e+, e-, G0) | V_102 -> (mu+, mu-, G0) | V_104 -> (e+, e-, H) | V_105 -> (mu+, mu-, H) | V_110 -> (ve~, e-, G+) | V_111 -> (vm~, mu-, G+) | V_116 -> (b~, u, G-) | V_117 -> (d~, c, G-) | V_118 -> (s~, c, G-) | V_119 -> (b~, c, G-) | V_120 -> (d~, t, G-) | V_121 -> (s~, t, G-) | V_124 -> (s~, u, W-) | V_125 -> (b~, u, W-) | V_126 -> (d~, c, W-) | V_128 -> (b~, c, W-) | V_129 -> (d~, t, W-) | V_130 -> (s~, t, W-) | V_138 -> (c~, c, G0) | V_140 -> (c~, c, H) | V_145 -> (e+, ve, G-) | V_146 -> (mu+, vm, G-)
  677. 257.47 s gammaloop-nextest-integration> [2026-09-16 22:39:32.808] @gammalooprs::model INFO : The following 36 couplings were removed by the restriction card:
  678. 257.47 s gammaloop-nextest-integration> GC_13, GC_14, GC_16, GC_17, GC_18, GC_19, GC_20, GC_22, GC_23, GC_24, GC_25, GC_26, GC_28, GC_29, GC_42, GC_43, GC_44, GC_46, GC_47, GC_48, GC_84, GC_85, GC_86, GC_87, GC_88, GC_89, GC_90, GC_91, GC_92, GC_93, GC_101, GC_102, GC_103, GC_105, GC_106, GC_107
  679. 257.47 s gammaloop-nextest-integration> [2026-09-16 22:39:32.808] @gammaloop_api::se... INFO : Running command remove processes
  680. 257.47 s gammaloop-nextest-integration> [2026-09-16 22:39:32.808] @gammaloop_api::se... INFO : Running command generate amp {} > {} [{2}] | g u
  681. 257.47 s gammaloop-nextest-integration> --numerator-grouping group_identical_graphs_up_to_scalar_rescaling
  682. 257.47 s gammaloop-nextest-integration> --max-n-bridges 0
  683. 257.47 s gammaloop-nextest-integration> --number-of-factorized-loop-subtopologies 1 1
  684. 257.47 s gammaloop-nextest-integration> --number-of-anticommutating-loops 1 1
  685. 257.47 s gammaloop-nextest-integration> [...]
  686. 257.47 s gammaloop-nextest-integration> [2026-09-16 22:39:32.809] @feyngen::diagram_... INFO : 0s | Δ=0s | Starting Feynman graph generation with Symbolica...
  687. 257.47 s gammaloop-nextest-integration> [2026-09-16 22:39:32.810] @feyngen::diagram_... INFO : 0s | Δ=0s | Number of graphs resulting from Symbolica generation: 3
  688. 257.47 s gammaloop-nextest-integration> [2026-09-16 22:39:32.811] @feyngen::diagram_... INFO : 0s | Δ=0s | Number of graphs retained after removal of vetoed topologies: 2
  689. 257.47 s gammaloop-nextest-integration> [2026-09-16 22:39:32.814] @feyngen::diagram_... INFO : 0s | Δ=0s | Number of graphs after vertex info assignment: 2
  690. 257.47 s gammaloop-nextest-integration> [2026-09-16 22:39:32.814] @feyngen::diagram_... INFO : 0s | Δ=0s | Number of graphs after all complete graphs filters are applied: 2
  691. 257.47 s gammaloop-nextest-integration> [2026-09-16 22:39:32.817] @feyngen::diagram_... INFO : 0s | Δ=0s | Number of graphs after closed anticommutating chains analysis: 1
  692. 257.47 s gammaloop-nextest-integration> [2026-09-16 22:39:32.817] @feyngen::diagram_... INFO : 0s | Δ=0s | Number of graphs after symmetrization of external states: 1
  693. 257.47 s gammaloop-nextest-integration> [2026-09-16 22:39:32.820] @feyngen::diagram_... INFO : 0s | Δ=0s | Number of graphs after canonization of vertices, edges and flows (graph labels assigned here): 1
  694. 257.47 s gammaloop-nextest-integration> [2026-09-16 22:39:32.845] @feyngen::diagram_... INFO : 0s | Δ=0s | Number of graphs after numerator-aware grouping with strategy 'up to a scalar rescaling': 1 (1 isomorphically unique graph, 0 color zero, 0 lorentz zero, 0 grouped and 0 cancellation)
  695. 257.47 s gammaloop-nextest-integration> [2026-09-16 22:39:32.845] @feyngen::diagram_... INFO : ( Sum of the symmetry factors from each graph generated = -1/2 )
  696. 257.47 s gammaloop-nextest-integration> [2026-09-16 22:39:32.846] @commands::generate INFO : Generated amplitude 1 graphs.
  697. 257.47 s gammaloop-nextest-integration> [2026-09-16 22:39:32.846] @commands::generate INFO : Only diagram generation was requested, skipping integrand generation. You can generate integrands later using the 'generate existing <options>' command.
  698. 257.47 s gammaloop-nextest-integration> [2026-09-16 22:39:32.846] @gammaloop_api::se... INFO : Running command generate
  699. 257.47 s gammaloop-nextest-integration> The application panicked (crashed).
  700. 257.47 s gammaloop-nextest-integration> Message: label _func_power_ not found
  701. 257.47 s gammaloop-nextest-integration> Location: /nix/store/n9w914kh1cm59xx3spcs831cdyb56m32-vendor-cargo-deps/c19b7c6f923b580ac259164a89f2577984ad5ab09ee9d583b888f934adbbe8d0/symjit-2.25.6/src/symjit/assembler.rs:77
  702. 257.47 s gammaloop-nextest-integration>
  703. 257.47 s gammaloop-nextest-integration> ━━━━━━━━━━━━━━━━━━━━━━━━━━━━━━━━━━ BACKTRACE ━━━━━━━━━━━━━━━━━━━━━━━━━━━━━━━━━━━
  704. 257.47 s gammaloop-nextest-integration> 1: <color_eyre[51793ea62743adbd]::config::PanicHook>::panic_report<unknown>
  705. 257.47 s gammaloop-nextest-integration> at <unknown source file>:<unknown line>
  706. 257.47 s gammaloop-nextest-integration> 2: <color_eyre[51793ea62743adbd]::config::PanicHook>::into_panic_hook::{closure#0}<unknown>
  707. 257.47 s gammaloop-nextest-integration> at <unknown source file>:<unknown line>
  708. 257.47 s gammaloop-nextest-integration> 3: std[bcb96dfbba0ab899]::panicking::panic_with_hook<unknown>
  709. 257.47 s gammaloop-nextest-integration> at <unknown source file>:<unknown line>
  710. 257.47 s gammaloop-nextest-integration> 4: std[bcb96dfbba0ab899]::panicking::panic_handler::{closure#0}<unknown>
  711. 257.47 s gammaloop-nextest-integration> at <unknown source file>:<unknown line>
  712. 257.47 s gammaloop-nextest-integration> 5: std[bcb96dfbba0ab899]::sys::backtrace::__rust_end_short_backtrace::<std[bcb96dfbba0ab899]::panicking::panic_handler::{closure#0}, !><unknown>
  713. 257.47 s gammaloop-nextest-integration> at <unknown source file>:<unknown line>
  714. 257.47 s gammaloop-nextest-integration> 6: __rustc[6c289b9f9c454d21]::rust_begin_unwind<unknown>
  715. 257.47 s gammaloop-nextest-integration> at <unknown source file>:<unknown line>
  716. 257.47 s gammaloop-nextest-integration> 7: core[940e698046960fd5]::panicking::panic_fmt<unknown>
  717. 257.47 s gammaloop-nextest-integration> at <unknown source file>:<unknown line>
  718. 257.47 s gammaloop-nextest-integration> 8: <symjit[e408de789c333cd]::symjit::assembler::Assembler>::apply_jumps<unknown>
  719. 257.47 s gammaloop-nextest-integration> at <unknown source file>:<unknown line>
  720. 257.47 s gammaloop-nextest-integration> 9: <symjit[e408de789c333cd]::symjit::builder::Builder>::compile_from_mir::<symjit[e408de789c333cd]::symjit::amd::complex::AmdComplexGenerator><unknown>
  721. 257.47 s gammaloop-nextest-integration> at <unknown source file>:<unknown line>
  722. 257.47 s gammaloop-nextest-integration> 10: <symjit[e408de789c333cd]::symjit::runnable::Application>::compile_ty<unknown>
  723. 257.47 s gammaloop-nextest-integration> at <unknown source file>:<unknown line>
  724. 257.47 s gammaloop-nextest-integration> 11: <symjit[e408de789c333cd]::symjit::runnable::Application>::with_mir<unknown>
  725. 257.47 s gammaloop-nextest-integration> at <unknown source file>:<unknown line>
  726. 257.47 s gammaloop-nextest-integration> 12: <symjit[e408de789c333cd]::symjit::composer::DirectTranslator as symjit[e408de789c333cd]::symjit::composer::Composer>::compile<unknown>
  727. 257.47 s gammaloop-nextest-integration> at <unknown source file>:<unknown line>
  728. 257.47 s gammaloop-nextest-integration> 13: <symjit[e408de789c333cd]::symjit::compiler::Translator as symjit[e408de789c333cd]::symjit::composer::Composer>::compile<unknown>
  729. 257.47 s gammaloop-nextest-integration> at <unknown source file>:<unknown line>
  730. 257.47 s gammaloop-nextest-integration> 14: <numerica[124dab8567f4861e]::domains::float::complex::Complex<f64> as symbolica[10e259bab675d243]::evaluate::backend::JITCompiledNumber>::jit_compile<unknown>
  731. 257.47 s gammaloop-nextest-integration> at <unknown source file>:<unknown line>
  732. 257.47 s gammaloop-nextest-integration> 15: <symbolica[10e259bab675d243]::evaluate::evaluator::ExpressionEvaluator<numerica[124dab8567f4861e]::domains::float::complex::Complex<f64>>>::jit_compile<unknown>
  733. 257.47 s gammaloop-nextest-integration> at <unknown source file>:<unknown line>
  734. 257.47 s gammaloop-nextest-integration> 16: <gammalooprs[917cbd3df9e68f8f]::integrands::process::evaluators::GenericEvaluator>::activate_symjit<unknown>
  735. 257.47 s gammaloop-nextest-integration> at <unknown source file>:<unknown line>
  736. 257.47 s gammaloop-nextest-integration> 17: <gammalooprs[917cbd3df9e68f8f]::integrands::process::amplitude::AmplitudeIntegrand>::prepare_runtime_backends_after_generation_with_compile_times<unknown>
  737. 257.47 s gammaloop-nextest-integration> at <unknown source file>:<unknown line>
  738. 257.47 s gammaloop-nextest-integration> 18: <gammalooprs[917cbd3df9e68f8f]::processes::amplitude::Amplitude>::build_integrand<unknown>
  739. 257.47 s gammaloop-nextest-integration> at <unknown source file>:<unknown line>
  740. 257.47 s gammaloop-nextest-integration> 19: <gammalooprs[917cbd3df9e68f8f]::processes::process::Process>::generate_integrands<unknown>
  741. 257.47 s gammaloop-nextest-integration> at <unknown source file>:<unknown line>
  742. 257.47 s gammaloop-nextest-integration> 20: <gammalooprs[917cbd3df9e68f8f]::processes::ProcessList>::generate_integrands<unknown>
  743. 257.47 s gammaloop-nextest-integration> at <unknown source file>:<unknown line>
  744. 257.47 s gammaloop-nextest-integration> 21: <gammaloop_api[9ebf6628f97aeb57]::state::State>::generate_integrands<unknown>
  745. 257.47 s gammaloop-nextest-integration> at <unknown source file>:<unknown line>
  746. 257.47 s gammaloop-nextest-integration> 22: <gammaloop_api[9ebf6628f97aeb57]::commands::generate::Generate>::run::<&std[bcb96dfbba0ab899]::path::PathBuf><unknown>
  747. 257.47 s gammaloop-nextest-integration> at <unknown source file>:<unknown line>
  748. 257.47 s gammaloop-nextest-integration> 23: <gammaloop_api[9ebf6628f97aeb57]::commands::Commands>::run<unknown>
  749. 257.47 s gammaloop-nextest-integration> at <unknown source file>:<unknown line>
  750. 257.47 s gammaloop-nextest-integration> 24: <gammaloop_api[9ebf6628f97aeb57]::session::CliSession>::execute_prepared<unknown>
  751. 257.47 s gammaloop-nextest-integration> at <unknown source file>:<unknown line>
  752. 257.47 s gammaloop-nextest-integration> 25: <gammaloop_api[9ebf6628f97aeb57]::session::CliSession>::execute_prepared_commands<unknown>
  753. 257.47 s gammaloop-nextest-integration> at <unknown source file>:<unknown line>
  754. 257.47 s gammaloop-nextest-integration> 26: <gammaloop_api[9ebf6628f97aeb57]::session::CliSession>::execute_prepared<unknown>
  755. 257.47 s gammaloop-nextest-integration> at <unknown source file>:<unknown line>
  756. 257.47 s gammaloop-nextest-integration> 27: <gammaloop_api[9ebf6628f97aeb57]::session::CliSession>::execute_command<unknown>
  757. 257.47 s gammaloop-nextest-integration> at <unknown source file>:<unknown line>
  758. 257.47 s gammaloop-nextest-integration> 28: <gammaloop_integration_tests[191607b70c61cd5a]::CLIState>::run_command<unknown>
  759. 257.47 s gammaloop-nextest-integration> at <unknown source file>:<unknown line>
  760. 257.47 s gammaloop-nextest-integration> 29: uv[3c7454ef256d6487]::run_single_integrated_uv_case<unknown>
  761. 257.47 s gammaloop-nextest-integration> at <unknown source file>:<unknown line>
  762. 257.47 s gammaloop-nextest-integration> 30: <uv[3c7454ef256d6487]::thermal_sunrise_uv::{closure#0} as core[940e698046960fd5]::ops::function::FnOnce<()>>::call_once<unknown>
  763. 257.47 s gammaloop-nextest-integration> at <unknown source file>:<unknown line>
  764. 257.47 s gammaloop-nextest-integration> 31: test[75d6903177b1d7e9]::__rust_begin_short_backtrace::<core[940e698046960fd5]::result::Result<(), alloc[2ea6bcb46fca0c42]::string::String>, fn() -> core[940e698046960fd5]::result::Result<(), alloc[2ea6bcb46fca0c42]::string::String>><unknown>
  765. 257.47 s gammaloop-nextest-integration> at <unknown source file>:<unknown line>
  766. 257.47 s gammaloop-nextest-integration> 32: test[75d6903177b1d7e9]::run_test::{closure#0}<unknown>
  767. 257.47 s gammaloop-nextest-integration> at <unknown source file>:<unknown line>
  768. 257.47 s gammaloop-nextest-integration> 33: std[bcb96dfbba0ab899]::sys::backtrace::__rust_begin_short_backtrace::<test[75d6903177b1d7e9]::run_test::{closure#1}, ()><unknown>
  769. 257.47 s gammaloop-nextest-integration> at <unknown source file>:<unknown line>
  770. 257.47 s gammaloop-nextest-integration> 34: <std[bcb96dfbba0ab899]::thread::lifecycle::spawn_unchecked<test[75d6903177b1d7e9]::run_test::{closure#1}, ()>::{closure#1} as core[940e698046960fd5]::ops::function::FnOnce<()>>::call_once::{shim:vtable#0}<unknown>
  771. 257.47 s gammaloop-nextest-integration> at <unknown source file>:<unknown line>
  772. 257.47 s gammaloop-nextest-integration> 35: <std[bcb96dfbba0ab899]::sys::thread::unix::Thread>::new::thread_start<unknown>
  773. 257.47 s gammaloop-nextest-integration> at <unknown source file>:<unknown line>
  774. 257.47 s gammaloop-nextest-integration> 36: start_thread<unknown>
  775. 257.47 s gammaloop-nextest-integration> at <unknown source file>:<unknown line>
  776. 257.47 s gammaloop-nextest-integration> 37: __clone3<unknown>
  777. 257.47 s gammaloop-nextest-integration> at <unknown source file>:<unknown line>
  778. 257.47 s gammaloop-nextest-integration>
  779. 257.47 s gammaloop-nextest-integration> Run with COLORBT_SHOW_HIDDEN=1 environment variable to disable frame filtering.
  780. 257.47 s gammaloop-nextest-integration> Run with RUST_BACKTRACE=full to include source snippets.
  781. 257.47 s gammaloop-nextest-integration> Warning: SpanTrace capture is Unsupported.
  782. 257.47 s gammaloop-nextest-integration> Ensure that you've setup a tracing-error ErrorLayer and the semver versions are compatible
  783. 257.47 s gammaloop-nextest-integration> =========================================
  784. 257.55 s error: Cannot build '/nix/store/4gv70f5250wa678m31ilwxkvjp2lhgng-gammaloop-nextest-integration.drv'.
  785. 257.55 s Reason: builder failed with exit code 100.
  786. 257.55 s Output paths:
  787. 257.55 s /nix/store/gckfrmakan4s1irmj0ynyr2spwwbiqmd-gammaloop-nextest-integration
  788. 257.55 s Last 767 log lines:
  789. 257.55 s > Extracting 13 binaries, 1 build script output directory, and 3 linked paths to /build/nextest-archive-TYYMRs
  790. 257.55 s > Extracted 30 files to /build/nextest-archive-TYYMRs in 2.29s
  791. 257.55 s > ------------
  792. 257.55 s > Nextest run ID 272608ad-6703-4890-9244-2c54ded5bfec with nextest profile: ci_gammaloop
  793. 257.55 s > Starting 170 tests across 13 binaries (209 tests skipped, including 208 tests via profile.ci_gammaloop.default-filter)
  794. 257.55 s > FAIL [ 3.252s] ( 55/170) gammaloop-integration-tests::test_runs aa_aa::important::aa_aa_local_inspect_backend_consistency
  795. 257.55 s > stdout ---
  796. 257.55 s >
  797. 257.55 s > running 1 test
  798. 257.55 s > test aa_aa::important::aa_aa_local_inspect_backend_consistency ... FAILED
  799. 257.55 s >
  800. 257.55 s > failures:
  801. 257.55 s >
  802. 257.55 s > failures:
  803. 257.55 s > aa_aa::important::aa_aa_local_inspect_backend_consistency
  804. 257.55 s >
  805. 257.55 s > test result: FAILED. 0 passed; 1 failed; 0 ignored; 0 measured; 274 filtered out; finished in 3.23s
  806. 257.55 s >
  807. 257.55 s > stderr ---
  808. 257.55 s > [2026-09-16 22:38:29.075] @gammaloop_api::se... INFO : Running command import model sm-default.json
  809. 257.55 s > [2026-09-16 22:38:29.075] @import::model INFO : Loading built-in JSON model sm-default
  810. 257.55 s > [2026-09-16 22:38:29.098] @gammalooprs::model INFO : The following 15 external parameters were forced to zero by the restriction card:
  811. 257.55 s > lamWS, AWS, rhoWS, etaWS, ymc, yme, ymm, MC, Me, MM, WTau, muQ, muLe, muLmu, muLtau
  812. 257.55 s > [2026-09-16 22:38:29.098] @gammalooprs::model INFO : The following 34 vertex rules were removed by the restriction card:
  813. 257.55 s > V_82 -> (c~, d, G+) | V_83 -> (t~, d, G+) | V_84 -> (c~, s, G+) | V_85 -> (t~, s, G+) | V_86 -> (u~, b, G+) | V_87 -> (c~, b, G+) | V_90 -> (c~, d, W+) | V_91 -> (t~, d, W+) | V_92 -> (u~, s, W+) | V_94 -> (t~, s, W+) | V_95 -> (u~, b, W+) | V_96 -> (c~, b, W+) | V_101 -> (e+, e-, G0) | V_102 -> (mu+, mu-, G0) | V_104 -> (e+, e-, H) | V_105 -> (mu+, mu-, H) | V_110 -> (ve~, e-, G+) | V_111 -> (vm~, mu-, G+) | V_116 -> (b~, u, G-) | V_117 -> (d~, c, G-) | V_118 -> (s~, c, G-) | V_119 -> (b~, c, G-) | V_120 -> (d~, t, G-) | V_121 -> (s~, t, G-) | V_124 -> (s~, u, W-) | V_125 -> (b~, u, W-) | V_126 -> (d~, c, W-) | V_128 -> (b~, c, W-) | V_129 -> (d~, t, W-) | V_130 -> (s~, t, W-) | V_138 -> (c~, c, G0) | V_140 -> (c~, c, H) | V_145 -> (e+, ve, G-) | V_146 -> (mu+, vm, G-)
  814. 257.55 s > [2026-09-16 22:38:29.098] @gammalooprs::model INFO : The following 36 couplings were removed by the restriction card:
  815. 257.55 s > GC_13, GC_14, GC_16, GC_17, GC_18, GC_19, GC_20, GC_22, GC_23, GC_24, GC_25, GC_26, GC_28, GC_29, GC_42, GC_43, GC_44, GC_46, GC_47, GC_48, GC_84, GC_85, GC_86, GC_87, GC_88, GC_89, GC_90, GC_91, GC_92, GC_93, GC_101, GC_102, GC_103, GC_105, GC_106, GC_107
  816. 257.55 s > [2026-09-16 22:38:29.099] @gammaloop_api::se... INFO : Running command run set_model_parameters
  817. 257.55 s > [2026-09-16 22:38:29.099] @gammaloop_api::se... INFO : Starting command block set_model_parameters
  818. 257.55 s > [2026-09-16 22:38:29.099] @gammaloop_api::se... INFO : Running command set model MT=173.0
  819. 257.55 s > [2026-09-16 22:38:29.104] @gammaloop_api::se... INFO : Running command set model WT=0.0
  820. 257.55 s > [2026-09-16 22:38:29.109] @gammaloop_api::se... INFO : Running command set model ymt=173.0
  821. 257.55 s > [2026-09-16 22:38:29.114] @gammaloop_api::se... INFO : Running command set model aS=0.118
  822. 257.55 s > [2026-09-16 22:38:29.119] @gammaloop_api::se... INFO : Running command set model aEWM1=137.036
  823. 257.55 s > [2026-09-16 22:38:29.123] @gammaloop_api::se... INFO : Running command set model Gf=1.166390e-05
  824. 257.55 s > [2026-09-16 22:38:29.128] @gammaloop_api::se... INFO : Running command set model MZ=91.188
  825. 257.55 s > [2026-09-16 22:38:29.134] @gammaloop_api::se... INFO : Running command set global string '
  826. 257.55 s > [global.generation.compile]
  827. 257.55 s > compilation_mode = "symjit"
  828. 257.55 s > optimization_level = "O0"
  829. 257.55 s > fast_math = false
  830. 257.55 s > [...]
  831. 257.55 s > [2026-09-16 22:38:29.135] @gammaloop_api::se... INFO : Running command import graphs ./examples/cli/aa_aa/1L/aa_aa_1L.dot -p aa_aa_all_helicities -i 1L_ppmm -o
  832. 257.55 s > [2026-09-16 22:38:29.135] @commands::import INFO : Loading graphs from '/build/source/examples/cli/aa_aa/1L/aa_aa_1L.dot'
  833. 257.55 s > [2026-09-16 22:38:29.146] @gammaloop_api::se... INFO : Running command generate existing -p aa_aa_all_helicities
  834. 257.55 s > The application panicked (crashed).
  835. 257.55 s > Message: label _func_power_ not found
  836. 257.55 s > Location: /nix/store/n9w914kh1cm59xx3spcs831cdyb56m32-vendor-cargo-deps/c19b7c6f923b580ac259164a89f2577984ad5ab09ee9d583b888f934adbbe8d0/symjit-2.25.6/src/symjit/assembler.rs:77
  837. 257.55 s >
  838. 257.55 s > ━━━━━━━━━━━━━━━━━━━━━━━━━━━━━━━━━━ BACKTRACE ━━━━━━━━━━━━━━━━━━━━━━━━━━━━━━━━━━━
  839. 257.55 s > 1: <color_eyre[51793ea62743adbd]::config::PanicHook>::panic_report<unknown>
  840. 257.55 s > at <unknown source file>:<unknown line>
  841. 257.55 s > 2: <color_eyre[51793ea62743adbd]::config::PanicHook>::into_panic_hook::{closure#0}<unknown>
  842. 257.55 s > at <unknown source file>:<unknown line>
  843. 257.55 s > 3: std[bcb96dfbba0ab899]::panicking::panic_with_hook<unknown>
  844. 257.55 s > at <unknown source file>:<unknown line>
  845. 257.55 s > 4: std[bcb96dfbba0ab899]::panicking::panic_handler::{closure#0}<unknown>
  846. 257.55 s > at <unknown source file>:<unknown line>
  847. 257.55 s > 5: std[bcb96dfbba0ab899]::sys::backtrace::__rust_end_short_backtrace::<std[bcb96dfbba0ab899]::panicking::panic_handler::{closure#0}, !><unknown>
  848. 257.55 s > at <unknown source file>:<unknown line>
  849. 257.55 s > 6: __rustc[6c289b9f9c454d21]::rust_begin_unwind<unknown>
  850. 257.55 s > at <unknown source file>:<unknown line>
  851. 257.55 s > 7: core[940e698046960fd5]::panicking::panic_fmt<unknown>
  852. 257.55 s > at <unknown source file>:<unknown line>
  853. 257.55 s > 8: <symjit[e408de789c333cd]::symjit::assembler::Assembler>::apply_jumps<unknown>
  854. 257.55 s > at <unknown source file>:<unknown line>
  855. 257.55 s > 9: <symjit[e408de789c333cd]::symjit::builder::Builder>::compile_from_mir::<symjit[e408de789c333cd]::symjit::amd::complex::AmdComplexGenerator><unknown>
  856. 257.55 s > at <unknown source file>:<unknown line>
  857. 257.55 s > 10: <symjit[e408de789c333cd]::symjit::runnable::Application>::compile_ty<unknown>
  858. 257.55 s > at <unknown source file>:<unknown line>
  859. 257.55 s > 11: <symjit[e408de789c333cd]::symjit::runnable::Application>::with_mir<unknown>
  860. 257.55 s > at <unknown source file>:<unknown line>
  861. 257.55 s > 12: <symjit[e408de789c333cd]::symjit::composer::DirectTranslator as symjit[e408de789c333cd]::symjit::composer::Composer>::compile<unknown>
  862. 257.55 s > at <unknown source file>:<unknown line>
  863. 257.55 s > 13: <symjit[e408de789c333cd]::symjit::compiler::Translator as symjit[e408de789c333cd]::symjit::composer::Composer>::compile<unknown>
  864. 257.55 s > at <unknown source file>:<unknown line>
  865. 257.55 s > 14: <numerica[124dab8567f4861e]::domains::float::complex::Complex<f64> as symbolica[10e259bab675d243]::evaluate::backend::JITCompiledNumber>::jit_compile<unknown>
  866. 257.55 s > at <unknown source file>:<unknown line>
  867. 257.55 s > 15: <symbolica[10e259bab675d243]::evaluate::evaluator::ExpressionEvaluator<numerica[124dab8567f4861e]::domains::float::complex::Complex<f64>>>::jit_compile<unknown>
  868. 257.55 s > at <unknown source file>:<unknown line>
  869. 257.55 s > 16: <gammalooprs[917cbd3df9e68f8f]::integrands::process::evaluators::GenericEvaluator>::activate_symjit<unknown>
  870. 257.55 s > at <unknown source file>:<unknown line>
  871. 257.55 s > 17: <gammalooprs[917cbd3df9e68f8f]::integrands::process::amplitude::AmplitudeIntegrand>::prepare_runtime_backends_after_generation_with_compile_times<unknown>
  872. 257.55 s > at <unknown source file>:<unknown line>
  873. 257.55 s > 18: <gammalooprs[917cbd3df9e68f8f]::processes::amplitude::Amplitude>::build_integrand<unknown>
  874. 257.55 s > at <unknown source file>:<unknown line>
  875. 257.55 s > 19: <gammalooprs[917cbd3df9e68f8f]::processes::process::Process>::generate_integrands<unknown>
  876. 257.55 s > at <unknown source file>:<unknown line>
  877. 257.55 s > 20: <gammaloop_api[9ebf6628f97aeb57]::state::State>::generate_integrand<unknown>
  878. 257.55 s > at <unknown source file>:<unknown line>
  879. 257.55 s > 21: <gammaloop_api[9ebf6628f97aeb57]::commands::generate::Generate>::run::<&std[bcb96dfbba0ab899]::path::PathBuf><unknown>
  880. 257.55 s > at <unknown source file>:<unknown line>
  881. 257.55 s > 22: <gammaloop_api[9ebf6628f97aeb57]::commands::Commands>::run<unknown>
  882. 257.55 s > at <unknown source file>:<unknown line>
  883. 257.55 s > 23: <gammaloop_api[9ebf6628f97aeb57]::session::CliSession>::execute_prepared<unknown>
  884. 257.55 s > at <unknown source file>:<unknown line>
  885. 257.55 s > 24: <gammaloop_api[9ebf6628f97aeb57]::session::CliSession>::execute_command<unknown>
  886. 257.55 s > at <unknown source file>:<unknown line>
  887. 257.55 s > 25: <gammaloop_integration_tests[191607b70c61cd5a]::CLIState>::run_command<unknown>
  888. 257.55 s > at <unknown source file>:<unknown line>
  889. 257.55 s > 26: test_runs[9b7e2dc2dc4f29b0]::aa_aa::generate_aa_aa_helicity_family<unknown>
  890. 257.55 s > at <unknown source file>:<unknown line>
  891. 257.55 s > 27: <test_runs[9b7e2dc2dc4f29b0]::aa_aa::important::aa_aa_local_inspect_backend_consistency::{closure#0} as core[940e698046960fd5]::ops::function::FnOnce<()>>::call_once<unknown>
  892. 257.55 s > at <unknown source file>:<unknown line>
  893. 257.55 s > 28: serial_test[cd99724524a2f1c0]::serial_code_lock::local_serial_core_with_return::<(), eyre[cb2fd339c0c40fca]::Report><unknown>
  894. 257.55 s > at <unknown source file>:<unknown line>
  895. 257.55 s > 29: <test_runs[9b7e2dc2dc4f29b0]::aa_aa::important::aa_aa_local_inspect_backend_consistency::{closure#0} as core[940e698046960fd5]::ops::function::FnOnce<()>>::call_once<unknown>
  896. 257.55 s > at <unknown source file>:<unknown line>
  897. 257.55 s > 30: test[75d6903177b1d7e9]::__rust_begin_short_backtrace::<core[940e698046960fd5]::result::Result<(), alloc[2ea6bcb46fca0c42]::string::String>, fn() -> core[940e698046960fd5]::result::Result<(), alloc[2ea6bcb46fca0c42]::string::String>><unknown>
  898. 257.55 s > at <unknown source file>:<unknown line>
  899. 257.55 s > 31: test[75d6903177b1d7e9]::run_test::{closure#0}<unknown>
  900. 257.55 s > at <unknown source file>:<unknown line>
  901. 257.55 s > 32: std[bcb96dfbba0ab899]::sys::backtrace::__rust_begin_short_backtrace::<test[75d6903177b1d7e9]::run_test::{closure#1}, ()><unknown>
  902. 257.55 s > at <unknown source file>:<unknown line>
  903. 257.55 s > 33: <std[bcb96dfbba0ab899]::thread::lifecycle::spawn_unchecked<test[75d6903177b1d7e9]::run_test::{closure#1}, ()>::{closure#1} as core[940e698046960fd5]::ops::function::FnOnce<()>>::call_once::{shim:vtable#0}<unknown>
  904. 257.55 s > at <unknown source file>:<unknown line>
  905. 257.55 s > 34: <std[bcb96dfbba0ab899]::sys::thread::unix::Thread>::new::thread_start<unknown>
  906. 257.55 s > at <unknown source file>:<unknown line>
  907. 257.55 s > 35: start_thread<unknown>
  908. 257.55 s > at <unknown source file>:<unknown line>
  909. 257.55 s > 36: __clone3<unknown>
  910. 257.55 s > at <unknown source file>:<unknown line>
  911. 257.55 s >
  912. 257.55 s > Run with COLORBT_SHOW_HIDDEN=1 environment variable to disable frame filtering.
  913. 257.55 s > Run with RUST_BACKTRACE=full to include source snippets.
  914. 257.55 s > Warning: SpanTrace capture is Unsupported.
  915. 257.55 s > Ensure that you've setup a tracing-error ErrorLayer and the semver versions are compatible
  916. 257.55 s >
  917. 257.55 s > FAIL [ 4.721s] (159/170) gammaloop-integration-tests::uv thermal_sunrise_uv
  918. 257.55 s > stdout ---
  919. 257.55 s >
  920. 257.55 s > running 1 test
  921. 257.55 s > test thermal_sunrise_uv ... FAILED
  922. 257.55 s >
  923. 257.55 s > failures:
  924. 257.55 s >
  925. 257.55 s > failures:
  926. 257.55 s > thermal_sunrise_uv
  927. 257.55 s >
  928. 257.55 s > test result: FAILED. 0 passed; 1 failed; 0 ignored; 0 measured; 31 filtered out; finished in 4.70s
  929. 257.55 s >
  930. 257.55 s > stderr ---
  931. 257.55 s > [2026-09-16 22:39:32.781] @gammaloop_api::se... INFO : Running command run generate
  932. 257.55 s > [2026-09-16 22:39:32.781] @gammaloop_api::se... INFO : Starting command block generate
  933. 257.55 s > [2026-09-16 22:39:32.781] @gammaloop_api::se... INFO : Running command import model sm-default.json
  934. 257.55 s > [2026-09-16 22:39:32.781] @import::model INFO : Loading built-in JSON model sm-default
  935. 257.55 s > [2026-09-16 22:39:32.808] @gammalooprs::model INFO : The following 15 external parameters were forced to zero by the restriction card:
  936. 257.55 s > lamWS, AWS, rhoWS, etaWS, ymc, yme, ymm, MC, Me, MM, WTau, muQ, muLe, muLmu, muLtau
  937. 257.55 s > [2026-09-16 22:39:32.808] @gammalooprs::model INFO : The following 34 vertex rules were removed by the restriction card:
  938. 257.55 s > V_82 -> (c~, d, G+) | V_83 -> (t~, d, G+) | V_84 -> (c~, s, G+) | V_85 -> (t~, s, G+) | V_86 -> (u~, b, G+) | V_87 -> (c~, b, G+) | V_90 -> (c~, d, W+) | V_91 -> (t~, d, W+) | V_92 -> (u~, s, W+) | V_94 -> (t~, s, W+) | V_95 -> (u~, b, W+) | V_96 -> (c~, b, W+) | V_101 -> (e+, e-, G0) | V_102 -> (mu+, mu-, G0) | V_104 -> (e+, e-, H) | V_105 -> (mu+, mu-, H) | V_110 -> (ve~, e-, G+) | V_111 -> (vm~, mu-, G+) | V_116 -> (b~, u, G-) | V_117 -> (d~, c, G-) | V_118 -> (s~, c, G-) | V_119 -> (b~, c, G-) | V_120 -> (d~, t, G-) | V_121 -> (s~, t, G-) | V_124 -> (s~, u, W-) | V_125 -> (b~, u, W-) | V_126 -> (d~, c, W-) | V_128 -> (b~, c, W-) | V_129 -> (d~, t, W-) | V_130 -> (s~, t, W-) | V_138 -> (c~, c, G0) | V_140 -> (c~, c, H) | V_145 -> (e+, ve, G-) | V_146 -> (mu+, vm, G-)
  939. 257.55 s > [2026-09-16 22:39:32.808] @gammalooprs::model INFO : The following 36 couplings were removed by the restriction card:
  940. 257.55 s > GC_13, GC_14, GC_16, GC_17, GC_18, GC_19, GC_20, GC_22, GC_23, GC_24, GC_25, GC_26, GC_28, GC_29, GC_42, GC_43, GC_44, GC_46, GC_47, GC_48, GC_84, GC_85, GC_86, GC_87, GC_88, GC_89, GC_90, GC_91, GC_92, GC_93, GC_101, GC_102, GC_103, GC_105, GC_106, GC_107
  941. 257.55 s > [2026-09-16 22:39:32.808] @gammaloop_api::se... INFO : Running command remove processes
  942. 257.55 s > [2026-09-16 22:39:32.808] @gammaloop_api::se... INFO : Running command generate amp {} > {} [{2}] | g u
  943. 257.55 s > --numerator-grouping group_identical_graphs_up_to_scalar_rescaling
  944. 257.55 s > --max-n-bridges 0
  945. 257.55 s > --number-of-factorized-loop-subtopologies 1 1
  946. 257.55 s > --number-of-anticommutating-loops 1 1
  947. 257.55 s > [...]
  948. 257.55 s > [2026-09-16 22:39:32.809] @feyngen::diagram_... INFO : 0s | Δ=0s | Starting Feynman graph generation with Symbolica...
  949. 257.55 s > [2026-09-16 22:39:32.810] @feyngen::diagram_... INFO : 0s | Δ=0s | Number of graphs resulting from Symbolica generation: 3
  950. 257.55 s > [2026-09-16 22:39:32.811] @feyngen::diagram_... INFO : 0s | Δ=0s | Number of graphs retained after removal of vetoed topologies: 2
  951. 257.55 s > [2026-09-16 22:39:32.814] @feyngen::diagram_... INFO : 0s | Δ=0s | Number of graphs after vertex info assignment: 2
  952. 257.55 s > [2026-09-16 22:39:32.814] @feyngen::diagram_... INFO : 0s | Δ=0s | Number of graphs after all complete graphs filters are applied: 2
  953. 257.55 s > [2026-09-16 22:39:32.817] @feyngen::diagram_... INFO : 0s | Δ=0s | Number of graphs after closed anticommutating chains analysis: 1
  954. 257.55 s > [2026-09-16 22:39:32.817] @feyngen::diagram_... INFO : 0s | Δ=0s | Number of graphs after symmetrization of external states: 1
  955. 257.55 s > [2026-09-16 22:39:32.820] @feyngen::diagram_... INFO : 0s | Δ=0s | Number of graphs after canonization of vertices, edges and flows (graph labels assigned here): 1
  956. 257.55 s > [2026-09-16 22:39:32.845] @feyngen::diagram_... INFO : 0s | Δ=0s | Number of graphs after numerator-aware grouping with strategy 'up to a scalar rescaling': 1 (1 isomorphically unique graph, 0 color zero, 0 lorentz zero, 0 grouped and 0 cancellation)
  957. 257.55 s > [2026-09-16 22:39:32.845] @feyngen::diagram_... INFO : ( Sum of the symmetry factors from each graph generated = -1/2 )
  958. 257.55 s > [2026-09-16 22:39:32.846] @commands::generate INFO : Generated amplitude 1 graphs.
  959. 257.55 s > [2026-09-16 22:39:32.846] @commands::generate INFO : Only diagram generation was requested, skipping integrand generation. You can generate integrands later using the 'generate existing <options>' command.
  960. 257.55 s > [2026-09-16 22:39:32.846] @gammaloop_api::se... INFO : Running command generate
  961. 257.55 s > The application panicked (crashed).
  962. 257.55 s > Message: label _func_power_ not found
  963. 257.55 s > Location: /nix/store/n9w914kh1cm59xx3spcs831cdyb56m32-vendor-cargo-deps/c19b7c6f923b580ac259164a89f2577984ad5ab09ee9d583b888f934adbbe8d0/symjit-2.25.6/src/symjit/assembler.rs:77
  964. 257.55 s >
  965. 257.55 s > ━━━━━━━━━━━━━━━━━━━━━━━━━━━━━━━━━━ BACKTRACE ━━━━━━━━━━━━━━━━━━━━━━━━━━━━━━━━━━━
  966. 257.55 s > 1: <color_eyre[51793ea62743adbd]::config::PanicHook>::panic_report<unknown>
  967. 257.55 s > at <unknown source file>:<unknown line>
  968. 257.55 s > 2: <color_eyre[51793ea62743adbd]::config::PanicHook>::into_panic_hook::{closure#0}<unknown>
  969. 257.55 s > at <unknown source file>:<unknown line>
  970. 257.55 s > 3: std[bcb96dfbba0ab899]::panicking::panic_with_hook<unknown>
  971. 257.55 s > at <unknown source file>:<unknown line>
  972. 257.55 s > 4: std[bcb96dfbba0ab899]::panicking::panic_handler::{closure#0}<unknown>
  973. 257.55 s > at <unknown source file>:<unknown line>
  974. 257.55 s > 5: std[bcb96dfbba0ab899]::sys::backtrace::__rust_end_short_backtrace::<std[bcb96dfbba0ab899]::panicking::panic_handler::{closure#0}, !><unknown>
  975. 257.55 s > at <unknown source file>:<unknown line>
  976. 257.55 s > 6: __rustc[6c289b9f9c454d21]::rust_begin_unwind<unknown>
  977. 257.55 s > at <unknown source file>:<unknown line>
  978. 257.55 s > 7: core[940e698046960fd5]::panicking::panic_fmt<unknown>
  979. 257.55 s > at <unknown source file>:<unknown line>
  980. 257.55 s > 8: <symjit[e408de789c333cd]::symjit::assembler::Assembler>::apply_jumps<unknown>
  981. 257.55 s > at <unknown source file>:<unknown line>
  982. 257.55 s > 9: <symjit[e408de789c333cd]::symjit::builder::Builder>::compile_from_mir::<symjit[e408de789c333cd]::symjit::amd::complex::AmdComplexGenerator><unknown>
  983. 257.55 s > at <unknown source file>:<unknown line>
  984. 257.55 s > 10: <symjit[e408de789c333cd]::symjit::runnable::Application>::compile_ty<unknown>
  985. 257.55 s > at <unknown source file>:<unknown line>
  986. 257.55 s > 11: <symjit[e408de789c333cd]::symjit::runnable::Application>::with_mir<unknown>
  987. 257.55 s > at <unknown source file>:<unknown line>
  988. 257.55 s > 12: <symjit[e408de789c333cd]::symjit::composer::DirectTranslator as symjit[e408de789c333cd]::symjit::composer::Composer>::compile<unknown>
  989. 257.55 s > at <unknown source file>:<unknown line>
  990. 257.55 s > 13: <symjit[e408de789c333cd]::symjit::compiler::Translator as symjit[e408de789c333cd]::symjit::composer::Composer>::compile<unknown>
  991. 257.55 s > at <unknown source file>:<unknown line>
  992. 257.55 s > 14: <numerica[124dab8567f4861e]::domains::float::complex::Complex<f64> as symbolica[10e259bab675d243]::evaluate::backend::JITCompiledNumber>::jit_compile<unknown>
  993. 257.55 s > at <unknown source file>:<unknown line>
  994. 257.55 s > 15: <symbolica[10e259bab675d243]::evaluate::evaluator::ExpressionEvaluator<numerica[124dab8567f4861e]::domains::float::complex::Complex<f64>>>::jit_compile<unknown>
  995. 257.55 s > at <unknown source file>:<unknown line>
  996. 257.55 s > 16: <gammalooprs[917cbd3df9e68f8f]::integrands::process::evaluators::GenericEvaluator>::activate_symjit<unknown>
  997. 257.55 s > at <unknown source file>:<unknown line>
  998. 257.55 s > 17: <gammalooprs[917cbd3df9e68f8f]::integrands::process::amplitude::AmplitudeIntegrand>::prepare_runtime_backends_after_generation_with_compile_times<unknown>
  999. 257.55 s > at <unknown source file>:<unknown line>
  1000. 257.55 s > 18: <gammalooprs[917cbd3df9e68f8f]::processes::amplitude::Amplitude>::build_integrand<unknown>
  1001. 257.55 s > at <unknown source file>:<unknown line>
  1002. 257.55 s > 19: <gammalooprs[917cbd3df9e68f8f]::processes::process::Process>::generate_integrands<unknown>
  1003. 257.55 s > at <unknown source file>:<unknown line>
  1004. 257.55 s > 20: <gammalooprs[917cbd3df9e68f8f]::processes::ProcessList>::generate_integrands<unknown>
  1005. 257.55 s > at <unknown source file>:<unknown line>
  1006. 257.55 s > 21: <gammaloop_api[9ebf6628f97aeb57]::state::State>::generate_integrands<unknown>
  1007. 257.55 s > at <unknown source file>:<unknown line>
  1008. 257.55 s > 22: <gammaloop_api[9ebf6628f97aeb57]::commands::generate::Generate>::run::<&std[bcb96dfbba0ab899]::path::PathBuf><unknown>
  1009. 257.55 s > at <unknown source file>:<unknown line>
  1010. 257.55 s > 23: <gammaloop_api[9ebf6628f97aeb57]::commands::Commands>::run<unknown>
  1011. 257.55 s > at <unknown source file>:<unknown line>
  1012. 257.55 s > 24: <gammaloop_api[9ebf6628f97aeb57]::session::CliSession>::execute_prepared<unknown>
  1013. 257.55 s > at <unknown source file>:<unknown line>
  1014. 257.55 s > 25: <gammaloop_api[9ebf6628f97aeb57]::session::CliSession>::execute_prepared_commands<unknown>
  1015. 257.55 s > at <unknown source file>:<unknown line>
  1016. 257.55 s > 26: <gammaloop_api[9ebf6628f97aeb57]::session::CliSession>::execute_prepared<unknown>
  1017. 257.55 s > at <unknown source file>:<unknown line>
  1018. 257.55 s > 27: <gammaloop_api[9ebf6628f97aeb57]::session::CliSession>::execute_command<unknown>
  1019. 257.55 s > at <unknown source file>:<unknown line>
  1020. 257.55 s > 28: <gammaloop_integration_tests[191607b70c61cd5a]::CLIState>::run_command<unknown>
  1021. 257.55 s > at <unknown source file>:<unknown line>
  1022. 257.55 s > 29: uv[3c7454ef256d6487]::run_single_integrated_uv_case<unknown>
  1023. 257.55 s > at <unknown source file>:<unknown line>
  1024. 257.55 s > 30: <uv[3c7454ef256d6487]::thermal_sunrise_uv::{closure#0} as core[940e698046960fd5]::ops::function::FnOnce<()>>::call_once<unknown>
  1025. 257.55 s > at <unknown source file>:<unknown line>
  1026. 257.55 s > 31: test[75d6903177b1d7e9]::__rust_begin_short_backtrace::<core[940e698046960fd5]::result::Result<(), alloc[2ea6bcb46fca0c42]::string::String>, fn() -> core[940e698046960fd5]::result::Result<(), alloc[2ea6bcb46fca0c42]::string::String>><unknown>
  1027. 257.55 s > at <unknown source file>:<unknown line>
  1028. 257.55 s > 32: test[75d6903177b1d7e9]::run_test::{closure#0}<unknown>
  1029. 257.55 s > at <unknown source file>:<unknown line>
  1030. 257.55 s > 33: std[bcb96dfbba0ab899]::sys::backtrace::__rust_begin_short_backtrace::<test[75d6903177b1d7e9]::run_test::{closure#1}, ()><unknown>
  1031. 257.55 s > at <unknown source file>:<unknown line>
  1032. 257.55 s > 34: <std[bcb96dfbba0ab899]::thread::lifecycle::spawn_unchecked<test[75d6903177b1d7e9]::run_test::{closure#1}, ()>::{closure#1} as core[940e698046960fd5]::ops::function::FnOnce<()>>::call_once::{shim:vtable#0}<unknown>
  1033. 257.55 s > at <unknown source file>:<unknown line>
  1034. 257.55 s > 35: <std[bcb96dfbba0ab899]::sys::thread::unix::Thread>::new::thread_start<unknown>
  1035. 257.55 s > at <unknown source file>:<unknown line>
  1036. 257.55 s > 36: start_thread<unknown>
  1037. 257.55 s > at <unknown source file>:<unknown line>
  1038. 257.55 s > 37: __clone3<unknown>
  1039. 257.55 s > at <unknown source file>:<unknown line>
  1040. 257.55 s >
  1041. 257.55 s > Run with COLORBT_SHOW_HIDDEN=1 environment variable to disable frame filtering.
  1042. 257.55 s > Run with RUST_BACKTRACE=full to include source snippets.
  1043. 257.55 s > Warning: SpanTrace capture is Unsupported.
  1044. 257.55 s > Ensure that you've setup a tracing-error ErrorLayer and the semver versions are compatible
  1045. 257.55 s >
  1046. 257.55 s > ------------
  1047. 257.55 s > Summary [ 232.283s] 170 tests run: 168 passed, 2 failed, 209 skipped
  1048. 257.55 s > FAIL [ 3.252s] ( 55/170) gammaloop-integration-tests::test_runs aa_aa::important::aa_aa_local_inspect_backend_consistency
  1049. 257.55 s > stdout ---
  1050. 257.55 s >
  1051. 257.55 s > running 1 test
  1052. 257.55 s > test aa_aa::important::aa_aa_local_inspect_backend_consistency ... FAILED
  1053. 257.55 s >
  1054. 257.55 s > failures:
  1055. 257.55 s >
  1056. 257.55 s > failures:
  1057. 257.55 s > aa_aa::important::aa_aa_local_inspect_backend_consistency
  1058. 257.55 s >
  1059. 257.55 s > test result: FAILED. 0 passed; 1 failed; 0 ignored; 0 measured; 274 filtered out; finished in 3.23s
  1060. 257.55 s >
  1061. 257.55 s > stderr ---
  1062. 257.55 s > [2026-09-16 22:38:29.075] @gammaloop_api::se... INFO : Running command import model sm-default.json
  1063. 257.55 s > [2026-09-16 22:38:29.075] @import::model INFO : Loading built-in JSON model sm-default
  1064. 257.55 s > [2026-09-16 22:38:29.098] @gammalooprs::model INFO : The following 15 external parameters were forced to zero by the restriction card:
  1065. 257.55 s > lamWS, AWS, rhoWS, etaWS, ymc, yme, ymm, MC, Me, MM, WTau, muQ, muLe, muLmu, muLtau
  1066. 257.55 s > [2026-09-16 22:38:29.098] @gammalooprs::model INFO : The following 34 vertex rules were removed by the restriction card:
  1067. 257.55 s > V_82 -> (c~, d, G+) | V_83 -> (t~, d, G+) | V_84 -> (c~, s, G+) | V_85 -> (t~, s, G+) | V_86 -> (u~, b, G+) | V_87 -> (c~, b, G+) | V_90 -> (c~, d, W+) | V_91 -> (t~, d, W+) | V_92 -> (u~, s, W+) | V_94 -> (t~, s, W+) | V_95 -> (u~, b, W+) | V_96 -> (c~, b, W+) | V_101 -> (e+, e-, G0) | V_102 -> (mu+, mu-, G0) | V_104 -> (e+, e-, H) | V_105 -> (mu+, mu-, H) | V_110 -> (ve~, e-, G+) | V_111 -> (vm~, mu-, G+) | V_116 -> (b~, u, G-) | V_117 -> (d~, c, G-) | V_118 -> (s~, c, G-) | V_119 -> (b~, c, G-) | V_120 -> (d~, t, G-) | V_121 -> (s~, t, G-) | V_124 -> (s~, u, W-) | V_125 -> (b~, u, W-) | V_126 -> (d~, c, W-) | V_128 -> (b~, c, W-) | V_129 -> (d~, t, W-) | V_130 -> (s~, t, W-) | V_138 -> (c~, c, G0) | V_140 -> (c~, c, H) | V_145 -> (e+, ve, G-) | V_146 -> (mu+, vm, G-)
  1068. 257.55 s > [2026-09-16 22:38:29.098] @gammalooprs::model INFO : The following 36 couplings were removed by the restriction card:
  1069. 257.55 s > GC_13, GC_14, GC_16, GC_17, GC_18, GC_19, GC_20, GC_22, GC_23, GC_24, GC_25, GC_26, GC_28, GC_29, GC_42, GC_43, GC_44, GC_46, GC_47, GC_48, GC_84, GC_85, GC_86, GC_87, GC_88, GC_89, GC_90, GC_91, GC_92, GC_93, GC_101, GC_102, GC_103, GC_105, GC_106, GC_107
  1070. 257.55 s > [2026-09-16 22:38:29.099] @gammaloop_api::se... INFO : Running command run set_model_parameters
  1071. 257.55 s > [2026-09-16 22:38:29.099] @gammaloop_api::se... INFO : Starting command block set_model_parameters
  1072. 257.55 s > [2026-09-16 22:38:29.099] @gammaloop_api::se... INFO : Running command set model MT=173.0
  1073. 257.55 s > [2026-09-16 22:38:29.104] @gammaloop_api::se... INFO : Running command set model WT=0.0
  1074. 257.55 s > [2026-09-16 22:38:29.109] @gammaloop_api::se... INFO : Running command set model ymt=173.0
  1075. 257.55 s > [2026-09-16 22:38:29.114] @gammaloop_api::se... INFO : Running command set model aS=0.118
  1076. 257.55 s > [2026-09-16 22:38:29.119] @gammaloop_api::se... INFO : Running command set model aEWM1=137.036
  1077. 257.55 s > [2026-09-16 22:38:29.123] @gammaloop_api::se... INFO : Running command set model Gf=1.166390e-05
  1078. 257.55 s > [2026-09-16 22:38:29.128] @gammaloop_api::se... INFO : Running command set model MZ=91.188
  1079. 257.55 s > [2026-09-16 22:38:29.134] @gammaloop_api::se... INFO : Running command set global string '
  1080. 257.55 s > [global.generation.compile]
  1081. 257.55 s > compilation_mode = "symjit"
  1082. 257.55 s > optimization_level = "O0"
  1083. 257.55 s > fast_math = false
  1084. 257.55 s > [...]
  1085. 257.55 s > [2026-09-16 22:38:29.135] @gammaloop_api::se... INFO : Running command import graphs ./examples/cli/aa_aa/1L/aa_aa_1L.dot -p aa_aa_all_helicities -i 1L_ppmm -o
  1086. 257.55 s > [2026-09-16 22:38:29.135] @commands::import INFO : Loading graphs from '/build/source/examples/cli/aa_aa/1L/aa_aa_1L.dot'
  1087. 257.55 s > [2026-09-16 22:38:29.146] @gammaloop_api::se... INFO : Running command generate existing -p aa_aa_all_helicities
  1088. 257.55 s > The application panicked (crashed).
  1089. 257.55 s > Message: label _func_power_ not found
  1090. 257.55 s > Location: /nix/store/n9w914kh1cm59xx3spcs831cdyb56m32-vendor-cargo-deps/c19b7c6f923b580ac259164a89f2577984ad5ab09ee9d583b888f934adbbe8d0/symjit-2.25.6/src/symjit/assembler.rs:77
  1091. 257.55 s >
  1092. 257.55 s > ━━━━━━━━━━━━━━━━━━━━━━━━━━━━━━━━━━ BACKTRACE ━━━━━━━━━━━━━━━━━━━━━━━━━━━━━━━━━━━
  1093. 257.55 s > 1: <color_eyre[51793ea62743adbd]::config::PanicHook>::panic_report<unknown>
  1094. 257.55 s > at <unknown source file>:<unknown line>
  1095. 257.55 s > 2: <color_eyre[51793ea62743adbd]::config::PanicHook>::into_panic_hook::{closure#0}<unknown>
  1096. 257.55 s > at <unknown source file>:<unknown line>
  1097. 257.55 s > 3: std[bcb96dfbba0ab899]::panicking::panic_with_hook<unknown>
  1098. 257.55 s > at <unknown source file>:<unknown line>
  1099. 257.55 s > 4: std[bcb96dfbba0ab899]::panicking::panic_handler::{closure#0}<unknown>
  1100. 257.55 s > at <unknown source file>:<unknown line>
  1101. 257.55 s > 5: std[bcb96dfbba0ab899]::sys::backtrace::__rust_end_short_backtrace::<std[bcb96dfbba0ab899]::panicking::panic_handler::{closure#0}, !><unknown>
  1102. 257.55 s > at <unknown source file>:<unknown line>
  1103. 257.55 s > 6: __rustc[6c289b9f9c454d21]::rust_begin_unwind<unknown>
  1104. 257.55 s > at <unknown source file>:<unknown line>
  1105. 257.55 s > 7: core[940e698046960fd5]::panicking::panic_fmt<unknown>
  1106. 257.55 s > at <unknown source file>:<unknown line>
  1107. 257.55 s > 8: <symjit[e408de789c333cd]::symjit::assembler::Assembler>::apply_jumps<unknown>
  1108. 257.55 s > at <unknown source file>:<unknown line>
  1109. 257.55 s > 9: <symjit[e408de789c333cd]::symjit::builder::Builder>::compile_from_mir::<symjit[e408de789c333cd]::symjit::amd::complex::AmdComplexGenerator><unknown>
  1110. 257.55 s > at <unknown source file>:<unknown line>
  1111. 257.55 s > 10: <symjit[e408de789c333cd]::symjit::runnable::Application>::compile_ty<unknown>
  1112. 257.55 s > at <unknown source file>:<unknown line>
  1113. 257.55 s > 11: <symjit[e408de789c333cd]::symjit::runnable::Application>::with_mir<unknown>
  1114. 257.55 s > at <unknown source file>:<unknown line>
  1115. 257.55 s > 12: <symjit[e408de789c333cd]::symjit::composer::DirectTranslator as symjit[e408de789c333cd]::symjit::composer::Composer>::compile<unknown>
  1116. 257.55 s > at <unknown source file>:<unknown line>
  1117. 257.55 s > 13: <symjit[e408de789c333cd]::symjit::compiler::Translator as symjit[e408de789c333cd]::symjit::composer::Composer>::compile<unknown>
  1118. 257.55 s > at <unknown source file>:<unknown line>
  1119. 257.55 s > 14: <numerica[124dab8567f4861e]::domains::float::complex::Complex<f64> as symbolica[10e259bab675d243]::evaluate::backend::JITCompiledNumber>::jit_compile<unknown>
  1120. 257.55 s > at <unknown source file>:<unknown line>
  1121. 257.55 s > 15: <symbolica[10e259bab675d243]::evaluate::evaluator::ExpressionEvaluator<numerica[124dab8567f4861e]::domains::float::complex::Complex<f64>>>::jit_compile<unknown>
  1122. 257.55 s > at <unknown source file>:<unknown line>
  1123. 257.55 s > 16: <gammalooprs[917cbd3df9e68f8f]::integrands::process::evaluators::GenericEvaluator>::activate_symjit<unknown>
  1124. 257.55 s > at <unknown source file>:<unknown line>
  1125. 257.55 s > 17: <gammalooprs[917cbd3df9e68f8f]::integrands::process::amplitude::AmplitudeIntegrand>::prepare_runtime_backends_after_generation_with_compile_times<unknown>
  1126. 257.55 s > at <unknown source file>:<unknown line>
  1127. 257.55 s > 18: <gammalooprs[917cbd3df9e68f8f]::processes::amplitude::Amplitude>::build_integrand<unknown>
  1128. 257.55 s > at <unknown source file>:<unknown line>
  1129. 257.55 s > 19: <gammalooprs[917cbd3df9e68f8f]::processes::process::Process>::generate_integrands<unknown>
  1130. 257.55 s > at <unknown source file>:<unknown line>
  1131. 257.55 s > 20: <gammaloop_api[9ebf6628f97aeb57]::state::State>::generate_integrand<unknown>
  1132. 257.55 s > at <unknown source file>:<unknown line>
  1133. 257.55 s > 21: <gammaloop_api[9ebf6628f97aeb57]::commands::generate::Generate>::run::<&std[bcb96dfbba0ab899]::path::PathBuf><unknown>
  1134. 257.55 s > at <unknown source file>:<unknown line>
  1135. 257.55 s > 22: <gammaloop_api[9ebf6628f97aeb57]::commands::Commands>::run<unknown>
  1136. 257.55 s > at <unknown source file>:<unknown line>
  1137. 257.55 s > 23: <gammaloop_api[9ebf6628f97aeb57]::session::CliSession>::execute_prepared<unknown>
  1138. 257.55 s > at <unknown source file>:<unknown line>
  1139. 257.55 s > 24: <gammaloop_api[9ebf6628f97aeb57]::session::CliSession>::execute_command<unknown>
  1140. 257.55 s > at <unknown source file>:<unknown line>
  1141. 257.55 s > 25: <gammaloop_integration_tests[191607b70c61cd5a]::CLIState>::run_command<unknown>
  1142. 257.55 s > at <unknown source file>:<unknown line>
  1143. 257.55 s > 26: test_runs[9b7e2dc2dc4f29b0]::aa_aa::generate_aa_aa_helicity_family<unknown>
  1144. 257.55 s > at <unknown source file>:<unknown line>
  1145. 257.55 s > 27: <test_runs[9b7e2dc2dc4f29b0]::aa_aa::important::aa_aa_local_inspect_backend_consistency::{closure#0} as core[940e698046960fd5]::ops::function::FnOnce<()>>::call_once<unknown>
  1146. 257.55 s > at <unknown source file>:<unknown line>
  1147. 257.55 s > 28: serial_test[cd99724524a2f1c0]::serial_code_lock::local_serial_core_with_return::<(), eyre[cb2fd339c0c40fca]::Report><unknown>
  1148. 257.55 s > at <unknown source file>:<unknown line>
  1149. 257.55 s > 29: <test_runs[9b7e2dc2dc4f29b0]::aa_aa::important::aa_aa_local_inspect_backend_consistency::{closure#0} as core[940e698046960fd5]::ops::function::FnOnce<()>>::call_once<unknown>
  1150. 257.55 s > at <unknown source file>:<unknown line>
  1151. 257.55 s > 30: test[75d6903177b1d7e9]::__rust_begin_short_backtrace::<core[940e698046960fd5]::result::Result<(), alloc[2ea6bcb46fca0c42]::string::String>, fn() -> core[940e698046960fd5]::result::Result<(), alloc[2ea6bcb46fca0c42]::string::String>><unknown>
  1152. 257.55 s > at <unknown source file>:<unknown line>
  1153. 257.55 s > 31: test[75d6903177b1d7e9]::run_test::{closure#0}<unknown>
  1154. 257.55 s > at <unknown source file>:<unknown line>
  1155. 257.55 s > 32: std[bcb96dfbba0ab899]::sys::backtrace::__rust_begin_short_backtrace::<test[75d6903177b1d7e9]::run_test::{closure#1}, ()><unknown>
  1156. 257.55 s > at <unknown source file>:<unknown line>
  1157. 257.55 s > 33: <std[bcb96dfbba0ab899]::thread::lifecycle::spawn_unchecked<test[75d6903177b1d7e9]::run_test::{closure#1}, ()>::{closure#1} as core[940e698046960fd5]::ops::function::FnOnce<()>>::call_once::{shim:vtable#0}<unknown>
  1158. 257.55 s > at <unknown source file>:<unknown line>
  1159. 257.55 s > 34: <std[bcb96dfbba0ab899]::sys::thread::unix::Thread>::new::thread_start<unknown>
  1160. 257.55 s > at <unknown source file>:<unknown line>
  1161. 257.55 s > 35: start_thread<unknown>
  1162. 257.55 s > at <unknown source file>:<unknown line>
  1163. 257.55 s > 36: __clone3<unknown>
  1164. 257.55 s > at <unknown source file>:<unknown line>
  1165. 257.55 s >
  1166. 257.55 s > Run with COLORBT_SHOW_HIDDEN=1 environment variable to disable frame filtering.
  1167. 257.55 s > Run with RUST_BACKTRACE=full to include source snippets.
  1168. 257.55 s > Warning: SpanTrace capture is Unsupported.
  1169. 257.55 s > Ensure that you've setup a tracing-error ErrorLayer and the semver versions are compatible
  1170. 257.55 s >
  1171. 257.55 s > FAIL [ 4.721s] (159/170) gammaloop-integration-tests::uv thermal_sunrise_uv
  1172. 257.55 s > stdout ---
  1173. 257.55 s >
  1174. 257.55 s > running 1 test
  1175. 257.55 s > test thermal_sunrise_uv ... FAILED
  1176. 257.55 s >
  1177. 257.55 s > failures:
  1178. 257.55 s >
  1179. 257.55 s > failures:
  1180. 257.55 s > thermal_sunrise_uv
  1181. 257.55 s >
  1182. 257.55 s > test result: FAILED. 0 passed; 1 failed; 0 ignored; 0 measured; 31 filtered out; finished in 4.70s
  1183. 257.55 s >
  1184. 257.55 s > stderr ---
  1185. 257.55 s > [2026-09-16 22:39:32.781] @gammaloop_api::se... INFO : Running command run generate
  1186. 257.55 s > [2026-09-16 22:39:32.781] @gammaloop_api::se... INFO : Starting command block generate
  1187. 257.55 s > [2026-09-16 22:39:32.781] @gammaloop_api::se... INFO : Running command import model sm-default.json
  1188. 257.55 s > [2026-09-16 22:39:32.781] @import::model INFO : Loading built-in JSON model sm-default
  1189. 257.55 s > [2026-09-16 22:39:32.808] @gammalooprs::model INFO : The following 15 external parameters were forced to zero by the restriction card:
  1190. 257.55 s > lamWS, AWS, rhoWS, etaWS, ymc, yme, ymm, MC, Me, MM, WTau, muQ, muLe, muLmu, muLtau
  1191. 257.55 s > [2026-09-16 22:39:32.808] @gammalooprs::model INFO : The following 34 vertex rules were removed by the restriction card:
  1192. 257.55 s > V_82 -> (c~, d, G+) | V_83 -> (t~, d, G+) | V_84 -> (c~, s, G+) | V_85 -> (t~, s, G+) | V_86 -> (u~, b, G+) | V_87 -> (c~, b, G+) | V_90 -> (c~, d, W+) | V_91 -> (t~, d, W+) | V_92 -> (u~, s, W+) | V_94 -> (t~, s, W+) | V_95 -> (u~, b, W+) | V_96 -> (c~, b, W+) | V_101 -> (e+, e-, G0) | V_102 -> (mu+, mu-, G0) | V_104 -> (e+, e-, H) | V_105 -> (mu+, mu-, H) | V_110 -> (ve~, e-, G+) | V_111 -> (vm~, mu-, G+) | V_116 -> (b~, u, G-) | V_117 -> (d~, c, G-) | V_118 -> (s~, c, G-) | V_119 -> (b~, c, G-) | V_120 -> (d~, t, G-) | V_121 -> (s~, t, G-) | V_124 -> (s~, u, W-) | V_125 -> (b~, u, W-) | V_126 -> (d~, c, W-) | V_128 -> (b~, c, W-) | V_129 -> (d~, t, W-) | V_130 -> (s~, t, W-) | V_138 -> (c~, c, G0) | V_140 -> (c~, c, H) | V_145 -> (e+, ve, G-) | V_146 -> (mu+, vm, G-)
  1193. 257.55 s > [2026-09-16 22:39:32.808] @gammalooprs::model INFO : The following 36 couplings were removed by the restriction card:
  1194. 257.55 s > GC_13, GC_14, GC_16, GC_17, GC_18, GC_19, GC_20, GC_22, GC_23, GC_24, GC_25, GC_26, GC_28, GC_29, GC_42, GC_43, GC_44, GC_46, GC_47, GC_48, GC_84, GC_85, GC_86, GC_87, GC_88, GC_89, GC_90, GC_91, GC_92, GC_93, GC_101, GC_102, GC_103, GC_105, GC_106, GC_107
  1195. 257.55 s > [2026-09-16 22:39:32.808] @gammaloop_api::se... INFO : Running command remove processes
  1196. 257.55 s > [2026-09-16 22:39:32.808] @gammaloop_api::se... INFO : Running command generate amp {} > {} [{2}] | g u
  1197. 257.55 s > --numerator-grouping group_identical_graphs_up_to_scalar_rescaling
  1198. 257.55 s > --max-n-bridges 0
  1199. 257.55 s > --number-of-factorized-loop-subtopologies 1 1
  1200. 257.55 s > --number-of-anticommutating-loops 1 1
  1201. 257.55 s > [...]
  1202. 257.55 s > [2026-09-16 22:39:32.809] @feyngen::diagram_... INFO : 0s | Δ=0s | Starting Feynman graph generation with Symbolica...
  1203. 257.55 s > [2026-09-16 22:39:32.810] @feyngen::diagram_... INFO : 0s | Δ=0s | Number of graphs resulting from Symbolica generation: 3
  1204. 257.55 s > [2026-09-16 22:39:32.811] @feyngen::diagram_... INFO : 0s | Δ=0s | Number of graphs retained after removal of vetoed topologies: 2
  1205. 257.55 s > [2026-09-16 22:39:32.814] @feyngen::diagram_... INFO : 0s | Δ=0s | Number of graphs after vertex info assignment: 2
  1206. 257.55 s > [2026-09-16 22:39:32.814] @feyngen::diagram_... INFO : 0s | Δ=0s | Number of graphs after all complete graphs filters are applied: 2
  1207. 257.55 s > [2026-09-16 22:39:32.817] @feyngen::diagram_... INFO : 0s | Δ=0s | Number of graphs after closed anticommutating chains analysis: 1
  1208. 257.55 s > [2026-09-16 22:39:32.817] @feyngen::diagram_... INFO : 0s | Δ=0s | Number of graphs after symmetrization of external states: 1
  1209. 257.55 s > [2026-09-16 22:39:32.820] @feyngen::diagram_... INFO : 0s | Δ=0s | Number of graphs after canonization of vertices, edges and flows (graph labels assigned here): 1
  1210. 257.55 s > [2026-09-16 22:39:32.845] @feyngen::diagram_... INFO : 0s | Δ=0s | Number of graphs after numerator-aware grouping with strategy 'up to a scalar rescaling': 1 (1 isomorphically unique graph, 0 color zero, 0 lorentz zero, 0 grouped and 0 cancellation)
  1211. 257.55 s > [2026-09-16 22:39:32.845] @feyngen::diagram_... INFO : ( Sum of the symmetry factors from each graph generated = -1/2 )
  1212. 257.55 s > [2026-09-16 22:39:32.846] @commands::generate INFO : Generated amplitude 1 graphs.
  1213. 257.55 s > [2026-09-16 22:39:32.846] @commands::generate INFO : Only diagram generation was requested, skipping integrand generation. You can generate integrands later using the 'generate existing <options>' command.
  1214. 257.55 s > [2026-09-16 22:39:32.846] @gammaloop_api::se... INFO : Running command generate
  1215. 257.55 s > The application panicked (crashed).
  1216. 257.55 s > Message: label _func_power_ not found
  1217. 257.55 s > Location: /nix/store/n9w914kh1cm59xx3spcs831cdyb56m32-vendor-cargo-deps/c19b7c6f923b580ac259164a89f2577984ad5ab09ee9d583b888f934adbbe8d0/symjit-2.25.6/src/symjit/assembler.rs:77
  1218. 257.55 s >
  1219. 257.55 s > ━━━━━━━━━━━━━━━━━━━━━━━━━━━━━━━━━━ BACKTRACE ━━━━━━━━━━━━━━━━━━━━━━━━━━━━━━━━━━━
  1220. 257.55 s > 1: <color_eyre[51793ea62743adbd]::config::PanicHook>::panic_report<unknown>
  1221. 257.55 s > at <unknown source file>:<unknown line>
  1222. 257.55 s > 2: <color_eyre[51793ea62743adbd]::config::PanicHook>::into_panic_hook::{closure#0}<unknown>
  1223. 257.55 s > at <unknown source file>:<unknown line>
  1224. 257.55 s > 3: std[bcb96dfbba0ab899]::panicking::panic_with_hook<unknown>
  1225. 257.55 s > at <unknown source file>:<unknown line>
  1226. 257.55 s > 4: std[bcb96dfbba0ab899]::panicking::panic_handler::{closure#0}<unknown>
  1227. 257.55 s > at <unknown source file>:<unknown line>
  1228. 257.55 s > 5: std[bcb96dfbba0ab899]::sys::backtrace::__rust_end_short_backtrace::<std[bcb96dfbba0ab899]::panicking::panic_handler::{closure#0}, !><unknown>
  1229. 257.55 s > at <unknown source file>:<unknown line>
  1230. 257.55 s > 6: __rustc[6c289b9f9c454d21]::rust_begin_unwind<unknown>
  1231. 257.55 s > at <unknown source file>:<unknown line>
  1232. 257.55 s > 7: core[940e698046960fd5]::panicking::panic_fmt<unknown>
  1233. 257.55 s > at <unknown source file>:<unknown line>
  1234. 257.55 s > 8: <symjit[e408de789c333cd]::symjit::assembler::Assembler>::apply_jumps<unknown>
  1235. 257.55 s > at <unknown source file>:<unknown line>
  1236. 257.55 s > 9: <symjit[e408de789c333cd]::symjit::builder::Builder>::compile_from_mir::<symjit[e408de789c333cd]::symjit::amd::complex::AmdComplexGenerator><unknown>
  1237. 257.55 s > at <unknown source file>:<unknown line>
  1238. 257.55 s > 10: <symjit[e408de789c333cd]::symjit::runnable::Application>::compile_ty<unknown>
  1239. 257.55 s > at <unknown source file>:<unknown line>
  1240. 257.55 s > 11: <symjit[e408de789c333cd]::symjit::runnable::Application>::with_mir<unknown>
  1241. 257.55 s > at <unknown source file>:<unknown line>
  1242. 257.55 s > 12: <symjit[e408de789c333cd]::symjit::composer::DirectTranslator as symjit[e408de789c333cd]::symjit::composer::Composer>::compile<unknown>
  1243. 257.55 s > at <unknown source file>:<unknown line>
  1244. 257.55 s > 13: <symjit[e408de789c333cd]::symjit::compiler::Translator as symjit[e408de789c333cd]::symjit::composer::Composer>::compile<unknown>
  1245. 257.55 s > at <unknown source file>:<unknown line>
  1246. 257.55 s > 14: <numerica[124dab8567f4861e]::domains::float::complex::Complex<f64> as symbolica[10e259bab675d243]::evaluate::backend::JITCompiledNumber>::jit_compile<unknown>
  1247. 257.55 s > at <unknown source file>:<unknown line>
  1248. 257.55 s > 15: <symbolica[10e259bab675d243]::evaluate::evaluator::ExpressionEvaluator<numerica[124dab8567f4861e]::domains::float::complex::Complex<f64>>>::jit_compile<unknown>
  1249. 257.55 s > at <unknown source file>:<unknown line>
  1250. 257.55 s > 16: <gammalooprs[917cbd3df9e68f8f]::integrands::process::evaluators::GenericEvaluator>::activate_symjit<unknown>
  1251. 257.55 s > at <unknown source file>:<unknown line>
  1252. 257.55 s > 17: <gammalooprs[917cbd3df9e68f8f]::integrands::process::amplitude::AmplitudeIntegrand>::prepare_runtime_backends_after_generation_with_compile_times<unknown>
  1253. 257.55 s > at <unknown source file>:<unknown line>
  1254. 257.55 s > 18: <gammalooprs[917cbd3df9e68f8f]::processes::amplitude::Amplitude>::build_integrand<unknown>
  1255. 257.55 s > at <unknown source file>:<unknown line>
  1256. 257.55 s > 19: <gammalooprs[917cbd3df9e68f8f]::processes::process::Process>::generate_integrands<unknown>
  1257. 257.55 s > at <unknown source file>:<unknown line>
  1258. 257.55 s > 20: <gammalooprs[917cbd3df9e68f8f]::processes::ProcessList>::generate_integrands<unknown>
  1259. 257.55 s > at <unknown source file>:<unknown line>
  1260. 257.55 s > 21: <gammaloop_api[9ebf6628f97aeb57]::state::State>::generate_integrands<unknown>
  1261. 257.55 s > at <unknown source file>:<unknown line>
  1262. 257.55 s > 22: <gammaloop_api[9ebf6628f97aeb57]::commands::generate::Generate>::run::<&std[bcb96dfbba0ab899]::path::PathBuf><unknown>
  1263. 257.55 s > at <unknown source file>:<unknown line>
  1264. 257.55 s > 23: <gammaloop_api[9ebf6628f97aeb57]::commands::Commands>::run<unknown>
  1265. 257.55 s > at <unknown source file>:<unknown line>
  1266. 257.55 s > 24: <gammaloop_api[9ebf6628f97aeb57]::session::CliSession>::execute_prepared<unknown>
  1267. 257.55 s > at <unknown source file>:<unknown line>
  1268. 257.55 s > 25: <gammaloop_api[9ebf6628f97aeb57]::session::CliSession>::execute_prepared_commands<unknown>
  1269. 257.55 s > at <unknown source file>:<unknown line>
  1270. 257.55 s > 26: <gammaloop_api[9ebf6628f97aeb57]::session::CliSession>::execute_prepared<unknown>
  1271. 257.55 s > at <unknown source file>:<unknown line>
  1272. 257.55 s > 27: <gammaloop_api[9ebf6628f97aeb57]::session::CliSession>::execute_command<unknown>
  1273. 257.55 s > at <unknown source file>:<unknown line>
  1274. 257.55 s > 28: <gammaloop_integration_tests[191607b70c61cd5a]::CLIState>::run_command<unknown>
  1275. 257.55 s > at <unknown source file>:<unknown line>
  1276. 257.55 s > 29: uv[3c7454ef256d6487]::run_single_integrated_uv_case<unknown>
  1277. 257.55 s > at <unknown source file>:<unknown line>
  1278. 257.55 s > 30: <uv[3c7454ef256d6487]::thermal_sunrise_uv::{closure#0} as core[940e698046960fd5]::ops::function::FnOnce<()>>::call_once<unknown>
  1279. 257.55 s > at <unknown source file>:<unknown line>
  1280. 257.55 s > 31: test[75d6903177b1d7e9]::__rust_begin_short_backtrace::<core[940e698046960fd5]::result::Result<(), alloc[2ea6bcb46fca0c42]::string::String>, fn() -> core[940e698046960fd5]::result::Result<(), alloc[2ea6bcb46fca0c42]::string::String>><unknown>
  1281. 257.55 s > at <unknown source file>:<unknown line>
  1282. 257.55 s > 32: test[75d6903177b1d7e9]::run_test::{closure#0}<unknown>
  1283. 257.55 s > at <unknown source file>:<unknown line>
  1284. 257.55 s > 33: std[bcb96dfbba0ab899]::sys::backtrace::__rust_begin_short_backtrace::<test[75d6903177b1d7e9]::run_test::{closure#1}, ()><unknown>
  1285. 257.55 s > at <unknown source file>:<unknown line>
  1286. 257.55 s > 34: <std[bcb96dfbba0ab899]::thread::lifecycle::spawn_unchecked<test[75d6903177b1d7e9]::run_test::{closure#1}, ()>::{closure#1} as core[940e698046960fd5]::ops::function::FnOnce<()>>::call_once::{shim:vtable#0}<unknown>
  1287. 257.55 s > at <unknown source file>:<unknown line>
  1288. 257.55 s > 35: <std[bcb96dfbba0ab899]::sys::thread::unix::Thread>::new::thread_start<unknown>
  1289. 257.55 s > at <unknown source file>:<unknown line>
  1290. 257.55 s > 36: start_thread<unknown>
  1291. 257.55 s > at <unknown source file>:<unknown line>
  1292. 257.55 s > 37: __clone3<unknown>
  1293. 257.55 s > at <unknown source file>:<unknown line>
  1294. 257.55 s >
  1295. 257.55 s > Run with COLORBT_SHOW_HIDDEN=1 environment variable to disable frame filtering.
  1296. 257.55 s > Run with RUST_BACKTRACE=full to include source snippets.
  1297. 257.55 s > Warning: SpanTrace capture is Unsupported.
  1298. 257.55 s > Ensure that you've setup a tracing-error ErrorLayer and the semver versions are compatible
  1299. 257.55 s >
  1300. 257.55 s > error: test run failed
  1301. 257.55 s >
  1302. 257.55 s > ========== nextest test summary ==========
  1303. 257.55 s > report: target/nextest/ci_gammaloop/junit.xml
  1304. 257.55 s > tests: 170, failures: 2, errors: 0
  1305. 257.55 s >
  1306. 257.55 s > 1. gammaloop-integration-tests::test_runs::aa_aa::important::aa_aa_local_inspect_backend_consistency
  1307. 257.55 s > failure: test failure with exit code 101
  1308. 257.55 s > system-out
  1309. 257.55 s > running 1 test
  1310. 257.55 s > test aa_aa::important::aa_aa_local_inspect_backend_consistency ... FAILED
  1311. 257.55 s >
  1312. 257.55 s > failures:
  1313. 257.55 s >
  1314. 257.55 s > failures:
  1315. 257.55 s > aa_aa::important::aa_aa_local_inspect_backend_consistency
  1316. 257.55 s >
  1317. 257.55 s > test result: FAILED. 0 passed; 1 failed; 0 ignored; 0 measured; 274 filtered out; finished in 3.23s
  1318. 257.55 s > system-err
  1319. 257.55 s > [2026-09-16 22:38:29.075] @gammaloop_api::se... INFO : Running command import model sm-default.json
  1320. 257.55 s > [2026-09-16 22:38:29.075] @import::model INFO : Loading built-in JSON model sm-default
  1321. 257.55 s > [2026-09-16 22:38:29.098] @gammalooprs::model INFO : The following 15 external parameters were forced to zero by the restriction card:
  1322. 257.55 s > lamWS, AWS, rhoWS, etaWS, ymc, yme, ymm, MC, Me, MM, WTau, muQ, muLe, muLmu, muLtau
  1323. 257.55 s > [2026-09-16 22:38:29.098] @gammalooprs::model INFO : The following 34 vertex rules were removed by the restriction card:
  1324. 257.55 s > V_82 -> (c~, d, G+) | V_83 -> (t~, d, G+) | V_84 -> (c~, s, G+) | V_85 -> (t~, s, G+) | V_86 -> (u~, b, G+) | V_87 -> (c~, b, G+) | V_90 -> (c~, d, W+) | V_91 -> (t~, d, W+) | V_92 -> (u~, s, W+) | V_94 -> (t~, s, W+) | V_95 -> (u~, b, W+) | V_96 -> (c~, b, W+) | V_101 -> (e+, e-, G0) | V_102 -> (mu+, mu-, G0) | V_104 -> (e+, e-, H) | V_105 -> (mu+, mu-, H) | V_110 -> (ve~, e-, G+) | V_111 -> (vm~, mu-, G+) | V_116 -> (b~, u, G-) | V_117 -> (d~, c, G-) | V_118 -> (s~, c, G-) | V_119 -> (b~, c, G-) | V_120 -> (d~, t, G-) | V_121 -> (s~, t, G-) | V_124 -> (s~, u, W-) | V_125 -> (b~, u, W-) | V_126 -> (d~, c, W-) | V_128 -> (b~, c, W-) | V_129 -> (d~, t, W-) | V_130 -> (s~, t, W-) | V_138 -> (c~, c, G0) | V_140 -> (c~, c, H) | V_145 -> (e+, ve, G-) | V_146 -> (mu+, vm, G-)
  1325. 257.55 s > [2026-09-16 22:38:29.098] @gammalooprs::model INFO : The following 36 couplings were removed by the restriction card:
  1326. 257.55 s > GC_13, GC_14, GC_16, GC_17, GC_18, GC_19, GC_20, GC_22, GC_23, GC_24, GC_25, GC_26, GC_28, GC_29, GC_42, GC_43, GC_44, GC_46, GC_47, GC_48, GC_84, GC_85, GC_86, GC_87, GC_88, GC_89, GC_90, GC_91, GC_92, GC_93, GC_101, GC_102, GC_103, GC_105, GC_106, GC_107
  1327. 257.55 s > [2026-09-16 22:38:29.099] @gammaloop_api::se... INFO : Running command run set_model_parameters
  1328. 257.55 s > [2026-09-16 22:38:29.099] @gammaloop_api::se... INFO : Starting command block set_model_parameters
  1329. 257.55 s > [2026-09-16 22:38:29.099] @gammaloop_api::se... INFO : Running command set model MT=173.0
  1330. 257.55 s > [2026-09-16 22:38:29.104] @gammaloop_api::se... INFO : Running command set model WT=0.0
  1331. 257.55 s > [2026-09-16 22:38:29.109] @gammaloop_api::se... INFO : Running command set model ymt=173.0
  1332. 257.55 s > [2026-09-16 22:38:29.114] @gammaloop_api::se... INFO : Running command set model aS=0.118
  1333. 257.55 s > [2026-09-16 22:38:29.119] @gammaloop_api::se... INFO : Running command set model aEWM1=137.036
  1334. 257.55 s > [2026-09-16 22:38:29.123] @gammaloop_api::se... INFO : Running command set model Gf=1.166390e-05
  1335. 257.55 s > [2026-09-16 22:38:29.128] @gammaloop_api::se... INFO : Running command set model MZ=91.188
  1336. 257.55 s > [2026-09-16 22:38:29.134] @gammaloop_api::se... INFO : Running command set global string '
  1337. 257.55 s > [global.generation.compile]
  1338. 257.55 s > compilation_mode = "symjit"
  1339. 257.55 s > optimization_level = "O0"
  1340. 257.55 s > fast_math = false
  1341. 257.55 s > [...]
  1342. 257.55 s > [2026-09-16 22:38:29.135] @gammaloop_api::se... INFO : Running command import graphs ./examples/cli/aa_aa/1L/aa_aa_1L.dot -p aa_aa_all_helicities -i 1L_ppmm -o
  1343. 257.55 s > [2026-09-16 22:38:29.135] @commands::import INFO : Loading graphs from '/build/source/examples/cli/aa_aa/1L/aa_aa_1L.dot'
  1344. 257.55 s > [2026-09-16 22:38:29.146] @gammaloop_api::se... INFO : Running command generate existing -p aa_aa_all_helicities
  1345. 257.55 s > The application panicked (crashed).
  1346. 257.55 s > Message: label _func_power_ not found
  1347. 257.55 s > Location: /nix/store/n9w914kh1cm59xx3spcs831cdyb56m32-vendor-cargo-deps/c19b7c6f923b580ac259164a89f2577984ad5ab09ee9d583b888f934adbbe8d0/symjit-2.25.6/src/symjit/assembler.rs:77
  1348. 257.55 s >
  1349. 257.55 s > ━━━━━━━━━━━━━━━━━━━━━━━━━━━━━━━━━━ BACKTRACE ━━━━━━━━━━━━━━━━━━━━━━━━━━━━━━━━━━━
  1350. 257.55 s > 1: <color_eyre[51793ea62743adbd]::config::PanicHook>::panic_report<unknown>
  1351. 257.55 s > at <unknown source file>:<unknown line>
  1352. 257.55 s > 2: <color_eyre[51793ea62743adbd]::config::PanicHook>::into_panic_hook::{closure#0}<unknown>
  1353. 257.55 s > at <unknown source file>:<unknown line>
  1354. 257.55 s > 3: std[bcb96dfbba0ab899]::panicking::panic_with_hook<unknown>
  1355. 257.55 s > at <unknown source file>:<unknown line>
  1356. 257.55 s > 4: std[bcb96dfbba0ab899]::panicking::panic_handler::{closure#0}<unknown>
  1357. 257.55 s > at <unknown source file>:<unknown line>
  1358. 257.55 s > 5: std[bcb96dfbba0ab899]::sys::backtrace::__rust_end_short_backtrace::<std[bcb96dfbba0ab899]::panicking::panic_handler::{closure#0}, !><unknown>
  1359. 257.55 s > at <unknown source file>:<unknown line>
  1360. 257.55 s > 6: __rustc[6c289b9f9c454d21]::rust_begin_unwind<unknown>
  1361. 257.55 s > at <unknown source file>:<unknown line>
  1362. 257.55 s > 7: core[940e698046960fd5]::panicking::panic_fmt<unknown>
  1363. 257.55 s > at <unknown source file>:<unknown line>
  1364. 257.55 s > 8: <symjit[e408de789c333cd]::symjit::assembler::Assembler>::apply_jumps<unknown>
  1365. 257.55 s > at <unknown source file>:<unknown line>
  1366. 257.55 s > 9: <symjit[e408de789c333cd]::symjit::builder::Builder>::compile_from_mir::<symjit[e408de789c333cd]::symjit::amd::complex::AmdComplexGenerator><unknown>
  1367. 257.55 s > at <unknown source file>:<unknown line>
  1368. 257.55 s > 10: <symjit[e408de789c333cd]::symjit::runnable::Application>::compile_ty<unknown>
  1369. 257.55 s > at <unknown source file>:<unknown line>
  1370. 257.55 s > 11: <symjit[e408de789c333cd]::symjit::runnable::Application>::with_mir<unknown>
  1371. 257.55 s > at <unknown source file>:<unknown line>
  1372. 257.55 s > 12: <symjit[e408de789c333cd]::symjit::composer::DirectTranslator as symjit[e408de789c333cd]::symjit::composer::Composer>::compile<unknown>
  1373. 257.55 s > at <unknown source file>:<unknown line>
  1374. 257.55 s > 13: <symjit[e408de789c333cd]::symjit::compiler::Translator as symjit[e408de789c333cd]::symjit::composer::Composer>::compile<unknown>
  1375. 257.55 s > at <unknown source file>:<unknown line>
  1376. 257.55 s > 14: <numerica[124dab8567f4861e]::domains::float::complex::Complex<f64> as symbolica[10e259bab675d243]::evaluate::backend::JITCompiledNumber>::jit_compile<unknown>
  1377. 257.55 s > at <unknown source file>:<unknown line>
  1378. 257.55 s > 15: <symbolica[10e259bab675d243]::evaluate::evaluator::ExpressionEvaluator<numerica[124dab8567f4861e]::domains::float::complex::Complex<f64>>>::jit_compile<unknown>
  1379. 257.55 s > at <unknown source file>:<unknown line>
  1380. 257.55 s > 16: <gammalooprs[917cbd3df9e68f8f]::integrands::process::evaluators::GenericEvaluator>::activate_symjit<unknown>
  1381. 257.55 s > at <unknown source file>:<unknown line>
  1382. 257.55 s > 17: <gammalooprs[917cbd3df9e68f8f]::integrands::process::amplitude::AmplitudeIntegrand>::prepare_runtime_backends_after_generation_with_compile_times<unknown>
  1383. 257.55 s > at <unknown source file>:<unknown line>
  1384. 257.55 s > 18: <gammalooprs[917cbd3df9e68f8f]::processes::amplitude::Amplitude>::build_integrand<unknown>
  1385. 257.55 s > at <unknown source file>:<unknown line>
  1386. 257.55 s > 19: <gammalooprs[917cbd3df9e68f8f]::processes::process::Process>::generate_integrands<unknown>
  1387. 257.55 s > at <unknown source file>:<unknown line>
  1388. 257.55 s > 20: <gammaloop_api[9ebf6628f97aeb57]::state::State>::generate_integrand<unknown>
  1389. 257.55 s > at <unknown source file>:<unknown line>
  1390. 257.55 s > 21: <gammaloop_api[9ebf6628f97aeb57]::commands::generate::Generate>::run::<&std[bcb96dfbba0ab899]::path::PathBuf><unknown>
  1391. 257.55 s > at <unknown source file>:<unknown line>
  1392. 257.55 s > 22: <gammaloop_api[9ebf6628f97aeb57]::commands::Commands>::run<unknown>
  1393. 257.55 s > at <unknown source file>:<unknown line>
  1394. 257.55 s > 23: <gammaloop_api[9ebf6628f97aeb57]::session::CliSession>::execute_prepared<unknown>
  1395. 257.55 s > at <unknown source file>:<unknown line>
  1396. 257.55 s > 24: <gammaloop_api[9ebf6628f97aeb57]::session::CliSession>::execute_command<unknown>
  1397. 257.55 s > at <unknown source file>:<unknown line>
  1398. 257.55 s > 25: <gammaloop_integration_tests[191607b70c61cd5a]::CLIState>::run_command<unknown>
  1399. 257.55 s > at <unknown source file>:<unknown line>
  1400. 257.55 s > 26: test_runs[9b7e2dc2dc4f29b0]::aa_aa::generate_aa_aa_helicity_family<unknown>
  1401. 257.55 s > at <unknown source file>:<unknown line>
  1402. 257.55 s > 27: <test_runs[9b7e2dc2dc4f29b0]::aa_aa::important::aa_aa_local_inspect_backend_consistency::{closure#0} as core[940e698046960fd5]::ops::function::FnOnce<()>>::call_once<unknown>
  1403. 257.55 s > at <unknown source file>:<unknown line>
  1404. 257.55 s > 28: serial_test[cd99724524a2f1c0]::serial_code_lock::local_serial_core_with_return::<(), eyre[cb2fd339c0c40fca]::Report><unknown>
  1405. 257.55 s > at <unknown source file>:<unknown line>
  1406. 257.55 s > 29: <test_runs[9b7e2dc2dc4f29b0]::aa_aa::important::aa_aa_local_inspect_backend_consistency::{closure#0} as core[940e698046960fd5]::ops::function::FnOnce<()>>::call_once<unknown>
  1407. 257.55 s > at <unknown source file>:<unknown line>
  1408. 257.55 s > 30: test[75d6903177b1d7e9]::__rust_begin_short_backtrace::<core[940e698046960fd5]::result::Result<(), alloc[2ea6bcb46fca0c42]::string::String>, fn() -> core[940e698046960fd5]::result::Result<(), alloc[2ea6bcb46fca0c42]::string::String>><unknown>
  1409. 257.55 s > at <unknown source file>:<unknown line>
  1410. 257.55 s > 31: test[75d6903177b1d7e9]::run_test::{closure#0}<unknown>
  1411. 257.55 s > at <unknown source file>:<unknown line>
  1412. 257.55 s > 32: std[bcb96dfbba0ab899]::sys::backtrace::__rust_begin_short_backtrace::<test[75d6903177b1d7e9]::run_test::{closure#1}, ()><unknown>
  1413. 257.55 s > at <unknown source file>:<unknown line>
  1414. 257.55 s > 33: <std[bcb96dfbba0ab899]::thread::lifecycle::spawn_unchecked<test[75d6903177b1d7e9]::run_test::{closure#1}, ()>::{closure#1} as core[940e698046960fd5]::ops::function::FnOnce<()>>::call_once::{shim:vtable#0}<unknown>
  1415. 257.55 s > at <unknown source file>:<unknown line>
  1416. 257.55 s > 34: <std[bcb96dfbba0ab899]::sys::thread::unix::Thread>::new::thread_start<unknown>
  1417. 257.55 s > at <unknown source file>:<unknown line>
  1418. 257.55 s > 35: start_thread<unknown>
  1419. 257.55 s > at <unknown source file>:<unknown line>
  1420. 257.55 s > 36: __clone3<unknown>
  1421. 257.55 s > at <unknown source file>:<unknown line>
  1422. 257.55 s >
  1423. 257.55 s > Run with COLORBT_SHOW_HIDDEN=1 environment variable to disable frame filtering.
  1424. 257.55 s > Run with RUST_BACKTRACE=full to include source snippets.
  1425. 257.55 s > Warning: SpanTrace capture is Unsupported.
  1426. 257.55 s > Ensure that you've setup a tracing-error ErrorLayer and the semver versions are compatible
  1427. 257.55 s >
  1428. 257.55 s > 2. gammaloop-integration-tests::uv::thermal_sunrise_uv
  1429. 257.55 s > failure: test failure with exit code 101
  1430. 257.55 s > system-out
  1431. 257.55 s > running 1 test
  1432. 257.55 s > test thermal_sunrise_uv ... FAILED
  1433. 257.55 s >
  1434. 257.55 s > failures:
  1435. 257.55 s >
  1436. 257.55 s > failures:
  1437. 257.55 s > thermal_sunrise_uv
  1438. 257.55 s >
  1439. 257.55 s > test result: FAILED. 0 passed; 1 failed; 0 ignored; 0 measured; 31 filtered out; finished in 4.70s
  1440. 257.55 s > system-err
  1441. 257.55 s > [2026-09-16 22:39:32.781] @gammaloop_api::se... INFO : Running command run generate
  1442. 257.55 s > [2026-09-16 22:39:32.781] @gammaloop_api::se... INFO : Starting command block generate
  1443. 257.55 s > [2026-09-16 22:39:32.781] @gammaloop_api::se... INFO : Running command import model sm-default.json
  1444. 257.55 s > [2026-09-16 22:39:32.781] @import::model INFO : Loading built-in JSON model sm-default
  1445. 257.55 s > [2026-09-16 22:39:32.808] @gammalooprs::model INFO : The following 15 external parameters were forced to zero by the restriction card:
  1446. 257.55 s > lamWS, AWS, rhoWS, etaWS, ymc, yme, ymm, MC, Me, MM, WTau, muQ, muLe, muLmu, muLtau
  1447. 257.55 s > [2026-09-16 22:39:32.808] @gammalooprs::model INFO : The following 34 vertex rules were removed by the restriction card:
  1448. 257.55 s > V_82 -> (c~, d, G+) | V_83 -> (t~, d, G+) | V_84 -> (c~, s, G+) | V_85 -> (t~, s, G+) | V_86 -> (u~, b, G+) | V_87 -> (c~, b, G+) | V_90 -> (c~, d, W+) | V_91 -> (t~, d, W+) | V_92 -> (u~, s, W+) | V_94 -> (t~, s, W+) | V_95 -> (u~, b, W+) | V_96 -> (c~, b, W+) | V_101 -> (e+, e-, G0) | V_102 -> (mu+, mu-, G0) | V_104 -> (e+, e-, H) | V_105 -> (mu+, mu-, H) | V_110 -> (ve~, e-, G+) | V_111 -> (vm~, mu-, G+) | V_116 -> (b~, u, G-) | V_117 -> (d~, c, G-) | V_118 -> (s~, c, G-) | V_119 -> (b~, c, G-) | V_120 -> (d~, t, G-) | V_121 -> (s~, t, G-) | V_124 -> (s~, u, W-) | V_125 -> (b~, u, W-) | V_126 -> (d~, c, W-) | V_128 -> (b~, c, W-) | V_129 -> (d~, t, W-) | V_130 -> (s~, t, W-) | V_138 -> (c~, c, G0) | V_140 -> (c~, c, H) | V_145 -> (e+, ve, G-) | V_146 -> (mu+, vm, G-)
  1449. 257.55 s > [2026-09-16 22:39:32.808] @gammalooprs::model INFO : The following 36 couplings were removed by the restriction card:
  1450. 257.55 s > GC_13, GC_14, GC_16, GC_17, GC_18, GC_19, GC_20, GC_22, GC_23, GC_24, GC_25, GC_26, GC_28, GC_29, GC_42, GC_43, GC_44, GC_46, GC_47, GC_48, GC_84, GC_85, GC_86, GC_87, GC_88, GC_89, GC_90, GC_91, GC_92, GC_93, GC_101, GC_102, GC_103, GC_105, GC_106, GC_107
  1451. 257.55 s > [2026-09-16 22:39:32.808] @gammaloop_api::se... INFO : Running command remove processes
  1452. 257.55 s > [2026-09-16 22:39:32.808] @gammaloop_api::se... INFO : Running command generate amp {} > {} [{2}] | g u
  1453. 257.55 s > --numerator-grouping group_identical_graphs_up_to_scalar_rescaling
  1454. 257.55 s > --max-n-bridges 0
  1455. 257.55 s > --number-of-factorized-loop-subtopologies 1 1
  1456. 257.55 s > --number-of-anticommutating-loops 1 1
  1457. 257.55 s > [...]
  1458. 257.55 s > [2026-09-16 22:39:32.809] @feyngen::diagram_... INFO : 0s | Δ=0s | Starting Feynman graph generation with Symbolica...
  1459. 257.55 s > [2026-09-16 22:39:32.810] @feyngen::diagram_... INFO : 0s | Δ=0s | Number of graphs resulting from Symbolica generation: 3
  1460. 257.55 s > [2026-09-16 22:39:32.811] @feyngen::diagram_... INFO : 0s | Δ=0s | Number of graphs retained after removal of vetoed topologies: 2
  1461. 257.55 s > [2026-09-16 22:39:32.814] @feyngen::diagram_... INFO : 0s | Δ=0s | Number of graphs after vertex info assignment: 2
  1462. 257.55 s > [2026-09-16 22:39:32.814] @feyngen::diagram_... INFO : 0s | Δ=0s | Number of graphs after all complete graphs filters are applied: 2
  1463. 257.55 s > [2026-09-16 22:39:32.817] @feyngen::diagram_... INFO : 0s | Δ=0s | Number of graphs after closed anticommutating chains analysis: 1
  1464. 257.55 s > [2026-09-16 22:39:32.817] @feyngen::diagram_... INFO : 0s | Δ=0s | Number of graphs after symmetrization of external states: 1
  1465. 257.55 s > [2026-09-16 22:39:32.820] @feyngen::diagram_... INFO : 0s | Δ=0s | Number of graphs after canonization of vertices, edges and flows (graph labels assigned here): 1
  1466. 257.55 s > [2026-09-16 22:39:32.845] @feyngen::diagram_... INFO : 0s | Δ=0s | Number of graphs after numerator-aware grouping with strategy 'up to a scalar rescaling': 1 (1 isomorphically unique graph, 0 color zero, 0 lorentz zero, 0 grouped and 0 cancellation)
  1467. 257.55 s > [2026-09-16 22:39:32.845] @feyngen::diagram_... INFO : ( Sum of the symmetry factors from each graph generated = -1/2 )
  1468. 257.55 s > [2026-09-16 22:39:32.846] @commands::generate INFO : Generated amplitude 1 graphs.
  1469. 257.55 s > [2026-09-16 22:39:32.846] @commands::generate INFO : Only diagram generation was requested, skipping integrand generation. You can generate integrands later using the 'generate existing <options>' command.
  1470. 257.55 s > [2026-09-16 22:39:32.846] @gammaloop_api::se... INFO : Running command generate
  1471. 257.55 s > The application panicked (crashed).
  1472. 257.55 s > Message: label _func_power_ not found
  1473. 257.55 s > Location: /nix/store/n9w914kh1cm59xx3spcs831cdyb56m32-vendor-cargo-deps/c19b7c6f923b580ac259164a89f2577984ad5ab09ee9d583b888f934adbbe8d0/symjit-2.25.6/src/symjit/assembler.rs:77
  1474. 257.55 s >
  1475. 257.55 s > ━━━━━━━━━━━━━━━━━━━━━━━━━━━━━━━━━━ BACKTRACE ━━━━━━━━━━━━━━━━━━━━━━━━━━━━━━━━━━━
  1476. 257.55 s > 1: <color_eyre[51793ea62743adbd]::config::PanicHook>::panic_report<unknown>
  1477. 257.55 s > at <unknown source file>:<unknown line>
  1478. 257.55 s > 2: <color_eyre[51793ea62743adbd]::config::PanicHook>::into_panic_hook::{closure#0}<unknown>
  1479. 257.55 s > at <unknown source file>:<unknown line>
  1480. 257.55 s > 3: std[bcb96dfbba0ab899]::panicking::panic_with_hook<unknown>
  1481. 257.55 s > at <unknown source file>:<unknown line>
  1482. 257.55 s > 4: std[bcb96dfbba0ab899]::panicking::panic_handler::{closure#0}<unknown>
  1483. 257.55 s > at <unknown source file>:<unknown line>
  1484. 257.55 s > 5: std[bcb96dfbba0ab899]::sys::backtrace::__rust_end_short_backtrace::<std[bcb96dfbba0ab899]::panicking::panic_handler::{closure#0}, !><unknown>
  1485. 257.55 s > at <unknown source file>:<unknown line>
  1486. 257.55 s > 6: __rustc[6c289b9f9c454d21]::rust_begin_unwind<unknown>
  1487. 257.55 s > at <unknown source file>:<unknown line>
  1488. 257.55 s > 7: core[940e698046960fd5]::panicking::panic_fmt<unknown>
  1489. 257.55 s > at <unknown source file>:<unknown line>
  1490. 257.55 s > 8: <symjit[e408de789c333cd]::symjit::assembler::Assembler>::apply_jumps<unknown>
  1491. 257.55 s > at <unknown source file>:<unknown line>
  1492. 257.55 s > 9: <symjit[e408de789c333cd]::symjit::builder::Builder>::compile_from_mir::<symjit[e408de789c333cd]::symjit::amd::complex::AmdComplexGenerator><unknown>
  1493. 257.55 s > at <unknown source file>:<unknown line>
  1494. 257.55 s > 10: <symjit[e408de789c333cd]::symjit::runnable::Application>::compile_ty<unknown>
  1495. 257.55 s > at <unknown source file>:<unknown line>
  1496. 257.55 s > 11: <symjit[e408de789c333cd]::symjit::runnable::Application>::with_mir<unknown>
  1497. 257.55 s > at <unknown source file>:<unknown line>
  1498. 257.55 s > 12: <symjit[e408de789c333cd]::symjit::composer::DirectTranslator as symjit[e408de789c333cd]::symjit::composer::Composer>::compile<unknown>
  1499. 257.55 s > at <unknown source file>:<unknown line>
  1500. 257.55 s > 13: <symjit[e408de789c333cd]::symjit::compiler::Translator as symjit[e408de789c333cd]::symjit::composer::Composer>::compile<unknown>
  1501. 257.55 s > at <unknown source file>:<unknown line>
  1502. 257.55 s > 14: <numerica[124dab8567f4861e]::domains::float::complex::Complex<f64> as symbolica[10e259bab675d243]::evaluate::backend::JITCompiledNumber>::jit_compile<unknown>
  1503. 257.55 s > at <unknown source file>:<unknown line>
  1504. 257.55 s > 15: <symbolica[10e259bab675d243]::evaluate::evaluator::ExpressionEvaluator<numerica[124dab8567f4861e]::domains::float::complex::Complex<f64>>>::jit_compile<unknown>
  1505. 257.55 s > at <unknown source file>:<unknown line>
  1506. 257.55 s > 16: <gammalooprs[917cbd3df9e68f8f]::integrands::process::evaluators::GenericEvaluator>::activate_symjit<unknown>
  1507. 257.55 s > at <unknown source file>:<unknown line>
  1508. 257.55 s > 17: <gammalooprs[917cbd3df9e68f8f]::integrands::process::amplitude::AmplitudeIntegrand>::prepare_runtime_backends_after_generation_with_compile_times<unknown>
  1509. 257.55 s > at <unknown source file>:<unknown line>
  1510. 257.55 s > 18: <gammalooprs[917cbd3df9e68f8f]::processes::amplitude::Amplitude>::build_integrand<unknown>
  1511. 257.55 s > at <unknown source file>:<unknown line>
  1512. 257.55 s > 19: <gammalooprs[917cbd3df9e68f8f]::processes::process::Process>::generate_integrands<unknown>
  1513. 257.55 s > at <unknown source file>:<unknown line>
  1514. 257.55 s > 20: <gammalooprs[917cbd3df9e68f8f]::processes::ProcessList>::generate_integrands<unknown>
  1515. 257.55 s > at <unknown source file>:<unknown line>
  1516. 257.55 s > 21: <gammaloop_api[9ebf6628f97aeb57]::state::State>::generate_integrands<unknown>
  1517. 257.55 s > at <unknown source file>:<unknown line>
  1518. 257.55 s > 22: <gammaloop_api[9ebf6628f97aeb57]::commands::generate::Generate>::run::<&std[bcb96dfbba0ab899]::path::PathBuf><unknown>
  1519. 257.55 s > at <unknown source file>:<unknown line>
  1520. 257.55 s > 23: <gammaloop_api[9ebf6628f97aeb57]::commands::Commands>::run<unknown>
  1521. 257.55 s > at <unknown source file>:<unknown line>
  1522. 257.55 s > 24: <gammaloop_api[9ebf6628f97aeb57]::session::CliSession>::execute_prepared<unknown>
  1523. 257.55 s > at <unknown source file>:<unknown line>
  1524. 257.55 s > 25: <gammaloop_api[9ebf6628f97aeb57]::session::CliSession>::execute_prepared_commands<unknown>
  1525. 257.55 s > at <unknown source file>:<unknown line>
  1526. 257.55 s > 26: <gammaloop_api[9ebf6628f97aeb57]::session::CliSession>::execute_prepared<unknown>
  1527. 257.55 s > at <unknown source file>:<unknown line>
  1528. 257.55 s > 27: <gammaloop_api[9ebf6628f97aeb57]::session::CliSession>::execute_command<unknown>
  1529. 257.55 s > at <unknown source file>:<unknown line>
  1530. 257.55 s > 28: <gammaloop_integration_tests[191607b70c61cd5a]::CLIState>::run_command<unknown>
  1531. 257.55 s > at <unknown source file>:<unknown line>
  1532. 257.55 s > 29: uv[3c7454ef256d6487]::run_single_integrated_uv_case<unknown>
  1533. 257.55 s > at <unknown source file>:<unknown line>
  1534. 257.55 s > 30: <uv[3c7454ef256d6487]::thermal_sunrise_uv::{closure#0} as core[940e698046960fd5]::ops::function::FnOnce<()>>::call_once<unknown>
  1535. 257.55 s > at <unknown source file>:<unknown line>
  1536. 257.55 s > 31: test[75d6903177b1d7e9]::__rust_begin_short_backtrace::<core[940e698046960fd5]::result::Result<(), alloc[2ea6bcb46fca0c42]::string::String>, fn() -> core[940e698046960fd5]::result::Result<(), alloc[2ea6bcb46fca0c42]::string::String>><unknown>
  1537. 257.55 s > at <unknown source file>:<unknown line>
  1538. 257.55 s > 32: test[75d6903177b1d7e9]::run_test::{closure#0}<unknown>
  1539. 257.55 s > at <unknown source file>:<unknown line>
  1540. 257.55 s > 33: std[bcb96dfbba0ab899]::sys::backtrace::__rust_begin_short_backtrace::<test[75d6903177b1d7e9]::run_test::{closure#1}, ()><unknown>
  1541. 257.55 s > at <unknown source file>:<unknown line>
  1542. 257.55 s > 34: <std[bcb96dfbba0ab899]::thread::lifecycle::spawn_unchecked<test[75d6903177b1d7e9]::run_test::{closure#1}, ()>::{closure#1} as core[940e698046960fd5]::ops::function::FnOnce<()>>::call_once::{shim:vtable#0}<unknown>
  1543. 257.55 s > at <unknown source file>:<unknown line>
  1544. 257.55 s > 35: <std[bcb96dfbba0ab899]::sys::thread::unix::Thread>::new::thread_start<unknown>
  1545. 257.55 s > at <unknown source file>:<unknown line>
  1546. 257.55 s > 36: start_thread<unknown>
  1547. 257.55 s > at <unknown source file>:<unknown line>
  1548. 257.55 s > 37: __clone3<unknown>
  1549. 257.55 s > at <unknown source file>:<unknown line>
  1550. 257.55 s >
  1551. 257.55 s > Run with COLORBT_SHOW_HIDDEN=1 environment variable to disable frame filtering.
  1552. 257.55 s > Run with RUST_BACKTRACE=full to include source snippets.
  1553. 257.55 s > Warning: SpanTrace capture is Unsupported.
  1554. 257.55 s > Ensure that you've setup a tracing-error ErrorLayer and the semver versions are compatible
  1555. 257.55 s > =========================================
  1556. 257.55 s For full logs, run:
  1557. 257.55 s nix log /nix/store/4gv70f5250wa678m31ilwxkvjp2lhgng-gammaloop-nextest-integration.drv
  1558. 257.65 s [0 built (1 failed)]Run failed.