test packages.x86_64-linux.nix-ci-check-gammaloop-nextest-integration

Reproduce this run
Retry Run
  1. 0.00 s $ /nix/store/61685rbaxmpigwi3z23i33sv3jyfl70q-coreutils-9.11/bin/timeout --kill-after=15s 7200s /nix/store/wknkybkzrc16r11vk5vrykh4wmw7a353-nix-2.34.8/bin/nix --extra-experimental-features nix-command --extra-experimental-features flakes flake clone git+https://github.com/alphal00p/gammaloop --dest /tmp/nix-ci-worker/stable-pwd/repo/
  2. 0.07 s Cloning into '/tmp/nix-ci-worker/stable-pwd/repo'...
  3. 0.73 s remote: Enumerating objects: 99402, done.
  4. 0.84 s remote: Counting objects: 0% (1/9113) remote: Counting objects: 1% (92/9113) remote: Counting objects: 2% (183/9113) remote: Counting objects: 3% (274/9113) remote: Counting objects: 4% (365/9113) remote: Counting objects: 5% (456/9113) remote: Counting objects: 6% (547/9113) remote: Counting objects: 7% (638/9113) remote: Counting objects: 8% (730/9113) remote: Counting objects: 9% (821/9113) remote: Counting objects: 10% (912/9113) remote: Counting objects: 11% (1003/9113) remote: Counting objects: 12% (1094/9113) remote: Counting objects: 13% (1185/9113) remote: Counting objects: 14% (1276/9113) remote: Counting objects: 15% (1367/9113) remote: Counting objects: 16% (1459/9113) remote: Counting objects: 17% (1550/9113) remote: Counting objects: 18% (1641/9113) remote: Counting objects: 19% (1732/9113) remote: Counting objects: 20% (1823/9113) remote: Counting objects: 21% (1914/9113) remote: Counting objects: 22% (2005/9113) remote: Counting objects: 23% (2096/9113) remote: Counting objects: 24% (2188/9113) remote: Counting objects: 25% (2279/9113) remote: Counting objects: 26% (2370/9113) remote: Counting objects: 27% (2461/9113) remote: Counting objects: 28% (2552/9113) remote: Counting objects: 29% (2643/9113) remote: Counting objects: 30% (2734/9113) remote: Counting objects: 31% (2826/9113) remote: Counting objects: 32% (2917/9113) remote: Counting objects: 33% (3008/9113) remote: Counting objects: 34% (3099/9113) remote: Counting objects: 35% (3190/9113) remote: Counting objects: 36% (3281/9113) remote: Counting objects: 37% (3372/9113) remote: Counting objects: 38% (3463/9113) remote: Counting objects: 39% (3555/9113) remote: Counting objects: 40% (3646/9113) remote: Counting objects: 41% (3737/9113) remote: Counting objects: 42% (3828/9113) remote: Counting objects: 43% (3919/9113) remote: Counting objects: 44% (4010/9113) remote: Counting objects: 45% (4101/9113) remote: Counting objects: 46% (4192/9113) remote: Counting objects: 47% (4284/9113) remote: Counting objects: 48% (4375/9113) remote: Counting objects: 49% (4466/9113) remote: Counting objects: 50% (4557/9113) remote: Counting objects: 51% (4648/9113) remote: Counting objects: 52% (4739/9113) remote: Counting objects: 53% (4830/9113) remote: Counting objects: 54% (4922/9113) remote: Counting objects: 55% (5013/9113) remote: Counting objects: 56% (5104/9113) remote: Counting objects: 57% (5195/9113) remote: Counting objects: 58% (5286/9113) remote: Counting objects: 59% (5377/9113) remote: Counting objects: 60% (5468/9113) remote: Counting objects: 61% (5559/9113) remote: Counting objects: 62% (5651/9113) remote: Counting objects: 63% (5742/9113) remote: Counting objects: 64% (5833/9113) remote: Counting objects: 65% (5924/9113) remote: Counting objects: 66% (6015/9113) remote: Counting objects: 67% (6106/9113) remote: Counting objects: 68% (6197/9113) remote: Counting objects: 69% (6288/9113) remote: Counting objects: 70% (6380/9113) remote: Counting objects: 71% (6471/9113) remote: Counting objects: 72% (6562/9113) remote: Counting objects: 73% (6653/9113) remote: Counting objects: 74% (6744/9113) remote: Counting objects: 75% (6835/9113) remote: Counting objects: 76% (6926/9113) remote: Counting objects: 77% (7018/9113) remote: Counting objects: 78% (7109/9113) remote: Counting objects: 79% (7200/9113) remote: Counting objects: 80% (7291/9113) remote: Counting objects: 81% (7382/9113) remote: Counting objects: 82% (7473/9113) remote: Counting objects: 83% (7564/9113) remote: Counting objects: 84% (7655/9113) remote: Counting objects: 85% (7747/9113) remote: Counting objects: 86% (7838/9113) remote: Counting objects: 87% (7929/9113) remote: Counting objects: 88% (8020/9113) remote: Counting objects: 89% (8111/9113) remote: Counting objects: 90% (8202/9113) remote: Counting objects: 91% (8293/9113) remote: Counting objects: 92% (8384/9113) remote: Counting objects: 93% (8476/9113) remote: Counting objects: 94% (8567/9113) remote: Counting objects: 95% (8658/9113) remote: Counting objects: 96% (8749/9113) remote: Counting objects: 97% (8840/9113) remote: Counting objects: 98% (8931/9113) remote: Counting objects: 99% (9022/9113) remote: Counting objects: 100% (9113/9113) remote: Counting objects: 100% (9113/9113), done.
  5. 3.06 s remote: Compressing objects: 0% (1/1899) remote: Compressing objects: 1% (19/1899) remote: Compressing objects: 2% (38/1899) remote: Compressing objects: 3% (57/1899) remote: Compressing objects: 4% (76/1899) remote: Compressing objects: 5% (95/1899) remote: Compressing objects: 6% (114/1899) remote: Compressing objects: 7% (133/1899) remote: Compressing objects: 8% (152/1899) remote: Compressing objects: 8% (154/1899) remote: Compressing objects: 9% (171/1899) remote: Compressing objects: 10% (190/1899) remote: Compressing objects: 11% (209/1899) remote: Compressing objects: 12% (228/1899) remote: Compressing objects: 13% (247/1899) remote: Compressing objects: 14% (266/1899) remote: Compressing objects: 15% (285/1899) remote: Compressing objects: 16% (304/1899) remote: Compressing objects: 17% (323/1899) remote: Compressing objects: 18% (342/1899) remote: Compressing objects: 19% (361/1899) remote: Compressing objects: 20% (380/1899) remote: Compressing objects: 21% (399/1899) remote: Compressing objects: 21% (404/1899) remote: Compressing objects: 22% (418/1899) remote: Compressing objects: 23% (437/1899) remote: Compressing objects: 24% (456/1899) remote: Compressing objects: 25% (475/1899) remote: Compressing objects: 26% (494/1899) remote: Compressing objects: 27% (513/1899) remote: Compressing objects: 28% (532/1899) remote: Compressing objects: 29% (551/1899) remote: Compressing objects: 30% (570/1899) remote: Compressing objects: 31% (589/1899) remote: Compressing objects: 32% (608/1899) remote: Compressing objects: 33% (627/1899) remote: Compressing objects: 34% (646/1899) remote: Compressing objects: 35% (665/1899) remote: Compressing objects: 36% (684/1899) remote: Compressing objects: 37% (703/1899) remote: Compressing objects: 38% (722/1899) remote: Compressing objects: 39% (741/1899) remote: Compressing objects: 40% (760/1899) remote: Compressing objects: 41% (779/1899) remote: Compressing objects: 42% (798/1899) remote: Compressing objects: 43% (817/1899) remote: Compressing objects: 44% (836/1899) remote: Compressing objects: 45% (855/1899) remote: Compressing objects: 46% (874/1899) remote: Compressing objects: 47% (893/1899) remote: Compressing objects: 48% (912/1899) remote: Compressing objects: 49% (931/1899) remote: Compressing objects: 50% (950/1899) remote: Compressing objects: 51% (969/1899) remote: Compressing objects: 52% (988/1899) remote: Compressing objects: 53% (1007/1899) remote: Compressing objects: 54% (1026/1899) remote: Compressing objects: 55% (1045/1899) remote: Compressing objects: 56% (1064/1899) remote: Compressing objects: 57% (1083/1899) remote: Compressing objects: 58% (1102/1899) remote: Compressing objects: 59% (1121/1899) remote: Compressing objects: 60% (1140/1899) remote: Compressing objects: 61% (1159/1899) remote: Compressing objects: 62% (1178/1899) remote: Compressing objects: 63% (1197/1899) remote: Compressing objects: 64% (1216/1899) remote: Compressing objects: 65% (1235/1899) remote: Compressing objects: 66% (1254/1899) remote: Compressing objects: 67% (1273/1899) remote: Compressing objects: 68% (1292/1899) remote: Compressing objects: 69% (1311/1899) remote: Compressing objects: 70% (1330/1899) remote: Compressing objects: 71% (1349/1899) remote: Compressing objects: 72% (1368/1899) remote: Compressing objects: 73% (1387/1899) remote: Compressing objects: 74% (1406/1899) remote: Compressing objects: 75% (1425/1899) remote: Compressing objects: 76% (1444/1899) remote: Compressing objects: 77% (1463/1899) remote: Compressing objects: 78% (1482/1899) remote: Compressing objects: 79% (1501/1899) remote: Compressing objects: 80% (1520/1899) remote: Compressing objects: 81% (1539/1899) remote: Compressing objects: 82% (1558/1899) remote: Compressing objects: 83% (1577/1899) remote: Compressing objects: 84% (1596/1899) remote: Compressing objects: 85% (1615/1899) remote: Compressing objects: 86% (1634/1899) remote: Compressing objects: 87% (1653/1899) remote: Compressing objects: 88% (1672/1899) remote: Compressing objects: 89% (1691/1899) remote: Compressing objects: 90% (1710/1899) remote: Compressing objects: 91% (1729/1899) remote: Compressing objects: 92% (1748/1899) remote: Compressing objects: 93% (1767/1899) remote: Compressing objects: 94% (1786/1899) remote: Compressing objects: 95% (1805/1899) remote: Compressing objects: 96% (1824/1899) remote: Compressing objects: 97% (1843/1899) remote: Compressing objects: 98% (1862/1899) remote: Compressing objects: 99% (1881/1899) remote: Compressing objects: 100% (1899/1899) remote: Compressing objects: 100% (1899/1899), done.
  6. 13.49 s Receiving objects: 0% (1/99402) Receiving objects: 1% (995/99402) Receiving objects: 2% (1989/99402) Receiving objects: 3% (2983/99402) Receiving objects: 4% (3977/99402) Receiving objects: 5% (4971/99402) Receiving objects: 6% (5965/99402) Receiving objects: 7% (6959/99402) Receiving objects: 8% (7953/99402), 16.21 MiB | 32.41 MiB/s Receiving objects: 9% (8947/99402), 16.21 MiB | 32.41 MiB/s Receiving objects: 10% (9941/99402), 16.21 MiB | 32.41 MiB/s Receiving objects: 11% (10935/99402), 16.21 MiB | 32.41 MiB/s Receiving objects: 12% (11929/99402), 16.21 MiB | 32.41 MiB/s Receiving objects: 13% (12923/99402), 16.21 MiB | 32.41 MiB/s Receiving objects: 14% (13917/99402), 16.21 MiB | 32.41 MiB/s Receiving objects: 15% (14911/99402), 16.21 MiB | 32.41 MiB/s Receiving objects: 16% (15905/99402), 16.21 MiB | 32.41 MiB/s Receiving objects: 17% (16899/99402), 16.21 MiB | 32.41 MiB/s Receiving objects: 18% (17893/99402), 16.21 MiB | 32.41 MiB/s Receiving objects: 19% (18887/99402), 16.21 MiB | 32.41 MiB/s Receiving objects: 20% (19881/99402), 16.21 MiB | 32.41 MiB/s Receiving objects: 21% (20875/99402), 16.21 MiB | 32.41 MiB/s Receiving objects: 22% (21869/99402), 16.21 MiB | 32.41 MiB/s Receiving objects: 23% (22863/99402), 16.21 MiB | 32.41 MiB/s Receiving objects: 24% (23857/99402), 16.21 MiB | 32.41 MiB/s Receiving objects: 25% (24851/99402), 16.21 MiB | 32.41 MiB/s Receiving objects: 26% (25845/99402), 16.21 MiB | 32.41 MiB/s Receiving objects: 27% (26839/99402), 16.21 MiB | 32.41 MiB/s Receiving objects: 28% (27833/99402), 16.21 MiB | 32.41 MiB/s Receiving objects: 29% (28827/99402), 16.21 MiB | 32.41 MiB/s Receiving objects: 30% (29821/99402), 16.21 MiB | 32.41 MiB/s Receiving objects: 31% (30815/99402), 16.21 MiB | 32.41 MiB/s Receiving objects: 32% (31809/99402), 16.21 MiB | 32.41 MiB/s Receiving objects: 33% (32803/99402), 16.21 MiB | 32.41 MiB/s Receiving objects: 34% (33797/99402), 16.21 MiB | 32.41 MiB/s Receiving objects: 34% (33921/99402), 32.77 MiB | 31.98 MiB/s Receiving objects: 35% (34791/99402), 32.77 MiB | 31.98 MiB/s Receiving objects: 36% (35785/99402), 32.77 MiB | 31.98 MiB/s Receiving objects: 37% (36779/99402), 32.77 MiB | 31.98 MiB/s Receiving objects: 38% (37773/99402), 32.77 MiB | 31.98 MiB/s Receiving objects: 39% (38767/99402), 32.77 MiB | 31.98 MiB/s Receiving objects: 40% (39761/99402), 32.77 MiB | 31.98 MiB/s Receiving objects: 41% (40755/99402), 32.77 MiB | 31.98 MiB/s Receiving objects: 42% (41749/99402), 32.77 MiB | 31.98 MiB/s Receiving objects: 43% (42743/99402), 32.77 MiB | 31.98 MiB/s Receiving objects: 44% (43737/99402), 51.33 MiB | 33.67 MiB/s Receiving objects: 45% (44731/99402), 51.33 MiB | 33.67 MiB/s Receiving objects: 46% (45725/99402), 51.33 MiB | 33.67 MiB/s Receiving objects: 47% (46719/99402), 51.33 MiB | 33.67 MiB/s Receiving objects: 48% (47713/99402), 51.33 MiB | 33.67 MiB/s Receiving objects: 49% (48707/99402), 51.33 MiB | 33.67 MiB/s Receiving objects: 49% (48999/99402), 51.33 MiB | 33.67 MiB/s Receiving objects: 50% (49701/99402), 67.77 MiB | 33.06 MiB/s Receiving objects: 51% (50696/99402), 67.77 MiB | 33.06 MiB/s Receiving objects: 52% (51690/99402), 67.77 MiB | 33.06 MiB/s Receiving objects: 53% (52684/99402), 67.77 MiB | 33.06 MiB/s Receiving objects: 54% (53678/99402), 67.77 MiB | 33.06 MiB/s Receiving objects: 55% (54672/99402), 67.77 MiB | 33.06 MiB/s Receiving objects: 56% (55666/99402), 67.77 MiB | 33.06 MiB/s Receiving objects: 57% (56660/99402), 67.77 MiB | 33.06 MiB/s Receiving objects: 57% (57027/99402), 102.27 MiB | 33.53 MiB/s Receiving objects: 57% (57125/99402), 118.92 MiB | 33.50 MiB/s Receiving objects: 57% (57593/99402), 151.50 MiB | 33.17 MiB/s Receiving objects: 58% (57654/99402), 168.98 MiB | 33.28 MiB/s Receiving objects: 59% (58648/99402), 168.98 MiB | 33.28 MiB/s Receiving objects: 60% (59642/99402), 185.68 MiB | 33.49 MiB/s Receiving objects: 61% (60636/99402), 185.68 MiB | 33.49 MiB/s Receiving objects: 62% (61630/99402), 185.68 MiB | 33.49 MiB/s Receiving objects: 63% (62624/99402), 185.68 MiB | 33.49 MiB/s Receiving objects: 63% (63486/99402), 185.68 MiB | 33.49 MiB/s Receiving objects: 64% (63618/99402), 185.68 MiB | 33.49 MiB/s Receiving objects: 65% (64612/99402), 202.32 MiB | 32.88 MiB/s Receiving objects: 66% (65606/99402), 202.32 MiB | 32.88 MiB/s Receiving objects: 67% (66600/99402), 202.32 MiB | 32.88 MiB/s Receiving objects: 68% (67594/99402), 202.32 MiB | 32.88 MiB/s Receiving objects: 69% (68588/99402), 202.32 MiB | 32.88 MiB/s Receiving objects: 70% (69582/99402), 202.32 MiB | 32.88 MiB/s Receiving objects: 71% (70576/99402), 202.32 MiB | 32.88 MiB/s Receiving objects: 72% (71570/99402), 202.32 MiB | 32.88 MiB/s Receiving objects: 73% (72564/99402), 202.32 MiB | 32.88 MiB/s Receiving objects: 74% (73558/99402), 202.32 MiB | 32.88 MiB/s Receiving objects: 75% (74552/99402), 219.59 MiB | 33.25 MiB/s Receiving objects: 76% (75546/99402), 219.59 MiB | 33.25 MiB/s Receiving objects: 77% (76540/99402), 219.59 MiB | 33.25 MiB/s Receiving objects: 77% (76567/99402), 219.59 MiB | 33.25 MiB/s Receiving objects: 78% (77534/99402), 253.22 MiB | 32.84 MiB/s Receiving objects: 79% (78528/99402), 253.22 MiB | 32.84 MiB/s Receiving objects: 80% (79522/99402), 253.22 MiB | 32.84 MiB/s Receiving objects: 81% (80516/99402), 253.22 MiB | 32.84 MiB/s Receiving objects: 82% (81510/99402), 253.22 MiB | 32.84 MiB/s Receiving objects: 82% (82499/99402), 253.22 MiB | 32.84 MiB/s Receiving objects: 83% (82504/99402), 253.22 MiB | 32.84 MiB/s Receiving objects: 84% (83498/99402), 253.22 MiB | 32.84 MiB/s Receiving objects: 85% (84492/99402), 271.50 MiB | 33.05 MiB/s Receiving objects: 86% (85486/99402), 271.50 MiB | 33.05 MiB/s Receiving objects: 87% (86480/99402), 287.96 MiB | 33.23 MiB/s Receiving objects: 88% (87474/99402), 287.96 MiB | 33.23 MiB/s Receiving objects: 88% (88054/99402), 287.96 MiB | 33.23 MiB/s Receiving objects: 89% (88468/99402), 321.59 MiB | 33.26 MiB/s Receiving objects: 89% (88542/99402), 321.59 MiB | 33.26 MiB/s Receiving objects: 90% (89462/99402), 321.59 MiB | 33.26 MiB/s Receiving objects: 91% (90456/99402), 339.32 MiB | 33.49 MiB/s Receiving objects: 92% (91450/99402), 339.32 MiB | 33.49 MiB/s Receiving objects: 93% (92444/99402), 339.32 MiB | 33.49 MiB/s Receiving objects: 94% (93438/99402), 339.32 MiB | 33.49 MiB/s Receiving objects: 95% (94432/99402), 339.32 MiB | 33.49 MiB/s Receiving objects: 96% (95426/99402), 339.32 MiB | 33.49 MiB/s Receiving objects: 97% (96420/99402), 339.32 MiB | 33.49 MiB/s Receiving objects: 98% (97414/99402), 339.32 MiB | 33.49 MiB/s Receiving objects: 99% (98408/99402), 339.32 MiB | 33.49 MiB/s remote: Total 99402 (delta 7922), reused 7232 (delta 7209), pack-reused 90289 (from 3)
  7. 13.49 s Receiving objects: 100% (99402/99402), 339.32 MiB | 33.49 MiB/s Receiving objects: 100% (99402/99402), 348.06 MiB | 33.37 MiB/s, done.
  8. 14.62 s Resolving deltas: 0% (0/65529) Resolving deltas: 1% (656/65529) Resolving deltas: 2% (1311/65529) Resolving deltas: 3% (1966/65529) Resolving deltas: 4% (2622/65529) Resolving deltas: 5% (3278/65529) Resolving deltas: 6% (3932/65529) Resolving deltas: 7% (4588/65529) Resolving deltas: 8% (5243/65529) Resolving deltas: 9% (5898/65529) Resolving deltas: 10% (6553/65529) Resolving deltas: 11% (7209/65529) Resolving deltas: 12% (7864/65529) Resolving deltas: 13% (8520/65529) Resolving deltas: 14% (9176/65529) Resolving deltas: 15% (9830/65529) Resolving deltas: 16% (10485/65529) Resolving deltas: 17% (11140/65529) Resolving deltas: 18% (11796/65529) Resolving deltas: 19% (12451/65529) Resolving deltas: 20% (13106/65529) Resolving deltas: 21% (13762/65529) Resolving deltas: 22% (14417/65529) Resolving deltas: 23% (15072/65529) Resolving deltas: 24% (15727/65529) Resolving deltas: 25% (16383/65529) Resolving deltas: 26% (17038/65529) Resolving deltas: 27% (17693/65529) Resolving deltas: 28% (18349/65529) Resolving deltas: 29% (19004/65529) Resolving deltas: 30% (19659/65529) Resolving deltas: 31% (20314/65529) Resolving deltas: 32% (20970/65529) Resolving deltas: 33% (21625/65529) Resolving deltas: 34% (22280/65529) Resolving deltas: 35% (22936/65529) Resolving deltas: 36% (23591/65529) Resolving deltas: 37% (24246/65529) Resolving deltas: 38% (24902/65529) Resolving deltas: 39% (25557/65529) Resolving deltas: 40% (26212/65529) Resolving deltas: 41% (26868/65529) Resolving deltas: 42% (27523/65529) Resolving deltas: 43% (28178/65529) Resolving deltas: 44% (28833/65529) Resolving deltas: 45% (29489/65529) Resolving deltas: 46% (30144/65529) Resolving deltas: 47% (30799/65529) Resolving deltas: 48% (31454/65529) Resolving deltas: 49% (32110/65529) Resolving deltas: 50% (32768/65529) Resolving deltas: 51% (33420/65529) Resolving deltas: 52% (34077/65529) Resolving deltas: 53% (34731/65529) Resolving deltas: 54% (35386/65529) Resolving deltas: 55% (36041/65529) Resolving deltas: 56% (36697/65529) Resolving deltas: 57% (37352/65529) Resolving deltas: 58% (38007/65529) Resolving deltas: 59% (38663/65529) Resolving deltas: 60% (39319/65529) Resolving deltas: 61% (39974/65529) Resolving deltas: 62% (40633/65529) Resolving deltas: 63% (41284/65529) Resolving deltas: 64% (41939/65529) Resolving deltas: 65% (42594/65529) Resolving deltas: 66% (43250/65529) Resolving deltas: 67% (43905/65529) Resolving deltas: 68% (44560/65529) Resolving deltas: 69% (45216/65529) Resolving deltas: 70% (45871/65529) Resolving deltas: 71% (46526/65529) Resolving deltas: 72% (47181/65529) Resolving deltas: 73% (47837/65529) Resolving deltas: 74% (48492/65529) Resolving deltas: 75% (49147/65529) Resolving deltas: 76% (49803/65529) Resolving deltas: 77% (50458/65529) Resolving deltas: 78% (51114/65529) Resolving deltas: 79% (51768/65529) Resolving deltas: 80% (52424/65529) Resolving deltas: 81% (53079/65529) Resolving deltas: 82% (53734/65529) Resolving deltas: 83% (54391/65529) Resolving deltas: 84% (55045/65529) Resolving deltas: 85% (55700/65529) Resolving deltas: 86% (56355/65529) Resolving deltas: 86% (56973/65529) Resolving deltas: 87% (57011/65529) Resolving deltas: 88% (57666/65529) Resolving deltas: 89% (58321/65529) Resolving deltas: 90% (58977/65529) Resolving deltas: 91% (59632/65529) Resolving deltas: 92% (60287/65529) Resolving deltas: 93% (60942/65529) Resolving deltas: 94% (61598/65529) Resolving deltas: 95% (62253/65529) Resolving deltas: 96% (62908/65529) Resolving deltas: 97% (63564/65529) Resolving deltas: 98% (64219/65529) Resolving deltas: 99% (64874/65529) Resolving deltas: 100% (65529/65529) Resolving deltas: 100% (65529/65529), done.
  9. 15.29 s Fetching commit 2165f0f37ccf61cea8bf9d12822c6ab8a71e86fa for finite_T_and_mu ...
  10. 15.29 s $ /nix/store/5vpcfsdx1lcnlb2y4k7xyc74shp5qwbh-git-2.54.0/bin/git fetch origin 2165f0f37ccf61cea8bf9d12822c6ab8a71e86fa
  11. 15.73 s From https://github.com/alphal00p/gammaloop
  12. 15.73 s * branch 2165f0f37ccf61cea8bf9d12822c6ab8a71e86fa -> FETCH_HEAD
  13. 15.75 s $ /nix/store/61685rbaxmpigwi3z23i33sv3jyfl70q-coreutils-9.11/bin/timeout --kill-after=15s 7200s /nix/store/5vpcfsdx1lcnlb2y4k7xyc74shp5qwbh-git-2.54.0/bin/git -c advice.detachedHead=false checkout 2165f0f37ccf61cea8bf9d12822c6ab8a71e86fa
  14. 16.17 s HEAD is now at 2165f0f37 add NLO cool quark matter EOS example
  15. 16.18 s $ /nix/store/61685rbaxmpigwi3z23i33sv3jyfl70q-coreutils-9.11/bin/timeout --kill-after=15s 7200s /nix/store/wknkybkzrc16r11vk5vrykh4wmw7a353-nix-2.34.8/bin/nix --extra-experimental-features nix-command --extra-experimental-features flakes --log-format internal-json run .#packages.x86_64-linux.nix-ci-check-gammaloop-nextest-integration --print-build-logs
  16. 21.33 s
  17. 21.43 s Downloading cached nix-ci-check-gammaloop-nextest-integration from https://cache.nix-ci.com
  18. 21.44 s Downloaded cached nix-ci-check-gammaloop-nextest-integration (1032 B) in 4ms
  19. 21.44 s Progress: 0 of 1 built, 1 of 1 downloaded from cache
  20. 27.01 s evaluating derivation 'g copying '/nix/store/avn8 evaluating derivation 'g copying '/nix/store/avn8 evaluating derivation 'g copying '/nix/store/avn8 evaluating derivation 'g copying '/nix/store/avn8 evaluating derivation 'g copying '/nix/store/avn8 evaluating derivation 'g copying '/nix/store/avn8 evaluating derivation 'g querying gammaloop-nexte [0.0 KiB DL] [0/1 built, 0.0 KiB DL] [1/0/1 built, 0.0 KiB DLgammaloop-nextest-integration> Extracting 13 binaries, 1 build script output directory, and 3 linked paths to /build/nextest-archive-Y9QbLo
  21. 29.75 s gammaloop-nextest-integration> Extracted 30 files to /build/nextest-archive-Y9QbLo in 2.75s
  22. 29.87 s gammaloop-nextest-integration> ------------
  23. 29.87 s gammaloop-nextest-integration> Nextest run ID aa36a7d7-3934-4669-adc0-28bcb761b4e4 with nextest profile: ci_gammaloop
  24. 29.87 s gammaloop-nextest-integration> Starting 170 tests across 13 binaries (209 tests skipped, including 208 tests via profile.ci_gammaloop.default-filter)
  25. 126.07 s gammaloop-nextest-integration> FAIL [ 2.899s] ( 55/170) gammaloop-integration-tests::test_runs aa_aa::important::aa_aa_local_inspect_backend_consistency
  26. 126.07 s gammaloop-nextest-integration> stdout ---
  27. 126.07 s gammaloop-nextest-integration>
  28. 126.07 s gammaloop-nextest-integration> running 1 test
  29. 126.07 s gammaloop-nextest-integration> test aa_aa::important::aa_aa_local_inspect_backend_consistency ... FAILED
  30. 126.07 s gammaloop-nextest-integration>
  31. 126.07 s gammaloop-nextest-integration> failures:
  32. 126.07 s gammaloop-nextest-integration>
  33. 126.07 s gammaloop-nextest-integration> failures:
  34. 126.07 s gammaloop-nextest-integration> aa_aa::important::aa_aa_local_inspect_backend_consistency
  35. 126.07 s gammaloop-nextest-integration>
  36. 126.07 s gammaloop-nextest-integration> test result: FAILED. 0 passed; 1 failed; 0 ignored; 0 measured; 274 filtered out; finished in 2.89s
  37. 126.07 s gammaloop-nextest-integration>
  38. 126.07 s gammaloop-nextest-integration> stderr ---
  39. 126.07 s gammaloop-nextest-integration> [2026-09-16 22:34:25.788] @gammaloop_api::se... INFO : Running command import model sm-default.json
  40. 126.07 s gammaloop-nextest-integration> [2026-09-16 22:34:25.788] @import::model INFO : Loading built-in JSON model sm-default
  41. 126.07 s gammaloop-nextest-integration> [2026-09-16 22:34:25.810] @gammalooprs::model INFO : The following 15 external parameters were forced to zero by the restriction card:
  42. 126.07 s gammaloop-nextest-integration> lamWS, AWS, rhoWS, etaWS, ymc, yme, ymm, MC, Me, MM, WTau, muQ, muLe, muLmu, muLtau
  43. 126.07 s gammaloop-nextest-integration> [2026-09-16 22:34:25.810] @gammalooprs::model INFO : The following 34 vertex rules were removed by the restriction card:
  44. 126.07 s gammaloop-nextest-integration> V_82 -> (c~, d, G+) | V_83 -> (t~, d, G+) | V_84 -> (c~, s, G+) | V_85 -> (t~, s, G+) | V_86 -> (u~, b, G+) | V_87 -> (c~, b, G+) | V_90 -> (c~, d, W+) | V_91 -> (t~, d, W+) | V_92 -> (u~, s, W+) | V_94 -> (t~, s, W+) | V_95 -> (u~, b, W+) | V_96 -> (c~, b, W+) | V_101 -> (e+, e-, G0) | V_102 -> (mu+, mu-, G0) | V_104 -> (e+, e-, H) | V_105 -> (mu+, mu-, H) | V_110 -> (ve~, e-, G+) | V_111 -> (vm~, mu-, G+) | V_116 -> (b~, u, G-) | V_117 -> (d~, c, G-) | V_118 -> (s~, c, G-) | V_119 -> (b~, c, G-) | V_120 -> (d~, t, G-) | V_121 -> (s~, t, G-) | V_124 -> (s~, u, W-) | V_125 -> (b~, u, W-) | V_126 -> (d~, c, W-) | V_128 -> (b~, c, W-) | V_129 -> (d~, t, W-) | V_130 -> (s~, t, W-) | V_138 -> (c~, c, G0) | V_140 -> (c~, c, H) | V_145 -> (e+, ve, G-) | V_146 -> (mu+, vm, G-)
  45. 126.07 s gammaloop-nextest-integration> [2026-09-16 22:34:25.810] @gammalooprs::model INFO : The following 36 couplings were removed by the restriction card:
  46. 126.07 s gammaloop-nextest-integration> GC_13, GC_14, GC_16, GC_17, GC_18, GC_19, GC_20, GC_22, GC_23, GC_24, GC_25, GC_26, GC_28, GC_29, GC_42, GC_43, GC_44, GC_46, GC_47, GC_48, GC_84, GC_85, GC_86, GC_87, GC_88, GC_89, GC_90, GC_91, GC_92, GC_93, GC_101, GC_102, GC_103, GC_105, GC_106, GC_107
  47. 126.07 s gammaloop-nextest-integration> [2026-09-16 22:34:25.811] @gammaloop_api::se... INFO : Running command run set_model_parameters
  48. 126.07 s gammaloop-nextest-integration> [2026-09-16 22:34:25.811] @gammaloop_api::se... INFO : Starting command block set_model_parameters
  49. 126.07 s gammaloop-nextest-integration> [2026-09-16 22:34:25.811] @gammaloop_api::se... INFO : Running command set model MT=173.0
  50. 126.07 s gammaloop-nextest-integration> [2026-09-16 22:34:25.816] @gammaloop_api::se... INFO : Running command set model WT=0.0
  51. 126.07 s gammaloop-nextest-integration> [2026-09-16 22:34:25.820] @gammaloop_api::se... INFO : Running command set model ymt=173.0
  52. 126.07 s gammaloop-nextest-integration> [2026-09-16 22:34:25.824] @gammaloop_api::se... INFO : Running command set model aS=0.118
  53. 126.07 s gammaloop-nextest-integration> [2026-09-16 22:34:25.829] @gammaloop_api::se... INFO : Running command set model aEWM1=137.036
  54. 126.07 s gammaloop-nextest-integration> [2026-09-16 22:34:25.834] @gammaloop_api::se... INFO : Running command set model Gf=1.166390e-05
  55. 126.07 s gammaloop-nextest-integration> [2026-09-16 22:34:25.838] @gammaloop_api::se... INFO : Running command set model MZ=91.188
  56. 126.07 s gammaloop-nextest-integration> [2026-09-16 22:34:25.843] @gammaloop_api::se... INFO : Running command set global string '
  57. 126.07 s gammaloop-nextest-integration> [global.generation.compile]
  58. 126.07 s gammaloop-nextest-integration> compilation_mode = "symjit"
  59. 126.07 s gammaloop-nextest-integration> optimization_level = "O0"
  60. 126.07 s gammaloop-nextest-integration> fast_math = false
  61. 126.07 s gammaloop-nextest-integration> [...]
  62. 126.07 s gammaloop-nextest-integration> [2026-09-16 22:34:25.844] @gammaloop_api::se... INFO : Running command import graphs ./examples/cli/aa_aa/1L/aa_aa_1L.dot -p aa_aa_all_helicities -i 1L_ppmm -o
  63. 126.07 s gammaloop-nextest-integration> [2026-09-16 22:34:25.844] @commands::import INFO : Loading graphs from '/build/source/examples/cli/aa_aa/1L/aa_aa_1L.dot'
  64. 126.07 s gammaloop-nextest-integration> [2026-09-16 22:34:25.853] @gammaloop_api::se... INFO : Running command generate existing -p aa_aa_all_helicities
  65. 126.07 s gammaloop-nextest-integration> The application panicked (crashed).
  66. 126.07 s gammaloop-nextest-integration> Message: label _func_power_ not found
  67. 126.07 s gammaloop-nextest-integration> Location: /nix/store/n9w914kh1cm59xx3spcs831cdyb56m32-vendor-cargo-deps/c19b7c6f923b580ac259164a89f2577984ad5ab09ee9d583b888f934adbbe8d0/symjit-2.25.6/src/symjit/assembler.rs:77
  68. 126.07 s gammaloop-nextest-integration>
  69. 126.07 s gammaloop-nextest-integration> ━━━━━━━━━━━━━━━━━━━━━━━━━━━━━━━━━━ BACKTRACE ━━━━━━━━━━━━━━━━━━━━━━━━━━━━━━━━━━━
  70. 126.07 s gammaloop-nextest-integration> 1: <color_eyre[51793ea62743adbd]::config::PanicHook>::panic_report<unknown>
  71. 126.07 s gammaloop-nextest-integration> at <unknown source file>:<unknown line>
  72. 126.07 s gammaloop-nextest-integration> 2: <color_eyre[51793ea62743adbd]::config::PanicHook>::into_panic_hook::{closure#0}<unknown>
  73. 126.07 s gammaloop-nextest-integration> at <unknown source file>:<unknown line>
  74. 126.07 s gammaloop-nextest-integration> 3: std[bcb96dfbba0ab899]::panicking::panic_with_hook<unknown>
  75. 126.07 s gammaloop-nextest-integration> at <unknown source file>:<unknown line>
  76. 126.07 s gammaloop-nextest-integration> 4: std[bcb96dfbba0ab899]::panicking::panic_handler::{closure#0}<unknown>
  77. 126.07 s gammaloop-nextest-integration> at <unknown source file>:<unknown line>
  78. 126.07 s gammaloop-nextest-integration> 5: std[bcb96dfbba0ab899]::sys::backtrace::__rust_end_short_backtrace::<std[bcb96dfbba0ab899]::panicking::panic_handler::{closure#0}, !><unknown>
  79. 126.07 s gammaloop-nextest-integration> at <unknown source file>:<unknown line>
  80. 126.07 s gammaloop-nextest-integration> 6: __rustc[6c289b9f9c454d21]::rust_begin_unwind<unknown>
  81. 126.07 s gammaloop-nextest-integration> at <unknown source file>:<unknown line>
  82. 126.07 s gammaloop-nextest-integration> 7: core[940e698046960fd5]::panicking::panic_fmt<unknown>
  83. 126.07 s gammaloop-nextest-integration> at <unknown source file>:<unknown line>
  84. 126.07 s gammaloop-nextest-integration> 8: <symjit[e408de789c333cd]::symjit::assembler::Assembler>::apply_jumps<unknown>
  85. 126.07 s gammaloop-nextest-integration> at <unknown source file>:<unknown line>
  86. 126.07 s gammaloop-nextest-integration> 9: <symjit[e408de789c333cd]::symjit::builder::Builder>::compile_from_mir::<symjit[e408de789c333cd]::symjit::amd::complex::AmdComplexGenerator><unknown>
  87. 126.07 s gammaloop-nextest-integration> at <unknown source file>:<unknown line>
  88. 126.07 s gammaloop-nextest-integration> 10: <symjit[e408de789c333cd]::symjit::runnable::Application>::compile_ty<unknown>
  89. 126.07 s gammaloop-nextest-integration> at <unknown source file>:<unknown line>
  90. 126.07 s gammaloop-nextest-integration> 11: <symjit[e408de789c333cd]::symjit::runnable::Application>::with_mir<unknown>
  91. 126.07 s gammaloop-nextest-integration> at <unknown source file>:<unknown line>
  92. 126.07 s gammaloop-nextest-integration> 12: <symjit[e408de789c333cd]::symjit::composer::DirectTranslator as symjit[e408de789c333cd]::symjit::composer::Composer>::compile<unknown>
  93. 126.07 s gammaloop-nextest-integration> at <unknown source file>:<unknown line>
  94. 126.07 s gammaloop-nextest-integration> 13: <symjit[e408de789c333cd]::symjit::compiler::Translator as symjit[e408de789c333cd]::symjit::composer::Composer>::compile<unknown>
  95. 126.07 s gammaloop-nextest-integration> at <unknown source file>:<unknown line>
  96. 126.07 s gammaloop-nextest-integration> 14: <numerica[124dab8567f4861e]::domains::float::complex::Complex<f64> as symbolica[10e259bab675d243]::evaluate::backend::JITCompiledNumber>::jit_compile<unknown>
  97. 126.07 s gammaloop-nextest-integration> at <unknown source file>:<unknown line>
  98. 126.07 s gammaloop-nextest-integration> 15: <symbolica[10e259bab675d243]::evaluate::evaluator::ExpressionEvaluator<numerica[124dab8567f4861e]::domains::float::complex::Complex<f64>>>::jit_compile<unknown>
  99. 126.07 s gammaloop-nextest-integration> at <unknown source file>:<unknown line>
  100. 126.07 s gammaloop-nextest-integration> 16: <gammalooprs[917cbd3df9e68f8f]::integrands::process::evaluators::GenericEvaluator>::activate_symjit<unknown>
  101. 126.07 s gammaloop-nextest-integration> at <unknown source file>:<unknown line>
  102. 126.07 s gammaloop-nextest-integration> 17: <gammalooprs[917cbd3df9e68f8f]::integrands::process::amplitude::AmplitudeIntegrand>::prepare_runtime_backends_after_generation_with_compile_times<unknown>
  103. 126.07 s gammaloop-nextest-integration> at <unknown source file>:<unknown line>
  104. 126.07 s gammaloop-nextest-integration> 18: <gammalooprs[917cbd3df9e68f8f]::processes::amplitude::Amplitude>::build_integrand<unknown>
  105. 126.07 s gammaloop-nextest-integration> at <unknown source file>:<unknown line>
  106. 126.07 s gammaloop-nextest-integration> 19: <gammalooprs[917cbd3df9e68f8f]::processes::process::Process>::generate_integrands<unknown>
  107. 126.07 s gammaloop-nextest-integration> at <unknown source file>:<unknown line>
  108. 126.07 s gammaloop-nextest-integration> 20: <gammaloop_api[9ebf6628f97aeb57]::state::State>::generate_integrand<unknown>
  109. 126.07 s gammaloop-nextest-integration> at <unknown source file>:<unknown line>
  110. 126.07 s gammaloop-nextest-integration> 21: <gammaloop_api[9ebf6628f97aeb57]::commands::generate::Generate>::run::<&std[bcb96dfbba0ab899]::path::PathBuf><unknown>
  111. 126.07 s gammaloop-nextest-integration> at <unknown source file>:<unknown line>
  112. 126.07 s gammaloop-nextest-integration> 22: <gammaloop_api[9ebf6628f97aeb57]::commands::Commands>::run<unknown>
  113. 126.07 s gammaloop-nextest-integration> at <unknown source file>:<unknown line>
  114. 126.07 s gammaloop-nextest-integration> 23: <gammaloop_api[9ebf6628f97aeb57]::session::CliSession>::execute_prepared<unknown>
  115. 126.07 s gammaloop-nextest-integration> at <unknown source file>:<unknown line>
  116. 126.07 s gammaloop-nextest-integration> 24: <gammaloop_api[9ebf6628f97aeb57]::session::CliSession>::execute_command<unknown>
  117. 126.07 s gammaloop-nextest-integration> at <unknown source file>:<unknown line>
  118. 126.07 s gammaloop-nextest-integration> 25: <gammaloop_integration_tests[191607b70c61cd5a]::CLIState>::run_command<unknown>
  119. 126.07 s gammaloop-nextest-integration> at <unknown source file>:<unknown line>
  120. 126.07 s gammaloop-nextest-integration> 26: test_runs[9b7e2dc2dc4f29b0]::aa_aa::generate_aa_aa_helicity_family<unknown>
  121. 126.07 s gammaloop-nextest-integration> at <unknown source file>:<unknown line>
  122. 126.07 s gammaloop-nextest-integration> 27: <test_runs[9b7e2dc2dc4f29b0]::aa_aa::important::aa_aa_local_inspect_backend_consistency::{closure#0} as core[940e698046960fd5]::ops::function::FnOnce<()>>::call_once<unknown>
  123. 126.07 s gammaloop-nextest-integration> at <unknown source file>:<unknown line>
  124. 126.07 s gammaloop-nextest-integration> 28: serial_test[cd99724524a2f1c0]::serial_code_lock::local_serial_core_with_return::<(), eyre[cb2fd339c0c40fca]::Report><unknown>
  125. 126.07 s gammaloop-nextest-integration> at <unknown source file>:<unknown line>
  126. 126.07 s gammaloop-nextest-integration> 29: <test_runs[9b7e2dc2dc4f29b0]::aa_aa::important::aa_aa_local_inspect_backend_consistency::{closure#0} as core[940e698046960fd5]::ops::function::FnOnce<()>>::call_once<unknown>
  127. 126.07 s gammaloop-nextest-integration> at <unknown source file>:<unknown line>
  128. 126.07 s gammaloop-nextest-integration> 30: test[75d6903177b1d7e9]::__rust_begin_short_backtrace::<core[940e698046960fd5]::result::Result<(), alloc[2ea6bcb46fca0c42]::string::String>, fn() -> core[940e698046960fd5]::result::Result<(), alloc[2ea6bcb46fca0c42]::string::String>><unknown>
  129. 126.07 s gammaloop-nextest-integration> at <unknown source file>:<unknown line>
  130. 126.07 s gammaloop-nextest-integration> 31: test[75d6903177b1d7e9]::run_test::{closure#0}<unknown>
  131. 126.07 s gammaloop-nextest-integration> at <unknown source file>:<unknown line>
  132. 126.07 s gammaloop-nextest-integration> 32: std[bcb96dfbba0ab899]::sys::backtrace::__rust_begin_short_backtrace::<test[75d6903177b1d7e9]::run_test::{closure#1}, ()><unknown>
  133. 126.07 s gammaloop-nextest-integration> at <unknown source file>:<unknown line>
  134. 126.07 s gammaloop-nextest-integration> 33: <std[bcb96dfbba0ab899]::thread::lifecycle::spawn_unchecked<test[75d6903177b1d7e9]::run_test::{closure#1}, ()>::{closure#1} as core[940e698046960fd5]::ops::function::FnOnce<()>>::call_once::{shim:vtable#0}<unknown>
  135. 126.07 s gammaloop-nextest-integration> at <unknown source file>:<unknown line>
  136. 126.07 s gammaloop-nextest-integration> 34: <std[bcb96dfbba0ab899]::sys::thread::unix::Thread>::new::thread_start<unknown>
  137. 126.07 s gammaloop-nextest-integration> at <unknown source file>:<unknown line>
  138. 126.07 s gammaloop-nextest-integration> 35: start_thread<unknown>
  139. 126.07 s gammaloop-nextest-integration> at <unknown source file>:<unknown line>
  140. 126.07 s gammaloop-nextest-integration> 36: __clone3<unknown>
  141. 126.07 s gammaloop-nextest-integration> at <unknown source file>:<unknown line>
  142. 126.07 s gammaloop-nextest-integration>
  143. 126.07 s gammaloop-nextest-integration> Run with COLORBT_SHOW_HIDDEN=1 environment variable to disable frame filtering.
  144. 126.07 s gammaloop-nextest-integration> Run with RUST_BACKTRACE=full to include source snippets.
  145. 126.07 s gammaloop-nextest-integration> Warning: SpanTrace capture is Unsupported.
  146. 126.07 s gammaloop-nextest-integration> Ensure that you've setup a tracing-error ErrorLayer and the semver versions are compatible
  147. 126.07 s gammaloop-nextest-integration>
  148. 182.69 s gammaloop-nextest-integration> FAIL [ 5.666s] (158/170) gammaloop-integration-tests::uv thermal_sunrise_uv
  149. 182.69 s gammaloop-nextest-integration> stdout ---
  150. 182.69 s gammaloop-nextest-integration>
  151. 182.69 s gammaloop-nextest-integration> running 1 test
  152. 182.69 s gammaloop-nextest-integration> test thermal_sunrise_uv ... FAILED
  153. 182.69 s gammaloop-nextest-integration>
  154. 182.69 s gammaloop-nextest-integration> failures:
  155. 182.69 s gammaloop-nextest-integration>
  156. 182.69 s gammaloop-nextest-integration> failures:
  157. 182.69 s gammaloop-nextest-integration> thermal_sunrise_uv
  158. 182.69 s gammaloop-nextest-integration>
  159. 182.69 s gammaloop-nextest-integration> test result: FAILED. 0 passed; 1 failed; 0 ignored; 0 measured; 31 filtered out; finished in 5.63s
  160. 182.69 s gammaloop-nextest-integration>
  161. 182.69 s gammaloop-nextest-integration> stderr ---
  162. 182.69 s gammaloop-nextest-integration> [2026-09-16 22:35:19.761] @gammaloop_api::se... INFO : Running command run generate
  163. 182.69 s gammaloop-nextest-integration> [2026-09-16 22:35:19.761] @gammaloop_api::se... INFO : Starting command block generate
  164. 182.69 s gammaloop-nextest-integration> [2026-09-16 22:35:19.761] @gammaloop_api::se... INFO : Running command import model sm-default.json
  165. 182.69 s gammaloop-nextest-integration> [2026-09-16 22:35:19.761] @import::model INFO : Loading built-in JSON model sm-default
  166. 182.69 s gammaloop-nextest-integration> [2026-09-16 22:35:19.810] @gammalooprs::model INFO : The following 15 external parameters were forced to zero by the restriction card:
  167. 182.69 s gammaloop-nextest-integration> lamWS, AWS, rhoWS, etaWS, ymc, yme, ymm, MC, Me, MM, WTau, muQ, muLe, muLmu, muLtau
  168. 182.69 s gammaloop-nextest-integration> [2026-09-16 22:35:19.810] @gammalooprs::model INFO : The following 34 vertex rules were removed by the restriction card:
  169. 182.69 s gammaloop-nextest-integration> V_82 -> (c~, d, G+) | V_83 -> (t~, d, G+) | V_84 -> (c~, s, G+) | V_85 -> (t~, s, G+) | V_86 -> (u~, b, G+) | V_87 -> (c~, b, G+) | V_90 -> (c~, d, W+) | V_91 -> (t~, d, W+) | V_92 -> (u~, s, W+) | V_94 -> (t~, s, W+) | V_95 -> (u~, b, W+) | V_96 -> (c~, b, W+) | V_101 -> (e+, e-, G0) | V_102 -> (mu+, mu-, G0) | V_104 -> (e+, e-, H) | V_105 -> (mu+, mu-, H) | V_110 -> (ve~, e-, G+) | V_111 -> (vm~, mu-, G+) | V_116 -> (b~, u, G-) | V_117 -> (d~, c, G-) | V_118 -> (s~, c, G-) | V_119 -> (b~, c, G-) | V_120 -> (d~, t, G-) | V_121 -> (s~, t, G-) | V_124 -> (s~, u, W-) | V_125 -> (b~, u, W-) | V_126 -> (d~, c, W-) | V_128 -> (b~, c, W-) | V_129 -> (d~, t, W-) | V_130 -> (s~, t, W-) | V_138 -> (c~, c, G0) | V_140 -> (c~, c, H) | V_145 -> (e+, ve, G-) | V_146 -> (mu+, vm, G-)
  170. 182.69 s gammaloop-nextest-integration> [2026-09-16 22:35:19.810] @gammalooprs::model INFO : The following 36 couplings were removed by the restriction card:
  171. 182.69 s gammaloop-nextest-integration> GC_13, GC_14, GC_16, GC_17, GC_18, GC_19, GC_20, GC_22, GC_23, GC_24, GC_25, GC_26, GC_28, GC_29, GC_42, GC_43, GC_44, GC_46, GC_47, GC_48, GC_84, GC_85, GC_86, GC_87, GC_88, GC_89, GC_90, GC_91, GC_92, GC_93, GC_101, GC_102, GC_103, GC_105, GC_106, GC_107
  172. 182.69 s gammaloop-nextest-integration> [2026-09-16 22:35:19.811] @gammaloop_api::se... INFO : Running command remove processes
  173. 182.69 s gammaloop-nextest-integration> [2026-09-16 22:35:19.811] @gammaloop_api::se... INFO : Running command generate amp {} > {} [{2}] | g u
  174. 182.69 s gammaloop-nextest-integration> --numerator-grouping group_identical_graphs_up_to_scalar_rescaling
  175. 182.69 s gammaloop-nextest-integration> --max-n-bridges 0
  176. 182.69 s gammaloop-nextest-integration> --number-of-factorized-loop-subtopologies 1 1
  177. 182.69 s gammaloop-nextest-integration> --number-of-anticommutating-loops 1 1
  178. 182.69 s gammaloop-nextest-integration> [...]
  179. 182.69 s gammaloop-nextest-integration> [2026-09-16 22:35:19.812] @feyngen::diagram_... INFO : 0s | Δ=0s | Starting Feynman graph generation with Symbolica...
  180. 182.69 s gammaloop-nextest-integration> [2026-09-16 22:35:19.816] @feyngen::diagram_... INFO : 0s | Δ=0s | Number of graphs resulting from Symbolica generation: 3
  181. 182.69 s gammaloop-nextest-integration> [2026-09-16 22:35:19.819] @feyngen::diagram_... INFO : 0s | Δ=0s | Number of graphs retained after removal of vetoed topologies: 2
  182. 182.69 s gammaloop-nextest-integration> [2026-09-16 22:35:19.822] @feyngen::diagram_... INFO : 0s | Δ=0s | Number of graphs after vertex info assignment: 2
  183. 182.69 s gammaloop-nextest-integration> [2026-09-16 22:35:19.822] @feyngen::diagram_... INFO : 0s | Δ=0s | Number of graphs after all complete graphs filters are applied: 2
  184. 182.69 s gammaloop-nextest-integration> [2026-09-16 22:35:19.825] @feyngen::diagram_... INFO : 0s | Δ=0s | Number of graphs after closed anticommutating chains analysis: 1
  185. 182.69 s gammaloop-nextest-integration> [2026-09-16 22:35:19.825] @feyngen::diagram_... INFO : 0s | Δ=0s | Number of graphs after symmetrization of external states: 1
  186. 182.69 s gammaloop-nextest-integration> [2026-09-16 22:35:19.828] @feyngen::diagram_... INFO : 0s | Δ=0s | Number of graphs after canonization of vertices, edges and flows (graph labels assigned here): 1
  187. 182.69 s gammaloop-nextest-integration> [2026-09-16 22:35:19.857] @feyngen::diagram_... INFO : 0s | Δ=0s | Number of graphs after numerator-aware grouping with strategy 'up to a scalar rescaling': 1 (1 isomorphically unique graph, 0 color zero, 0 lorentz zero, 0 grouped and 0 cancellation)
  188. 182.69 s gammaloop-nextest-integration> [2026-09-16 22:35:19.857] @feyngen::diagram_... INFO : ( Sum of the symmetry factors from each graph generated = -1/2 )
  189. 182.69 s gammaloop-nextest-integration> [2026-09-16 22:35:19.857] @commands::generate INFO : Generated amplitude 1 graphs.
  190. 182.69 s gammaloop-nextest-integration> [2026-09-16 22:35:19.857] @commands::generate INFO : Only diagram generation was requested, skipping integrand generation. You can generate integrands later using the 'generate existing <options>' command.
  191. 182.69 s gammaloop-nextest-integration> [2026-09-16 22:35:19.857] @gammaloop_api::se... INFO : Running command generate
  192. 182.69 s gammaloop-nextest-integration> The application panicked (crashed).
  193. 182.69 s gammaloop-nextest-integration> Message: label _func_power_ not found
  194. 182.69 s gammaloop-nextest-integration> Location: /nix/store/n9w914kh1cm59xx3spcs831cdyb56m32-vendor-cargo-deps/c19b7c6f923b580ac259164a89f2577984ad5ab09ee9d583b888f934adbbe8d0/symjit-2.25.6/src/symjit/assembler.rs:77
  195. 182.69 s gammaloop-nextest-integration>
  196. 182.69 s gammaloop-nextest-integration> ━━━━━━━━━━━━━━━━━━━━━━━━━━━━━━━━━━ BACKTRACE ━━━━━━━━━━━━━━━━━━━━━━━━━━━━━━━━━━━
  197. 182.69 s gammaloop-nextest-integration> 1: <color_eyre[51793ea62743adbd]::config::PanicHook>::panic_report<unknown>
  198. 182.69 s gammaloop-nextest-integration> at <unknown source file>:<unknown line>
  199. 182.69 s gammaloop-nextest-integration> 2: <color_eyre[51793ea62743adbd]::config::PanicHook>::into_panic_hook::{closure#0}<unknown>
  200. 182.69 s gammaloop-nextest-integration> at <unknown source file>:<unknown line>
  201. 182.69 s gammaloop-nextest-integration> 3: std[bcb96dfbba0ab899]::panicking::panic_with_hook<unknown>
  202. 182.69 s gammaloop-nextest-integration> at <unknown source file>:<unknown line>
  203. 182.69 s gammaloop-nextest-integration> 4: std[bcb96dfbba0ab899]::panicking::panic_handler::{closure#0}<unknown>
  204. 182.69 s gammaloop-nextest-integration> at <unknown source file>:<unknown line>
  205. 182.69 s gammaloop-nextest-integration> 5: std[bcb96dfbba0ab899]::sys::backtrace::__rust_end_short_backtrace::<std[bcb96dfbba0ab899]::panicking::panic_handler::{closure#0}, !><unknown>
  206. 182.69 s gammaloop-nextest-integration> at <unknown source file>:<unknown line>
  207. 182.69 s gammaloop-nextest-integration> 6: __rustc[6c289b9f9c454d21]::rust_begin_unwind<unknown>
  208. 182.69 s gammaloop-nextest-integration> at <unknown source file>:<unknown line>
  209. 182.69 s gammaloop-nextest-integration> 7: core[940e698046960fd5]::panicking::panic_fmt<unknown>
  210. 182.69 s gammaloop-nextest-integration> at <unknown source file>:<unknown line>
  211. 182.69 s gammaloop-nextest-integration> 8: <symjit[e408de789c333cd]::symjit::assembler::Assembler>::apply_jumps<unknown>
  212. 182.69 s gammaloop-nextest-integration> at <unknown source file>:<unknown line>
  213. 182.69 s gammaloop-nextest-integration> 9: <symjit[e408de789c333cd]::symjit::builder::Builder>::compile_from_mir::<symjit[e408de789c333cd]::symjit::amd::complex::AmdComplexGenerator><unknown>
  214. 182.69 s gammaloop-nextest-integration> at <unknown source file>:<unknown line>
  215. 182.69 s gammaloop-nextest-integration> 10: <symjit[e408de789c333cd]::symjit::runnable::Application>::compile_ty<unknown>
  216. 182.69 s gammaloop-nextest-integration> at <unknown source file>:<unknown line>
  217. 182.69 s gammaloop-nextest-integration> 11: <symjit[e408de789c333cd]::symjit::runnable::Application>::with_mir<unknown>
  218. 182.69 s gammaloop-nextest-integration> at <unknown source file>:<unknown line>
  219. 182.69 s gammaloop-nextest-integration> 12: <symjit[e408de789c333cd]::symjit::composer::DirectTranslator as symjit[e408de789c333cd]::symjit::composer::Composer>::compile<unknown>
  220. 182.69 s gammaloop-nextest-integration> at <unknown source file>:<unknown line>
  221. 182.69 s gammaloop-nextest-integration> 13: <symjit[e408de789c333cd]::symjit::compiler::Translator as symjit[e408de789c333cd]::symjit::composer::Composer>::compile<unknown>
  222. 182.69 s gammaloop-nextest-integration> at <unknown source file>:<unknown line>
  223. 182.69 s gammaloop-nextest-integration> 14: <numerica[124dab8567f4861e]::domains::float::complex::Complex<f64> as symbolica[10e259bab675d243]::evaluate::backend::JITCompiledNumber>::jit_compile<unknown>
  224. 182.69 s gammaloop-nextest-integration> at <unknown source file>:<unknown line>
  225. 182.69 s gammaloop-nextest-integration> 15: <symbolica[10e259bab675d243]::evaluate::evaluator::ExpressionEvaluator<numerica[124dab8567f4861e]::domains::float::complex::Complex<f64>>>::jit_compile<unknown>
  226. 182.69 s gammaloop-nextest-integration> at <unknown source file>:<unknown line>
  227. 182.69 s gammaloop-nextest-integration> 16: <gammalooprs[917cbd3df9e68f8f]::integrands::process::evaluators::GenericEvaluator>::activate_symjit<unknown>
  228. 182.69 s gammaloop-nextest-integration> at <unknown source file>:<unknown line>
  229. 182.69 s gammaloop-nextest-integration> 17: <gammalooprs[917cbd3df9e68f8f]::integrands::process::amplitude::AmplitudeIntegrand>::prepare_runtime_backends_after_generation_with_compile_times<unknown>
  230. 182.69 s gammaloop-nextest-integration> at <unknown source file>:<unknown line>
  231. 182.69 s gammaloop-nextest-integration> 18: <gammalooprs[917cbd3df9e68f8f]::processes::amplitude::Amplitude>::build_integrand<unknown>
  232. 182.69 s gammaloop-nextest-integration> at <unknown source file>:<unknown line>
  233. 182.69 s gammaloop-nextest-integration> 19: <gammalooprs[917cbd3df9e68f8f]::processes::process::Process>::generate_integrands<unknown>
  234. 182.69 s gammaloop-nextest-integration> at <unknown source file>:<unknown line>
  235. 182.69 s gammaloop-nextest-integration> 20: <gammalooprs[917cbd3df9e68f8f]::processes::ProcessList>::generate_integrands<unknown>
  236. 182.69 s gammaloop-nextest-integration> at <unknown source file>:<unknown line>
  237. 182.69 s gammaloop-nextest-integration> 21: <gammaloop_api[9ebf6628f97aeb57]::state::State>::generate_integrands<unknown>
  238. 182.69 s gammaloop-nextest-integration> at <unknown source file>:<unknown line>
  239. 182.69 s gammaloop-nextest-integration> 22: <gammaloop_api[9ebf6628f97aeb57]::commands::generate::Generate>::run::<&std[bcb96dfbba0ab899]::path::PathBuf><unknown>
  240. 182.69 s gammaloop-nextest-integration> at <unknown source file>:<unknown line>
  241. 182.69 s gammaloop-nextest-integration> 23: <gammaloop_api[9ebf6628f97aeb57]::commands::Commands>::run<unknown>
  242. 182.70 s gammaloop-nextest-integration> at <unknown source file>:<unknown line>
  243. 182.70 s gammaloop-nextest-integration> 24: <gammaloop_api[9ebf6628f97aeb57]::session::CliSession>::execute_prepared<unknown>
  244. 182.70 s gammaloop-nextest-integration> at <unknown source file>:<unknown line>
  245. 182.70 s gammaloop-nextest-integration> 25: <gammaloop_api[9ebf6628f97aeb57]::session::CliSession>::execute_prepared_commands<unknown>
  246. 182.70 s gammaloop-nextest-integration> at <unknown source file>:<unknown line>
  247. 182.70 s gammaloop-nextest-integration> 26: <gammaloop_api[9ebf6628f97aeb57]::session::CliSession>::execute_prepared<unknown>
  248. 182.70 s gammaloop-nextest-integration> at <unknown source file>:<unknown line>
  249. 182.70 s gammaloop-nextest-integration> 27: <gammaloop_api[9ebf6628f97aeb57]::session::CliSession>::execute_command<unknown>
  250. 182.70 s gammaloop-nextest-integration> at <unknown source file>:<unknown line>
  251. 182.70 s gammaloop-nextest-integration> 28: <gammaloop_integration_tests[191607b70c61cd5a]::CLIState>::run_command<unknown>
  252. 182.70 s gammaloop-nextest-integration> at <unknown source file>:<unknown line>
  253. 182.70 s gammaloop-nextest-integration> 29: uv[3c7454ef256d6487]::run_single_integrated_uv_case<unknown>
  254. 182.70 s gammaloop-nextest-integration> at <unknown source file>:<unknown line>
  255. 182.70 s gammaloop-nextest-integration> 30: <uv[3c7454ef256d6487]::thermal_sunrise_uv::{closure#0} as core[940e698046960fd5]::ops::function::FnOnce<()>>::call_once<unknown>
  256. 182.70 s gammaloop-nextest-integration> at <unknown source file>:<unknown line>
  257. 182.70 s gammaloop-nextest-integration> 31: test[75d6903177b1d7e9]::__rust_begin_short_backtrace::<core[940e698046960fd5]::result::Result<(), alloc[2ea6bcb46fca0c42]::string::String>, fn() -> core[940e698046960fd5]::result::Result<(), alloc[2ea6bcb46fca0c42]::string::String>><unknown>
  258. 182.70 s gammaloop-nextest-integration> at <unknown source file>:<unknown line>
  259. 182.70 s gammaloop-nextest-integration> 32: test[75d6903177b1d7e9]::run_test::{closure#0}<unknown>
  260. 182.70 s gammaloop-nextest-integration> at <unknown source file>:<unknown line>
  261. 182.70 s gammaloop-nextest-integration> 33: std[bcb96dfbba0ab899]::sys::backtrace::__rust_begin_short_backtrace::<test[75d6903177b1d7e9]::run_test::{closure#1}, ()><unknown>
  262. 182.70 s gammaloop-nextest-integration> at <unknown source file>:<unknown line>
  263. 182.70 s gammaloop-nextest-integration> 34: <std[bcb96dfbba0ab899]::thread::lifecycle::spawn_unchecked<test[75d6903177b1d7e9]::run_test::{closure#1}, ()>::{closure#1} as core[940e698046960fd5]::ops::function::FnOnce<()>>::call_once::{shim:vtable#0}<unknown>
  264. 182.70 s gammaloop-nextest-integration> at <unknown source file>:<unknown line>
  265. 182.70 s gammaloop-nextest-integration> 35: <std[bcb96dfbba0ab899]::sys::thread::unix::Thread>::new::thread_start<unknown>
  266. 182.70 s gammaloop-nextest-integration> at <unknown source file>:<unknown line>
  267. 182.70 s gammaloop-nextest-integration> 36: start_thread<unknown>
  268. 182.70 s gammaloop-nextest-integration> at <unknown source file>:<unknown line>
  269. 182.70 s gammaloop-nextest-integration> 37: __clone3<unknown>
  270. 182.70 s gammaloop-nextest-integration> at <unknown source file>:<unknown line>
  271. 182.70 s gammaloop-nextest-integration>
  272. 182.70 s gammaloop-nextest-integration> Run with COLORBT_SHOW_HIDDEN=1 environment variable to disable frame filtering.
  273. 182.70 s gammaloop-nextest-integration> Run with RUST_BACKTRACE=full to include source snippets.
  274. 182.70 s gammaloop-nextest-integration> Warning: SpanTrace capture is Unsupported.
  275. 182.70 s gammaloop-nextest-integration> Ensure that you've setup a tracing-error ErrorLayer and the semver versions are compatible
  276. 182.70 s gammaloop-nextest-integration>
  277. 246.15 s gammaloop-nextest-integration> ------------
  278. 246.15 s gammaloop-nextest-integration> Summary [ 216.288s] 170 tests run: 168 passed, 2 failed, 209 skipped
  279. 246.15 s gammaloop-nextest-integration> FAIL [ 2.899s] ( 55/170) gammaloop-integration-tests::test_runs aa_aa::important::aa_aa_local_inspect_backend_consistency
  280. 246.15 s gammaloop-nextest-integration> stdout ---
  281. 246.15 s gammaloop-nextest-integration>
  282. 246.15 s gammaloop-nextest-integration> running 1 test
  283. 246.15 s gammaloop-nextest-integration> test aa_aa::important::aa_aa_local_inspect_backend_consistency ... FAILED
  284. 246.15 s gammaloop-nextest-integration>
  285. 246.15 s gammaloop-nextest-integration> failures:
  286. 246.15 s gammaloop-nextest-integration>
  287. 246.15 s gammaloop-nextest-integration> failures:
  288. 246.15 s gammaloop-nextest-integration> aa_aa::important::aa_aa_local_inspect_backend_consistency
  289. 246.15 s gammaloop-nextest-integration>
  290. 246.15 s gammaloop-nextest-integration> test result: FAILED. 0 passed; 1 failed; 0 ignored; 0 measured; 274 filtered out; finished in 2.89s
  291. 246.15 s gammaloop-nextest-integration>
  292. 246.15 s gammaloop-nextest-integration> stderr ---
  293. 246.15 s gammaloop-nextest-integration> [2026-09-16 22:34:25.788] @gammaloop_api::se... INFO : Running command import model sm-default.json
  294. 246.15 s gammaloop-nextest-integration> [2026-09-16 22:34:25.788] @import::model INFO : Loading built-in JSON model sm-default
  295. 246.15 s gammaloop-nextest-integration> [2026-09-16 22:34:25.810] @gammalooprs::model INFO : The following 15 external parameters were forced to zero by the restriction card:
  296. 246.15 s gammaloop-nextest-integration> lamWS, AWS, rhoWS, etaWS, ymc, yme, ymm, MC, Me, MM, WTau, muQ, muLe, muLmu, muLtau
  297. 246.15 s gammaloop-nextest-integration> [2026-09-16 22:34:25.810] @gammalooprs::model INFO : The following 34 vertex rules were removed by the restriction card:
  298. 246.15 s gammaloop-nextest-integration> V_82 -> (c~, d, G+) | V_83 -> (t~, d, G+) | V_84 -> (c~, s, G+) | V_85 -> (t~, s, G+) | V_86 -> (u~, b, G+) | V_87 -> (c~, b, G+) | V_90 -> (c~, d, W+) | V_91 -> (t~, d, W+) | V_92 -> (u~, s, W+) | V_94 -> (t~, s, W+) | V_95 -> (u~, b, W+) | V_96 -> (c~, b, W+) | V_101 -> (e+, e-, G0) | V_102 -> (mu+, mu-, G0) | V_104 -> (e+, e-, H) | V_105 -> (mu+, mu-, H) | V_110 -> (ve~, e-, G+) | V_111 -> (vm~, mu-, G+) | V_116 -> (b~, u, G-) | V_117 -> (d~, c, G-) | V_118 -> (s~, c, G-) | V_119 -> (b~, c, G-) | V_120 -> (d~, t, G-) | V_121 -> (s~, t, G-) | V_124 -> (s~, u, W-) | V_125 -> (b~, u, W-) | V_126 -> (d~, c, W-) | V_128 -> (b~, c, W-) | V_129 -> (d~, t, W-) | V_130 -> (s~, t, W-) | V_138 -> (c~, c, G0) | V_140 -> (c~, c, H) | V_145 -> (e+, ve, G-) | V_146 -> (mu+, vm, G-)
  299. 246.15 s gammaloop-nextest-integration> [2026-09-16 22:34:25.810] @gammalooprs::model INFO : The following 36 couplings were removed by the restriction card:
  300. 246.15 s gammaloop-nextest-integration> GC_13, GC_14, GC_16, GC_17, GC_18, GC_19, GC_20, GC_22, GC_23, GC_24, GC_25, GC_26, GC_28, GC_29, GC_42, GC_43, GC_44, GC_46, GC_47, GC_48, GC_84, GC_85, GC_86, GC_87, GC_88, GC_89, GC_90, GC_91, GC_92, GC_93, GC_101, GC_102, GC_103, GC_105, GC_106, GC_107
  301. 246.15 s gammaloop-nextest-integration> [2026-09-16 22:34:25.811] @gammaloop_api::se... INFO : Running command run set_model_parameters
  302. 246.15 s gammaloop-nextest-integration> [2026-09-16 22:34:25.811] @gammaloop_api::se... INFO : Starting command block set_model_parameters
  303. 246.15 s gammaloop-nextest-integration> [2026-09-16 22:34:25.811] @gammaloop_api::se... INFO : Running command set model MT=173.0
  304. 246.15 s gammaloop-nextest-integration> [2026-09-16 22:34:25.816] @gammaloop_api::se... INFO : Running command set model WT=0.0
  305. 246.15 s gammaloop-nextest-integration> [2026-09-16 22:34:25.820] @gammaloop_api::se... INFO : Running command set model ymt=173.0
  306. 246.15 s gammaloop-nextest-integration> [2026-09-16 22:34:25.824] @gammaloop_api::se... INFO : Running command set model aS=0.118
  307. 246.15 s gammaloop-nextest-integration> [2026-09-16 22:34:25.829] @gammaloop_api::se... INFO : Running command set model aEWM1=137.036
  308. 246.15 s gammaloop-nextest-integration> [2026-09-16 22:34:25.834] @gammaloop_api::se... INFO : Running command set model Gf=1.166390e-05
  309. 246.15 s gammaloop-nextest-integration> [2026-09-16 22:34:25.838] @gammaloop_api::se... INFO : Running command set model MZ=91.188
  310. 246.15 s gammaloop-nextest-integration> [2026-09-16 22:34:25.843] @gammaloop_api::se... INFO : Running command set global string '
  311. 246.15 s gammaloop-nextest-integration> [global.generation.compile]
  312. 246.15 s gammaloop-nextest-integration> compilation_mode = "symjit"
  313. 246.15 s gammaloop-nextest-integration> optimization_level = "O0"
  314. 246.15 s gammaloop-nextest-integration> fast_math = false
  315. 246.15 s gammaloop-nextest-integration> [...]
  316. 246.15 s gammaloop-nextest-integration> [2026-09-16 22:34:25.844] @gammaloop_api::se... INFO : Running command import graphs ./examples/cli/aa_aa/1L/aa_aa_1L.dot -p aa_aa_all_helicities -i 1L_ppmm -o
  317. 246.15 s gammaloop-nextest-integration> [2026-09-16 22:34:25.844] @commands::import INFO : Loading graphs from '/build/source/examples/cli/aa_aa/1L/aa_aa_1L.dot'
  318. 246.15 s gammaloop-nextest-integration> [2026-09-16 22:34:25.853] @gammaloop_api::se... INFO : Running command generate existing -p aa_aa_all_helicities
  319. 246.15 s gammaloop-nextest-integration> The application panicked (crashed).
  320. 246.15 s gammaloop-nextest-integration> Message: label _func_power_ not found
  321. 246.15 s gammaloop-nextest-integration> Location: /nix/store/n9w914kh1cm59xx3spcs831cdyb56m32-vendor-cargo-deps/c19b7c6f923b580ac259164a89f2577984ad5ab09ee9d583b888f934adbbe8d0/symjit-2.25.6/src/symjit/assembler.rs:77
  322. 246.15 s gammaloop-nextest-integration>
  323. 246.15 s gammaloop-nextest-integration> ━━━━━━━━━━━━━━━━━━━━━━━━━━━━━━━━━━ BACKTRACE ━━━━━━━━━━━━━━━━━━━━━━━━━━━━━━━━━━━
  324. 246.15 s gammaloop-nextest-integration> 1: <color_eyre[51793ea62743adbd]::config::PanicHook>::panic_report<unknown>
  325. 246.15 s gammaloop-nextest-integration> at <unknown source file>:<unknown line>
  326. 246.15 s gammaloop-nextest-integration> 2: <color_eyre[51793ea62743adbd]::config::PanicHook>::into_panic_hook::{closure#0}<unknown>
  327. 246.15 s gammaloop-nextest-integration> at <unknown source file>:<unknown line>
  328. 246.15 s gammaloop-nextest-integration> 3: std[bcb96dfbba0ab899]::panicking::panic_with_hook<unknown>
  329. 246.15 s gammaloop-nextest-integration> at <unknown source file>:<unknown line>
  330. 246.15 s gammaloop-nextest-integration> 4: std[bcb96dfbba0ab899]::panicking::panic_handler::{closure#0}<unknown>
  331. 246.15 s gammaloop-nextest-integration> at <unknown source file>:<unknown line>
  332. 246.15 s gammaloop-nextest-integration> 5: std[bcb96dfbba0ab899]::sys::backtrace::__rust_end_short_backtrace::<std[bcb96dfbba0ab899]::panicking::panic_handler::{closure#0}, !><unknown>
  333. 246.15 s gammaloop-nextest-integration> at <unknown source file>:<unknown line>
  334. 246.15 s gammaloop-nextest-integration> 6: __rustc[6c289b9f9c454d21]::rust_begin_unwind<unknown>
  335. 246.15 s gammaloop-nextest-integration> at <unknown source file>:<unknown line>
  336. 246.15 s gammaloop-nextest-integration> 7: core[940e698046960fd5]::panicking::panic_fmt<unknown>
  337. 246.15 s gammaloop-nextest-integration> at <unknown source file>:<unknown line>
  338. 246.15 s gammaloop-nextest-integration> 8: <symjit[e408de789c333cd]::symjit::assembler::Assembler>::apply_jumps<unknown>
  339. 246.15 s gammaloop-nextest-integration> at <unknown source file>:<unknown line>
  340. 246.15 s gammaloop-nextest-integration> 9: <symjit[e408de789c333cd]::symjit::builder::Builder>::compile_from_mir::<symjit[e408de789c333cd]::symjit::amd::complex::AmdComplexGenerator><unknown>
  341. 246.15 s gammaloop-nextest-integration> at <unknown source file>:<unknown line>
  342. 246.15 s gammaloop-nextest-integration> 10: <symjit[e408de789c333cd]::symjit::runnable::Application>::compile_ty<unknown>
  343. 246.15 s gammaloop-nextest-integration> at <unknown source file>:<unknown line>
  344. 246.15 s gammaloop-nextest-integration> 11: <symjit[e408de789c333cd]::symjit::runnable::Application>::with_mir<unknown>
  345. 246.15 s gammaloop-nextest-integration> at <unknown source file>:<unknown line>
  346. 246.15 s gammaloop-nextest-integration> 12: <symjit[e408de789c333cd]::symjit::composer::DirectTranslator as symjit[e408de789c333cd]::symjit::composer::Composer>::compile<unknown>
  347. 246.15 s gammaloop-nextest-integration> at <unknown source file>:<unknown line>
  348. 246.15 s gammaloop-nextest-integration> 13: <symjit[e408de789c333cd]::symjit::compiler::Translator as symjit[e408de789c333cd]::symjit::composer::Composer>::compile<unknown>
  349. 246.15 s gammaloop-nextest-integration> at <unknown source file>:<unknown line>
  350. 246.15 s gammaloop-nextest-integration> 14: <numerica[124dab8567f4861e]::domains::float::complex::Complex<f64> as symbolica[10e259bab675d243]::evaluate::backend::JITCompiledNumber>::jit_compile<unknown>
  351. 246.15 s gammaloop-nextest-integration> at <unknown source file>:<unknown line>
  352. 246.15 s gammaloop-nextest-integration> 15: <symbolica[10e259bab675d243]::evaluate::evaluator::ExpressionEvaluator<numerica[124dab8567f4861e]::domains::float::complex::Complex<f64>>>::jit_compile<unknown>
  353. 246.15 s gammaloop-nextest-integration> at <unknown source file>:<unknown line>
  354. 246.15 s gammaloop-nextest-integration> 16: <gammalooprs[917cbd3df9e68f8f]::integrands::process::evaluators::GenericEvaluator>::activate_symjit<unknown>
  355. 246.15 s gammaloop-nextest-integration> at <unknown source file>:<unknown line>
  356. 246.15 s gammaloop-nextest-integration> 17: <gammalooprs[917cbd3df9e68f8f]::integrands::process::amplitude::AmplitudeIntegrand>::prepare_runtime_backends_after_generation_with_compile_times<unknown>
  357. 246.15 s gammaloop-nextest-integration> at <unknown source file>:<unknown line>
  358. 246.15 s gammaloop-nextest-integration> 18: <gammalooprs[917cbd3df9e68f8f]::processes::amplitude::Amplitude>::build_integrand<unknown>
  359. 246.15 s gammaloop-nextest-integration> at <unknown source file>:<unknown line>
  360. 246.15 s gammaloop-nextest-integration> 19: <gammalooprs[917cbd3df9e68f8f]::processes::process::Process>::generate_integrands<unknown>
  361. 246.15 s gammaloop-nextest-integration> at <unknown source file>:<unknown line>
  362. 246.15 s gammaloop-nextest-integration> 20: <gammaloop_api[9ebf6628f97aeb57]::state::State>::generate_integrand<unknown>
  363. 246.15 s gammaloop-nextest-integration> at <unknown source file>:<unknown line>
  364. 246.15 s gammaloop-nextest-integration> 21: <gammaloop_api[9ebf6628f97aeb57]::commands::generate::Generate>::run::<&std[bcb96dfbba0ab899]::path::PathBuf><unknown>
  365. 246.15 s gammaloop-nextest-integration> at <unknown source file>:<unknown line>
  366. 246.15 s gammaloop-nextest-integration> 22: <gammaloop_api[9ebf6628f97aeb57]::commands::Commands>::run<unknown>
  367. 246.15 s gammaloop-nextest-integration> at <unknown source file>:<unknown line>
  368. 246.15 s gammaloop-nextest-integration> 23: <gammaloop_api[9ebf6628f97aeb57]::session::CliSession>::execute_prepared<unknown>
  369. 246.15 s gammaloop-nextest-integration> at <unknown source file>:<unknown line>
  370. 246.15 s gammaloop-nextest-integration> 24: <gammaloop_api[9ebf6628f97aeb57]::session::CliSession>::execute_command<unknown>
  371. 246.15 s gammaloop-nextest-integration> at <unknown source file>:<unknown line>
  372. 246.15 s gammaloop-nextest-integration> 25: <gammaloop_integration_tests[191607b70c61cd5a]::CLIState>::run_command<unknown>
  373. 246.15 s gammaloop-nextest-integration> at <unknown source file>:<unknown line>
  374. 246.15 s gammaloop-nextest-integration> 26: test_runs[9b7e2dc2dc4f29b0]::aa_aa::generate_aa_aa_helicity_family<unknown>
  375. 246.15 s gammaloop-nextest-integration> at <unknown source file>:<unknown line>
  376. 246.15 s gammaloop-nextest-integration> 27: <test_runs[9b7e2dc2dc4f29b0]::aa_aa::important::aa_aa_local_inspect_backend_consistency::{closure#0} as core[940e698046960fd5]::ops::function::FnOnce<()>>::call_once<unknown>
  377. 246.15 s gammaloop-nextest-integration> at <unknown source file>:<unknown line>
  378. 246.15 s gammaloop-nextest-integration> 28: serial_test[cd99724524a2f1c0]::serial_code_lock::local_serial_core_with_return::<(), eyre[cb2fd339c0c40fca]::Report><unknown>
  379. 246.15 s gammaloop-nextest-integration> at <unknown source file>:<unknown line>
  380. 246.15 s gammaloop-nextest-integration> 29: <test_runs[9b7e2dc2dc4f29b0]::aa_aa::important::aa_aa_local_inspect_backend_consistency::{closure#0} as core[940e698046960fd5]::ops::function::FnOnce<()>>::call_once<unknown>
  381. 246.15 s gammaloop-nextest-integration> at <unknown source file>:<unknown line>
  382. 246.15 s gammaloop-nextest-integration> 30: test[75d6903177b1d7e9]::__rust_begin_short_backtrace::<core[940e698046960fd5]::result::Result<(), alloc[2ea6bcb46fca0c42]::string::String>, fn() -> core[940e698046960fd5]::result::Result<(), alloc[2ea6bcb46fca0c42]::string::String>><unknown>
  383. 246.15 s gammaloop-nextest-integration> at <unknown source file>:<unknown line>
  384. 246.15 s gammaloop-nextest-integration> 31: test[75d6903177b1d7e9]::run_test::{closure#0}<unknown>
  385. 246.15 s gammaloop-nextest-integration> at <unknown source file>:<unknown line>
  386. 246.15 s gammaloop-nextest-integration> 32: std[bcb96dfbba0ab899]::sys::backtrace::__rust_begin_short_backtrace::<test[75d6903177b1d7e9]::run_test::{closure#1}, ()><unknown>
  387. 246.15 s gammaloop-nextest-integration> at <unknown source file>:<unknown line>
  388. 246.15 s gammaloop-nextest-integration> 33: <std[bcb96dfbba0ab899]::thread::lifecycle::spawn_unchecked<test[75d6903177b1d7e9]::run_test::{closure#1}, ()>::{closure#1} as core[940e698046960fd5]::ops::function::FnOnce<()>>::call_once::{shim:vtable#0}<unknown>
  389. 246.15 s gammaloop-nextest-integration> at <unknown source file>:<unknown line>
  390. 246.15 s gammaloop-nextest-integration> 34: <std[bcb96dfbba0ab899]::sys::thread::unix::Thread>::new::thread_start<unknown>
  391. 246.15 s gammaloop-nextest-integration> at <unknown source file>:<unknown line>
  392. 246.15 s gammaloop-nextest-integration> 35: start_thread<unknown>
  393. 246.15 s gammaloop-nextest-integration> at <unknown source file>:<unknown line>
  394. 246.15 s gammaloop-nextest-integration> 36: __clone3<unknown>
  395. 246.15 s gammaloop-nextest-integration> at <unknown source file>:<unknown line>
  396. 246.15 s gammaloop-nextest-integration>
  397. 246.15 s gammaloop-nextest-integration> Run with COLORBT_SHOW_HIDDEN=1 environment variable to disable frame filtering.
  398. 246.15 s gammaloop-nextest-integration> Run with RUST_BACKTRACE=full to include source snippets.
  399. 246.15 s gammaloop-nextest-integration> Warning: SpanTrace capture is Unsupported.
  400. 246.15 s gammaloop-nextest-integration> Ensure that you've setup a tracing-error ErrorLayer and the semver versions are compatible
  401. 246.15 s gammaloop-nextest-integration>
  402. 246.15 s gammaloop-nextest-integration> FAIL [ 5.666s] (158/170) gammaloop-integration-tests::uv thermal_sunrise_uv
  403. 246.15 s gammaloop-nextest-integration> stdout ---
  404. 246.15 s gammaloop-nextest-integration>
  405. 246.15 s gammaloop-nextest-integration> running 1 test
  406. 246.15 s gammaloop-nextest-integration> test thermal_sunrise_uv ... FAILED
  407. 246.15 s gammaloop-nextest-integration>
  408. 246.15 s gammaloop-nextest-integration> failures:
  409. 246.15 s gammaloop-nextest-integration>
  410. 246.15 s gammaloop-nextest-integration> failures:
  411. 246.15 s gammaloop-nextest-integration> thermal_sunrise_uv
  412. 246.15 s gammaloop-nextest-integration>
  413. 246.15 s gammaloop-nextest-integration> test result: FAILED. 0 passed; 1 failed; 0 ignored; 0 measured; 31 filtered out; finished in 5.63s
  414. 246.15 s gammaloop-nextest-integration>
  415. 246.15 s gammaloop-nextest-integration> stderr ---
  416. 246.15 s gammaloop-nextest-integration> [2026-09-16 22:35:19.761] @gammaloop_api::se... INFO : Running command run generate
  417. 246.15 s gammaloop-nextest-integration> [2026-09-16 22:35:19.761] @gammaloop_api::se... INFO : Starting command block generate
  418. 246.15 s gammaloop-nextest-integration> [2026-09-16 22:35:19.761] @gammaloop_api::se... INFO : Running command import model sm-default.json
  419. 246.15 s gammaloop-nextest-integration> [2026-09-16 22:35:19.761] @import::model INFO : Loading built-in JSON model sm-default
  420. 246.15 s gammaloop-nextest-integration> [2026-09-16 22:35:19.810] @gammalooprs::model INFO : The following 15 external parameters were forced to zero by the restriction card:
  421. 246.15 s gammaloop-nextest-integration> lamWS, AWS, rhoWS, etaWS, ymc, yme, ymm, MC, Me, MM, WTau, muQ, muLe, muLmu, muLtau
  422. 246.15 s gammaloop-nextest-integration> [2026-09-16 22:35:19.810] @gammalooprs::model INFO : The following 34 vertex rules were removed by the restriction card:
  423. 246.15 s gammaloop-nextest-integration> V_82 -> (c~, d, G+) | V_83 -> (t~, d, G+) | V_84 -> (c~, s, G+) | V_85 -> (t~, s, G+) | V_86 -> (u~, b, G+) | V_87 -> (c~, b, G+) | V_90 -> (c~, d, W+) | V_91 -> (t~, d, W+) | V_92 -> (u~, s, W+) | V_94 -> (t~, s, W+) | V_95 -> (u~, b, W+) | V_96 -> (c~, b, W+) | V_101 -> (e+, e-, G0) | V_102 -> (mu+, mu-, G0) | V_104 -> (e+, e-, H) | V_105 -> (mu+, mu-, H) | V_110 -> (ve~, e-, G+) | V_111 -> (vm~, mu-, G+) | V_116 -> (b~, u, G-) | V_117 -> (d~, c, G-) | V_118 -> (s~, c, G-) | V_119 -> (b~, c, G-) | V_120 -> (d~, t, G-) | V_121 -> (s~, t, G-) | V_124 -> (s~, u, W-) | V_125 -> (b~, u, W-) | V_126 -> (d~, c, W-) | V_128 -> (b~, c, W-) | V_129 -> (d~, t, W-) | V_130 -> (s~, t, W-) | V_138 -> (c~, c, G0) | V_140 -> (c~, c, H) | V_145 -> (e+, ve, G-) | V_146 -> (mu+, vm, G-)
  424. 246.15 s gammaloop-nextest-integration> [2026-09-16 22:35:19.810] @gammalooprs::model INFO : The following 36 couplings were removed by the restriction card:
  425. 246.15 s gammaloop-nextest-integration> GC_13, GC_14, GC_16, GC_17, GC_18, GC_19, GC_20, GC_22, GC_23, GC_24, GC_25, GC_26, GC_28, GC_29, GC_42, GC_43, GC_44, GC_46, GC_47, GC_48, GC_84, GC_85, GC_86, GC_87, GC_88, GC_89, GC_90, GC_91, GC_92, GC_93, GC_101, GC_102, GC_103, GC_105, GC_106, GC_107
  426. 246.15 s gammaloop-nextest-integration> [2026-09-16 22:35:19.811] @gammaloop_api::se... INFO : Running command remove processes
  427. 246.15 s gammaloop-nextest-integration> [2026-09-16 22:35:19.811] @gammaloop_api::se... INFO : Running command generate amp {} > {} [{2}] | g u
  428. 246.16 s gammaloop-nextest-integration> --numerator-grouping group_identical_graphs_up_to_scalar_rescaling
  429. 246.16 s gammaloop-nextest-integration> --max-n-bridges 0
  430. 246.16 s gammaloop-nextest-integration> --number-of-factorized-loop-subtopologies 1 1
  431. 246.16 s gammaloop-nextest-integration> --number-of-anticommutating-loops 1 1
  432. 246.16 s gammaloop-nextest-integration> [...]
  433. 246.16 s gammaloop-nextest-integration> [2026-09-16 22:35:19.812] @feyngen::diagram_... INFO : 0s | Δ=0s | Starting Feynman graph generation with Symbolica...
  434. 246.16 s gammaloop-nextest-integration> [2026-09-16 22:35:19.816] @feyngen::diagram_... INFO : 0s | Δ=0s | Number of graphs resulting from Symbolica generation: 3
  435. 246.16 s gammaloop-nextest-integration> [2026-09-16 22:35:19.819] @feyngen::diagram_... INFO : 0s | Δ=0s | Number of graphs retained after removal of vetoed topologies: 2
  436. 246.16 s gammaloop-nextest-integration> [2026-09-16 22:35:19.822] @feyngen::diagram_... INFO : 0s | Δ=0s | Number of graphs after vertex info assignment: 2
  437. 246.16 s gammaloop-nextest-integration> [2026-09-16 22:35:19.822] @feyngen::diagram_... INFO : 0s | Δ=0s | Number of graphs after all complete graphs filters are applied: 2
  438. 246.16 s gammaloop-nextest-integration> [2026-09-16 22:35:19.825] @feyngen::diagram_... INFO : 0s | Δ=0s | Number of graphs after closed anticommutating chains analysis: 1
  439. 246.16 s gammaloop-nextest-integration> [2026-09-16 22:35:19.825] @feyngen::diagram_... INFO : 0s | Δ=0s | Number of graphs after symmetrization of external states: 1
  440. 246.16 s gammaloop-nextest-integration> [2026-09-16 22:35:19.828] @feyngen::diagram_... INFO : 0s | Δ=0s | Number of graphs after canonization of vertices, edges and flows (graph labels assigned here): 1
  441. 246.16 s gammaloop-nextest-integration> [2026-09-16 22:35:19.857] @feyngen::diagram_... INFO : 0s | Δ=0s | Number of graphs after numerator-aware grouping with strategy 'up to a scalar rescaling': 1 (1 isomorphically unique graph, 0 color zero, 0 lorentz zero, 0 grouped and 0 cancellation)
  442. 246.16 s gammaloop-nextest-integration> [2026-09-16 22:35:19.857] @feyngen::diagram_... INFO : ( Sum of the symmetry factors from each graph generated = -1/2 )
  443. 246.16 s gammaloop-nextest-integration> [2026-09-16 22:35:19.857] @commands::generate INFO : Generated amplitude 1 graphs.
  444. 246.16 s gammaloop-nextest-integration> [2026-09-16 22:35:19.857] @commands::generate INFO : Only diagram generation was requested, skipping integrand generation. You can generate integrands later using the 'generate existing <options>' command.
  445. 246.16 s gammaloop-nextest-integration> [2026-09-16 22:35:19.857] @gammaloop_api::se... INFO : Running command generate
  446. 246.16 s gammaloop-nextest-integration> The application panicked (crashed).
  447. 246.16 s gammaloop-nextest-integration> Message: label _func_power_ not found
  448. 246.16 s gammaloop-nextest-integration> Location: /nix/store/n9w914kh1cm59xx3spcs831cdyb56m32-vendor-cargo-deps/c19b7c6f923b580ac259164a89f2577984ad5ab09ee9d583b888f934adbbe8d0/symjit-2.25.6/src/symjit/assembler.rs:77
  449. 246.16 s gammaloop-nextest-integration>
  450. 246.16 s gammaloop-nextest-integration> ━━━━━━━━━━━━━━━━━━━━━━━━━━━━━━━━━━ BACKTRACE ━━━━━━━━━━━━━━━━━━━━━━━━━━━━━━━━━━━
  451. 246.16 s gammaloop-nextest-integration> 1: <color_eyre[51793ea62743adbd]::config::PanicHook>::panic_report<unknown>
  452. 246.16 s gammaloop-nextest-integration> at <unknown source file>:<unknown line>
  453. 246.16 s gammaloop-nextest-integration> 2: <color_eyre[51793ea62743adbd]::config::PanicHook>::into_panic_hook::{closure#0}<unknown>
  454. 246.16 s gammaloop-nextest-integration> at <unknown source file>:<unknown line>
  455. 246.16 s gammaloop-nextest-integration> 3: std[bcb96dfbba0ab899]::panicking::panic_with_hook<unknown>
  456. 246.16 s gammaloop-nextest-integration> at <unknown source file>:<unknown line>
  457. 246.16 s gammaloop-nextest-integration> 4: std[bcb96dfbba0ab899]::panicking::panic_handler::{closure#0}<unknown>
  458. 246.16 s gammaloop-nextest-integration> at <unknown source file>:<unknown line>
  459. 246.16 s gammaloop-nextest-integration> 5: std[bcb96dfbba0ab899]::sys::backtrace::__rust_end_short_backtrace::<std[bcb96dfbba0ab899]::panicking::panic_handler::{closure#0}, !><unknown>
  460. 246.16 s gammaloop-nextest-integration> at <unknown source file>:<unknown line>
  461. 246.16 s gammaloop-nextest-integration> 6: __rustc[6c289b9f9c454d21]::rust_begin_unwind<unknown>
  462. 246.16 s gammaloop-nextest-integration> at <unknown source file>:<unknown line>
  463. 246.16 s gammaloop-nextest-integration> 7: core[940e698046960fd5]::panicking::panic_fmt<unknown>
  464. 246.16 s gammaloop-nextest-integration> at <unknown source file>:<unknown line>
  465. 246.16 s gammaloop-nextest-integration> 8: <symjit[e408de789c333cd]::symjit::assembler::Assembler>::apply_jumps<unknown>
  466. 246.16 s gammaloop-nextest-integration> at <unknown source file>:<unknown line>
  467. 246.16 s gammaloop-nextest-integration> 9: <symjit[e408de789c333cd]::symjit::builder::Builder>::compile_from_mir::<symjit[e408de789c333cd]::symjit::amd::complex::AmdComplexGenerator><unknown>
  468. 246.16 s gammaloop-nextest-integration> at <unknown source file>:<unknown line>
  469. 246.16 s gammaloop-nextest-integration> 10: <symjit[e408de789c333cd]::symjit::runnable::Application>::compile_ty<unknown>
  470. 246.16 s gammaloop-nextest-integration> at <unknown source file>:<unknown line>
  471. 246.16 s gammaloop-nextest-integration> 11: <symjit[e408de789c333cd]::symjit::runnable::Application>::with_mir<unknown>
  472. 246.16 s gammaloop-nextest-integration> at <unknown source file>:<unknown line>
  473. 246.16 s gammaloop-nextest-integration> 12: <symjit[e408de789c333cd]::symjit::composer::DirectTranslator as symjit[e408de789c333cd]::symjit::composer::Composer>::compile<unknown>
  474. 246.16 s gammaloop-nextest-integration> at <unknown source file>:<unknown line>
  475. 246.16 s gammaloop-nextest-integration> 13: <symjit[e408de789c333cd]::symjit::compiler::Translator as symjit[e408de789c333cd]::symjit::composer::Composer>::compile<unknown>
  476. 246.16 s gammaloop-nextest-integration> at <unknown source file>:<unknown line>
  477. 246.16 s gammaloop-nextest-integration> 14: <numerica[124dab8567f4861e]::domains::float::complex::Complex<f64> as symbolica[10e259bab675d243]::evaluate::backend::JITCompiledNumber>::jit_compile<unknown>
  478. 246.16 s gammaloop-nextest-integration> at <unknown source file>:<unknown line>
  479. 246.16 s gammaloop-nextest-integration> 15: <symbolica[10e259bab675d243]::evaluate::evaluator::ExpressionEvaluator<numerica[124dab8567f4861e]::domains::float::complex::Complex<f64>>>::jit_compile<unknown>
  480. 246.16 s gammaloop-nextest-integration> at <unknown source file>:<unknown line>
  481. 246.16 s gammaloop-nextest-integration> 16: <gammalooprs[917cbd3df9e68f8f]::integrands::process::evaluators::GenericEvaluator>::activate_symjit<unknown>
  482. 246.16 s gammaloop-nextest-integration> at <unknown source file>:<unknown line>
  483. 246.16 s gammaloop-nextest-integration> 17: <gammalooprs[917cbd3df9e68f8f]::integrands::process::amplitude::AmplitudeIntegrand>::prepare_runtime_backends_after_generation_with_compile_times<unknown>
  484. 246.16 s gammaloop-nextest-integration> at <unknown source file>:<unknown line>
  485. 246.16 s gammaloop-nextest-integration> 18: <gammalooprs[917cbd3df9e68f8f]::processes::amplitude::Amplitude>::build_integrand<unknown>
  486. 246.16 s gammaloop-nextest-integration> at <unknown source file>:<unknown line>
  487. 246.16 s gammaloop-nextest-integration> 19: <gammalooprs[917cbd3df9e68f8f]::processes::process::Process>::generate_integrands<unknown>
  488. 246.16 s gammaloop-nextest-integration> at <unknown source file>:<unknown line>
  489. 246.16 s gammaloop-nextest-integration> 20: <gammalooprs[917cbd3df9e68f8f]::processes::ProcessList>::generate_integrands<unknown>
  490. 246.16 s gammaloop-nextest-integration> at <unknown source file>:<unknown line>
  491. 246.16 s gammaloop-nextest-integration> 21: <gammaloop_api[9ebf6628f97aeb57]::state::State>::generate_integrands<unknown>
  492. 246.16 s gammaloop-nextest-integration> at <unknown source file>:<unknown line>
  493. 246.16 s gammaloop-nextest-integration> 22: <gammaloop_api[9ebf6628f97aeb57]::commands::generate::Generate>::run::<&std[bcb96dfbba0ab899]::path::PathBuf><unknown>
  494. 246.16 s gammaloop-nextest-integration> at <unknown source file>:<unknown line>
  495. 246.16 s gammaloop-nextest-integration> 23: <gammaloop_api[9ebf6628f97aeb57]::commands::Commands>::run<unknown>
  496. 246.16 s gammaloop-nextest-integration> at <unknown source file>:<unknown line>
  497. 246.16 s gammaloop-nextest-integration> 24: <gammaloop_api[9ebf6628f97aeb57]::session::CliSession>::execute_prepared<unknown>
  498. 246.16 s gammaloop-nextest-integration> at <unknown source file>:<unknown line>
  499. 246.16 s gammaloop-nextest-integration> 25: <gammaloop_api[9ebf6628f97aeb57]::session::CliSession>::execute_prepared_commands<unknown>
  500. 246.16 s gammaloop-nextest-integration> at <unknown source file>:<unknown line>
  501. 246.16 s gammaloop-nextest-integration> 26: <gammaloop_api[9ebf6628f97aeb57]::session::CliSession>::execute_prepared<unknown>
  502. 246.16 s gammaloop-nextest-integration> at <unknown source file>:<unknown line>
  503. 246.16 s gammaloop-nextest-integration> 27: <gammaloop_api[9ebf6628f97aeb57]::session::CliSession>::execute_command<unknown>
  504. 246.16 s gammaloop-nextest-integration> at <unknown source file>:<unknown line>
  505. 246.16 s gammaloop-nextest-integration> 28: <gammaloop_integration_tests[191607b70c61cd5a]::CLIState>::run_command<unknown>
  506. 246.16 s gammaloop-nextest-integration> at <unknown source file>:<unknown line>
  507. 246.16 s gammaloop-nextest-integration> 29: uv[3c7454ef256d6487]::run_single_integrated_uv_case<unknown>
  508. 246.16 s gammaloop-nextest-integration> at <unknown source file>:<unknown line>
  509. 246.16 s gammaloop-nextest-integration> 30: <uv[3c7454ef256d6487]::thermal_sunrise_uv::{closure#0} as core[940e698046960fd5]::ops::function::FnOnce<()>>::call_once<unknown>
  510. 246.16 s gammaloop-nextest-integration> at <unknown source file>:<unknown line>
  511. 246.16 s gammaloop-nextest-integration> 31: test[75d6903177b1d7e9]::__rust_begin_short_backtrace::<core[940e698046960fd5]::result::Result<(), alloc[2ea6bcb46fca0c42]::string::String>, fn() -> core[940e698046960fd5]::result::Result<(), alloc[2ea6bcb46fca0c42]::string::String>><unknown>
  512. 246.16 s gammaloop-nextest-integration> at <unknown source file>:<unknown line>
  513. 246.16 s gammaloop-nextest-integration> 32: test[75d6903177b1d7e9]::run_test::{closure#0}<unknown>
  514. 246.16 s gammaloop-nextest-integration> at <unknown source file>:<unknown line>
  515. 246.16 s gammaloop-nextest-integration> 33: std[bcb96dfbba0ab899]::sys::backtrace::__rust_begin_short_backtrace::<test[75d6903177b1d7e9]::run_test::{closure#1}, ()><unknown>
  516. 246.16 s gammaloop-nextest-integration> at <unknown source file>:<unknown line>
  517. 246.16 s gammaloop-nextest-integration> 34: <std[bcb96dfbba0ab899]::thread::lifecycle::spawn_unchecked<test[75d6903177b1d7e9]::run_test::{closure#1}, ()>::{closure#1} as core[940e698046960fd5]::ops::function::FnOnce<()>>::call_once::{shim:vtable#0}<unknown>
  518. 246.16 s gammaloop-nextest-integration> at <unknown source file>:<unknown line>
  519. 246.16 s gammaloop-nextest-integration> 35: <std[bcb96dfbba0ab899]::sys::thread::unix::Thread>::new::thread_start<unknown>
  520. 246.16 s gammaloop-nextest-integration> at <unknown source file>:<unknown line>
  521. 246.16 s gammaloop-nextest-integration> 36: start_thread<unknown>
  522. 246.16 s gammaloop-nextest-integration> at <unknown source file>:<unknown line>
  523. 246.16 s gammaloop-nextest-integration> 37: __clone3<unknown>
  524. 246.16 s gammaloop-nextest-integration> at <unknown source file>:<unknown line>
  525. 246.16 s gammaloop-nextest-integration>
  526. 246.16 s gammaloop-nextest-integration> Run with COLORBT_SHOW_HIDDEN=1 environment variable to disable frame filtering.
  527. 246.16 s gammaloop-nextest-integration> Run with RUST_BACKTRACE=full to include source snippets.
  528. 246.16 s gammaloop-nextest-integration> Warning: SpanTrace capture is Unsupported.
  529. 246.16 s gammaloop-nextest-integration> Ensure that you've setup a tracing-error ErrorLayer and the semver versions are compatible
  530. 246.16 s gammaloop-nextest-integration>
  531. 246.26 s gammaloop-nextest-integration> error: test run failed
  532. 246.29 s gammaloop-nextest-integration>
  533. 246.29 s gammaloop-nextest-integration> ========== nextest test summary ==========
  534. 246.29 s gammaloop-nextest-integration> report: target/nextest/ci_gammaloop/junit.xml
  535. 246.29 s gammaloop-nextest-integration> tests: 170, failures: 2, errors: 0
  536. 246.29 s gammaloop-nextest-integration>
  537. 246.29 s gammaloop-nextest-integration> 1. gammaloop-integration-tests::test_runs::aa_aa::important::aa_aa_local_inspect_backend_consistency
  538. 246.29 s gammaloop-nextest-integration> failure: test failure with exit code 101
  539. 246.29 s gammaloop-nextest-integration> system-out
  540. 246.29 s gammaloop-nextest-integration> running 1 test
  541. 246.29 s gammaloop-nextest-integration> test aa_aa::important::aa_aa_local_inspect_backend_consistency ... FAILED
  542. 246.29 s gammaloop-nextest-integration>
  543. 246.29 s gammaloop-nextest-integration> failures:
  544. 246.29 s gammaloop-nextest-integration>
  545. 246.29 s gammaloop-nextest-integration> failures:
  546. 246.29 s gammaloop-nextest-integration> aa_aa::important::aa_aa_local_inspect_backend_consistency
  547. 246.29 s gammaloop-nextest-integration>
  548. 246.29 s gammaloop-nextest-integration> test result: FAILED. 0 passed; 1 failed; 0 ignored; 0 measured; 274 filtered out; finished in 2.89s
  549. 246.29 s gammaloop-nextest-integration> system-err
  550. 246.29 s gammaloop-nextest-integration> [2026-09-16 22:34:25.788] @gammaloop_api::se... INFO : Running command import model sm-default.json
  551. 246.29 s gammaloop-nextest-integration> [2026-09-16 22:34:25.788] @import::model INFO : Loading built-in JSON model sm-default
  552. 246.29 s gammaloop-nextest-integration> [2026-09-16 22:34:25.810] @gammalooprs::model INFO : The following 15 external parameters were forced to zero by the restriction card:
  553. 246.29 s gammaloop-nextest-integration> lamWS, AWS, rhoWS, etaWS, ymc, yme, ymm, MC, Me, MM, WTau, muQ, muLe, muLmu, muLtau
  554. 246.29 s gammaloop-nextest-integration> [2026-09-16 22:34:25.810] @gammalooprs::model INFO : The following 34 vertex rules were removed by the restriction card:
  555. 246.29 s gammaloop-nextest-integration> V_82 -> (c~, d, G+) | V_83 -> (t~, d, G+) | V_84 -> (c~, s, G+) | V_85 -> (t~, s, G+) | V_86 -> (u~, b, G+) | V_87 -> (c~, b, G+) | V_90 -> (c~, d, W+) | V_91 -> (t~, d, W+) | V_92 -> (u~, s, W+) | V_94 -> (t~, s, W+) | V_95 -> (u~, b, W+) | V_96 -> (c~, b, W+) | V_101 -> (e+, e-, G0) | V_102 -> (mu+, mu-, G0) | V_104 -> (e+, e-, H) | V_105 -> (mu+, mu-, H) | V_110 -> (ve~, e-, G+) | V_111 -> (vm~, mu-, G+) | V_116 -> (b~, u, G-) | V_117 -> (d~, c, G-) | V_118 -> (s~, c, G-) | V_119 -> (b~, c, G-) | V_120 -> (d~, t, G-) | V_121 -> (s~, t, G-) | V_124 -> (s~, u, W-) | V_125 -> (b~, u, W-) | V_126 -> (d~, c, W-) | V_128 -> (b~, c, W-) | V_129 -> (d~, t, W-) | V_130 -> (s~, t, W-) | V_138 -> (c~, c, G0) | V_140 -> (c~, c, H) | V_145 -> (e+, ve, G-) | V_146 -> (mu+, vm, G-)
  556. 246.29 s gammaloop-nextest-integration> [2026-09-16 22:34:25.810] @gammalooprs::model INFO : The following 36 couplings were removed by the restriction card:
  557. 246.29 s gammaloop-nextest-integration> GC_13, GC_14, GC_16, GC_17, GC_18, GC_19, GC_20, GC_22, GC_23, GC_24, GC_25, GC_26, GC_28, GC_29, GC_42, GC_43, GC_44, GC_46, GC_47, GC_48, GC_84, GC_85, GC_86, GC_87, GC_88, GC_89, GC_90, GC_91, GC_92, GC_93, GC_101, GC_102, GC_103, GC_105, GC_106, GC_107
  558. 246.29 s gammaloop-nextest-integration> [2026-09-16 22:34:25.811] @gammaloop_api::se... INFO : Running command run set_model_parameters
  559. 246.29 s gammaloop-nextest-integration> [2026-09-16 22:34:25.811] @gammaloop_api::se... INFO : Starting command block set_model_parameters
  560. 246.29 s gammaloop-nextest-integration> [2026-09-16 22:34:25.811] @gammaloop_api::se... INFO : Running command set model MT=173.0
  561. 246.29 s gammaloop-nextest-integration> [2026-09-16 22:34:25.816] @gammaloop_api::se... INFO : Running command set model WT=0.0
  562. 246.29 s gammaloop-nextest-integration> [2026-09-16 22:34:25.820] @gammaloop_api::se... INFO : Running command set model ymt=173.0
  563. 246.29 s gammaloop-nextest-integration> [2026-09-16 22:34:25.824] @gammaloop_api::se... INFO : Running command set model aS=0.118
  564. 246.29 s gammaloop-nextest-integration> [2026-09-16 22:34:25.829] @gammaloop_api::se... INFO : Running command set model aEWM1=137.036
  565. 246.29 s gammaloop-nextest-integration> [2026-09-16 22:34:25.834] @gammaloop_api::se... INFO : Running command set model Gf=1.166390e-05
  566. 246.29 s gammaloop-nextest-integration> [2026-09-16 22:34:25.838] @gammaloop_api::se... INFO : Running command set model MZ=91.188
  567. 246.29 s gammaloop-nextest-integration> [2026-09-16 22:34:25.843] @gammaloop_api::se... INFO : Running command set global string '
  568. 246.29 s gammaloop-nextest-integration> [global.generation.compile]
  569. 246.29 s gammaloop-nextest-integration> compilation_mode = "symjit"
  570. 246.29 s gammaloop-nextest-integration> optimization_level = "O0"
  571. 246.29 s gammaloop-nextest-integration> fast_math = false
  572. 246.29 s gammaloop-nextest-integration> [...]
  573. 246.29 s gammaloop-nextest-integration> [2026-09-16 22:34:25.844] @gammaloop_api::se... INFO : Running command import graphs ./examples/cli/aa_aa/1L/aa_aa_1L.dot -p aa_aa_all_helicities -i 1L_ppmm -o
  574. 246.29 s gammaloop-nextest-integration> [2026-09-16 22:34:25.844] @commands::import INFO : Loading graphs from '/build/source/examples/cli/aa_aa/1L/aa_aa_1L.dot'
  575. 246.29 s gammaloop-nextest-integration> [2026-09-16 22:34:25.853] @gammaloop_api::se... INFO : Running command generate existing -p aa_aa_all_helicities
  576. 246.29 s gammaloop-nextest-integration> The application panicked (crashed).
  577. 246.29 s gammaloop-nextest-integration> Message: label _func_power_ not found
  578. 246.29 s gammaloop-nextest-integration> Location: /nix/store/n9w914kh1cm59xx3spcs831cdyb56m32-vendor-cargo-deps/c19b7c6f923b580ac259164a89f2577984ad5ab09ee9d583b888f934adbbe8d0/symjit-2.25.6/src/symjit/assembler.rs:77
  579. 246.29 s gammaloop-nextest-integration>
  580. 246.29 s gammaloop-nextest-integration> ━━━━━━━━━━━━━━━━━━━━━━━━━━━━━━━━━━ BACKTRACE ━━━━━━━━━━━━━━━━━━━━━━━━━━━━━━━━━━━
  581. 246.29 s gammaloop-nextest-integration> 1: <color_eyre[51793ea62743adbd]::config::PanicHook>::panic_report<unknown>
  582. 246.29 s gammaloop-nextest-integration> at <unknown source file>:<unknown line>
  583. 246.29 s gammaloop-nextest-integration> 2: <color_eyre[51793ea62743adbd]::config::PanicHook>::into_panic_hook::{closure#0}<unknown>
  584. 246.29 s gammaloop-nextest-integration> at <unknown source file>:<unknown line>
  585. 246.29 s gammaloop-nextest-integration> 3: std[bcb96dfbba0ab899]::panicking::panic_with_hook<unknown>
  586. 246.29 s gammaloop-nextest-integration> at <unknown source file>:<unknown line>
  587. 246.29 s gammaloop-nextest-integration> 4: std[bcb96dfbba0ab899]::panicking::panic_handler::{closure#0}<unknown>
  588. 246.29 s gammaloop-nextest-integration> at <unknown source file>:<unknown line>
  589. 246.29 s gammaloop-nextest-integration> 5: std[bcb96dfbba0ab899]::sys::backtrace::__rust_end_short_backtrace::<std[bcb96dfbba0ab899]::panicking::panic_handler::{closure#0}, !><unknown>
  590. 246.29 s gammaloop-nextest-integration> at <unknown source file>:<unknown line>
  591. 246.29 s gammaloop-nextest-integration> 6: __rustc[6c289b9f9c454d21]::rust_begin_unwind<unknown>
  592. 246.29 s gammaloop-nextest-integration> at <unknown source file>:<unknown line>
  593. 246.29 s gammaloop-nextest-integration> 7: core[940e698046960fd5]::panicking::panic_fmt<unknown>
  594. 246.29 s gammaloop-nextest-integration> at <unknown source file>:<unknown line>
  595. 246.29 s gammaloop-nextest-integration> 8: <symjit[e408de789c333cd]::symjit::assembler::Assembler>::apply_jumps<unknown>
  596. 246.29 s gammaloop-nextest-integration> at <unknown source file>:<unknown line>
  597. 246.29 s gammaloop-nextest-integration> 9: <symjit[e408de789c333cd]::symjit::builder::Builder>::compile_from_mir::<symjit[e408de789c333cd]::symjit::amd::complex::AmdComplexGenerator><unknown>
  598. 246.29 s gammaloop-nextest-integration> at <unknown source file>:<unknown line>
  599. 246.29 s gammaloop-nextest-integration> 10: <symjit[e408de789c333cd]::symjit::runnable::Application>::compile_ty<unknown>
  600. 246.29 s gammaloop-nextest-integration> at <unknown source file>:<unknown line>
  601. 246.29 s gammaloop-nextest-integration> 11: <symjit[e408de789c333cd]::symjit::runnable::Application>::with_mir<unknown>
  602. 246.29 s gammaloop-nextest-integration> at <unknown source file>:<unknown line>
  603. 246.29 s gammaloop-nextest-integration> 12: <symjit[e408de789c333cd]::symjit::composer::DirectTranslator as symjit[e408de789c333cd]::symjit::composer::Composer>::compile<unknown>
  604. 246.29 s gammaloop-nextest-integration> at <unknown source file>:<unknown line>
  605. 246.29 s gammaloop-nextest-integration> 13: <symjit[e408de789c333cd]::symjit::compiler::Translator as symjit[e408de789c333cd]::symjit::composer::Composer>::compile<unknown>
  606. 246.29 s gammaloop-nextest-integration> at <unknown source file>:<unknown line>
  607. 246.29 s gammaloop-nextest-integration> 14: <numerica[124dab8567f4861e]::domains::float::complex::Complex<f64> as symbolica[10e259bab675d243]::evaluate::backend::JITCompiledNumber>::jit_compile<unknown>
  608. 246.29 s gammaloop-nextest-integration> at <unknown source file>:<unknown line>
  609. 246.29 s gammaloop-nextest-integration> 15: <symbolica[10e259bab675d243]::evaluate::evaluator::ExpressionEvaluator<numerica[124dab8567f4861e]::domains::float::complex::Complex<f64>>>::jit_compile<unknown>
  610. 246.29 s gammaloop-nextest-integration> at <unknown source file>:<unknown line>
  611. 246.29 s gammaloop-nextest-integration> 16: <gammalooprs[917cbd3df9e68f8f]::integrands::process::evaluators::GenericEvaluator>::activate_symjit<unknown>
  612. 246.29 s gammaloop-nextest-integration> at <unknown source file>:<unknown line>
  613. 246.29 s gammaloop-nextest-integration> 17: <gammalooprs[917cbd3df9e68f8f]::integrands::process::amplitude::AmplitudeIntegrand>::prepare_runtime_backends_after_generation_with_compile_times<unknown>
  614. 246.29 s gammaloop-nextest-integration> at <unknown source file>:<unknown line>
  615. 246.29 s gammaloop-nextest-integration> 18: <gammalooprs[917cbd3df9e68f8f]::processes::amplitude::Amplitude>::build_integrand<unknown>
  616. 246.29 s gammaloop-nextest-integration> at <unknown source file>:<unknown line>
  617. 246.29 s gammaloop-nextest-integration> 19: <gammalooprs[917cbd3df9e68f8f]::processes::process::Process>::generate_integrands<unknown>
  618. 246.29 s gammaloop-nextest-integration> at <unknown source file>:<unknown line>
  619. 246.29 s gammaloop-nextest-integration> 20: <gammaloop_api[9ebf6628f97aeb57]::state::State>::generate_integrand<unknown>
  620. 246.29 s gammaloop-nextest-integration> at <unknown source file>:<unknown line>
  621. 246.29 s gammaloop-nextest-integration> 21: <gammaloop_api[9ebf6628f97aeb57]::commands::generate::Generate>::run::<&std[bcb96dfbba0ab899]::path::PathBuf><unknown>
  622. 246.29 s gammaloop-nextest-integration> at <unknown source file>:<unknown line>
  623. 246.29 s gammaloop-nextest-integration> 22: <gammaloop_api[9ebf6628f97aeb57]::commands::Commands>::run<unknown>
  624. 246.29 s gammaloop-nextest-integration> at <unknown source file>:<unknown line>
  625. 246.29 s gammaloop-nextest-integration> 23: <gammaloop_api[9ebf6628f97aeb57]::session::CliSession>::execute_prepared<unknown>
  626. 246.29 s gammaloop-nextest-integration> at <unknown source file>:<unknown line>
  627. 246.29 s gammaloop-nextest-integration> 24: <gammaloop_api[9ebf6628f97aeb57]::session::CliSession>::execute_command<unknown>
  628. 246.29 s gammaloop-nextest-integration> at <unknown source file>:<unknown line>
  629. 246.29 s gammaloop-nextest-integration> 25: <gammaloop_integration_tests[191607b70c61cd5a]::CLIState>::run_command<unknown>
  630. 246.29 s gammaloop-nextest-integration> at <unknown source file>:<unknown line>
  631. 246.29 s gammaloop-nextest-integration> 26: test_runs[9b7e2dc2dc4f29b0]::aa_aa::generate_aa_aa_helicity_family<unknown>
  632. 246.29 s gammaloop-nextest-integration> at <unknown source file>:<unknown line>
  633. 246.29 s gammaloop-nextest-integration> 27: <test_runs[9b7e2dc2dc4f29b0]::aa_aa::important::aa_aa_local_inspect_backend_consistency::{closure#0} as core[940e698046960fd5]::ops::function::FnOnce<()>>::call_once<unknown>
  634. 246.29 s gammaloop-nextest-integration> at <unknown source file>:<unknown line>
  635. 246.29 s gammaloop-nextest-integration> 28: serial_test[cd99724524a2f1c0]::serial_code_lock::local_serial_core_with_return::<(), eyre[cb2fd339c0c40fca]::Report><unknown>
  636. 246.29 s gammaloop-nextest-integration> at <unknown source file>:<unknown line>
  637. 246.29 s gammaloop-nextest-integration> 29: <test_runs[9b7e2dc2dc4f29b0]::aa_aa::important::aa_aa_local_inspect_backend_consistency::{closure#0} as core[940e698046960fd5]::ops::function::FnOnce<()>>::call_once<unknown>
  638. 246.29 s gammaloop-nextest-integration> at <unknown source file>:<unknown line>
  639. 246.29 s gammaloop-nextest-integration> 30: test[75d6903177b1d7e9]::__rust_begin_short_backtrace::<core[940e698046960fd5]::result::Result<(), alloc[2ea6bcb46fca0c42]::string::String>, fn() -> core[940e698046960fd5]::result::Result<(), alloc[2ea6bcb46fca0c42]::string::String>><unknown>
  640. 246.29 s gammaloop-nextest-integration> at <unknown source file>:<unknown line>
  641. 246.29 s gammaloop-nextest-integration> 31: test[75d6903177b1d7e9]::run_test::{closure#0}<unknown>
  642. 246.29 s gammaloop-nextest-integration> at <unknown source file>:<unknown line>
  643. 246.29 s gammaloop-nextest-integration> 32: std[bcb96dfbba0ab899]::sys::backtrace::__rust_begin_short_backtrace::<test[75d6903177b1d7e9]::run_test::{closure#1}, ()><unknown>
  644. 246.29 s gammaloop-nextest-integration> at <unknown source file>:<unknown line>
  645. 246.29 s gammaloop-nextest-integration> 33: <std[bcb96dfbba0ab899]::thread::lifecycle::spawn_unchecked<test[75d6903177b1d7e9]::run_test::{closure#1}, ()>::{closure#1} as core[940e698046960fd5]::ops::function::FnOnce<()>>::call_once::{shim:vtable#0}<unknown>
  646. 246.29 s gammaloop-nextest-integration> at <unknown source file>:<unknown line>
  647. 246.29 s gammaloop-nextest-integration> 34: <std[bcb96dfbba0ab899]::sys::thread::unix::Thread>::new::thread_start<unknown>
  648. 246.29 s gammaloop-nextest-integration> at <unknown source file>:<unknown line>
  649. 246.29 s gammaloop-nextest-integration> 35: start_thread<unknown>
  650. 246.29 s gammaloop-nextest-integration> at <unknown source file>:<unknown line>
  651. 246.29 s gammaloop-nextest-integration> 36: __clone3<unknown>
  652. 246.29 s gammaloop-nextest-integration> at <unknown source file>:<unknown line>
  653. 246.29 s gammaloop-nextest-integration>
  654. 246.29 s gammaloop-nextest-integration> Run with COLORBT_SHOW_HIDDEN=1 environment variable to disable frame filtering.
  655. 246.29 s gammaloop-nextest-integration> Run with RUST_BACKTRACE=full to include source snippets.
  656. 246.29 s gammaloop-nextest-integration> Warning: SpanTrace capture is Unsupported.
  657. 246.29 s gammaloop-nextest-integration> Ensure that you've setup a tracing-error ErrorLayer and the semver versions are compatible
  658. 246.29 s gammaloop-nextest-integration>
  659. 246.29 s gammaloop-nextest-integration> 2. gammaloop-integration-tests::uv::thermal_sunrise_uv
  660. 246.29 s gammaloop-nextest-integration> failure: test failure with exit code 101
  661. 246.29 s gammaloop-nextest-integration> system-out
  662. 246.29 s gammaloop-nextest-integration> running 1 test
  663. 246.29 s gammaloop-nextest-integration> test thermal_sunrise_uv ... FAILED
  664. 246.29 s gammaloop-nextest-integration>
  665. 246.29 s gammaloop-nextest-integration> failures:
  666. 246.29 s gammaloop-nextest-integration>
  667. 246.29 s gammaloop-nextest-integration> failures:
  668. 246.29 s gammaloop-nextest-integration> thermal_sunrise_uv
  669. 246.29 s gammaloop-nextest-integration>
  670. 246.29 s gammaloop-nextest-integration> test result: FAILED. 0 passed; 1 failed; 0 ignored; 0 measured; 31 filtered out; finished in 5.63s
  671. 246.29 s gammaloop-nextest-integration> system-err
  672. 246.29 s gammaloop-nextest-integration> [2026-09-16 22:35:19.761] @gammaloop_api::se... INFO : Running command run generate
  673. 246.29 s gammaloop-nextest-integration> [2026-09-16 22:35:19.761] @gammaloop_api::se... INFO : Starting command block generate
  674. 246.29 s gammaloop-nextest-integration> [2026-09-16 22:35:19.761] @gammaloop_api::se... INFO : Running command import model sm-default.json
  675. 246.29 s gammaloop-nextest-integration> [2026-09-16 22:35:19.761] @import::model INFO : Loading built-in JSON model sm-default
  676. 246.29 s gammaloop-nextest-integration> [2026-09-16 22:35:19.810] @gammalooprs::model INFO : The following 15 external parameters were forced to zero by the restriction card:
  677. 246.29 s gammaloop-nextest-integration> lamWS, AWS, rhoWS, etaWS, ymc, yme, ymm, MC, Me, MM, WTau, muQ, muLe, muLmu, muLtau
  678. 246.29 s gammaloop-nextest-integration> [2026-09-16 22:35:19.810] @gammalooprs::model INFO : The following 34 vertex rules were removed by the restriction card:
  679. 246.29 s gammaloop-nextest-integration> V_82 -> (c~, d, G+) | V_83 -> (t~, d, G+) | V_84 -> (c~, s, G+) | V_85 -> (t~, s, G+) | V_86 -> (u~, b, G+) | V_87 -> (c~, b, G+) | V_90 -> (c~, d, W+) | V_91 -> (t~, d, W+) | V_92 -> (u~, s, W+) | V_94 -> (t~, s, W+) | V_95 -> (u~, b, W+) | V_96 -> (c~, b, W+) | V_101 -> (e+, e-, G0) | V_102 -> (mu+, mu-, G0) | V_104 -> (e+, e-, H) | V_105 -> (mu+, mu-, H) | V_110 -> (ve~, e-, G+) | V_111 -> (vm~, mu-, G+) | V_116 -> (b~, u, G-) | V_117 -> (d~, c, G-) | V_118 -> (s~, c, G-) | V_119 -> (b~, c, G-) | V_120 -> (d~, t, G-) | V_121 -> (s~, t, G-) | V_124 -> (s~, u, W-) | V_125 -> (b~, u, W-) | V_126 -> (d~, c, W-) | V_128 -> (b~, c, W-) | V_129 -> (d~, t, W-) | V_130 -> (s~, t, W-) | V_138 -> (c~, c, G0) | V_140 -> (c~, c, H) | V_145 -> (e+, ve, G-) | V_146 -> (mu+, vm, G-)
  680. 246.29 s gammaloop-nextest-integration> [2026-09-16 22:35:19.810] @gammalooprs::model INFO : The following 36 couplings were removed by the restriction card:
  681. 246.29 s gammaloop-nextest-integration> GC_13, GC_14, GC_16, GC_17, GC_18, GC_19, GC_20, GC_22, GC_23, GC_24, GC_25, GC_26, GC_28, GC_29, GC_42, GC_43, GC_44, GC_46, GC_47, GC_48, GC_84, GC_85, GC_86, GC_87, GC_88, GC_89, GC_90, GC_91, GC_92, GC_93, GC_101, GC_102, GC_103, GC_105, GC_106, GC_107
  682. 246.29 s gammaloop-nextest-integration> [2026-09-16 22:35:19.811] @gammaloop_api::se... INFO : Running command remove processes
  683. 246.29 s gammaloop-nextest-integration> [2026-09-16 22:35:19.811] @gammaloop_api::se... INFO : Running command generate amp {} > {} [{2}] | g u
  684. 246.29 s gammaloop-nextest-integration> --numerator-grouping group_identical_graphs_up_to_scalar_rescaling
  685. 246.29 s gammaloop-nextest-integration> --max-n-bridges 0
  686. 246.29 s gammaloop-nextest-integration> --number-of-factorized-loop-subtopologies 1 1
  687. 246.29 s gammaloop-nextest-integration> --number-of-anticommutating-loops 1 1
  688. 246.29 s gammaloop-nextest-integration> [...]
  689. 246.29 s gammaloop-nextest-integration> [2026-09-16 22:35:19.812] @feyngen::diagram_... INFO : 0s | Δ=0s | Starting Feynman graph generation with Symbolica...
  690. 246.29 s gammaloop-nextest-integration> [2026-09-16 22:35:19.816] @feyngen::diagram_... INFO : 0s | Δ=0s | Number of graphs resulting from Symbolica generation: 3
  691. 246.29 s gammaloop-nextest-integration> [2026-09-16 22:35:19.819] @feyngen::diagram_... INFO : 0s | Δ=0s | Number of graphs retained after removal of vetoed topologies: 2
  692. 246.29 s gammaloop-nextest-integration> [2026-09-16 22:35:19.822] @feyngen::diagram_... INFO : 0s | Δ=0s | Number of graphs after vertex info assignment: 2
  693. 246.29 s gammaloop-nextest-integration> [2026-09-16 22:35:19.822] @feyngen::diagram_... INFO : 0s | Δ=0s | Number of graphs after all complete graphs filters are applied: 2
  694. 246.29 s gammaloop-nextest-integration> [2026-09-16 22:35:19.825] @feyngen::diagram_... INFO : 0s | Δ=0s | Number of graphs after closed anticommutating chains analysis: 1
  695. 246.29 s gammaloop-nextest-integration> [2026-09-16 22:35:19.825] @feyngen::diagram_... INFO : 0s | Δ=0s | Number of graphs after symmetrization of external states: 1
  696. 246.29 s gammaloop-nextest-integration> [2026-09-16 22:35:19.828] @feyngen::diagram_... INFO : 0s | Δ=0s | Number of graphs after canonization of vertices, edges and flows (graph labels assigned here): 1
  697. 246.29 s gammaloop-nextest-integration> [2026-09-16 22:35:19.857] @feyngen::diagram_... INFO : 0s | Δ=0s | Number of graphs after numerator-aware grouping with strategy 'up to a scalar rescaling': 1 (1 isomorphically unique graph, 0 color zero, 0 lorentz zero, 0 grouped and 0 cancellation)
  698. 246.29 s gammaloop-nextest-integration> [2026-09-16 22:35:19.857] @feyngen::diagram_... INFO : ( Sum of the symmetry factors from each graph generated = -1/2 )
  699. 246.29 s gammaloop-nextest-integration> [2026-09-16 22:35:19.857] @commands::generate INFO : Generated amplitude 1 graphs.
  700. 246.29 s gammaloop-nextest-integration> [2026-09-16 22:35:19.857] @commands::generate INFO : Only diagram generation was requested, skipping integrand generation. You can generate integrands later using the 'generate existing <options>' command.
  701. 246.29 s gammaloop-nextest-integration> [2026-09-16 22:35:19.857] @gammaloop_api::se... INFO : Running command generate
  702. 246.29 s gammaloop-nextest-integration> The application panicked (crashed).
  703. 246.29 s gammaloop-nextest-integration> Message: label _func_power_ not found
  704. 246.29 s gammaloop-nextest-integration> Location: /nix/store/n9w914kh1cm59xx3spcs831cdyb56m32-vendor-cargo-deps/c19b7c6f923b580ac259164a89f2577984ad5ab09ee9d583b888f934adbbe8d0/symjit-2.25.6/src/symjit/assembler.rs:77
  705. 246.29 s gammaloop-nextest-integration>
  706. 246.29 s gammaloop-nextest-integration> ━━━━━━━━━━━━━━━━━━━━━━━━━━━━━━━━━━ BACKTRACE ━━━━━━━━━━━━━━━━━━━━━━━━━━━━━━━━━━━
  707. 246.29 s gammaloop-nextest-integration> 1: <color_eyre[51793ea62743adbd]::config::PanicHook>::panic_report<unknown>
  708. 246.29 s gammaloop-nextest-integration> at <unknown source file>:<unknown line>
  709. 246.29 s gammaloop-nextest-integration> 2: <color_eyre[51793ea62743adbd]::config::PanicHook>::into_panic_hook::{closure#0}<unknown>
  710. 246.29 s gammaloop-nextest-integration> at <unknown source file>:<unknown line>
  711. 246.29 s gammaloop-nextest-integration> 3: std[bcb96dfbba0ab899]::panicking::panic_with_hook<unknown>
  712. 246.29 s gammaloop-nextest-integration> at <unknown source file>:<unknown line>
  713. 246.29 s gammaloop-nextest-integration> 4: std[bcb96dfbba0ab899]::panicking::panic_handler::{closure#0}<unknown>
  714. 246.29 s gammaloop-nextest-integration> at <unknown source file>:<unknown line>
  715. 246.29 s gammaloop-nextest-integration> 5: std[bcb96dfbba0ab899]::sys::backtrace::__rust_end_short_backtrace::<std[bcb96dfbba0ab899]::panicking::panic_handler::{closure#0}, !><unknown>
  716. 246.29 s gammaloop-nextest-integration> at <unknown source file>:<unknown line>
  717. 246.29 s gammaloop-nextest-integration> 6: __rustc[6c289b9f9c454d21]::rust_begin_unwind<unknown>
  718. 246.29 s gammaloop-nextest-integration> at <unknown source file>:<unknown line>
  719. 246.29 s gammaloop-nextest-integration> 7: core[940e698046960fd5]::panicking::panic_fmt<unknown>
  720. 246.29 s gammaloop-nextest-integration> at <unknown source file>:<unknown line>
  721. 246.29 s gammaloop-nextest-integration> 8: <symjit[e408de789c333cd]::symjit::assembler::Assembler>::apply_jumps<unknown>
  722. 246.29 s gammaloop-nextest-integration> at <unknown source file>:<unknown line>
  723. 246.29 s gammaloop-nextest-integration> 9: <symjit[e408de789c333cd]::symjit::builder::Builder>::compile_from_mir::<symjit[e408de789c333cd]::symjit::amd::complex::AmdComplexGenerator><unknown>
  724. 246.29 s gammaloop-nextest-integration> at <unknown source file>:<unknown line>
  725. 246.29 s gammaloop-nextest-integration> 10: <symjit[e408de789c333cd]::symjit::runnable::Application>::compile_ty<unknown>
  726. 246.29 s gammaloop-nextest-integration> at <unknown source file>:<unknown line>
  727. 246.29 s gammaloop-nextest-integration> 11: <symjit[e408de789c333cd]::symjit::runnable::Application>::with_mir<unknown>
  728. 246.29 s gammaloop-nextest-integration> at <unknown source file>:<unknown line>
  729. 246.29 s gammaloop-nextest-integration> 12: <symjit[e408de789c333cd]::symjit::composer::DirectTranslator as symjit[e408de789c333cd]::symjit::composer::Composer>::compile<unknown>
  730. 246.29 s gammaloop-nextest-integration> at <unknown source file>:<unknown line>
  731. 246.29 s gammaloop-nextest-integration> 13: <symjit[e408de789c333cd]::symjit::compiler::Translator as symjit[e408de789c333cd]::symjit::composer::Composer>::compile<unknown>
  732. 246.29 s gammaloop-nextest-integration> at <unknown source file>:<unknown line>
  733. 246.29 s gammaloop-nextest-integration> 14: <numerica[124dab8567f4861e]::domains::float::complex::Complex<f64> as symbolica[10e259bab675d243]::evaluate::backend::JITCompiledNumber>::jit_compile<unknown>
  734. 246.29 s gammaloop-nextest-integration> at <unknown source file>:<unknown line>
  735. 246.29 s gammaloop-nextest-integration> 15: <symbolica[10e259bab675d243]::evaluate::evaluator::ExpressionEvaluator<numerica[124dab8567f4861e]::domains::float::complex::Complex<f64>>>::jit_compile<unknown>
  736. 246.29 s gammaloop-nextest-integration> at <unknown source file>:<unknown line>
  737. 246.29 s gammaloop-nextest-integration> 16: <gammalooprs[917cbd3df9e68f8f]::integrands::process::evaluators::GenericEvaluator>::activate_symjit<unknown>
  738. 246.29 s gammaloop-nextest-integration> at <unknown source file>:<unknown line>
  739. 246.29 s gammaloop-nextest-integration> 17: <gammalooprs[917cbd3df9e68f8f]::integrands::process::amplitude::AmplitudeIntegrand>::prepare_runtime_backends_after_generation_with_compile_times<unknown>
  740. 246.29 s gammaloop-nextest-integration> at <unknown source file>:<unknown line>
  741. 246.29 s gammaloop-nextest-integration> 18: <gammalooprs[917cbd3df9e68f8f]::processes::amplitude::Amplitude>::build_integrand<unknown>
  742. 246.29 s gammaloop-nextest-integration> at <unknown source file>:<unknown line>
  743. 246.29 s gammaloop-nextest-integration> 19: <gammalooprs[917cbd3df9e68f8f]::processes::process::Process>::generate_integrands<unknown>
  744. 246.29 s gammaloop-nextest-integration> at <unknown source file>:<unknown line>
  745. 246.29 s gammaloop-nextest-integration> 20: <gammalooprs[917cbd3df9e68f8f]::processes::ProcessList>::generate_integrands<unknown>
  746. 246.29 s gammaloop-nextest-integration> at <unknown source file>:<unknown line>
  747. 246.29 s gammaloop-nextest-integration> 21: <gammaloop_api[9ebf6628f97aeb57]::state::State>::generate_integrands<unknown>
  748. 246.29 s gammaloop-nextest-integration> at <unknown source file>:<unknown line>
  749. 246.29 s gammaloop-nextest-integration> 22: <gammaloop_api[9ebf6628f97aeb57]::commands::generate::Generate>::run::<&std[bcb96dfbba0ab899]::path::PathBuf><unknown>
  750. 246.29 s gammaloop-nextest-integration> at <unknown source file>:<unknown line>
  751. 246.29 s gammaloop-nextest-integration> 23: <gammaloop_api[9ebf6628f97aeb57]::commands::Commands>::run<unknown>
  752. 246.29 s gammaloop-nextest-integration> at <unknown source file>:<unknown line>
  753. 246.29 s gammaloop-nextest-integration> 24: <gammaloop_api[9ebf6628f97aeb57]::session::CliSession>::execute_prepared<unknown>
  754. 246.29 s gammaloop-nextest-integration> at <unknown source file>:<unknown line>
  755. 246.29 s gammaloop-nextest-integration> 25: <gammaloop_api[9ebf6628f97aeb57]::session::CliSession>::execute_prepared_commands<unknown>
  756. 246.29 s gammaloop-nextest-integration> at <unknown source file>:<unknown line>
  757. 246.29 s gammaloop-nextest-integration> 26: <gammaloop_api[9ebf6628f97aeb57]::session::CliSession>::execute_prepared<unknown>
  758. 246.29 s gammaloop-nextest-integration> at <unknown source file>:<unknown line>
  759. 246.29 s gammaloop-nextest-integration> 27: <gammaloop_api[9ebf6628f97aeb57]::session::CliSession>::execute_command<unknown>
  760. 246.29 s gammaloop-nextest-integration> at <unknown source file>:<unknown line>
  761. 246.29 s gammaloop-nextest-integration> 28: <gammaloop_integration_tests[191607b70c61cd5a]::CLIState>::run_command<unknown>
  762. 246.29 s gammaloop-nextest-integration> at <unknown source file>:<unknown line>
  763. 246.29 s gammaloop-nextest-integration> 29: uv[3c7454ef256d6487]::run_single_integrated_uv_case<unknown>
  764. 246.29 s gammaloop-nextest-integration> at <unknown source file>:<unknown line>
  765. 246.29 s gammaloop-nextest-integration> 30: <uv[3c7454ef256d6487]::thermal_sunrise_uv::{closure#0} as core[940e698046960fd5]::ops::function::FnOnce<()>>::call_once<unknown>
  766. 246.29 s gammaloop-nextest-integration> at <unknown source file>:<unknown line>
  767. 246.29 s gammaloop-nextest-integration> 31: test[75d6903177b1d7e9]::__rust_begin_short_backtrace::<core[940e698046960fd5]::result::Result<(), alloc[2ea6bcb46fca0c42]::string::String>, fn() -> core[940e698046960fd5]::result::Result<(), alloc[2ea6bcb46fca0c42]::string::String>><unknown>
  768. 246.29 s gammaloop-nextest-integration> at <unknown source file>:<unknown line>
  769. 246.29 s gammaloop-nextest-integration> 32: test[75d6903177b1d7e9]::run_test::{closure#0}<unknown>
  770. 246.29 s gammaloop-nextest-integration> at <unknown source file>:<unknown line>
  771. 246.29 s gammaloop-nextest-integration> 33: std[bcb96dfbba0ab899]::sys::backtrace::__rust_begin_short_backtrace::<test[75d6903177b1d7e9]::run_test::{closure#1}, ()><unknown>
  772. 246.29 s gammaloop-nextest-integration> at <unknown source file>:<unknown line>
  773. 246.29 s gammaloop-nextest-integration> 34: <std[bcb96dfbba0ab899]::thread::lifecycle::spawn_unchecked<test[75d6903177b1d7e9]::run_test::{closure#1}, ()>::{closure#1} as core[940e698046960fd5]::ops::function::FnOnce<()>>::call_once::{shim:vtable#0}<unknown>
  774. 246.29 s gammaloop-nextest-integration> at <unknown source file>:<unknown line>
  775. 246.29 s gammaloop-nextest-integration> 35: <std[bcb96dfbba0ab899]::sys::thread::unix::Thread>::new::thread_start<unknown>
  776. 246.29 s gammaloop-nextest-integration> at <unknown source file>:<unknown line>
  777. 246.29 s gammaloop-nextest-integration> 36: start_thread<unknown>
  778. 246.29 s gammaloop-nextest-integration> at <unknown source file>:<unknown line>
  779. 246.29 s gammaloop-nextest-integration> 37: __clone3<unknown>
  780. 246.29 s gammaloop-nextest-integration> at <unknown source file>:<unknown line>
  781. 246.29 s gammaloop-nextest-integration>
  782. 246.29 s gammaloop-nextest-integration> Run with COLORBT_SHOW_HIDDEN=1 environment variable to disable frame filtering.
  783. 246.29 s gammaloop-nextest-integration> Run with RUST_BACKTRACE=full to include source snippets.
  784. 246.29 s gammaloop-nextest-integration> Warning: SpanTrace capture is Unsupported.
  785. 246.29 s gammaloop-nextest-integration> Ensure that you've setup a tracing-error ErrorLayer and the semver versions are compatible
  786. 246.29 s gammaloop-nextest-integration> =========================================
  787. 246.39 s error: Cannot build '/nix/store/4gv70f5250wa678m31ilwxkvjp2lhgng-gammaloop-nextest-integration.drv'.
  788. 246.39 s Reason: builder failed with exit code 100.
  789. 246.39 s Output paths:
  790. 246.39 s /nix/store/gckfrmakan4s1irmj0ynyr2spwwbiqmd-gammaloop-nextest-integration
  791. 246.39 s Last 767 log lines:
  792. 246.39 s > Extracting 13 binaries, 1 build script output directory, and 3 linked paths to /build/nextest-archive-Y9QbLo
  793. 246.39 s > Extracted 30 files to /build/nextest-archive-Y9QbLo in 2.75s
  794. 246.39 s > ------------
  795. 246.39 s > Nextest run ID aa36a7d7-3934-4669-adc0-28bcb761b4e4 with nextest profile: ci_gammaloop
  796. 246.39 s > Starting 170 tests across 13 binaries (209 tests skipped, including 208 tests via profile.ci_gammaloop.default-filter)
  797. 246.39 s > FAIL [ 2.899s] ( 55/170) gammaloop-integration-tests::test_runs aa_aa::important::aa_aa_local_inspect_backend_consistency
  798. 246.39 s > stdout ---
  799. 246.39 s >
  800. 246.39 s > running 1 test
  801. 246.39 s > test aa_aa::important::aa_aa_local_inspect_backend_consistency ... FAILED
  802. 246.39 s >
  803. 246.39 s > failures:
  804. 246.39 s >
  805. 246.39 s > failures:
  806. 246.39 s > aa_aa::important::aa_aa_local_inspect_backend_consistency
  807. 246.39 s >
  808. 246.39 s > test result: FAILED. 0 passed; 1 failed; 0 ignored; 0 measured; 274 filtered out; finished in 2.89s
  809. 246.39 s >
  810. 246.39 s > stderr ---
  811. 246.39 s > [2026-09-16 22:34:25.788] @gammaloop_api::se... INFO : Running command import model sm-default.json
  812. 246.39 s > [2026-09-16 22:34:25.788] @import::model INFO : Loading built-in JSON model sm-default
  813. 246.39 s > [2026-09-16 22:34:25.810] @gammalooprs::model INFO : The following 15 external parameters were forced to zero by the restriction card:
  814. 246.39 s > lamWS, AWS, rhoWS, etaWS, ymc, yme, ymm, MC, Me, MM, WTau, muQ, muLe, muLmu, muLtau
  815. 246.39 s > [2026-09-16 22:34:25.810] @gammalooprs::model INFO : The following 34 vertex rules were removed by the restriction card:
  816. 246.39 s > V_82 -> (c~, d, G+) | V_83 -> (t~, d, G+) | V_84 -> (c~, s, G+) | V_85 -> (t~, s, G+) | V_86 -> (u~, b, G+) | V_87 -> (c~, b, G+) | V_90 -> (c~, d, W+) | V_91 -> (t~, d, W+) | V_92 -> (u~, s, W+) | V_94 -> (t~, s, W+) | V_95 -> (u~, b, W+) | V_96 -> (c~, b, W+) | V_101 -> (e+, e-, G0) | V_102 -> (mu+, mu-, G0) | V_104 -> (e+, e-, H) | V_105 -> (mu+, mu-, H) | V_110 -> (ve~, e-, G+) | V_111 -> (vm~, mu-, G+) | V_116 -> (b~, u, G-) | V_117 -> (d~, c, G-) | V_118 -> (s~, c, G-) | V_119 -> (b~, c, G-) | V_120 -> (d~, t, G-) | V_121 -> (s~, t, G-) | V_124 -> (s~, u, W-) | V_125 -> (b~, u, W-) | V_126 -> (d~, c, W-) | V_128 -> (b~, c, W-) | V_129 -> (d~, t, W-) | V_130 -> (s~, t, W-) | V_138 -> (c~, c, G0) | V_140 -> (c~, c, H) | V_145 -> (e+, ve, G-) | V_146 -> (mu+, vm, G-)
  817. 246.39 s > [2026-09-16 22:34:25.810] @gammalooprs::model INFO : The following 36 couplings were removed by the restriction card:
  818. 246.39 s > GC_13, GC_14, GC_16, GC_17, GC_18, GC_19, GC_20, GC_22, GC_23, GC_24, GC_25, GC_26, GC_28, GC_29, GC_42, GC_43, GC_44, GC_46, GC_47, GC_48, GC_84, GC_85, GC_86, GC_87, GC_88, GC_89, GC_90, GC_91, GC_92, GC_93, GC_101, GC_102, GC_103, GC_105, GC_106, GC_107
  819. 246.39 s > [2026-09-16 22:34:25.811] @gammaloop_api::se... INFO : Running command run set_model_parameters
  820. 246.39 s > [2026-09-16 22:34:25.811] @gammaloop_api::se... INFO : Starting command block set_model_parameters
  821. 246.39 s > [2026-09-16 22:34:25.811] @gammaloop_api::se... INFO : Running command set model MT=173.0
  822. 246.39 s > [2026-09-16 22:34:25.816] @gammaloop_api::se... INFO : Running command set model WT=0.0
  823. 246.39 s > [2026-09-16 22:34:25.820] @gammaloop_api::se... INFO : Running command set model ymt=173.0
  824. 246.39 s > [2026-09-16 22:34:25.824] @gammaloop_api::se... INFO : Running command set model aS=0.118
  825. 246.39 s > [2026-09-16 22:34:25.829] @gammaloop_api::se... INFO : Running command set model aEWM1=137.036
  826. 246.39 s > [2026-09-16 22:34:25.834] @gammaloop_api::se... INFO : Running command set model Gf=1.166390e-05
  827. 246.39 s > [2026-09-16 22:34:25.838] @gammaloop_api::se... INFO : Running command set model MZ=91.188
  828. 246.39 s > [2026-09-16 22:34:25.843] @gammaloop_api::se... INFO : Running command set global string '
  829. 246.39 s > [global.generation.compile]
  830. 246.39 s > compilation_mode = "symjit"
  831. 246.39 s > optimization_level = "O0"
  832. 246.39 s > fast_math = false
  833. 246.39 s > [...]
  834. 246.39 s > [2026-09-16 22:34:25.844] @gammaloop_api::se... INFO : Running command import graphs ./examples/cli/aa_aa/1L/aa_aa_1L.dot -p aa_aa_all_helicities -i 1L_ppmm -o
  835. 246.39 s > [2026-09-16 22:34:25.844] @commands::import INFO : Loading graphs from '/build/source/examples/cli/aa_aa/1L/aa_aa_1L.dot'
  836. 246.39 s > [2026-09-16 22:34:25.853] @gammaloop_api::se... INFO : Running command generate existing -p aa_aa_all_helicities
  837. 246.39 s > The application panicked (crashed).
  838. 246.39 s > Message: label _func_power_ not found
  839. 246.39 s > Location: /nix/store/n9w914kh1cm59xx3spcs831cdyb56m32-vendor-cargo-deps/c19b7c6f923b580ac259164a89f2577984ad5ab09ee9d583b888f934adbbe8d0/symjit-2.25.6/src/symjit/assembler.rs:77
  840. 246.39 s >
  841. 246.39 s > ━━━━━━━━━━━━━━━━━━━━━━━━━━━━━━━━━━ BACKTRACE ━━━━━━━━━━━━━━━━━━━━━━━━━━━━━━━━━━━
  842. 246.39 s > 1: <color_eyre[51793ea62743adbd]::config::PanicHook>::panic_report<unknown>
  843. 246.39 s > at <unknown source file>:<unknown line>
  844. 246.39 s > 2: <color_eyre[51793ea62743adbd]::config::PanicHook>::into_panic_hook::{closure#0}<unknown>
  845. 246.39 s > at <unknown source file>:<unknown line>
  846. 246.39 s > 3: std[bcb96dfbba0ab899]::panicking::panic_with_hook<unknown>
  847. 246.39 s > at <unknown source file>:<unknown line>
  848. 246.39 s > 4: std[bcb96dfbba0ab899]::panicking::panic_handler::{closure#0}<unknown>
  849. 246.39 s > at <unknown source file>:<unknown line>
  850. 246.39 s > 5: std[bcb96dfbba0ab899]::sys::backtrace::__rust_end_short_backtrace::<std[bcb96dfbba0ab899]::panicking::panic_handler::{closure#0}, !><unknown>
  851. 246.39 s > at <unknown source file>:<unknown line>
  852. 246.39 s > 6: __rustc[6c289b9f9c454d21]::rust_begin_unwind<unknown>
  853. 246.39 s > at <unknown source file>:<unknown line>
  854. 246.39 s > 7: core[940e698046960fd5]::panicking::panic_fmt<unknown>
  855. 246.39 s > at <unknown source file>:<unknown line>
  856. 246.39 s > 8: <symjit[e408de789c333cd]::symjit::assembler::Assembler>::apply_jumps<unknown>
  857. 246.39 s > at <unknown source file>:<unknown line>
  858. 246.39 s > 9: <symjit[e408de789c333cd]::symjit::builder::Builder>::compile_from_mir::<symjit[e408de789c333cd]::symjit::amd::complex::AmdComplexGenerator><unknown>
  859. 246.39 s > at <unknown source file>:<unknown line>
  860. 246.39 s > 10: <symjit[e408de789c333cd]::symjit::runnable::Application>::compile_ty<unknown>
  861. 246.39 s > at <unknown source file>:<unknown line>
  862. 246.39 s > 11: <symjit[e408de789c333cd]::symjit::runnable::Application>::with_mir<unknown>
  863. 246.39 s > at <unknown source file>:<unknown line>
  864. 246.39 s > 12: <symjit[e408de789c333cd]::symjit::composer::DirectTranslator as symjit[e408de789c333cd]::symjit::composer::Composer>::compile<unknown>
  865. 246.39 s > at <unknown source file>:<unknown line>
  866. 246.39 s > 13: <symjit[e408de789c333cd]::symjit::compiler::Translator as symjit[e408de789c333cd]::symjit::composer::Composer>::compile<unknown>
  867. 246.39 s > at <unknown source file>:<unknown line>
  868. 246.39 s > 14: <numerica[124dab8567f4861e]::domains::float::complex::Complex<f64> as symbolica[10e259bab675d243]::evaluate::backend::JITCompiledNumber>::jit_compile<unknown>
  869. 246.39 s > at <unknown source file>:<unknown line>
  870. 246.39 s > 15: <symbolica[10e259bab675d243]::evaluate::evaluator::ExpressionEvaluator<numerica[124dab8567f4861e]::domains::float::complex::Complex<f64>>>::jit_compile<unknown>
  871. 246.39 s > at <unknown source file>:<unknown line>
  872. 246.39 s > 16: <gammalooprs[917cbd3df9e68f8f]::integrands::process::evaluators::GenericEvaluator>::activate_symjit<unknown>
  873. 246.39 s > at <unknown source file>:<unknown line>
  874. 246.39 s > 17: <gammalooprs[917cbd3df9e68f8f]::integrands::process::amplitude::AmplitudeIntegrand>::prepare_runtime_backends_after_generation_with_compile_times<unknown>
  875. 246.39 s > at <unknown source file>:<unknown line>
  876. 246.39 s > 18: <gammalooprs[917cbd3df9e68f8f]::processes::amplitude::Amplitude>::build_integrand<unknown>
  877. 246.39 s > at <unknown source file>:<unknown line>
  878. 246.39 s > 19: <gammalooprs[917cbd3df9e68f8f]::processes::process::Process>::generate_integrands<unknown>
  879. 246.39 s > at <unknown source file>:<unknown line>
  880. 246.39 s > 20: <gammaloop_api[9ebf6628f97aeb57]::state::State>::generate_integrand<unknown>
  881. 246.39 s > at <unknown source file>:<unknown line>
  882. 246.40 s > 21: <gammaloop_api[9ebf6628f97aeb57]::commands::generate::Generate>::run::<&std[bcb96dfbba0ab899]::path::PathBuf><unknown>
  883. 246.40 s > at <unknown source file>:<unknown line>
  884. 246.40 s > 22: <gammaloop_api[9ebf6628f97aeb57]::commands::Commands>::run<unknown>
  885. 246.40 s > at <unknown source file>:<unknown line>
  886. 246.40 s > 23: <gammaloop_api[9ebf6628f97aeb57]::session::CliSession>::execute_prepared<unknown>
  887. 246.40 s > at <unknown source file>:<unknown line>
  888. 246.40 s > 24: <gammaloop_api[9ebf6628f97aeb57]::session::CliSession>::execute_command<unknown>
  889. 246.40 s > at <unknown source file>:<unknown line>
  890. 246.40 s > 25: <gammaloop_integration_tests[191607b70c61cd5a]::CLIState>::run_command<unknown>
  891. 246.40 s > at <unknown source file>:<unknown line>
  892. 246.40 s > 26: test_runs[9b7e2dc2dc4f29b0]::aa_aa::generate_aa_aa_helicity_family<unknown>
  893. 246.40 s > at <unknown source file>:<unknown line>
  894. 246.40 s > 27: <test_runs[9b7e2dc2dc4f29b0]::aa_aa::important::aa_aa_local_inspect_backend_consistency::{closure#0} as core[940e698046960fd5]::ops::function::FnOnce<()>>::call_once<unknown>
  895. 246.40 s > at <unknown source file>:<unknown line>
  896. 246.40 s > 28: serial_test[cd99724524a2f1c0]::serial_code_lock::local_serial_core_with_return::<(), eyre[cb2fd339c0c40fca]::Report><unknown>
  897. 246.40 s > at <unknown source file>:<unknown line>
  898. 246.40 s > 29: <test_runs[9b7e2dc2dc4f29b0]::aa_aa::important::aa_aa_local_inspect_backend_consistency::{closure#0} as core[940e698046960fd5]::ops::function::FnOnce<()>>::call_once<unknown>
  899. 246.40 s > at <unknown source file>:<unknown line>
  900. 246.40 s > 30: test[75d6903177b1d7e9]::__rust_begin_short_backtrace::<core[940e698046960fd5]::result::Result<(), alloc[2ea6bcb46fca0c42]::string::String>, fn() -> core[940e698046960fd5]::result::Result<(), alloc[2ea6bcb46fca0c42]::string::String>><unknown>
  901. 246.40 s > at <unknown source file>:<unknown line>
  902. 246.40 s > 31: test[75d6903177b1d7e9]::run_test::{closure#0}<unknown>
  903. 246.40 s > at <unknown source file>:<unknown line>
  904. 246.40 s > 32: std[bcb96dfbba0ab899]::sys::backtrace::__rust_begin_short_backtrace::<test[75d6903177b1d7e9]::run_test::{closure#1}, ()><unknown>
  905. 246.40 s > at <unknown source file>:<unknown line>
  906. 246.40 s > 33: <std[bcb96dfbba0ab899]::thread::lifecycle::spawn_unchecked<test[75d6903177b1d7e9]::run_test::{closure#1}, ()>::{closure#1} as core[940e698046960fd5]::ops::function::FnOnce<()>>::call_once::{shim:vtable#0}<unknown>
  907. 246.40 s > at <unknown source file>:<unknown line>
  908. 246.40 s > 34: <std[bcb96dfbba0ab899]::sys::thread::unix::Thread>::new::thread_start<unknown>
  909. 246.40 s > at <unknown source file>:<unknown line>
  910. 246.40 s > 35: start_thread<unknown>
  911. 246.40 s > at <unknown source file>:<unknown line>
  912. 246.40 s > 36: __clone3<unknown>
  913. 246.40 s > at <unknown source file>:<unknown line>
  914. 246.40 s >
  915. 246.40 s > Run with COLORBT_SHOW_HIDDEN=1 environment variable to disable frame filtering.
  916. 246.40 s > Run with RUST_BACKTRACE=full to include source snippets.
  917. 246.40 s > Warning: SpanTrace capture is Unsupported.
  918. 246.40 s > Ensure that you've setup a tracing-error ErrorLayer and the semver versions are compatible
  919. 246.40 s >
  920. 246.40 s > FAIL [ 5.666s] (158/170) gammaloop-integration-tests::uv thermal_sunrise_uv
  921. 246.40 s > stdout ---
  922. 246.40 s >
  923. 246.40 s > running 1 test
  924. 246.40 s > test thermal_sunrise_uv ... FAILED
  925. 246.40 s >
  926. 246.40 s > failures:
  927. 246.40 s >
  928. 246.40 s > failures:
  929. 246.40 s > thermal_sunrise_uv
  930. 246.40 s >
  931. 246.40 s > test result: FAILED. 0 passed; 1 failed; 0 ignored; 0 measured; 31 filtered out; finished in 5.63s
  932. 246.40 s >
  933. 246.40 s > stderr ---
  934. 246.40 s > [2026-09-16 22:35:19.761] @gammaloop_api::se... INFO : Running command run generate
  935. 246.40 s > [2026-09-16 22:35:19.761] @gammaloop_api::se... INFO : Starting command block generate
  936. 246.40 s > [2026-09-16 22:35:19.761] @gammaloop_api::se... INFO : Running command import model sm-default.json
  937. 246.40 s > [2026-09-16 22:35:19.761] @import::model INFO : Loading built-in JSON model sm-default
  938. 246.40 s > [2026-09-16 22:35:19.810] @gammalooprs::model INFO : The following 15 external parameters were forced to zero by the restriction card:
  939. 246.40 s > lamWS, AWS, rhoWS, etaWS, ymc, yme, ymm, MC, Me, MM, WTau, muQ, muLe, muLmu, muLtau
  940. 246.40 s > [2026-09-16 22:35:19.810] @gammalooprs::model INFO : The following 34 vertex rules were removed by the restriction card:
  941. 246.40 s > V_82 -> (c~, d, G+) | V_83 -> (t~, d, G+) | V_84 -> (c~, s, G+) | V_85 -> (t~, s, G+) | V_86 -> (u~, b, G+) | V_87 -> (c~, b, G+) | V_90 -> (c~, d, W+) | V_91 -> (t~, d, W+) | V_92 -> (u~, s, W+) | V_94 -> (t~, s, W+) | V_95 -> (u~, b, W+) | V_96 -> (c~, b, W+) | V_101 -> (e+, e-, G0) | V_102 -> (mu+, mu-, G0) | V_104 -> (e+, e-, H) | V_105 -> (mu+, mu-, H) | V_110 -> (ve~, e-, G+) | V_111 -> (vm~, mu-, G+) | V_116 -> (b~, u, G-) | V_117 -> (d~, c, G-) | V_118 -> (s~, c, G-) | V_119 -> (b~, c, G-) | V_120 -> (d~, t, G-) | V_121 -> (s~, t, G-) | V_124 -> (s~, u, W-) | V_125 -> (b~, u, W-) | V_126 -> (d~, c, W-) | V_128 -> (b~, c, W-) | V_129 -> (d~, t, W-) | V_130 -> (s~, t, W-) | V_138 -> (c~, c, G0) | V_140 -> (c~, c, H) | V_145 -> (e+, ve, G-) | V_146 -> (mu+, vm, G-)
  942. 246.40 s > [2026-09-16 22:35:19.810] @gammalooprs::model INFO : The following 36 couplings were removed by the restriction card:
  943. 246.40 s > GC_13, GC_14, GC_16, GC_17, GC_18, GC_19, GC_20, GC_22, GC_23, GC_24, GC_25, GC_26, GC_28, GC_29, GC_42, GC_43, GC_44, GC_46, GC_47, GC_48, GC_84, GC_85, GC_86, GC_87, GC_88, GC_89, GC_90, GC_91, GC_92, GC_93, GC_101, GC_102, GC_103, GC_105, GC_106, GC_107
  944. 246.40 s > [2026-09-16 22:35:19.811] @gammaloop_api::se... INFO : Running command remove processes
  945. 246.40 s > [2026-09-16 22:35:19.811] @gammaloop_api::se... INFO : Running command generate amp {} > {} [{2}] | g u
  946. 246.40 s > --numerator-grouping group_identical_graphs_up_to_scalar_rescaling
  947. 246.40 s > --max-n-bridges 0
  948. 246.40 s > --number-of-factorized-loop-subtopologies 1 1
  949. 246.40 s > --number-of-anticommutating-loops 1 1
  950. 246.40 s > [...]
  951. 246.40 s > [2026-09-16 22:35:19.812] @feyngen::diagram_... INFO : 0s | Δ=0s | Starting Feynman graph generation with Symbolica...
  952. 246.40 s > [2026-09-16 22:35:19.816] @feyngen::diagram_... INFO : 0s | Δ=0s | Number of graphs resulting from Symbolica generation: 3
  953. 246.40 s > [2026-09-16 22:35:19.819] @feyngen::diagram_... INFO : 0s | Δ=0s | Number of graphs retained after removal of vetoed topologies: 2
  954. 246.40 s > [2026-09-16 22:35:19.822] @feyngen::diagram_... INFO : 0s | Δ=0s | Number of graphs after vertex info assignment: 2
  955. 246.40 s > [2026-09-16 22:35:19.822] @feyngen::diagram_... INFO : 0s | Δ=0s | Number of graphs after all complete graphs filters are applied: 2
  956. 246.40 s > [2026-09-16 22:35:19.825] @feyngen::diagram_... INFO : 0s | Δ=0s | Number of graphs after closed anticommutating chains analysis: 1
  957. 246.40 s > [2026-09-16 22:35:19.825] @feyngen::diagram_... INFO : 0s | Δ=0s | Number of graphs after symmetrization of external states: 1
  958. 246.40 s > [2026-09-16 22:35:19.828] @feyngen::diagram_... INFO : 0s | Δ=0s | Number of graphs after canonization of vertices, edges and flows (graph labels assigned here): 1
  959. 246.40 s > [2026-09-16 22:35:19.857] @feyngen::diagram_... INFO : 0s | Δ=0s | Number of graphs after numerator-aware grouping with strategy 'up to a scalar rescaling': 1 (1 isomorphically unique graph, 0 color zero, 0 lorentz zero, 0 grouped and 0 cancellation)
  960. 246.40 s > [2026-09-16 22:35:19.857] @feyngen::diagram_... INFO : ( Sum of the symmetry factors from each graph generated = -1/2 )
  961. 246.40 s > [2026-09-16 22:35:19.857] @commands::generate INFO : Generated amplitude 1 graphs.
  962. 246.40 s > [2026-09-16 22:35:19.857] @commands::generate INFO : Only diagram generation was requested, skipping integrand generation. You can generate integrands later using the 'generate existing <options>' command.
  963. 246.40 s > [2026-09-16 22:35:19.857] @gammaloop_api::se... INFO : Running command generate
  964. 246.40 s > The application panicked (crashed).
  965. 246.40 s > Message: label _func_power_ not found
  966. 246.40 s > Location: /nix/store/n9w914kh1cm59xx3spcs831cdyb56m32-vendor-cargo-deps/c19b7c6f923b580ac259164a89f2577984ad5ab09ee9d583b888f934adbbe8d0/symjit-2.25.6/src/symjit/assembler.rs:77
  967. 246.40 s >
  968. 246.40 s > ━━━━━━━━━━━━━━━━━━━━━━━━━━━━━━━━━━ BACKTRACE ━━━━━━━━━━━━━━━━━━━━━━━━━━━━━━━━━━━
  969. 246.40 s > 1: <color_eyre[51793ea62743adbd]::config::PanicHook>::panic_report<unknown>
  970. 246.40 s > at <unknown source file>:<unknown line>
  971. 246.40 s > 2: <color_eyre[51793ea62743adbd]::config::PanicHook>::into_panic_hook::{closure#0}<unknown>
  972. 246.40 s > at <unknown source file>:<unknown line>
  973. 246.40 s > 3: std[bcb96dfbba0ab899]::panicking::panic_with_hook<unknown>
  974. 246.40 s > at <unknown source file>:<unknown line>
  975. 246.40 s > 4: std[bcb96dfbba0ab899]::panicking::panic_handler::{closure#0}<unknown>
  976. 246.40 s > at <unknown source file>:<unknown line>
  977. 246.40 s > 5: std[bcb96dfbba0ab899]::sys::backtrace::__rust_end_short_backtrace::<std[bcb96dfbba0ab899]::panicking::panic_handler::{closure#0}, !><unknown>
  978. 246.40 s > at <unknown source file>:<unknown line>
  979. 246.40 s > 6: __rustc[6c289b9f9c454d21]::rust_begin_unwind<unknown>
  980. 246.40 s > at <unknown source file>:<unknown line>
  981. 246.40 s > 7: core[940e698046960fd5]::panicking::panic_fmt<unknown>
  982. 246.40 s > at <unknown source file>:<unknown line>
  983. 246.40 s > 8: <symjit[e408de789c333cd]::symjit::assembler::Assembler>::apply_jumps<unknown>
  984. 246.40 s > at <unknown source file>:<unknown line>
  985. 246.40 s > 9: <symjit[e408de789c333cd]::symjit::builder::Builder>::compile_from_mir::<symjit[e408de789c333cd]::symjit::amd::complex::AmdComplexGenerator><unknown>
  986. 246.40 s > at <unknown source file>:<unknown line>
  987. 246.40 s > 10: <symjit[e408de789c333cd]::symjit::runnable::Application>::compile_ty<unknown>
  988. 246.40 s > at <unknown source file>:<unknown line>
  989. 246.40 s > 11: <symjit[e408de789c333cd]::symjit::runnable::Application>::with_mir<unknown>
  990. 246.40 s > at <unknown source file>:<unknown line>
  991. 246.40 s > 12: <symjit[e408de789c333cd]::symjit::composer::DirectTranslator as symjit[e408de789c333cd]::symjit::composer::Composer>::compile<unknown>
  992. 246.40 s > at <unknown source file>:<unknown line>
  993. 246.40 s > 13: <symjit[e408de789c333cd]::symjit::compiler::Translator as symjit[e408de789c333cd]::symjit::composer::Composer>::compile<unknown>
  994. 246.40 s > at <unknown source file>:<unknown line>
  995. 246.40 s > 14: <numerica[124dab8567f4861e]::domains::float::complex::Complex<f64> as symbolica[10e259bab675d243]::evaluate::backend::JITCompiledNumber>::jit_compile<unknown>
  996. 246.40 s > at <unknown source file>:<unknown line>
  997. 246.40 s > 15: <symbolica[10e259bab675d243]::evaluate::evaluator::ExpressionEvaluator<numerica[124dab8567f4861e]::domains::float::complex::Complex<f64>>>::jit_compile<unknown>
  998. 246.40 s > at <unknown source file>:<unknown line>
  999. 246.40 s > 16: <gammalooprs[917cbd3df9e68f8f]::integrands::process::evaluators::GenericEvaluator>::activate_symjit<unknown>
  1000. 246.40 s > at <unknown source file>:<unknown line>
  1001. 246.40 s > 17: <gammalooprs[917cbd3df9e68f8f]::integrands::process::amplitude::AmplitudeIntegrand>::prepare_runtime_backends_after_generation_with_compile_times<unknown>
  1002. 246.40 s > at <unknown source file>:<unknown line>
  1003. 246.40 s > 18: <gammalooprs[917cbd3df9e68f8f]::processes::amplitude::Amplitude>::build_integrand<unknown>
  1004. 246.40 s > at <unknown source file>:<unknown line>
  1005. 246.40 s > 19: <gammalooprs[917cbd3df9e68f8f]::processes::process::Process>::generate_integrands<unknown>
  1006. 246.40 s > at <unknown source file>:<unknown line>
  1007. 246.40 s > 20: <gammalooprs[917cbd3df9e68f8f]::processes::ProcessList>::generate_integrands<unknown>
  1008. 246.40 s > at <unknown source file>:<unknown line>
  1009. 246.40 s > 21: <gammaloop_api[9ebf6628f97aeb57]::state::State>::generate_integrands<unknown>
  1010. 246.40 s > at <unknown source file>:<unknown line>
  1011. 246.40 s > 22: <gammaloop_api[9ebf6628f97aeb57]::commands::generate::Generate>::run::<&std[bcb96dfbba0ab899]::path::PathBuf><unknown>
  1012. 246.40 s > at <unknown source file>:<unknown line>
  1013. 246.40 s > 23: <gammaloop_api[9ebf6628f97aeb57]::commands::Commands>::run<unknown>
  1014. 246.40 s > at <unknown source file>:<unknown line>
  1015. 246.40 s > 24: <gammaloop_api[9ebf6628f97aeb57]::session::CliSession>::execute_prepared<unknown>
  1016. 246.40 s > at <unknown source file>:<unknown line>
  1017. 246.40 s > 25: <gammaloop_api[9ebf6628f97aeb57]::session::CliSession>::execute_prepared_commands<unknown>
  1018. 246.40 s > at <unknown source file>:<unknown line>
  1019. 246.40 s > 26: <gammaloop_api[9ebf6628f97aeb57]::session::CliSession>::execute_prepared<unknown>
  1020. 246.40 s > at <unknown source file>:<unknown line>
  1021. 246.40 s > 27: <gammaloop_api[9ebf6628f97aeb57]::session::CliSession>::execute_command<unknown>
  1022. 246.40 s > at <unknown source file>:<unknown line>
  1023. 246.40 s > 28: <gammaloop_integration_tests[191607b70c61cd5a]::CLIState>::run_command<unknown>
  1024. 246.40 s > at <unknown source file>:<unknown line>
  1025. 246.40 s > 29: uv[3c7454ef256d6487]::run_single_integrated_uv_case<unknown>
  1026. 246.40 s > at <unknown source file>:<unknown line>
  1027. 246.40 s > 30: <uv[3c7454ef256d6487]::thermal_sunrise_uv::{closure#0} as core[940e698046960fd5]::ops::function::FnOnce<()>>::call_once<unknown>
  1028. 246.40 s > at <unknown source file>:<unknown line>
  1029. 246.40 s > 31: test[75d6903177b1d7e9]::__rust_begin_short_backtrace::<core[940e698046960fd5]::result::Result<(), alloc[2ea6bcb46fca0c42]::string::String>, fn() -> core[940e698046960fd5]::result::Result<(), alloc[2ea6bcb46fca0c42]::string::String>><unknown>
  1030. 246.40 s > at <unknown source file>:<unknown line>
  1031. 246.40 s > 32: test[75d6903177b1d7e9]::run_test::{closure#0}<unknown>
  1032. 246.40 s > at <unknown source file>:<unknown line>
  1033. 246.40 s > 33: std[bcb96dfbba0ab899]::sys::backtrace::__rust_begin_short_backtrace::<test[75d6903177b1d7e9]::run_test::{closure#1}, ()><unknown>
  1034. 246.40 s > at <unknown source file>:<unknown line>
  1035. 246.40 s > 34: <std[bcb96dfbba0ab899]::thread::lifecycle::spawn_unchecked<test[75d6903177b1d7e9]::run_test::{closure#1}, ()>::{closure#1} as core[940e698046960fd5]::ops::function::FnOnce<()>>::call_once::{shim:vtable#0}<unknown>
  1036. 246.40 s > at <unknown source file>:<unknown line>
  1037. 246.40 s > 35: <std[bcb96dfbba0ab899]::sys::thread::unix::Thread>::new::thread_start<unknown>
  1038. 246.40 s > at <unknown source file>:<unknown line>
  1039. 246.40 s > 36: start_thread<unknown>
  1040. 246.40 s > at <unknown source file>:<unknown line>
  1041. 246.40 s > 37: __clone3<unknown>
  1042. 246.40 s > at <unknown source file>:<unknown line>
  1043. 246.40 s >
  1044. 246.40 s > Run with COLORBT_SHOW_HIDDEN=1 environment variable to disable frame filtering.
  1045. 246.40 s > Run with RUST_BACKTRACE=full to include source snippets.
  1046. 246.40 s > Warning: SpanTrace capture is Unsupported.
  1047. 246.40 s > Ensure that you've setup a tracing-error ErrorLayer and the semver versions are compatible
  1048. 246.40 s >
  1049. 246.40 s > ------------
  1050. 246.40 s > Summary [ 216.288s] 170 tests run: 168 passed, 2 failed, 209 skipped
  1051. 246.40 s > FAIL [ 2.899s] ( 55/170) gammaloop-integration-tests::test_runs aa_aa::important::aa_aa_local_inspect_backend_consistency
  1052. 246.40 s > stdout ---
  1053. 246.40 s >
  1054. 246.40 s > running 1 test
  1055. 246.40 s > test aa_aa::important::aa_aa_local_inspect_backend_consistency ... FAILED
  1056. 246.40 s >
  1057. 246.40 s > failures:
  1058. 246.40 s >
  1059. 246.40 s > failures:
  1060. 246.40 s > aa_aa::important::aa_aa_local_inspect_backend_consistency
  1061. 246.40 s >
  1062. 246.40 s > test result: FAILED. 0 passed; 1 failed; 0 ignored; 0 measured; 274 filtered out; finished in 2.89s
  1063. 246.40 s >
  1064. 246.40 s > stderr ---
  1065. 246.40 s > [2026-09-16 22:34:25.788] @gammaloop_api::se... INFO : Running command import model sm-default.json
  1066. 246.40 s > [2026-09-16 22:34:25.788] @import::model INFO : Loading built-in JSON model sm-default
  1067. 246.40 s > [2026-09-16 22:34:25.810] @gammalooprs::model INFO : The following 15 external parameters were forced to zero by the restriction card:
  1068. 246.40 s > lamWS, AWS, rhoWS, etaWS, ymc, yme, ymm, MC, Me, MM, WTau, muQ, muLe, muLmu, muLtau
  1069. 246.40 s > [2026-09-16 22:34:25.810] @gammalooprs::model INFO : The following 34 vertex rules were removed by the restriction card:
  1070. 246.40 s > V_82 -> (c~, d, G+) | V_83 -> (t~, d, G+) | V_84 -> (c~, s, G+) | V_85 -> (t~, s, G+) | V_86 -> (u~, b, G+) | V_87 -> (c~, b, G+) | V_90 -> (c~, d, W+) | V_91 -> (t~, d, W+) | V_92 -> (u~, s, W+) | V_94 -> (t~, s, W+) | V_95 -> (u~, b, W+) | V_96 -> (c~, b, W+) | V_101 -> (e+, e-, G0) | V_102 -> (mu+, mu-, G0) | V_104 -> (e+, e-, H) | V_105 -> (mu+, mu-, H) | V_110 -> (ve~, e-, G+) | V_111 -> (vm~, mu-, G+) | V_116 -> (b~, u, G-) | V_117 -> (d~, c, G-) | V_118 -> (s~, c, G-) | V_119 -> (b~, c, G-) | V_120 -> (d~, t, G-) | V_121 -> (s~, t, G-) | V_124 -> (s~, u, W-) | V_125 -> (b~, u, W-) | V_126 -> (d~, c, W-) | V_128 -> (b~, c, W-) | V_129 -> (d~, t, W-) | V_130 -> (s~, t, W-) | V_138 -> (c~, c, G0) | V_140 -> (c~, c, H) | V_145 -> (e+, ve, G-) | V_146 -> (mu+, vm, G-)
  1071. 246.40 s > [2026-09-16 22:34:25.810] @gammalooprs::model INFO : The following 36 couplings were removed by the restriction card:
  1072. 246.40 s > GC_13, GC_14, GC_16, GC_17, GC_18, GC_19, GC_20, GC_22, GC_23, GC_24, GC_25, GC_26, GC_28, GC_29, GC_42, GC_43, GC_44, GC_46, GC_47, GC_48, GC_84, GC_85, GC_86, GC_87, GC_88, GC_89, GC_90, GC_91, GC_92, GC_93, GC_101, GC_102, GC_103, GC_105, GC_106, GC_107
  1073. 246.40 s > [2026-09-16 22:34:25.811] @gammaloop_api::se... INFO : Running command run set_model_parameters
  1074. 246.40 s > [2026-09-16 22:34:25.811] @gammaloop_api::se... INFO : Starting command block set_model_parameters
  1075. 246.40 s > [2026-09-16 22:34:25.811] @gammaloop_api::se... INFO : Running command set model MT=173.0
  1076. 246.40 s > [2026-09-16 22:34:25.816] @gammaloop_api::se... INFO : Running command set model WT=0.0
  1077. 246.40 s > [2026-09-16 22:34:25.820] @gammaloop_api::se... INFO : Running command set model ymt=173.0
  1078. 246.40 s > [2026-09-16 22:34:25.824] @gammaloop_api::se... INFO : Running command set model aS=0.118
  1079. 246.40 s > [2026-09-16 22:34:25.829] @gammaloop_api::se... INFO : Running command set model aEWM1=137.036
  1080. 246.40 s > [2026-09-16 22:34:25.834] @gammaloop_api::se... INFO : Running command set model Gf=1.166390e-05
  1081. 246.40 s > [2026-09-16 22:34:25.838] @gammaloop_api::se... INFO : Running command set model MZ=91.188
  1082. 246.40 s > [2026-09-16 22:34:25.843] @gammaloop_api::se... INFO : Running command set global string '
  1083. 246.40 s > [global.generation.compile]
  1084. 246.40 s > compilation_mode = "symjit"
  1085. 246.40 s > optimization_level = "O0"
  1086. 246.40 s > fast_math = false
  1087. 246.40 s > [...]
  1088. 246.40 s > [2026-09-16 22:34:25.844] @gammaloop_api::se... INFO : Running command import graphs ./examples/cli/aa_aa/1L/aa_aa_1L.dot -p aa_aa_all_helicities -i 1L_ppmm -o
  1089. 246.40 s > [2026-09-16 22:34:25.844] @commands::import INFO : Loading graphs from '/build/source/examples/cli/aa_aa/1L/aa_aa_1L.dot'
  1090. 246.40 s > [2026-09-16 22:34:25.853] @gammaloop_api::se... INFO : Running command generate existing -p aa_aa_all_helicities
  1091. 246.40 s > The application panicked (crashed).
  1092. 246.40 s > Message: label _func_power_ not found
  1093. 246.40 s > Location: /nix/store/n9w914kh1cm59xx3spcs831cdyb56m32-vendor-cargo-deps/c19b7c6f923b580ac259164a89f2577984ad5ab09ee9d583b888f934adbbe8d0/symjit-2.25.6/src/symjit/assembler.rs:77
  1094. 246.40 s >
  1095. 246.40 s > ━━━━━━━━━━━━━━━━━━━━━━━━━━━━━━━━━━ BACKTRACE ━━━━━━━━━━━━━━━━━━━━━━━━━━━━━━━━━━━
  1096. 246.40 s > 1: <color_eyre[51793ea62743adbd]::config::PanicHook>::panic_report<unknown>
  1097. 246.40 s > at <unknown source file>:<unknown line>
  1098. 246.40 s > 2: <color_eyre[51793ea62743adbd]::config::PanicHook>::into_panic_hook::{closure#0}<unknown>
  1099. 246.40 s > at <unknown source file>:<unknown line>
  1100. 246.40 s > 3: std[bcb96dfbba0ab899]::panicking::panic_with_hook<unknown>
  1101. 246.40 s > at <unknown source file>:<unknown line>
  1102. 246.40 s > 4: std[bcb96dfbba0ab899]::panicking::panic_handler::{closure#0}<unknown>
  1103. 246.40 s > at <unknown source file>:<unknown line>
  1104. 246.40 s > 5: std[bcb96dfbba0ab899]::sys::backtrace::__rust_end_short_backtrace::<std[bcb96dfbba0ab899]::panicking::panic_handler::{closure#0}, !><unknown>
  1105. 246.40 s > at <unknown source file>:<unknown line>
  1106. 246.40 s > 6: __rustc[6c289b9f9c454d21]::rust_begin_unwind<unknown>
  1107. 246.40 s > at <unknown source file>:<unknown line>
  1108. 246.40 s > 7: core[940e698046960fd5]::panicking::panic_fmt<unknown>
  1109. 246.40 s > at <unknown source file>:<unknown line>
  1110. 246.40 s > 8: <symjit[e408de789c333cd]::symjit::assembler::Assembler>::apply_jumps<unknown>
  1111. 246.40 s > at <unknown source file>:<unknown line>
  1112. 246.40 s > 9: <symjit[e408de789c333cd]::symjit::builder::Builder>::compile_from_mir::<symjit[e408de789c333cd]::symjit::amd::complex::AmdComplexGenerator><unknown>
  1113. 246.40 s > at <unknown source file>:<unknown line>
  1114. 246.40 s > 10: <symjit[e408de789c333cd]::symjit::runnable::Application>::compile_ty<unknown>
  1115. 246.40 s > at <unknown source file>:<unknown line>
  1116. 246.40 s > 11: <symjit[e408de789c333cd]::symjit::runnable::Application>::with_mir<unknown>
  1117. 246.40 s > at <unknown source file>:<unknown line>
  1118. 246.40 s > 12: <symjit[e408de789c333cd]::symjit::composer::DirectTranslator as symjit[e408de789c333cd]::symjit::composer::Composer>::compile<unknown>
  1119. 246.40 s > at <unknown source file>:<unknown line>
  1120. 246.40 s > 13: <symjit[e408de789c333cd]::symjit::compiler::Translator as symjit[e408de789c333cd]::symjit::composer::Composer>::compile<unknown>
  1121. 246.40 s > at <unknown source file>:<unknown line>
  1122. 246.40 s > 14: <numerica[124dab8567f4861e]::domains::float::complex::Complex<f64> as symbolica[10e259bab675d243]::evaluate::backend::JITCompiledNumber>::jit_compile<unknown>
  1123. 246.40 s > at <unknown source file>:<unknown line>
  1124. 246.40 s > 15: <symbolica[10e259bab675d243]::evaluate::evaluator::ExpressionEvaluator<numerica[124dab8567f4861e]::domains::float::complex::Complex<f64>>>::jit_compile<unknown>
  1125. 246.40 s > at <unknown source file>:<unknown line>
  1126. 246.40 s > 16: <gammalooprs[917cbd3df9e68f8f]::integrands::process::evaluators::GenericEvaluator>::activate_symjit<unknown>
  1127. 246.40 s > at <unknown source file>:<unknown line>
  1128. 246.40 s > 17: <gammalooprs[917cbd3df9e68f8f]::integrands::process::amplitude::AmplitudeIntegrand>::prepare_runtime_backends_after_generation_with_compile_times<unknown>
  1129. 246.40 s > at <unknown source file>:<unknown line>
  1130. 246.40 s > 18: <gammalooprs[917cbd3df9e68f8f]::processes::amplitude::Amplitude>::build_integrand<unknown>
  1131. 246.40 s > at <unknown source file>:<unknown line>
  1132. 246.40 s > 19: <gammalooprs[917cbd3df9e68f8f]::processes::process::Process>::generate_integrands<unknown>
  1133. 246.40 s > at <unknown source file>:<unknown line>
  1134. 246.40 s > 20: <gammaloop_api[9ebf6628f97aeb57]::state::State>::generate_integrand<unknown>
  1135. 246.40 s > at <unknown source file>:<unknown line>
  1136. 246.40 s > 21: <gammaloop_api[9ebf6628f97aeb57]::commands::generate::Generate>::run::<&std[bcb96dfbba0ab899]::path::PathBuf><unknown>
  1137. 246.40 s > at <unknown source file>:<unknown line>
  1138. 246.40 s > 22: <gammaloop_api[9ebf6628f97aeb57]::commands::Commands>::run<unknown>
  1139. 246.40 s > at <unknown source file>:<unknown line>
  1140. 246.40 s > 23: <gammaloop_api[9ebf6628f97aeb57]::session::CliSession>::execute_prepared<unknown>
  1141. 246.40 s > at <unknown source file>:<unknown line>
  1142. 246.40 s > 24: <gammaloop_api[9ebf6628f97aeb57]::session::CliSession>::execute_command<unknown>
  1143. 246.40 s > at <unknown source file>:<unknown line>
  1144. 246.40 s > 25: <gammaloop_integration_tests[191607b70c61cd5a]::CLIState>::run_command<unknown>
  1145. 246.40 s > at <unknown source file>:<unknown line>
  1146. 246.40 s > 26: test_runs[9b7e2dc2dc4f29b0]::aa_aa::generate_aa_aa_helicity_family<unknown>
  1147. 246.40 s > at <unknown source file>:<unknown line>
  1148. 246.40 s > 27: <test_runs[9b7e2dc2dc4f29b0]::aa_aa::important::aa_aa_local_inspect_backend_consistency::{closure#0} as core[940e698046960fd5]::ops::function::FnOnce<()>>::call_once<unknown>
  1149. 246.40 s > at <unknown source file>:<unknown line>
  1150. 246.40 s > 28: serial_test[cd99724524a2f1c0]::serial_code_lock::local_serial_core_with_return::<(), eyre[cb2fd339c0c40fca]::Report><unknown>
  1151. 246.40 s > at <unknown source file>:<unknown line>
  1152. 246.40 s > 29: <test_runs[9b7e2dc2dc4f29b0]::aa_aa::important::aa_aa_local_inspect_backend_consistency::{closure#0} as core[940e698046960fd5]::ops::function::FnOnce<()>>::call_once<unknown>
  1153. 246.40 s > at <unknown source file>:<unknown line>
  1154. 246.40 s > 30: test[75d6903177b1d7e9]::__rust_begin_short_backtrace::<core[940e698046960fd5]::result::Result<(), alloc[2ea6bcb46fca0c42]::string::String>, fn() -> core[940e698046960fd5]::result::Result<(), alloc[2ea6bcb46fca0c42]::string::String>><unknown>
  1155. 246.40 s > at <unknown source file>:<unknown line>
  1156. 246.40 s > 31: test[75d6903177b1d7e9]::run_test::{closure#0}<unknown>
  1157. 246.40 s > at <unknown source file>:<unknown line>
  1158. 246.40 s > 32: std[bcb96dfbba0ab899]::sys::backtrace::__rust_begin_short_backtrace::<test[75d6903177b1d7e9]::run_test::{closure#1}, ()><unknown>
  1159. 246.40 s > at <unknown source file>:<unknown line>
  1160. 246.40 s > 33: <std[bcb96dfbba0ab899]::thread::lifecycle::spawn_unchecked<test[75d6903177b1d7e9]::run_test::{closure#1}, ()>::{closure#1} as core[940e698046960fd5]::ops::function::FnOnce<()>>::call_once::{shim:vtable#0}<unknown>
  1161. 246.40 s > at <unknown source file>:<unknown line>
  1162. 246.40 s > 34: <std[bcb96dfbba0ab899]::sys::thread::unix::Thread>::new::thread_start<unknown>
  1163. 246.40 s > at <unknown source file>:<unknown line>
  1164. 246.40 s > 35: start_thread<unknown>
  1165. 246.40 s > at <unknown source file>:<unknown line>
  1166. 246.40 s > 36: __clone3<unknown>
  1167. 246.40 s > at <unknown source file>:<unknown line>
  1168. 246.40 s >
  1169. 246.40 s > Run with COLORBT_SHOW_HIDDEN=1 environment variable to disable frame filtering.
  1170. 246.40 s > Run with RUST_BACKTRACE=full to include source snippets.
  1171. 246.40 s > Warning: SpanTrace capture is Unsupported.
  1172. 246.40 s > Ensure that you've setup a tracing-error ErrorLayer and the semver versions are compatible
  1173. 246.40 s >
  1174. 246.40 s > FAIL [ 5.666s] (158/170) gammaloop-integration-tests::uv thermal_sunrise_uv
  1175. 246.40 s > stdout ---
  1176. 246.40 s >
  1177. 246.40 s > running 1 test
  1178. 246.40 s > test thermal_sunrise_uv ... FAILED
  1179. 246.40 s >
  1180. 246.40 s > failures:
  1181. 246.40 s >
  1182. 246.40 s > failures:
  1183. 246.40 s > thermal_sunrise_uv
  1184. 246.40 s >
  1185. 246.40 s > test result: FAILED. 0 passed; 1 failed; 0 ignored; 0 measured; 31 filtered out; finished in 5.63s
  1186. 246.40 s >
  1187. 246.40 s > stderr ---
  1188. 246.40 s > [2026-09-16 22:35:19.761] @gammaloop_api::se... INFO : Running command run generate
  1189. 246.40 s > [2026-09-16 22:35:19.761] @gammaloop_api::se... INFO : Starting command block generate
  1190. 246.40 s > [2026-09-16 22:35:19.761] @gammaloop_api::se... INFO : Running command import model sm-default.json
  1191. 246.40 s > [2026-09-16 22:35:19.761] @import::model INFO : Loading built-in JSON model sm-default
  1192. 246.40 s > [2026-09-16 22:35:19.810] @gammalooprs::model INFO : The following 15 external parameters were forced to zero by the restriction card:
  1193. 246.40 s > lamWS, AWS, rhoWS, etaWS, ymc, yme, ymm, MC, Me, MM, WTau, muQ, muLe, muLmu, muLtau
  1194. 246.40 s > [2026-09-16 22:35:19.810] @gammalooprs::model INFO : The following 34 vertex rules were removed by the restriction card:
  1195. 246.40 s > V_82 -> (c~, d, G+) | V_83 -> (t~, d, G+) | V_84 -> (c~, s, G+) | V_85 -> (t~, s, G+) | V_86 -> (u~, b, G+) | V_87 -> (c~, b, G+) | V_90 -> (c~, d, W+) | V_91 -> (t~, d, W+) | V_92 -> (u~, s, W+) | V_94 -> (t~, s, W+) | V_95 -> (u~, b, W+) | V_96 -> (c~, b, W+) | V_101 -> (e+, e-, G0) | V_102 -> (mu+, mu-, G0) | V_104 -> (e+, e-, H) | V_105 -> (mu+, mu-, H) | V_110 -> (ve~, e-, G+) | V_111 -> (vm~, mu-, G+) | V_116 -> (b~, u, G-) | V_117 -> (d~, c, G-) | V_118 -> (s~, c, G-) | V_119 -> (b~, c, G-) | V_120 -> (d~, t, G-) | V_121 -> (s~, t, G-) | V_124 -> (s~, u, W-) | V_125 -> (b~, u, W-) | V_126 -> (d~, c, W-) | V_128 -> (b~, c, W-) | V_129 -> (d~, t, W-) | V_130 -> (s~, t, W-) | V_138 -> (c~, c, G0) | V_140 -> (c~, c, H) | V_145 -> (e+, ve, G-) | V_146 -> (mu+, vm, G-)
  1196. 246.40 s > [2026-09-16 22:35:19.810] @gammalooprs::model INFO : The following 36 couplings were removed by the restriction card:
  1197. 246.40 s > GC_13, GC_14, GC_16, GC_17, GC_18, GC_19, GC_20, GC_22, GC_23, GC_24, GC_25, GC_26, GC_28, GC_29, GC_42, GC_43, GC_44, GC_46, GC_47, GC_48, GC_84, GC_85, GC_86, GC_87, GC_88, GC_89, GC_90, GC_91, GC_92, GC_93, GC_101, GC_102, GC_103, GC_105, GC_106, GC_107
  1198. 246.40 s > [2026-09-16 22:35:19.811] @gammaloop_api::se... INFO : Running command remove processes
  1199. 246.40 s > [2026-09-16 22:35:19.811] @gammaloop_api::se... INFO : Running command generate amp {} > {} [{2}] | g u
  1200. 246.40 s > --numerator-grouping group_identical_graphs_up_to_scalar_rescaling
  1201. 246.40 s > --max-n-bridges 0
  1202. 246.40 s > --number-of-factorized-loop-subtopologies 1 1
  1203. 246.40 s > --number-of-anticommutating-loops 1 1
  1204. 246.40 s > [...]
  1205. 246.40 s > [2026-09-16 22:35:19.812] @feyngen::diagram_... INFO : 0s | Δ=0s | Starting Feynman graph generation with Symbolica...
  1206. 246.40 s > [2026-09-16 22:35:19.816] @feyngen::diagram_... INFO : 0s | Δ=0s | Number of graphs resulting from Symbolica generation: 3
  1207. 246.40 s > [2026-09-16 22:35:19.819] @feyngen::diagram_... INFO : 0s | Δ=0s | Number of graphs retained after removal of vetoed topologies: 2
  1208. 246.40 s > [2026-09-16 22:35:19.822] @feyngen::diagram_... INFO : 0s | Δ=0s | Number of graphs after vertex info assignment: 2
  1209. 246.40 s > [2026-09-16 22:35:19.822] @feyngen::diagram_... INFO : 0s | Δ=0s | Number of graphs after all complete graphs filters are applied: 2
  1210. 246.40 s > [2026-09-16 22:35:19.825] @feyngen::diagram_... INFO : 0s | Δ=0s | Number of graphs after closed anticommutating chains analysis: 1
  1211. 246.40 s > [2026-09-16 22:35:19.825] @feyngen::diagram_... INFO : 0s | Δ=0s | Number of graphs after symmetrization of external states: 1
  1212. 246.40 s > [2026-09-16 22:35:19.828] @feyngen::diagram_... INFO : 0s | Δ=0s | Number of graphs after canonization of vertices, edges and flows (graph labels assigned here): 1
  1213. 246.40 s > [2026-09-16 22:35:19.857] @feyngen::diagram_... INFO : 0s | Δ=0s | Number of graphs after numerator-aware grouping with strategy 'up to a scalar rescaling': 1 (1 isomorphically unique graph, 0 color zero, 0 lorentz zero, 0 grouped and 0 cancellation)
  1214. 246.40 s > [2026-09-16 22:35:19.857] @feyngen::diagram_... INFO : ( Sum of the symmetry factors from each graph generated = -1/2 )
  1215. 246.40 s > [2026-09-16 22:35:19.857] @commands::generate INFO : Generated amplitude 1 graphs.
  1216. 246.40 s > [2026-09-16 22:35:19.857] @commands::generate INFO : Only diagram generation was requested, skipping integrand generation. You can generate integrands later using the 'generate existing <options>' command.
  1217. 246.40 s > [2026-09-16 22:35:19.857] @gammaloop_api::se... INFO : Running command generate
  1218. 246.40 s > The application panicked (crashed).
  1219. 246.40 s > Message: label _func_power_ not found
  1220. 246.40 s > Location: /nix/store/n9w914kh1cm59xx3spcs831cdyb56m32-vendor-cargo-deps/c19b7c6f923b580ac259164a89f2577984ad5ab09ee9d583b888f934adbbe8d0/symjit-2.25.6/src/symjit/assembler.rs:77
  1221. 246.40 s >
  1222. 246.40 s > ━━━━━━━━━━━━━━━━━━━━━━━━━━━━━━━━━━ BACKTRACE ━━━━━━━━━━━━━━━━━━━━━━━━━━━━━━━━━━━
  1223. 246.40 s > 1: <color_eyre[51793ea62743adbd]::config::PanicHook>::panic_report<unknown>
  1224. 246.40 s > at <unknown source file>:<unknown line>
  1225. 246.40 s > 2: <color_eyre[51793ea62743adbd]::config::PanicHook>::into_panic_hook::{closure#0}<unknown>
  1226. 246.40 s > at <unknown source file>:<unknown line>
  1227. 246.40 s > 3: std[bcb96dfbba0ab899]::panicking::panic_with_hook<unknown>
  1228. 246.40 s > at <unknown source file>:<unknown line>
  1229. 246.40 s > 4: std[bcb96dfbba0ab899]::panicking::panic_handler::{closure#0}<unknown>
  1230. 246.40 s > at <unknown source file>:<unknown line>
  1231. 246.40 s > 5: std[bcb96dfbba0ab899]::sys::backtrace::__rust_end_short_backtrace::<std[bcb96dfbba0ab899]::panicking::panic_handler::{closure#0}, !><unknown>
  1232. 246.40 s > at <unknown source file>:<unknown line>
  1233. 246.40 s > 6: __rustc[6c289b9f9c454d21]::rust_begin_unwind<unknown>
  1234. 246.40 s > at <unknown source file>:<unknown line>
  1235. 246.40 s > 7: core[940e698046960fd5]::panicking::panic_fmt<unknown>
  1236. 246.40 s > at <unknown source file>:<unknown line>
  1237. 246.40 s > 8: <symjit[e408de789c333cd]::symjit::assembler::Assembler>::apply_jumps<unknown>
  1238. 246.40 s > at <unknown source file>:<unknown line>
  1239. 246.40 s > 9: <symjit[e408de789c333cd]::symjit::builder::Builder>::compile_from_mir::<symjit[e408de789c333cd]::symjit::amd::complex::AmdComplexGenerator><unknown>
  1240. 246.40 s > at <unknown source file>:<unknown line>
  1241. 246.40 s > 10: <symjit[e408de789c333cd]::symjit::runnable::Application>::compile_ty<unknown>
  1242. 246.40 s > at <unknown source file>:<unknown line>
  1243. 246.40 s > 11: <symjit[e408de789c333cd]::symjit::runnable::Application>::with_mir<unknown>
  1244. 246.40 s > at <unknown source file>:<unknown line>
  1245. 246.40 s > 12: <symjit[e408de789c333cd]::symjit::composer::DirectTranslator as symjit[e408de789c333cd]::symjit::composer::Composer>::compile<unknown>
  1246. 246.40 s > at <unknown source file>:<unknown line>
  1247. 246.40 s > 13: <symjit[e408de789c333cd]::symjit::compiler::Translator as symjit[e408de789c333cd]::symjit::composer::Composer>::compile<unknown>
  1248. 246.40 s > at <unknown source file>:<unknown line>
  1249. 246.40 s > 14: <numerica[124dab8567f4861e]::domains::float::complex::Complex<f64> as symbolica[10e259bab675d243]::evaluate::backend::JITCompiledNumber>::jit_compile<unknown>
  1250. 246.40 s > at <unknown source file>:<unknown line>
  1251. 246.40 s > 15: <symbolica[10e259bab675d243]::evaluate::evaluator::ExpressionEvaluator<numerica[124dab8567f4861e]::domains::float::complex::Complex<f64>>>::jit_compile<unknown>
  1252. 246.40 s > at <unknown source file>:<unknown line>
  1253. 246.40 s > 16: <gammalooprs[917cbd3df9e68f8f]::integrands::process::evaluators::GenericEvaluator>::activate_symjit<unknown>
  1254. 246.40 s > at <unknown source file>:<unknown line>
  1255. 246.40 s > 17: <gammalooprs[917cbd3df9e68f8f]::integrands::process::amplitude::AmplitudeIntegrand>::prepare_runtime_backends_after_generation_with_compile_times<unknown>
  1256. 246.40 s > at <unknown source file>:<unknown line>
  1257. 246.40 s > 18: <gammalooprs[917cbd3df9e68f8f]::processes::amplitude::Amplitude>::build_integrand<unknown>
  1258. 246.40 s > at <unknown source file>:<unknown line>
  1259. 246.40 s > 19: <gammalooprs[917cbd3df9e68f8f]::processes::process::Process>::generate_integrands<unknown>
  1260. 246.40 s > at <unknown source file>:<unknown line>
  1261. 246.40 s > 20: <gammalooprs[917cbd3df9e68f8f]::processes::ProcessList>::generate_integrands<unknown>
  1262. 246.40 s > at <unknown source file>:<unknown line>
  1263. 246.40 s > 21: <gammaloop_api[9ebf6628f97aeb57]::state::State>::generate_integrands<unknown>
  1264. 246.40 s > at <unknown source file>:<unknown line>
  1265. 246.40 s > 22: <gammaloop_api[9ebf6628f97aeb57]::commands::generate::Generate>::run::<&std[bcb96dfbba0ab899]::path::PathBuf><unknown>
  1266. 246.40 s > at <unknown source file>:<unknown line>
  1267. 246.40 s > 23: <gammaloop_api[9ebf6628f97aeb57]::commands::Commands>::run<unknown>
  1268. 246.40 s > at <unknown source file>:<unknown line>
  1269. 246.40 s > 24: <gammaloop_api[9ebf6628f97aeb57]::session::CliSession>::execute_prepared<unknown>
  1270. 246.40 s > at <unknown source file>:<unknown line>
  1271. 246.40 s > 25: <gammaloop_api[9ebf6628f97aeb57]::session::CliSession>::execute_prepared_commands<unknown>
  1272. 246.40 s > at <unknown source file>:<unknown line>
  1273. 246.40 s > 26: <gammaloop_api[9ebf6628f97aeb57]::session::CliSession>::execute_prepared<unknown>
  1274. 246.40 s > at <unknown source file>:<unknown line>
  1275. 246.40 s > 27: <gammaloop_api[9ebf6628f97aeb57]::session::CliSession>::execute_command<unknown>
  1276. 246.40 s > at <unknown source file>:<unknown line>
  1277. 246.40 s > 28: <gammaloop_integration_tests[191607b70c61cd5a]::CLIState>::run_command<unknown>
  1278. 246.40 s > at <unknown source file>:<unknown line>
  1279. 246.40 s > 29: uv[3c7454ef256d6487]::run_single_integrated_uv_case<unknown>
  1280. 246.40 s > at <unknown source file>:<unknown line>
  1281. 246.40 s > 30: <uv[3c7454ef256d6487]::thermal_sunrise_uv::{closure#0} as core[940e698046960fd5]::ops::function::FnOnce<()>>::call_once<unknown>
  1282. 246.40 s > at <unknown source file>:<unknown line>
  1283. 246.40 s > 31: test[75d6903177b1d7e9]::__rust_begin_short_backtrace::<core[940e698046960fd5]::result::Result<(), alloc[2ea6bcb46fca0c42]::string::String>, fn() -> core[940e698046960fd5]::result::Result<(), alloc[2ea6bcb46fca0c42]::string::String>><unknown>
  1284. 246.40 s > at <unknown source file>:<unknown line>
  1285. 246.40 s > 32: test[75d6903177b1d7e9]::run_test::{closure#0}<unknown>
  1286. 246.40 s > at <unknown source file>:<unknown line>
  1287. 246.40 s > 33: std[bcb96dfbba0ab899]::sys::backtrace::__rust_begin_short_backtrace::<test[75d6903177b1d7e9]::run_test::{closure#1}, ()><unknown>
  1288. 246.40 s > at <unknown source file>:<unknown line>
  1289. 246.40 s > 34: <std[bcb96dfbba0ab899]::thread::lifecycle::spawn_unchecked<test[75d6903177b1d7e9]::run_test::{closure#1}, ()>::{closure#1} as core[940e698046960fd5]::ops::function::FnOnce<()>>::call_once::{shim:vtable#0}<unknown>
  1290. 246.40 s > at <unknown source file>:<unknown line>
  1291. 246.40 s > 35: <std[bcb96dfbba0ab899]::sys::thread::unix::Thread>::new::thread_start<unknown>
  1292. 246.40 s > at <unknown source file>:<unknown line>
  1293. 246.40 s > 36: start_thread<unknown>
  1294. 246.40 s > at <unknown source file>:<unknown line>
  1295. 246.40 s > 37: __clone3<unknown>
  1296. 246.40 s > at <unknown source file>:<unknown line>
  1297. 246.40 s >
  1298. 246.40 s > Run with COLORBT_SHOW_HIDDEN=1 environment variable to disable frame filtering.
  1299. 246.40 s > Run with RUST_BACKTRACE=full to include source snippets.
  1300. 246.40 s > Warning: SpanTrace capture is Unsupported.
  1301. 246.40 s > Ensure that you've setup a tracing-error ErrorLayer and the semver versions are compatible
  1302. 246.40 s >
  1303. 246.40 s > error: test run failed
  1304. 246.40 s >
  1305. 246.40 s > ========== nextest test summary ==========
  1306. 246.40 s > report: target/nextest/ci_gammaloop/junit.xml
  1307. 246.40 s > tests: 170, failures: 2, errors: 0
  1308. 246.40 s >
  1309. 246.40 s > 1. gammaloop-integration-tests::test_runs::aa_aa::important::aa_aa_local_inspect_backend_consistency
  1310. 246.40 s > failure: test failure with exit code 101
  1311. 246.40 s > system-out
  1312. 246.40 s > running 1 test
  1313. 246.40 s > test aa_aa::important::aa_aa_local_inspect_backend_consistency ... FAILED
  1314. 246.40 s >
  1315. 246.40 s > failures:
  1316. 246.40 s >
  1317. 246.40 s > failures:
  1318. 246.40 s > aa_aa::important::aa_aa_local_inspect_backend_consistency
  1319. 246.40 s >
  1320. 246.40 s > test result: FAILED. 0 passed; 1 failed; 0 ignored; 0 measured; 274 filtered out; finished in 2.89s
  1321. 246.40 s > system-err
  1322. 246.40 s > [2026-09-16 22:34:25.788] @gammaloop_api::se... INFO : Running command import model sm-default.json
  1323. 246.40 s > [2026-09-16 22:34:25.788] @import::model INFO : Loading built-in JSON model sm-default
  1324. 246.40 s > [2026-09-16 22:34:25.810] @gammalooprs::model INFO : The following 15 external parameters were forced to zero by the restriction card:
  1325. 246.40 s > lamWS, AWS, rhoWS, etaWS, ymc, yme, ymm, MC, Me, MM, WTau, muQ, muLe, muLmu, muLtau
  1326. 246.40 s > [2026-09-16 22:34:25.810] @gammalooprs::model INFO : The following 34 vertex rules were removed by the restriction card:
  1327. 246.40 s > V_82 -> (c~, d, G+) | V_83 -> (t~, d, G+) | V_84 -> (c~, s, G+) | V_85 -> (t~, s, G+) | V_86 -> (u~, b, G+) | V_87 -> (c~, b, G+) | V_90 -> (c~, d, W+) | V_91 -> (t~, d, W+) | V_92 -> (u~, s, W+) | V_94 -> (t~, s, W+) | V_95 -> (u~, b, W+) | V_96 -> (c~, b, W+) | V_101 -> (e+, e-, G0) | V_102 -> (mu+, mu-, G0) | V_104 -> (e+, e-, H) | V_105 -> (mu+, mu-, H) | V_110 -> (ve~, e-, G+) | V_111 -> (vm~, mu-, G+) | V_116 -> (b~, u, G-) | V_117 -> (d~, c, G-) | V_118 -> (s~, c, G-) | V_119 -> (b~, c, G-) | V_120 -> (d~, t, G-) | V_121 -> (s~, t, G-) | V_124 -> (s~, u, W-) | V_125 -> (b~, u, W-) | V_126 -> (d~, c, W-) | V_128 -> (b~, c, W-) | V_129 -> (d~, t, W-) | V_130 -> (s~, t, W-) | V_138 -> (c~, c, G0) | V_140 -> (c~, c, H) | V_145 -> (e+, ve, G-) | V_146 -> (mu+, vm, G-)
  1328. 246.40 s > [2026-09-16 22:34:25.810] @gammalooprs::model INFO : The following 36 couplings were removed by the restriction card:
  1329. 246.40 s > GC_13, GC_14, GC_16, GC_17, GC_18, GC_19, GC_20, GC_22, GC_23, GC_24, GC_25, GC_26, GC_28, GC_29, GC_42, GC_43, GC_44, GC_46, GC_47, GC_48, GC_84, GC_85, GC_86, GC_87, GC_88, GC_89, GC_90, GC_91, GC_92, GC_93, GC_101, GC_102, GC_103, GC_105, GC_106, GC_107
  1330. 246.40 s > [2026-09-16 22:34:25.811] @gammaloop_api::se... INFO : Running command run set_model_parameters
  1331. 246.40 s > [2026-09-16 22:34:25.811] @gammaloop_api::se... INFO : Starting command block set_model_parameters
  1332. 246.40 s > [2026-09-16 22:34:25.811] @gammaloop_api::se... INFO : Running command set model MT=173.0
  1333. 246.40 s > [2026-09-16 22:34:25.816] @gammaloop_api::se... INFO : Running command set model WT=0.0
  1334. 246.40 s > [2026-09-16 22:34:25.820] @gammaloop_api::se... INFO : Running command set model ymt=173.0
  1335. 246.40 s > [2026-09-16 22:34:25.824] @gammaloop_api::se... INFO : Running command set model aS=0.118
  1336. 246.40 s > [2026-09-16 22:34:25.829] @gammaloop_api::se... INFO : Running command set model aEWM1=137.036
  1337. 246.40 s > [2026-09-16 22:34:25.834] @gammaloop_api::se... INFO : Running command set model Gf=1.166390e-05
  1338. 246.40 s > [2026-09-16 22:34:25.838] @gammaloop_api::se... INFO : Running command set model MZ=91.188
  1339. 246.40 s > [2026-09-16 22:34:25.843] @gammaloop_api::se... INFO : Running command set global string '
  1340. 246.40 s > [global.generation.compile]
  1341. 246.40 s > compilation_mode = "symjit"
  1342. 246.40 s > optimization_level = "O0"
  1343. 246.40 s > fast_math = false
  1344. 246.40 s > [...]
  1345. 246.40 s > [2026-09-16 22:34:25.844] @gammaloop_api::se... INFO : Running command import graphs ./examples/cli/aa_aa/1L/aa_aa_1L.dot -p aa_aa_all_helicities -i 1L_ppmm -o
  1346. 246.40 s > [2026-09-16 22:34:25.844] @commands::import INFO : Loading graphs from '/build/source/examples/cli/aa_aa/1L/aa_aa_1L.dot'
  1347. 246.40 s > [2026-09-16 22:34:25.853] @gammaloop_api::se... INFO : Running command generate existing -p aa_aa_all_helicities
  1348. 246.40 s > The application panicked (crashed).
  1349. 246.40 s > Message: label _func_power_ not found
  1350. 246.40 s > Location: /nix/store/n9w914kh1cm59xx3spcs831cdyb56m32-vendor-cargo-deps/c19b7c6f923b580ac259164a89f2577984ad5ab09ee9d583b888f934adbbe8d0/symjit-2.25.6/src/symjit/assembler.rs:77
  1351. 246.40 s >
  1352. 246.40 s > ━━━━━━━━━━━━━━━━━━━━━━━━━━━━━━━━━━ BACKTRACE ━━━━━━━━━━━━━━━━━━━━━━━━━━━━━━━━━━━
  1353. 246.40 s > 1: <color_eyre[51793ea62743adbd]::config::PanicHook>::panic_report<unknown>
  1354. 246.40 s > at <unknown source file>:<unknown line>
  1355. 246.40 s > 2: <color_eyre[51793ea62743adbd]::config::PanicHook>::into_panic_hook::{closure#0}<unknown>
  1356. 246.40 s > at <unknown source file>:<unknown line>
  1357. 246.40 s > 3: std[bcb96dfbba0ab899]::panicking::panic_with_hook<unknown>
  1358. 246.40 s > at <unknown source file>:<unknown line>
  1359. 246.40 s > 4: std[bcb96dfbba0ab899]::panicking::panic_handler::{closure#0}<unknown>
  1360. 246.40 s > at <unknown source file>:<unknown line>
  1361. 246.40 s > 5: std[bcb96dfbba0ab899]::sys::backtrace::__rust_end_short_backtrace::<std[bcb96dfbba0ab899]::panicking::panic_handler::{closure#0}, !><unknown>
  1362. 246.40 s > at <unknown source file>:<unknown line>
  1363. 246.40 s > 6: __rustc[6c289b9f9c454d21]::rust_begin_unwind<unknown>
  1364. 246.40 s > at <unknown source file>:<unknown line>
  1365. 246.40 s > 7: core[940e698046960fd5]::panicking::panic_fmt<unknown>
  1366. 246.40 s > at <unknown source file>:<unknown line>
  1367. 246.40 s > 8: <symjit[e408de789c333cd]::symjit::assembler::Assembler>::apply_jumps<unknown>
  1368. 246.40 s > at <unknown source file>:<unknown line>
  1369. 246.40 s > 9: <symjit[e408de789c333cd]::symjit::builder::Builder>::compile_from_mir::<symjit[e408de789c333cd]::symjit::amd::complex::AmdComplexGenerator><unknown>
  1370. 246.40 s > at <unknown source file>:<unknown line>
  1371. 246.40 s > 10: <symjit[e408de789c333cd]::symjit::runnable::Application>::compile_ty<unknown>
  1372. 246.40 s > at <unknown source file>:<unknown line>
  1373. 246.40 s > 11: <symjit[e408de789c333cd]::symjit::runnable::Application>::with_mir<unknown>
  1374. 246.40 s > at <unknown source file>:<unknown line>
  1375. 246.40 s > 12: <symjit[e408de789c333cd]::symjit::composer::DirectTranslator as symjit[e408de789c333cd]::symjit::composer::Composer>::compile<unknown>
  1376. 246.40 s > at <unknown source file>:<unknown line>
  1377. 246.40 s > 13: <symjit[e408de789c333cd]::symjit::compiler::Translator as symjit[e408de789c333cd]::symjit::composer::Composer>::compile<unknown>
  1378. 246.40 s > at <unknown source file>:<unknown line>
  1379. 246.40 s > 14: <numerica[124dab8567f4861e]::domains::float::complex::Complex<f64> as symbolica[10e259bab675d243]::evaluate::backend::JITCompiledNumber>::jit_compile<unknown>
  1380. 246.40 s > at <unknown source file>:<unknown line>
  1381. 246.40 s > 15: <symbolica[10e259bab675d243]::evaluate::evaluator::ExpressionEvaluator<numerica[124dab8567f4861e]::domains::float::complex::Complex<f64>>>::jit_compile<unknown>
  1382. 246.40 s > at <unknown source file>:<unknown line>
  1383. 246.40 s > 16: <gammalooprs[917cbd3df9e68f8f]::integrands::process::evaluators::GenericEvaluator>::activate_symjit<unknown>
  1384. 246.40 s > at <unknown source file>:<unknown line>
  1385. 246.40 s > 17: <gammalooprs[917cbd3df9e68f8f]::integrands::process::amplitude::AmplitudeIntegrand>::prepare_runtime_backends_after_generation_with_compile_times<unknown>
  1386. 246.40 s > at <unknown source file>:<unknown line>
  1387. 246.40 s > 18: <gammalooprs[917cbd3df9e68f8f]::processes::amplitude::Amplitude>::build_integrand<unknown>
  1388. 246.40 s > at <unknown source file>:<unknown line>
  1389. 246.40 s > 19: <gammalooprs[917cbd3df9e68f8f]::processes::process::Process>::generate_integrands<unknown>
  1390. 246.40 s > at <unknown source file>:<unknown line>
  1391. 246.40 s > 20: <gammaloop_api[9ebf6628f97aeb57]::state::State>::generate_integrand<unknown>
  1392. 246.40 s > at <unknown source file>:<unknown line>
  1393. 246.40 s > 21: <gammaloop_api[9ebf6628f97aeb57]::commands::generate::Generate>::run::<&std[bcb96dfbba0ab899]::path::PathBuf><unknown>
  1394. 246.40 s > at <unknown source file>:<unknown line>
  1395. 246.40 s > 22: <gammaloop_api[9ebf6628f97aeb57]::commands::Commands>::run<unknown>
  1396. 246.40 s > at <unknown source file>:<unknown line>
  1397. 246.40 s > 23: <gammaloop_api[9ebf6628f97aeb57]::session::CliSession>::execute_prepared<unknown>
  1398. 246.40 s > at <unknown source file>:<unknown line>
  1399. 246.40 s > 24: <gammaloop_api[9ebf6628f97aeb57]::session::CliSession>::execute_command<unknown>
  1400. 246.40 s > at <unknown source file>:<unknown line>
  1401. 246.40 s > 25: <gammaloop_integration_tests[191607b70c61cd5a]::CLIState>::run_command<unknown>
  1402. 246.40 s > at <unknown source file>:<unknown line>
  1403. 246.40 s > 26: test_runs[9b7e2dc2dc4f29b0]::aa_aa::generate_aa_aa_helicity_family<unknown>
  1404. 246.40 s > at <unknown source file>:<unknown line>
  1405. 246.40 s > 27: <test_runs[9b7e2dc2dc4f29b0]::aa_aa::important::aa_aa_local_inspect_backend_consistency::{closure#0} as core[940e698046960fd5]::ops::function::FnOnce<()>>::call_once<unknown>
  1406. 246.40 s > at <unknown source file>:<unknown line>
  1407. 246.40 s > 28: serial_test[cd99724524a2f1c0]::serial_code_lock::local_serial_core_with_return::<(), eyre[cb2fd339c0c40fca]::Report><unknown>
  1408. 246.40 s > at <unknown source file>:<unknown line>
  1409. 246.40 s > 29: <test_runs[9b7e2dc2dc4f29b0]::aa_aa::important::aa_aa_local_inspect_backend_consistency::{closure#0} as core[940e698046960fd5]::ops::function::FnOnce<()>>::call_once<unknown>
  1410. 246.40 s > at <unknown source file>:<unknown line>
  1411. 246.40 s > 30: test[75d6903177b1d7e9]::__rust_begin_short_backtrace::<core[940e698046960fd5]::result::Result<(), alloc[2ea6bcb46fca0c42]::string::String>, fn() -> core[940e698046960fd5]::result::Result<(), alloc[2ea6bcb46fca0c42]::string::String>><unknown>
  1412. 246.40 s > at <unknown source file>:<unknown line>
  1413. 246.40 s > 31: test[75d6903177b1d7e9]::run_test::{closure#0}<unknown>
  1414. 246.40 s > at <unknown source file>:<unknown line>
  1415. 246.40 s > 32: std[bcb96dfbba0ab899]::sys::backtrace::__rust_begin_short_backtrace::<test[75d6903177b1d7e9]::run_test::{closure#1}, ()><unknown>
  1416. 246.40 s > at <unknown source file>:<unknown line>
  1417. 246.40 s > 33: <std[bcb96dfbba0ab899]::thread::lifecycle::spawn_unchecked<test[75d6903177b1d7e9]::run_test::{closure#1}, ()>::{closure#1} as core[940e698046960fd5]::ops::function::FnOnce<()>>::call_once::{shim:vtable#0}<unknown>
  1418. 246.40 s > at <unknown source file>:<unknown line>
  1419. 246.40 s > 34: <std[bcb96dfbba0ab899]::sys::thread::unix::Thread>::new::thread_start<unknown>
  1420. 246.40 s > at <unknown source file>:<unknown line>
  1421. 246.40 s > 35: start_thread<unknown>
  1422. 246.40 s > at <unknown source file>:<unknown line>
  1423. 246.40 s > 36: __clone3<unknown>
  1424. 246.40 s > at <unknown source file>:<unknown line>
  1425. 246.40 s >
  1426. 246.40 s > Run with COLORBT_SHOW_HIDDEN=1 environment variable to disable frame filtering.
  1427. 246.40 s > Run with RUST_BACKTRACE=full to include source snippets.
  1428. 246.40 s > Warning: SpanTrace capture is Unsupported.
  1429. 246.40 s > Ensure that you've setup a tracing-error ErrorLayer and the semver versions are compatible
  1430. 246.40 s >
  1431. 246.40 s > 2. gammaloop-integration-tests::uv::thermal_sunrise_uv
  1432. 246.40 s > failure: test failure with exit code 101
  1433. 246.40 s > system-out
  1434. 246.40 s > running 1 test
  1435. 246.40 s > test thermal_sunrise_uv ... FAILED
  1436. 246.40 s >
  1437. 246.40 s > failures:
  1438. 246.40 s >
  1439. 246.40 s > failures:
  1440. 246.40 s > thermal_sunrise_uv
  1441. 246.40 s >
  1442. 246.40 s > test result: FAILED. 0 passed; 1 failed; 0 ignored; 0 measured; 31 filtered out; finished in 5.63s
  1443. 246.40 s > system-err
  1444. 246.40 s > [2026-09-16 22:35:19.761] @gammaloop_api::se... INFO : Running command run generate
  1445. 246.40 s > [2026-09-16 22:35:19.761] @gammaloop_api::se... INFO : Starting command block generate
  1446. 246.40 s > [2026-09-16 22:35:19.761] @gammaloop_api::se... INFO : Running command import model sm-default.json
  1447. 246.40 s > [2026-09-16 22:35:19.761] @import::model INFO : Loading built-in JSON model sm-default
  1448. 246.40 s > [2026-09-16 22:35:19.810] @gammalooprs::model INFO : The following 15 external parameters were forced to zero by the restriction card:
  1449. 246.40 s > lamWS, AWS, rhoWS, etaWS, ymc, yme, ymm, MC, Me, MM, WTau, muQ, muLe, muLmu, muLtau
  1450. 246.40 s > [2026-09-16 22:35:19.810] @gammalooprs::model INFO : The following 34 vertex rules were removed by the restriction card:
  1451. 246.40 s > V_82 -> (c~, d, G+) | V_83 -> (t~, d, G+) | V_84 -> (c~, s, G+) | V_85 -> (t~, s, G+) | V_86 -> (u~, b, G+) | V_87 -> (c~, b, G+) | V_90 -> (c~, d, W+) | V_91 -> (t~, d, W+) | V_92 -> (u~, s, W+) | V_94 -> (t~, s, W+) | V_95 -> (u~, b, W+) | V_96 -> (c~, b, W+) | V_101 -> (e+, e-, G0) | V_102 -> (mu+, mu-, G0) | V_104 -> (e+, e-, H) | V_105 -> (mu+, mu-, H) | V_110 -> (ve~, e-, G+) | V_111 -> (vm~, mu-, G+) | V_116 -> (b~, u, G-) | V_117 -> (d~, c, G-) | V_118 -> (s~, c, G-) | V_119 -> (b~, c, G-) | V_120 -> (d~, t, G-) | V_121 -> (s~, t, G-) | V_124 -> (s~, u, W-) | V_125 -> (b~, u, W-) | V_126 -> (d~, c, W-) | V_128 -> (b~, c, W-) | V_129 -> (d~, t, W-) | V_130 -> (s~, t, W-) | V_138 -> (c~, c, G0) | V_140 -> (c~, c, H) | V_145 -> (e+, ve, G-) | V_146 -> (mu+, vm, G-)
  1452. 246.40 s > [2026-09-16 22:35:19.810] @gammalooprs::model INFO : The following 36 couplings were removed by the restriction card:
  1453. 246.40 s > GC_13, GC_14, GC_16, GC_17, GC_18, GC_19, GC_20, GC_22, GC_23, GC_24, GC_25, GC_26, GC_28, GC_29, GC_42, GC_43, GC_44, GC_46, GC_47, GC_48, GC_84, GC_85, GC_86, GC_87, GC_88, GC_89, GC_90, GC_91, GC_92, GC_93, GC_101, GC_102, GC_103, GC_105, GC_106, GC_107
  1454. 246.40 s > [2026-09-16 22:35:19.811] @gammaloop_api::se... INFO : Running command remove processes
  1455. 246.40 s > [2026-09-16 22:35:19.811] @gammaloop_api::se... INFO : Running command generate amp {} > {} [{2}] | g u
  1456. 246.40 s > --numerator-grouping group_identical_graphs_up_to_scalar_rescaling
  1457. 246.40 s > --max-n-bridges 0
  1458. 246.40 s > --number-of-factorized-loop-subtopologies 1 1
  1459. 246.40 s > --number-of-anticommutating-loops 1 1
  1460. 246.40 s > [...]
  1461. 246.40 s > [2026-09-16 22:35:19.812] @feyngen::diagram_... INFO : 0s | Δ=0s | Starting Feynman graph generation with Symbolica...
  1462. 246.40 s > [2026-09-16 22:35:19.816] @feyngen::diagram_... INFO : 0s | Δ=0s | Number of graphs resulting from Symbolica generation: 3
  1463. 246.40 s > [2026-09-16 22:35:19.819] @feyngen::diagram_... INFO : 0s | Δ=0s | Number of graphs retained after removal of vetoed topologies: 2
  1464. 246.40 s > [2026-09-16 22:35:19.822] @feyngen::diagram_... INFO : 0s | Δ=0s | Number of graphs after vertex info assignment: 2
  1465. 246.40 s > [2026-09-16 22:35:19.822] @feyngen::diagram_... INFO : 0s | Δ=0s | Number of graphs after all complete graphs filters are applied: 2
  1466. 246.40 s > [2026-09-16 22:35:19.825] @feyngen::diagram_... INFO : 0s | Δ=0s | Number of graphs after closed anticommutating chains analysis: 1
  1467. 246.40 s > [2026-09-16 22:35:19.825] @feyngen::diagram_... INFO : 0s | Δ=0s | Number of graphs after symmetrization of external states: 1
  1468. 246.40 s > [2026-09-16 22:35:19.828] @feyngen::diagram_... INFO : 0s | Δ=0s | Number of graphs after canonization of vertices, edges and flows (graph labels assigned here): 1
  1469. 246.40 s > [2026-09-16 22:35:19.857] @feyngen::diagram_... INFO : 0s | Δ=0s | Number of graphs after numerator-aware grouping with strategy 'up to a scalar rescaling': 1 (1 isomorphically unique graph, 0 color zero, 0 lorentz zero, 0 grouped and 0 cancellation)
  1470. 246.40 s > [2026-09-16 22:35:19.857] @feyngen::diagram_... INFO : ( Sum of the symmetry factors from each graph generated = -1/2 )
  1471. 246.40 s > [2026-09-16 22:35:19.857] @commands::generate INFO : Generated amplitude 1 graphs.
  1472. 246.40 s > [2026-09-16 22:35:19.857] @commands::generate INFO : Only diagram generation was requested, skipping integrand generation. You can generate integrands later using the 'generate existing <options>' command.
  1473. 246.40 s > [2026-09-16 22:35:19.857] @gammaloop_api::se... INFO : Running command generate
  1474. 246.40 s > The application panicked (crashed).
  1475. 246.40 s > Message: label _func_power_ not found
  1476. 246.40 s > Location: /nix/store/n9w914kh1cm59xx3spcs831cdyb56m32-vendor-cargo-deps/c19b7c6f923b580ac259164a89f2577984ad5ab09ee9d583b888f934adbbe8d0/symjit-2.25.6/src/symjit/assembler.rs:77
  1477. 246.40 s >
  1478. 246.40 s > ━━━━━━━━━━━━━━━━━━━━━━━━━━━━━━━━━━ BACKTRACE ━━━━━━━━━━━━━━━━━━━━━━━━━━━━━━━━━━━
  1479. 246.40 s > 1: <color_eyre[51793ea62743adbd]::config::PanicHook>::panic_report<unknown>
  1480. 246.40 s > at <unknown source file>:<unknown line>
  1481. 246.40 s > 2: <color_eyre[51793ea62743adbd]::config::PanicHook>::into_panic_hook::{closure#0}<unknown>
  1482. 246.40 s > at <unknown source file>:<unknown line>
  1483. 246.40 s > 3: std[bcb96dfbba0ab899]::panicking::panic_with_hook<unknown>
  1484. 246.40 s > at <unknown source file>:<unknown line>
  1485. 246.40 s > 4: std[bcb96dfbba0ab899]::panicking::panic_handler::{closure#0}<unknown>
  1486. 246.40 s > at <unknown source file>:<unknown line>
  1487. 246.40 s > 5: std[bcb96dfbba0ab899]::sys::backtrace::__rust_end_short_backtrace::<std[bcb96dfbba0ab899]::panicking::panic_handler::{closure#0}, !><unknown>
  1488. 246.40 s > at <unknown source file>:<unknown line>
  1489. 246.40 s > 6: __rustc[6c289b9f9c454d21]::rust_begin_unwind<unknown>
  1490. 246.40 s > at <unknown source file>:<unknown line>
  1491. 246.40 s > 7: core[940e698046960fd5]::panicking::panic_fmt<unknown>
  1492. 246.40 s > at <unknown source file>:<unknown line>
  1493. 246.40 s > 8: <symjit[e408de789c333cd]::symjit::assembler::Assembler>::apply_jumps<unknown>
  1494. 246.40 s > at <unknown source file>:<unknown line>
  1495. 246.40 s > 9: <symjit[e408de789c333cd]::symjit::builder::Builder>::compile_from_mir::<symjit[e408de789c333cd]::symjit::amd::complex::AmdComplexGenerator><unknown>
  1496. 246.40 s > at <unknown source file>:<unknown line>
  1497. 246.40 s > 10: <symjit[e408de789c333cd]::symjit::runnable::Application>::compile_ty<unknown>
  1498. 246.40 s > at <unknown source file>:<unknown line>
  1499. 246.40 s > 11: <symjit[e408de789c333cd]::symjit::runnable::Application>::with_mir<unknown>
  1500. 246.40 s > at <unknown source file>:<unknown line>
  1501. 246.40 s > 12: <symjit[e408de789c333cd]::symjit::composer::DirectTranslator as symjit[e408de789c333cd]::symjit::composer::Composer>::compile<unknown>
  1502. 246.40 s > at <unknown source file>:<unknown line>
  1503. 246.40 s > 13: <symjit[e408de789c333cd]::symjit::compiler::Translator as symjit[e408de789c333cd]::symjit::composer::Composer>::compile<unknown>
  1504. 246.40 s > at <unknown source file>:<unknown line>
  1505. 246.40 s > 14: <numerica[124dab8567f4861e]::domains::float::complex::Complex<f64> as symbolica[10e259bab675d243]::evaluate::backend::JITCompiledNumber>::jit_compile<unknown>
  1506. 246.40 s > at <unknown source file>:<unknown line>
  1507. 246.40 s > 15: <symbolica[10e259bab675d243]::evaluate::evaluator::ExpressionEvaluator<numerica[124dab8567f4861e]::domains::float::complex::Complex<f64>>>::jit_compile<unknown>
  1508. 246.40 s > at <unknown source file>:<unknown line>
  1509. 246.40 s > 16: <gammalooprs[917cbd3df9e68f8f]::integrands::process::evaluators::GenericEvaluator>::activate_symjit<unknown>
  1510. 246.40 s > at <unknown source file>:<unknown line>
  1511. 246.40 s > 17: <gammalooprs[917cbd3df9e68f8f]::integrands::process::amplitude::AmplitudeIntegrand>::prepare_runtime_backends_after_generation_with_compile_times<unknown>
  1512. 246.40 s > at <unknown source file>:<unknown line>
  1513. 246.40 s > 18: <gammalooprs[917cbd3df9e68f8f]::processes::amplitude::Amplitude>::build_integrand<unknown>
  1514. 246.40 s > at <unknown source file>:<unknown line>
  1515. 246.40 s > 19: <gammalooprs[917cbd3df9e68f8f]::processes::process::Process>::generate_integrands<unknown>
  1516. 246.40 s > at <unknown source file>:<unknown line>
  1517. 246.40 s > 20: <gammalooprs[917cbd3df9e68f8f]::processes::ProcessList>::generate_integrands<unknown>
  1518. 246.40 s > at <unknown source file>:<unknown line>
  1519. 246.40 s > 21: <gammaloop_api[9ebf6628f97aeb57]::state::State>::generate_integrands<unknown>
  1520. 246.40 s > at <unknown source file>:<unknown line>
  1521. 246.40 s > 22: <gammaloop_api[9ebf6628f97aeb57]::commands::generate::Generate>::run::<&std[bcb96dfbba0ab899]::path::PathBuf><unknown>
  1522. 246.40 s > at <unknown source file>:<unknown line>
  1523. 246.40 s > 23: <gammaloop_api[9ebf6628f97aeb57]::commands::Commands>::run<unknown>
  1524. 246.40 s > at <unknown source file>:<unknown line>
  1525. 246.40 s > 24: <gammaloop_api[9ebf6628f97aeb57]::session::CliSession>::execute_prepared<unknown>
  1526. 246.40 s > at <unknown source file>:<unknown line>
  1527. 246.40 s > 25: <gammaloop_api[9ebf6628f97aeb57]::session::CliSession>::execute_prepared_commands<unknown>
  1528. 246.40 s > at <unknown source file>:<unknown line>
  1529. 246.40 s > 26: <gammaloop_api[9ebf6628f97aeb57]::session::CliSession>::execute_prepared<unknown>
  1530. 246.40 s > at <unknown source file>:<unknown line>
  1531. 246.40 s > 27: <gammaloop_api[9ebf6628f97aeb57]::session::CliSession>::execute_command<unknown>
  1532. 246.40 s > at <unknown source file>:<unknown line>
  1533. 246.40 s > 28: <gammaloop_integration_tests[191607b70c61cd5a]::CLIState>::run_command<unknown>
  1534. 246.40 s > at <unknown source file>:<unknown line>
  1535. 246.40 s > 29: uv[3c7454ef256d6487]::run_single_integrated_uv_case<unknown>
  1536. 246.40 s > at <unknown source file>:<unknown line>
  1537. 246.40 s > 30: <uv[3c7454ef256d6487]::thermal_sunrise_uv::{closure#0} as core[940e698046960fd5]::ops::function::FnOnce<()>>::call_once<unknown>
  1538. 246.40 s > at <unknown source file>:<unknown line>
  1539. 246.40 s > 31: test[75d6903177b1d7e9]::__rust_begin_short_backtrace::<core[940e698046960fd5]::result::Result<(), alloc[2ea6bcb46fca0c42]::string::String>, fn() -> core[940e698046960fd5]::result::Result<(), alloc[2ea6bcb46fca0c42]::string::String>><unknown>
  1540. 246.40 s > at <unknown source file>:<unknown line>
  1541. 246.40 s > 32: test[75d6903177b1d7e9]::run_test::{closure#0}<unknown>
  1542. 246.40 s > at <unknown source file>:<unknown line>
  1543. 246.40 s > 33: std[bcb96dfbba0ab899]::sys::backtrace::__rust_begin_short_backtrace::<test[75d6903177b1d7e9]::run_test::{closure#1}, ()><unknown>
  1544. 246.40 s > at <unknown source file>:<unknown line>
  1545. 246.40 s > 34: <std[bcb96dfbba0ab899]::thread::lifecycle::spawn_unchecked<test[75d6903177b1d7e9]::run_test::{closure#1}, ()>::{closure#1} as core[940e698046960fd5]::ops::function::FnOnce<()>>::call_once::{shim:vtable#0}<unknown>
  1546. 246.40 s > at <unknown source file>:<unknown line>
  1547. 246.40 s > 35: <std[bcb96dfbba0ab899]::sys::thread::unix::Thread>::new::thread_start<unknown>
  1548. 246.40 s > at <unknown source file>:<unknown line>
  1549. 246.40 s > 36: start_thread<unknown>
  1550. 246.40 s > at <unknown source file>:<unknown line>
  1551. 246.40 s > 37: __clone3<unknown>
  1552. 246.40 s > at <unknown source file>:<unknown line>
  1553. 246.40 s >
  1554. 246.40 s > Run with COLORBT_SHOW_HIDDEN=1 environment variable to disable frame filtering.
  1555. 246.40 s > Run with RUST_BACKTRACE=full to include source snippets.
  1556. 246.40 s > Warning: SpanTrace capture is Unsupported.
  1557. 246.40 s > Ensure that you've setup a tracing-error ErrorLayer and the semver versions are compatible
  1558. 246.40 s > =========================================
  1559. 246.40 s For full logs, run:
  1560. 246.40 s nix log /nix/store/4gv70f5250wa678m31ilwxkvjp2lhgng-gammaloop-nextest-integration.drv
  1561. 246.52 s [0 built (1 failed), 0.0Run failed.