test packages.x86_64-linux.nix-ci-check-gammaloop-nextest-integration

Reproduce this run
Original Run
  1. 0.00 s $ /nix/store/61685rbaxmpigwi3z23i33sv3jyfl70q-coreutils-9.11/bin/timeout --kill-after=15s 7200s /nix/store/wknkybkzrc16r11vk5vrykh4wmw7a353-nix-2.34.8/bin/nix --extra-experimental-features nix-command --extra-experimental-features flakes flake clone git+https://github.com/alphal00p/gammaloop --dest /tmp/nix-ci-worker/stable-pwd/repo/
  2. 0.06 s Cloning into '/tmp/nix-ci-worker/stable-pwd/repo'...
  3. 0.71 s remote: Enumerating objects: 103438, done.
  4. 0.83 s remote: Counting objects: 0% (1/10061) remote: Counting objects: 1% (101/10061) remote: Counting objects: 2% (202/10061) remote: Counting objects: 3% (302/10061) remote: Counting objects: 4% (403/10061) remote: Counting objects: 5% (504/10061) remote: Counting objects: 6% (604/10061) remote: Counting objects: 7% (705/10061) remote: Counting objects: 8% (805/10061) remote: Counting objects: 9% (906/10061) remote: Counting objects: 10% (1007/10061) remote: Counting objects: 11% (1107/10061) remote: Counting objects: 12% (1208/10061) remote: Counting objects: 13% (1308/10061) remote: Counting objects: 14% (1409/10061) remote: Counting objects: 15% (1510/10061) remote: Counting objects: 16% (1610/10061) remote: Counting objects: 17% (1711/10061) remote: Counting objects: 18% (1811/10061) remote: Counting objects: 19% (1912/10061) remote: Counting objects: 20% (2013/10061) remote: Counting objects: 21% (2113/10061) remote: Counting objects: 22% (2214/10061) remote: Counting objects: 23% (2315/10061) remote: Counting objects: 24% (2415/10061) remote: Counting objects: 25% (2516/10061) remote: Counting objects: 26% (2616/10061) remote: Counting objects: 27% (2717/10061) remote: Counting objects: 28% (2818/10061) remote: Counting objects: 29% (2918/10061) remote: Counting objects: 30% (3019/10061) remote: Counting objects: 31% (3119/10061) remote: Counting objects: 32% (3220/10061) remote: Counting objects: 33% (3321/10061) remote: Counting objects: 34% (3421/10061) remote: Counting objects: 35% (3522/10061) remote: Counting objects: 36% (3622/10061) remote: Counting objects: 37% (3723/10061) remote: Counting objects: 38% (3824/10061) remote: Counting objects: 39% (3924/10061) remote: Counting objects: 40% (4025/10061) remote: Counting objects: 41% (4126/10061) remote: Counting objects: 42% (4226/10061) remote: Counting objects: 43% (4327/10061) remote: Counting objects: 44% (4427/10061) remote: Counting objects: 45% (4528/10061) remote: Counting objects: 46% (4629/10061) remote: Counting objects: 47% (4729/10061) remote: Counting objects: 48% (4830/10061) remote: Counting objects: 49% (4930/10061) remote: Counting objects: 50% (5031/10061) remote: Counting objects: 51% (5132/10061) remote: Counting objects: 52% (5232/10061) remote: Counting objects: 53% (5333/10061) remote: Counting objects: 54% (5433/10061) remote: Counting objects: 55% (5534/10061) remote: Counting objects: 56% (5635/10061) remote: Counting objects: 57% (5735/10061) remote: Counting objects: 58% (5836/10061) remote: Counting objects: 59% (5936/10061) remote: Counting objects: 60% (6037/10061) remote: Counting objects: 61% (6138/10061) remote: Counting objects: 62% (6238/10061) remote: Counting objects: 63% (6339/10061) remote: Counting objects: 64% (6440/10061) remote: Counting objects: 65% (6540/10061) remote: Counting objects: 66% (6641/10061) remote: Counting objects: 67% (6741/10061) remote: Counting objects: 68% (6842/10061) remote: Counting objects: 69% (6943/10061) remote: Counting objects: 70% (7043/10061) remote: Counting objects: 71% (7144/10061) remote: Counting objects: 72% (7244/10061) remote: Counting objects: 73% (7345/10061) remote: Counting objects: 74% (7446/10061) remote: Counting objects: 75% (7546/10061) remote: Counting objects: 76% (7647/10061) remote: Counting objects: 77% (7747/10061) remote: Counting objects: 78% (7848/10061) remote: Counting objects: 79% (7949/10061) remote: Counting objects: 80% (8049/10061) remote: Counting objects: 81% (8150/10061) remote: Counting objects: 82% (8251/10061) remote: Counting objects: 83% (8351/10061) remote: Counting objects: 84% (8452/10061) remote: Counting objects: 85% (8552/10061) remote: Counting objects: 86% (8653/10061) remote: Counting objects: 87% (8754/10061) remote: Counting objects: 88% (8854/10061) remote: Counting objects: 89% (8955/10061) remote: Counting objects: 90% (9055/10061) remote: Counting objects: 91% (9156/10061) remote: Counting objects: 92% (9257/10061) remote: Counting objects: 93% (9357/10061) remote: Counting objects: 94% (9458/10061) remote: Counting objects: 95% (9558/10061) remote: Counting objects: 96% (9659/10061) remote: Counting objects: 97% (9760/10061) remote: Counting objects: 98% (9860/10061) remote: Counting objects: 99% (9961/10061) remote: Counting objects: 100% (10061/10061) remote: Counting objects: 100% (10061/10061), done.
  5. 3.09 s remote: Compressing objects: 0% (1/2240) remote: Compressing objects: 1% (23/2240) remote: Compressing objects: 2% (45/2240) remote: Compressing objects: 3% (68/2240) remote: Compressing objects: 4% (90/2240) remote: Compressing objects: 5% (112/2240) remote: Compressing objects: 6% (135/2240) remote: Compressing objects: 7% (157/2240) remote: Compressing objects: 8% (180/2240) remote: Compressing objects: 9% (202/2240) remote: Compressing objects: 9% (217/2240) remote: Compressing objects: 10% (224/2240) remote: Compressing objects: 11% (247/2240) remote: Compressing objects: 12% (269/2240) remote: Compressing objects: 13% (292/2240) remote: Compressing objects: 14% (314/2240) remote: Compressing objects: 15% (336/2240) remote: Compressing objects: 16% (359/2240) remote: Compressing objects: 17% (381/2240) remote: Compressing objects: 18% (404/2240) remote: Compressing objects: 19% (426/2240) remote: Compressing objects: 20% (448/2240) remote: Compressing objects: 20% (463/2240) remote: Compressing objects: 21% (471/2240) remote: Compressing objects: 22% (493/2240) remote: Compressing objects: 23% (516/2240) remote: Compressing objects: 24% (538/2240) remote: Compressing objects: 25% (560/2240) remote: Compressing objects: 26% (583/2240) remote: Compressing objects: 27% (605/2240) remote: Compressing objects: 28% (628/2240) remote: Compressing objects: 29% (650/2240) remote: Compressing objects: 30% (672/2240) remote: Compressing objects: 31% (695/2240) remote: Compressing objects: 32% (717/2240) remote: Compressing objects: 33% (740/2240) remote: Compressing objects: 34% (762/2240) remote: Compressing objects: 35% (784/2240) remote: Compressing objects: 36% (807/2240) remote: Compressing objects: 37% (829/2240) remote: Compressing objects: 38% (852/2240) remote: Compressing objects: 39% (874/2240) remote: Compressing objects: 40% (896/2240) remote: Compressing objects: 41% (919/2240) remote: Compressing objects: 42% (941/2240) remote: Compressing objects: 43% (964/2240) remote: Compressing objects: 44% (986/2240) remote: Compressing objects: 45% (1008/2240) remote: Compressing objects: 46% (1031/2240) remote: Compressing objects: 47% (1053/2240) remote: Compressing objects: 48% (1076/2240) remote: Compressing objects: 49% (1098/2240) remote: Compressing objects: 50% (1120/2240) remote: Compressing objects: 51% (1143/2240) remote: Compressing objects: 52% (1165/2240) remote: Compressing objects: 53% (1188/2240) remote: Compressing objects: 54% (1210/2240) remote: Compressing objects: 55% (1232/2240) remote: Compressing objects: 56% (1255/2240) remote: Compressing objects: 57% (1277/2240) remote: Compressing objects: 58% (1300/2240) remote: Compressing objects: 59% (1322/2240) remote: Compressing objects: 60% (1344/2240) remote: Compressing objects: 61% (1367/2240) remote: Compressing objects: 62% (1389/2240) remote: Compressing objects: 63% (1412/2240) remote: Compressing objects: 64% (1434/2240) remote: Compressing objects: 65% (1456/2240) remote: Compressing objects: 66% (1479/2240) remote: Compressing objects: 67% (1501/2240) remote: Compressing objects: 68% (1524/2240) remote: Compressing objects: 69% (1546/2240) remote: Compressing objects: 70% (1568/2240) remote: Compressing objects: 71% (1591/2240) remote: Compressing objects: 72% (1613/2240) remote: Compressing objects: 73% (1636/2240) remote: Compressing objects: 74% (1658/2240) remote: Compressing objects: 75% (1680/2240) remote: Compressing objects: 76% (1703/2240) remote: Compressing objects: 77% (1725/2240) remote: Compressing objects: 78% (1748/2240) remote: Compressing objects: 79% (1770/2240) remote: Compressing objects: 80% (1792/2240) remote: Compressing objects: 81% (1815/2240) remote: Compressing objects: 82% (1837/2240) remote: Compressing objects: 83% (1860/2240) remote: Compressing objects: 84% (1882/2240) remote: Compressing objects: 85% (1904/2240) remote: Compressing objects: 86% (1927/2240) remote: Compressing objects: 87% (1949/2240) remote: Compressing objects: 88% (1972/2240) remote: Compressing objects: 89% (1994/2240) remote: Compressing objects: 90% (2016/2240) remote: Compressing objects: 91% (2039/2240) remote: Compressing objects: 92% (2061/2240) remote: Compressing objects: 93% (2084/2240) remote: Compressing objects: 94% (2106/2240) remote: Compressing objects: 95% (2128/2240) remote: Compressing objects: 96% (2151/2240) remote: Compressing objects: 97% (2173/2240) remote: Compressing objects: 98% (2196/2240) remote: Compressing objects: 99% (2218/2240) remote: Compressing objects: 100% (2240/2240) remote: Compressing objects: 100% (2240/2240), done.
  6. 14.78 s Receiving objects: 0% (1/103438) Receiving objects: 1% (1035/103438) Receiving objects: 2% (2069/103438) Receiving objects: 3% (3104/103438) Receiving objects: 4% (4138/103438) Receiving objects: 5% (5172/103438) Receiving objects: 6% (6207/103438) Receiving objects: 7% (7241/103438), 16.93 MiB | 33.84 MiB/s Receiving objects: 8% (8276/103438), 16.93 MiB | 33.84 MiB/s Receiving objects: 9% (9310/103438), 16.93 MiB | 33.84 MiB/s Receiving objects: 10% (10344/103438), 16.93 MiB | 33.84 MiB/s Receiving objects: 11% (11379/103438), 16.93 MiB | 33.84 MiB/s Receiving objects: 12% (12413/103438), 16.93 MiB | 33.84 MiB/s Receiving objects: 13% (13447/103438), 16.93 MiB | 33.84 MiB/s Receiving objects: 14% (14482/103438), 16.93 MiB | 33.84 MiB/s Receiving objects: 15% (15516/103438), 16.93 MiB | 33.84 MiB/s Receiving objects: 16% (16551/103438), 16.93 MiB | 33.84 MiB/s Receiving objects: 17% (17585/103438), 16.93 MiB | 33.84 MiB/s Receiving objects: 18% (18619/103438), 16.93 MiB | 33.84 MiB/s Receiving objects: 19% (19654/103438), 16.93 MiB | 33.84 MiB/s Receiving objects: 20% (20688/103438), 16.93 MiB | 33.84 MiB/s Receiving objects: 21% (21722/103438), 16.93 MiB | 33.84 MiB/s Receiving objects: 22% (22757/103438), 16.93 MiB | 33.84 MiB/s Receiving objects: 23% (23791/103438), 16.93 MiB | 33.84 MiB/s Receiving objects: 24% (24826/103438), 16.93 MiB | 33.84 MiB/s Receiving objects: 25% (25860/103438), 16.93 MiB | 33.84 MiB/s Receiving objects: 26% (26894/103438), 16.93 MiB | 33.84 MiB/s Receiving objects: 27% (27929/103438), 16.93 MiB | 33.84 MiB/s Receiving objects: 28% (28963/103438), 16.93 MiB | 33.84 MiB/s Receiving objects: 29% (29998/103438), 16.93 MiB | 33.84 MiB/s Receiving objects: 30% (31032/103438), 16.93 MiB | 33.84 MiB/s Receiving objects: 31% (32066/103438), 16.93 MiB | 33.84 MiB/s Receiving objects: 32% (33101/103438), 16.93 MiB | 33.84 MiB/s Receiving objects: 33% (34135/103438), 16.93 MiB | 33.84 MiB/s Receiving objects: 33% (34860/103438), 34.29 MiB | 33.37 MiB/s Receiving objects: 34% (35169/103438), 34.29 MiB | 33.37 MiB/s Receiving objects: 35% (36204/103438), 34.29 MiB | 33.37 MiB/s Receiving objects: 36% (37238/103438), 34.29 MiB | 33.37 MiB/s Receiving objects: 37% (38273/103438), 34.29 MiB | 33.37 MiB/s Receiving objects: 38% (39307/103438), 34.29 MiB | 33.37 MiB/s Receiving objects: 39% (40341/103438), 34.29 MiB | 33.37 MiB/s Receiving objects: 40% (41376/103438), 34.29 MiB | 33.37 MiB/s Receiving objects: 41% (42410/103438), 34.29 MiB | 33.37 MiB/s Receiving objects: 42% (43444/103438), 34.29 MiB | 33.37 MiB/s Receiving objects: 43% (44479/103438), 51.93 MiB | 34.00 MiB/s Receiving objects: 44% (45513/103438), 51.93 MiB | 34.00 MiB/s Receiving objects: 45% (46548/103438), 51.93 MiB | 34.00 MiB/s Receiving objects: 46% (47582/103438), 51.93 MiB | 34.00 MiB/s Receiving objects: 47% (48616/103438), 51.93 MiB | 34.00 MiB/s Receiving objects: 47% (49103/103438), 51.93 MiB | 34.00 MiB/s Receiving objects: 48% (49651/103438), 51.93 MiB | 34.00 MiB/s Receiving objects: 49% (50685/103438), 68.93 MiB | 33.45 MiB/s Receiving objects: 50% (51719/103438), 68.93 MiB | 33.45 MiB/s Receiving objects: 51% (52754/103438), 68.93 MiB | 33.45 MiB/s Receiving objects: 52% (53788/103438), 68.93 MiB | 33.45 MiB/s Receiving objects: 53% (54823/103438), 68.93 MiB | 33.45 MiB/s Receiving objects: 54% (55857/103438), 68.93 MiB | 33.45 MiB/s Receiving objects: 55% (56891/103438), 68.93 MiB | 33.45 MiB/s Receiving objects: 55% (57068/103438), 86.95 MiB | 33.95 MiB/s Receiving objects: 55% (57173/103438), 121.51 MiB | 33.81 MiB/s Receiving objects: 56% (57926/103438), 156.40 MiB | 33.79 MiB/s Receiving objects: 57% (58960/103438), 156.40 MiB | 33.79 MiB/s Receiving objects: 58% (59995/103438), 156.40 MiB | 33.79 MiB/s Receiving objects: 59% (61029/103438), 156.40 MiB | 33.79 MiB/s Receiving objects: 59% (61125/103438), 156.40 MiB | 33.79 MiB/s Receiving objects: 60% (62063/103438), 156.40 MiB | 33.79 MiB/s Receiving objects: 61% (63098/103438), 173.58 MiB | 33.61 MiB/s Receiving objects: 62% (64132/103438), 173.58 MiB | 33.61 MiB/s Receiving objects: 63% (65166/103438), 173.58 MiB | 33.61 MiB/s Receiving objects: 64% (66201/103438), 190.66 MiB | 33.74 MiB/s Receiving objects: 65% (67235/103438), 190.66 MiB | 33.74 MiB/s Receiving objects: 66% (68270/103438), 190.66 MiB | 33.74 MiB/s Receiving objects: 67% (69304/103438), 190.66 MiB | 33.74 MiB/s Receiving objects: 68% (70338/103438), 190.66 MiB | 33.74 MiB/s Receiving objects: 69% (71373/103438), 190.66 MiB | 33.74 MiB/s Receiving objects: 70% (72407/103438), 190.66 MiB | 33.74 MiB/s Receiving objects: 71% (73441/103438), 190.66 MiB | 33.74 MiB/s Receiving objects: 71% (74291/103438), 190.66 MiB | 33.74 MiB/s Receiving objects: 72% (74476/103438), 190.66 MiB | 33.74 MiB/s Receiving objects: 73% (75510/103438), 190.66 MiB | 33.74 MiB/s Receiving objects: 74% (76545/103438), 207.77 MiB | 33.39 MiB/s Receiving objects: 75% (77579/103438), 225.59 MiB | 33.81 MiB/s Receiving objects: 76% (78613/103438), 225.59 MiB | 33.81 MiB/s Receiving objects: 76% (79582/103438), 225.59 MiB | 33.81 MiB/s Receiving objects: 77% (79648/103438), 225.59 MiB | 33.81 MiB/s Receiving objects: 78% (80682/103438), 225.59 MiB | 33.81 MiB/s Receiving objects: 79% (81717/103438), 242.26 MiB | 33.28 MiB/s Receiving objects: 80% (82751/103438), 242.26 MiB | 33.28 MiB/s Receiving objects: 81% (83785/103438), 242.26 MiB | 33.28 MiB/s Receiving objects: 81% (84183/103438), 260.01 MiB | 33.72 MiB/s Receiving objects: 81% (84511/103438), 292.90 MiB | 33.52 MiB/s Receiving objects: 82% (84820/103438), 309.27 MiB | 33.23 MiB/s Receiving objects: 83% (85854/103438), 309.27 MiB | 33.23 MiB/s Receiving objects: 84% (86888/103438), 309.27 MiB | 33.23 MiB/s Receiving objects: 85% (87923/103438), 326.08 MiB | 33.20 MiB/s Receiving objects: 85% (87969/103438), 326.08 MiB | 33.20 MiB/s Receiving objects: 86% (88957/103438), 326.08 MiB | 33.20 MiB/s Receiving objects: 87% (89992/103438), 326.08 MiB | 33.20 MiB/s Receiving objects: 88% (91026/103438), 326.08 MiB | 33.20 MiB/s Receiving objects: 88% (91493/103438), 360.91 MiB | 33.58 MiB/s Receiving objects: 89% (92060/103438), 376.83 MiB | 33.16 MiB/s Receiving objects: 90% (93095/103438), 376.83 MiB | 33.16 MiB/s Receiving objects: 91% (94129/103438), 376.83 MiB | 33.16 MiB/s Receiving objects: 92% (95163/103438), 376.83 MiB | 33.16 MiB/s Receiving objects: 93% (96198/103438), 376.83 MiB | 33.16 MiB/s Receiving objects: 94% (97232/103438), 376.83 MiB | 33.16 MiB/s Receiving objects: 95% (98267/103438), 376.83 MiB | 33.16 MiB/s Receiving objects: 96% (99301/103438), 376.83 MiB | 33.16 MiB/s Receiving objects: 97% (100335/103438), 376.83 MiB | 33.16 MiB/s Receiving objects: 98% (101370/103438), 376.83 MiB | 33.16 MiB/s Receiving objects: 99% (102404/103438), 376.83 MiB | 33.16 MiB/s remote: Total 103438 (delta 8585), reused 8019 (delta 7796), pack-reused 93377 (from 4)
  7. 14.78 s Receiving objects: 100% (103438/103438), 376.83 MiB | 33.16 MiB/s Receiving objects: 100% (103438/103438), 391.84 MiB | 33.54 MiB/s, done.
  8. 15.89 s Resolving deltas: 0% (0/67773) Resolving deltas: 1% (679/67773) Resolving deltas: 2% (1356/67773) Resolving deltas: 3% (2034/67773) Resolving deltas: 4% (2711/67773) Resolving deltas: 5% (3394/67773) Resolving deltas: 6% (4067/67773) Resolving deltas: 7% (4745/67773) Resolving deltas: 8% (5422/67773) Resolving deltas: 9% (6100/67773) Resolving deltas: 10% (6780/67773) Resolving deltas: 11% (7456/67773) Resolving deltas: 12% (8133/67773) Resolving deltas: 13% (8811/67773) Resolving deltas: 14% (9489/67773) Resolving deltas: 15% (10166/67773) Resolving deltas: 16% (10844/67773) Resolving deltas: 17% (11524/67773) Resolving deltas: 18% (12201/67773) Resolving deltas: 19% (12878/67773) Resolving deltas: 20% (13555/67773) Resolving deltas: 21% (14234/67773) Resolving deltas: 22% (14911/67773) Resolving deltas: 23% (15589/67773) Resolving deltas: 24% (16266/67773) Resolving deltas: 25% (16944/67773) Resolving deltas: 26% (17621/67773) Resolving deltas: 27% (18299/67773) Resolving deltas: 28% (18977/67773) Resolving deltas: 29% (19655/67773) Resolving deltas: 30% (20332/67773) Resolving deltas: 31% (21010/67773) Resolving deltas: 32% (21688/67773) Resolving deltas: 33% (22366/67773) Resolving deltas: 34% (23044/67773) Resolving deltas: 35% (23721/67773) Resolving deltas: 36% (24399/67773) Resolving deltas: 37% (25077/67773) Resolving deltas: 38% (25754/67773) Resolving deltas: 39% (26432/67773) Resolving deltas: 40% (27110/67773) Resolving deltas: 41% (27787/67773) Resolving deltas: 42% (28465/67773) Resolving deltas: 43% (29144/67773) Resolving deltas: 44% (29821/67773) Resolving deltas: 45% (30498/67773) Resolving deltas: 46% (31176/67773) Resolving deltas: 47% (31854/67773) Resolving deltas: 48% (32532/67773) Resolving deltas: 49% (33209/67773) Resolving deltas: 50% (33887/67773) Resolving deltas: 51% (34568/67773) Resolving deltas: 52% (35242/67773) Resolving deltas: 53% (35920/67773) Resolving deltas: 54% (36598/67773) Resolving deltas: 55% (37276/67773) Resolving deltas: 56% (37953/67773) Resolving deltas: 57% (38632/67773) Resolving deltas: 58% (39309/67773) Resolving deltas: 59% (39988/67773) Resolving deltas: 60% (40664/67773) Resolving deltas: 61% (41342/67773) Resolving deltas: 62% (42020/67773) Resolving deltas: 63% (42698/67773) Resolving deltas: 64% (43377/67773) Resolving deltas: 65% (44053/67773) Resolving deltas: 66% (44731/67773) Resolving deltas: 67% (45410/67773) Resolving deltas: 68% (46086/67773) Resolving deltas: 69% (46764/67773) Resolving deltas: 70% (47442/67773) Resolving deltas: 71% (48119/67773) Resolving deltas: 72% (48797/67773) Resolving deltas: 73% (49475/67773) Resolving deltas: 74% (50153/67773) Resolving deltas: 75% (50830/67773) Resolving deltas: 76% (51508/67773) Resolving deltas: 77% (52186/67773) Resolving deltas: 78% (52863/67773) Resolving deltas: 79% (53541/67773) Resolving deltas: 80% (54221/67773) Resolving deltas: 81% (54897/67773) Resolving deltas: 82% (55574/67773) Resolving deltas: 83% (56252/67773) Resolving deltas: 84% (56930/67773) Resolving deltas: 85% (57609/67773) Resolving deltas: 86% (58286/67773) Resolving deltas: 87% (58963/67773) Resolving deltas: 87% (59121/67773) Resolving deltas: 88% (59641/67773) Resolving deltas: 89% (60318/67773) Resolving deltas: 90% (60996/67773) Resolving deltas: 91% (61674/67773) Resolving deltas: 92% (62352/67773) Resolving deltas: 93% (63029/67773) Resolving deltas: 94% (63707/67773) Resolving deltas: 95% (64386/67773) Resolving deltas: 96% (65065/67773) Resolving deltas: 97% (65740/67773) Resolving deltas: 98% (66418/67773) Resolving deltas: 99% (67096/67773) Resolving deltas: 100% (67773/67773) Resolving deltas: 100% (67773/67773), done.
  9. 16.44 s Fetching commit 5771856b10d744e1d21d497095c24f885b591f6d for finite_T_and_mu ...
  10. 16.44 s $ /nix/store/5vpcfsdx1lcnlb2y4k7xyc74shp5qwbh-git-2.54.0/bin/git fetch origin 5771856b10d744e1d21d497095c24f885b591f6d
  11. 16.83 s From https://github.com/alphal00p/gammaloop
  12. 16.83 s * branch 5771856b10d744e1d21d497095c24f885b591f6d -> FETCH_HEAD
  13. 16.84 s $ /nix/store/61685rbaxmpigwi3z23i33sv3jyfl70q-coreutils-9.11/bin/timeout --kill-after=15s 7200s /nix/store/5vpcfsdx1lcnlb2y4k7xyc74shp5qwbh-git-2.54.0/bin/git -c advice.detachedHead=false checkout 5771856b10d744e1d21d497095c24f885b591f6d
  14. 17.11 s HEAD is now at 5771856b1 test higher energy power treatment through inverse-propagator cancellation in both vacuum and medium mode
  15. 17.11 s $ /nix/store/61685rbaxmpigwi3z23i33sv3jyfl70q-coreutils-9.11/bin/timeout --kill-after=15s 7200s /nix/store/wknkybkzrc16r11vk5vrykh4wmw7a353-nix-2.34.8/bin/nix --extra-experimental-features nix-command --extra-experimental-features flakes --log-format internal-json run .#packages.x86_64-linux.nix-ci-check-gammaloop-nextest-integration --print-build-logs
  16. 17.22 s
  17. 21.19 s evaluating derivation 'g copying '/nix/store/73ca evaluating derivation 'g copying '/nix/store/73ca evaluating derivation 'g copying '/nix/store/73ca evaluating derivation 'g copying '/nix/store/73ca evaluating derivation 'g copying '/nix/store/73ca evaluating derivation 'g copying '/nix/store/73ca evaluating derivation 'g [0/1 built] [1/0/1 built] [1/0/1 built] building ggammaloop-nextest-integration> Extracting 13 binaries, 1 build script output directory, and 3 linked paths to /build/nextest-archive-YP4ubw
  18. 23.28 s gammaloop-nextest-integration> Extracted 30 files to /build/nextest-archive-YP4ubw in 2.10s
  19. 23.30 s gammaloop-nextest-integration> ------------
  20. 23.30 s gammaloop-nextest-integration> Nextest run ID 363b06b2-1b8f-4ee8-b83c-11bda896f208 with nextest profile: ci_gammaloop
  21. 23.30 s gammaloop-nextest-integration> Starting 170 tests across 13 binaries (209 tests skipped, including 208 tests via profile.ci_gammaloop.default-filter)
  22. 111.82 s gammaloop-nextest-integration> FAIL [ 2.786s] ( 55/170) gammaloop-integration-tests::test_runs aa_aa::important::aa_aa_local_inspect_backend_consistency
  23. 111.82 s gammaloop-nextest-integration> stdout ---
  24. 111.82 s gammaloop-nextest-integration>
  25. 111.82 s gammaloop-nextest-integration> running 1 test
  26. 111.82 s gammaloop-nextest-integration> test aa_aa::important::aa_aa_local_inspect_backend_consistency ... FAILED
  27. 111.82 s gammaloop-nextest-integration>
  28. 111.82 s gammaloop-nextest-integration> failures:
  29. 111.82 s gammaloop-nextest-integration>
  30. 111.82 s gammaloop-nextest-integration> failures:
  31. 111.82 s gammaloop-nextest-integration> aa_aa::important::aa_aa_local_inspect_backend_consistency
  32. 111.82 s gammaloop-nextest-integration>
  33. 111.82 s gammaloop-nextest-integration> test result: FAILED. 0 passed; 1 failed; 0 ignored; 0 measured; 274 filtered out; finished in 2.77s
  34. 111.82 s gammaloop-nextest-integration>
  35. 111.82 s gammaloop-nextest-integration> stderr ---
  36. 111.82 s gammaloop-nextest-integration> [2026-09-18 22:29:32.324] @gammaloop_api::se... INFO : Running command import model sm-default.json
  37. 111.82 s gammaloop-nextest-integration> [2026-09-18 22:29:32.324] @import::model INFO : Loading built-in JSON model sm-default
  38. 111.82 s gammaloop-nextest-integration> [2026-09-18 22:29:32.345] @gammalooprs::model INFO : The following 15 external parameters were forced to zero by the restriction card:
  39. 111.82 s gammaloop-nextest-integration> lamWS, AWS, rhoWS, etaWS, ymc, yme, ymm, MC, Me, MM, WTau, muQ, muLe, muLmu, muLtau
  40. 111.82 s gammaloop-nextest-integration> [2026-09-18 22:29:32.345] @gammalooprs::model INFO : The following 34 vertex rules were removed by the restriction card:
  41. 111.82 s gammaloop-nextest-integration> V_82 -> (c~, d, G+) | V_83 -> (t~, d, G+) | V_84 -> (c~, s, G+) | V_85 -> (t~, s, G+) | V_86 -> (u~, b, G+) | V_87 -> (c~, b, G+) | V_90 -> (c~, d, W+) | V_91 -> (t~, d, W+) | V_92 -> (u~, s, W+) | V_94 -> (t~, s, W+) | V_95 -> (u~, b, W+) | V_96 -> (c~, b, W+) | V_101 -> (e+, e-, G0) | V_102 -> (mu+, mu-, G0) | V_104 -> (e+, e-, H) | V_105 -> (mu+, mu-, H) | V_110 -> (ve~, e-, G+) | V_111 -> (vm~, mu-, G+) | V_116 -> (b~, u, G-) | V_117 -> (d~, c, G-) | V_118 -> (s~, c, G-) | V_119 -> (b~, c, G-) | V_120 -> (d~, t, G-) | V_121 -> (s~, t, G-) | V_124 -> (s~, u, W-) | V_125 -> (b~, u, W-) | V_126 -> (d~, c, W-) | V_128 -> (b~, c, W-) | V_129 -> (d~, t, W-) | V_130 -> (s~, t, W-) | V_138 -> (c~, c, G0) | V_140 -> (c~, c, H) | V_145 -> (e+, ve, G-) | V_146 -> (mu+, vm, G-)
  42. 111.82 s gammaloop-nextest-integration> [2026-09-18 22:29:32.345] @gammalooprs::model INFO : The following 36 couplings were removed by the restriction card:
  43. 111.82 s gammaloop-nextest-integration> GC_13, GC_14, GC_16, GC_17, GC_18, GC_19, GC_20, GC_22, GC_23, GC_24, GC_25, GC_26, GC_28, GC_29, GC_42, GC_43, GC_44, GC_46, GC_47, GC_48, GC_84, GC_85, GC_86, GC_87, GC_88, GC_89, GC_90, GC_91, GC_92, GC_93, GC_101, GC_102, GC_103, GC_105, GC_106, GC_107
  44. 111.82 s gammaloop-nextest-integration> [2026-09-18 22:29:32.345] @gammaloop_api::se... INFO : Running command run set_model_parameters
  45. 111.82 s gammaloop-nextest-integration> [2026-09-18 22:29:32.345] @gammaloop_api::se... INFO : Starting command block set_model_parameters
  46. 111.82 s gammaloop-nextest-integration> [2026-09-18 22:29:32.345] @gammaloop_api::se... INFO : Running command set model MT=173.0
  47. 111.82 s gammaloop-nextest-integration> [2026-09-18 22:29:32.349] @gammaloop_api::se... INFO : Running command set model WT=0.0
  48. 111.82 s gammaloop-nextest-integration> [2026-09-18 22:29:32.353] @gammaloop_api::se... INFO : Running command set model ymt=173.0
  49. 111.82 s gammaloop-nextest-integration> [2026-09-18 22:29:32.357] @gammaloop_api::se... INFO : Running command set model aS=0.118
  50. 111.82 s gammaloop-nextest-integration> [2026-09-18 22:29:32.361] @gammaloop_api::se... INFO : Running command set model aEWM1=137.036
  51. 111.82 s gammaloop-nextest-integration> [2026-09-18 22:29:32.364] @gammaloop_api::se... INFO : Running command set model Gf=1.166390e-05
  52. 111.82 s gammaloop-nextest-integration> [2026-09-18 22:29:32.368] @gammaloop_api::se... INFO : Running command set model MZ=91.188
  53. 111.82 s gammaloop-nextest-integration> [2026-09-18 22:29:32.372] @gammaloop_api::se... INFO : Running command set global string '
  54. 111.82 s gammaloop-nextest-integration> [global.generation.compile]
  55. 111.82 s gammaloop-nextest-integration> compilation_mode = "symjit"
  56. 111.82 s gammaloop-nextest-integration> optimization_level = "O0"
  57. 111.82 s gammaloop-nextest-integration> fast_math = false
  58. 111.82 s gammaloop-nextest-integration> [...]
  59. 111.82 s gammaloop-nextest-integration> [2026-09-18 22:29:32.372] @gammaloop_api::se... INFO : Running command import graphs ./examples/cli/aa_aa/1L/aa_aa_1L.dot -p aa_aa_all_helicities -i 1L_ppmm -o
  60. 111.82 s gammaloop-nextest-integration> [2026-09-18 22:29:32.373] @commands::import INFO : Loading graphs from '/build/source/examples/cli/aa_aa/1L/aa_aa_1L.dot'
  61. 111.82 s gammaloop-nextest-integration> [2026-09-18 22:29:32.381] @gammaloop_api::se... INFO : Running command generate existing -p aa_aa_all_helicities
  62. 111.82 s gammaloop-nextest-integration> The application panicked (crashed).
  63. 111.82 s gammaloop-nextest-integration> Message: label _func_power_ not found
  64. 111.82 s gammaloop-nextest-integration> Location: /nix/store/n9w914kh1cm59xx3spcs831cdyb56m32-vendor-cargo-deps/c19b7c6f923b580ac259164a89f2577984ad5ab09ee9d583b888f934adbbe8d0/symjit-2.25.6/src/symjit/assembler.rs:77
  65. 111.82 s gammaloop-nextest-integration>
  66. 111.82 s gammaloop-nextest-integration> ━━━━━━━━━━━━━━━━━━━━━━━━━━━━━━━━━━ BACKTRACE ━━━━━━━━━━━━━━━━━━━━━━━━━━━━━━━━━━━
  67. 111.82 s gammaloop-nextest-integration> 1: <color_eyre[51793ea62743adbd]::config::PanicHook>::panic_report<unknown>
  68. 111.82 s gammaloop-nextest-integration> at <unknown source file>:<unknown line>
  69. 111.82 s gammaloop-nextest-integration> 2: <color_eyre[51793ea62743adbd]::config::PanicHook>::into_panic_hook::{closure#0}<unknown>
  70. 111.82 s gammaloop-nextest-integration> at <unknown source file>:<unknown line>
  71. 111.82 s gammaloop-nextest-integration> 3: std[bcb96dfbba0ab899]::panicking::panic_with_hook<unknown>
  72. 111.82 s gammaloop-nextest-integration> at <unknown source file>:<unknown line>
  73. 111.82 s gammaloop-nextest-integration> 4: std[bcb96dfbba0ab899]::panicking::panic_handler::{closure#0}<unknown>
  74. 111.82 s gammaloop-nextest-integration> at <unknown source file>:<unknown line>
  75. 111.82 s gammaloop-nextest-integration> 5: std[bcb96dfbba0ab899]::sys::backtrace::__rust_end_short_backtrace::<std[bcb96dfbba0ab899]::panicking::panic_handler::{closure#0}, !><unknown>
  76. 111.82 s gammaloop-nextest-integration> at <unknown source file>:<unknown line>
  77. 111.82 s gammaloop-nextest-integration> 6: __rustc[6c289b9f9c454d21]::rust_begin_unwind<unknown>
  78. 111.82 s gammaloop-nextest-integration> at <unknown source file>:<unknown line>
  79. 111.82 s gammaloop-nextest-integration> 7: core[940e698046960fd5]::panicking::panic_fmt<unknown>
  80. 111.82 s gammaloop-nextest-integration> at <unknown source file>:<unknown line>
  81. 111.82 s gammaloop-nextest-integration> 8: <symjit[e408de789c333cd]::symjit::assembler::Assembler>::apply_jumps<unknown>
  82. 111.82 s gammaloop-nextest-integration> at <unknown source file>:<unknown line>
  83. 111.82 s gammaloop-nextest-integration> 9: <symjit[e408de789c333cd]::symjit::builder::Builder>::compile_from_mir::<symjit[e408de789c333cd]::symjit::amd::complex::AmdComplexGenerator><unknown>
  84. 111.82 s gammaloop-nextest-integration> at <unknown source file>:<unknown line>
  85. 111.82 s gammaloop-nextest-integration> 10: <symjit[e408de789c333cd]::symjit::runnable::Application>::compile_ty<unknown>
  86. 111.82 s gammaloop-nextest-integration> at <unknown source file>:<unknown line>
  87. 111.82 s gammaloop-nextest-integration> 11: <symjit[e408de789c333cd]::symjit::runnable::Application>::with_mir<unknown>
  88. 111.82 s gammaloop-nextest-integration> at <unknown source file>:<unknown line>
  89. 111.82 s gammaloop-nextest-integration> 12: <symjit[e408de789c333cd]::symjit::composer::DirectTranslator as symjit[e408de789c333cd]::symjit::composer::Composer>::compile<unknown>
  90. 111.82 s gammaloop-nextest-integration> at <unknown source file>:<unknown line>
  91. 111.82 s gammaloop-nextest-integration> 13: <symjit[e408de789c333cd]::symjit::compiler::Translator as symjit[e408de789c333cd]::symjit::composer::Composer>::compile<unknown>
  92. 111.82 s gammaloop-nextest-integration> at <unknown source file>:<unknown line>
  93. 111.82 s gammaloop-nextest-integration> 14: <numerica[124dab8567f4861e]::domains::float::complex::Complex<f64> as symbolica[10e259bab675d243]::evaluate::backend::JITCompiledNumber>::jit_compile<unknown>
  94. 111.82 s gammaloop-nextest-integration> at <unknown source file>:<unknown line>
  95. 111.82 s gammaloop-nextest-integration> 15: <gammalooprs[917cbd3df9e68f8f]::integrands::process::evaluators::GenericEvaluator>::activate_symjit<unknown>
  96. 111.82 s gammaloop-nextest-integration> at <unknown source file>:<unknown line>
  97. 111.82 s gammaloop-nextest-integration> 16: <gammalooprs[917cbd3df9e68f8f]::integrands::process::amplitude::AmplitudeIntegrand>::prepare_runtime_backends_after_generation_with_compile_times<unknown>
  98. 111.82 s gammaloop-nextest-integration> at <unknown source file>:<unknown line>
  99. 111.82 s gammaloop-nextest-integration> 17: <gammalooprs[917cbd3df9e68f8f]::processes::amplitude::Amplitude>::build_integrand<unknown>
  100. 111.82 s gammaloop-nextest-integration> at <unknown source file>:<unknown line>
  101. 111.82 s gammaloop-nextest-integration> 18: <gammalooprs[917cbd3df9e68f8f]::processes::process::Process>::generate_integrands<unknown>
  102. 111.82 s gammaloop-nextest-integration> at <unknown source file>:<unknown line>
  103. 111.82 s gammaloop-nextest-integration> 19: <gammaloop_api[9ebf6628f97aeb57]::state::State>::generate_integrand<unknown>
  104. 111.82 s gammaloop-nextest-integration> at <unknown source file>:<unknown line>
  105. 111.82 s gammaloop-nextest-integration> 20: <gammaloop_api[9ebf6628f97aeb57]::commands::generate::Generate>::run::<&std[bcb96dfbba0ab899]::path::PathBuf><unknown>
  106. 111.82 s gammaloop-nextest-integration> at <unknown source file>:<unknown line>
  107. 111.82 s gammaloop-nextest-integration> 21: <gammaloop_api[9ebf6628f97aeb57]::commands::Commands>::run<unknown>
  108. 111.82 s gammaloop-nextest-integration> at <unknown source file>:<unknown line>
  109. 111.82 s gammaloop-nextest-integration> 22: <gammaloop_api[9ebf6628f97aeb57]::session::CliSession>::execute_prepared<unknown>
  110. 111.82 s gammaloop-nextest-integration> at <unknown source file>:<unknown line>
  111. 111.82 s gammaloop-nextest-integration> 23: <gammaloop_api[9ebf6628f97aeb57]::session::CliSession>::execute_command<unknown>
  112. 111.82 s gammaloop-nextest-integration> at <unknown source file>:<unknown line>
  113. 111.82 s gammaloop-nextest-integration> 24: <gammaloop_integration_tests[191607b70c61cd5a]::CLIState>::run_command<unknown>
  114. 111.82 s gammaloop-nextest-integration> at <unknown source file>:<unknown line>
  115. 111.82 s gammaloop-nextest-integration> 25: test_runs[9b7e2dc2dc4f29b0]::aa_aa::generate_aa_aa_helicity_family<unknown>
  116. 111.82 s gammaloop-nextest-integration> at <unknown source file>:<unknown line>
  117. 111.82 s gammaloop-nextest-integration> 26: <test_runs[9b7e2dc2dc4f29b0]::aa_aa::important::aa_aa_local_inspect_backend_consistency::{closure#0} as core[940e698046960fd5]::ops::function::FnOnce<()>>::call_once<unknown>
  118. 111.82 s gammaloop-nextest-integration> at <unknown source file>:<unknown line>
  119. 111.82 s gammaloop-nextest-integration> 27: serial_test[cd99724524a2f1c0]::serial_code_lock::local_serial_core_with_return::<(), eyre[cb2fd339c0c40fca]::Report><unknown>
  120. 111.82 s gammaloop-nextest-integration> at <unknown source file>:<unknown line>
  121. 111.82 s gammaloop-nextest-integration> 28: <test_runs[9b7e2dc2dc4f29b0]::aa_aa::important::aa_aa_local_inspect_backend_consistency::{closure#0} as core[940e698046960fd5]::ops::function::FnOnce<()>>::call_once<unknown>
  122. 111.82 s gammaloop-nextest-integration> at <unknown source file>:<unknown line>
  123. 111.82 s gammaloop-nextest-integration> 29: test[75d6903177b1d7e9]::__rust_begin_short_backtrace::<core[940e698046960fd5]::result::Result<(), alloc[2ea6bcb46fca0c42]::string::String>, fn() -> core[940e698046960fd5]::result::Result<(), alloc[2ea6bcb46fca0c42]::string::String>><unknown>
  124. 111.82 s gammaloop-nextest-integration> at <unknown source file>:<unknown line>
  125. 111.82 s gammaloop-nextest-integration> 30: test[75d6903177b1d7e9]::run_test::{closure#0}<unknown>
  126. 111.82 s gammaloop-nextest-integration> at <unknown source file>:<unknown line>
  127. 111.82 s gammaloop-nextest-integration> 31: std[bcb96dfbba0ab899]::sys::backtrace::__rust_begin_short_backtrace::<test[75d6903177b1d7e9]::run_test::{closure#1}, ()><unknown>
  128. 111.82 s gammaloop-nextest-integration> at <unknown source file>:<unknown line>
  129. 111.82 s gammaloop-nextest-integration> 32: <std[bcb96dfbba0ab899]::thread::lifecycle::spawn_unchecked<test[75d6903177b1d7e9]::run_test::{closure#1}, ()>::{closure#1} as core[940e698046960fd5]::ops::function::FnOnce<()>>::call_once::{shim:vtable#0}<unknown>
  130. 111.82 s gammaloop-nextest-integration> at <unknown source file>:<unknown line>
  131. 111.82 s gammaloop-nextest-integration> 33: <std[bcb96dfbba0ab899]::sys::thread::unix::Thread>::new::thread_start<unknown>
  132. 111.82 s gammaloop-nextest-integration> at <unknown source file>:<unknown line>
  133. 111.82 s gammaloop-nextest-integration> 34: start_thread<unknown>
  134. 111.82 s gammaloop-nextest-integration> at <unknown source file>:<unknown line>
  135. 111.82 s gammaloop-nextest-integration> 35: __clone3<unknown>
  136. 111.82 s gammaloop-nextest-integration> at <unknown source file>:<unknown line>
  137. 111.82 s gammaloop-nextest-integration>
  138. 111.82 s gammaloop-nextest-integration> Run with COLORBT_SHOW_HIDDEN=1 environment variable to disable frame filtering.
  139. 111.82 s gammaloop-nextest-integration> Run with RUST_BACKTRACE=full to include source snippets.
  140. 111.82 s gammaloop-nextest-integration> Warning: SpanTrace capture is Unsupported.
  141. 111.82 s gammaloop-nextest-integration> Ensure that you've setup a tracing-error ErrorLayer and the semver versions are compatible
  142. 111.82 s gammaloop-nextest-integration>
  143. 153.90 s gammaloop-nextest-integration> FAIL [ 2.764s] (158/170) gammaloop-integration-tests::uv thermal_sunrise_uv
  144. 153.90 s gammaloop-nextest-integration> stdout ---
  145. 153.90 s gammaloop-nextest-integration>
  146. 153.90 s gammaloop-nextest-integration> running 1 test
  147. 153.90 s gammaloop-nextest-integration> test thermal_sunrise_uv ... FAILED
  148. 153.90 s gammaloop-nextest-integration>
  149. 153.90 s gammaloop-nextest-integration> failures:
  150. 153.90 s gammaloop-nextest-integration>
  151. 153.90 s gammaloop-nextest-integration> failures:
  152. 153.90 s gammaloop-nextest-integration> thermal_sunrise_uv
  153. 153.90 s gammaloop-nextest-integration>
  154. 153.90 s gammaloop-nextest-integration> test result: FAILED. 0 passed; 1 failed; 0 ignored; 0 measured; 31 filtered out; finished in 2.75s
  155. 153.90 s gammaloop-nextest-integration>
  156. 153.90 s gammaloop-nextest-integration> stderr ---
  157. 153.90 s gammaloop-nextest-integration> [2026-09-18 22:30:14.541] @gammaloop_api::se... INFO : Running command run generate
  158. 153.90 s gammaloop-nextest-integration> [2026-09-18 22:30:14.541] @gammaloop_api::se... INFO : Starting command block generate
  159. 153.90 s gammaloop-nextest-integration> [2026-09-18 22:30:14.541] @gammaloop_api::se... INFO : Running command import model sm-default.json
  160. 153.90 s gammaloop-nextest-integration> [2026-09-18 22:30:14.541] @import::model INFO : Loading built-in JSON model sm-default
  161. 153.90 s gammaloop-nextest-integration> [2026-09-18 22:30:14.572] @gammalooprs::model INFO : The following 15 external parameters were forced to zero by the restriction card:
  162. 153.90 s gammaloop-nextest-integration> lamWS, AWS, rhoWS, etaWS, ymc, yme, ymm, MC, Me, MM, WTau, muQ, muLe, muLmu, muLtau
  163. 153.90 s gammaloop-nextest-integration> [2026-09-18 22:30:14.572] @gammalooprs::model INFO : The following 34 vertex rules were removed by the restriction card:
  164. 153.90 s gammaloop-nextest-integration> V_82 -> (c~, d, G+) | V_83 -> (t~, d, G+) | V_84 -> (c~, s, G+) | V_85 -> (t~, s, G+) | V_86 -> (u~, b, G+) | V_87 -> (c~, b, G+) | V_90 -> (c~, d, W+) | V_91 -> (t~, d, W+) | V_92 -> (u~, s, W+) | V_94 -> (t~, s, W+) | V_95 -> (u~, b, W+) | V_96 -> (c~, b, W+) | V_101 -> (e+, e-, G0) | V_102 -> (mu+, mu-, G0) | V_104 -> (e+, e-, H) | V_105 -> (mu+, mu-, H) | V_110 -> (ve~, e-, G+) | V_111 -> (vm~, mu-, G+) | V_116 -> (b~, u, G-) | V_117 -> (d~, c, G-) | V_118 -> (s~, c, G-) | V_119 -> (b~, c, G-) | V_120 -> (d~, t, G-) | V_121 -> (s~, t, G-) | V_124 -> (s~, u, W-) | V_125 -> (b~, u, W-) | V_126 -> (d~, c, W-) | V_128 -> (b~, c, W-) | V_129 -> (d~, t, W-) | V_130 -> (s~, t, W-) | V_138 -> (c~, c, G0) | V_140 -> (c~, c, H) | V_145 -> (e+, ve, G-) | V_146 -> (mu+, vm, G-)
  165. 153.90 s gammaloop-nextest-integration> [2026-09-18 22:30:14.572] @gammalooprs::model INFO : The following 36 couplings were removed by the restriction card:
  166. 153.90 s gammaloop-nextest-integration> GC_13, GC_14, GC_16, GC_17, GC_18, GC_19, GC_20, GC_22, GC_23, GC_24, GC_25, GC_26, GC_28, GC_29, GC_42, GC_43, GC_44, GC_46, GC_47, GC_48, GC_84, GC_85, GC_86, GC_87, GC_88, GC_89, GC_90, GC_91, GC_92, GC_93, GC_101, GC_102, GC_103, GC_105, GC_106, GC_107
  167. 153.90 s gammaloop-nextest-integration> [2026-09-18 22:30:14.572] @gammaloop_api::se... INFO : Running command remove processes
  168. 153.90 s gammaloop-nextest-integration> [2026-09-18 22:30:14.573] @gammaloop_api::se... INFO : Running command generate amp {} > {} [{2}] | g u
  169. 153.90 s gammaloop-nextest-integration> --numerator-grouping group_identical_graphs_up_to_scalar_rescaling
  170. 153.90 s gammaloop-nextest-integration> --max-n-bridges 0
  171. 153.90 s gammaloop-nextest-integration> --number-of-factorized-loop-subtopologies 1 1
  172. 153.90 s gammaloop-nextest-integration> --number-of-anticommutating-loops 1 1
  173. 153.90 s gammaloop-nextest-integration> [...]
  174. 153.90 s gammaloop-nextest-integration> [2026-09-18 22:30:14.574] @feyngen::diagram_... INFO : 0s | Δ=0s | Starting Feynman graph generation with Symbolica...
  175. 153.90 s gammaloop-nextest-integration> [2026-09-18 22:30:14.574] @feyngen::diagram_... INFO : 0s | Δ=0s | Number of graphs resulting from Symbolica generation: 3
  176. 153.90 s gammaloop-nextest-integration> [2026-09-18 22:30:14.574] @feyngen::diagram_... INFO : 0s | Δ=0s | Number of graphs retained after removal of vetoed topologies: 2
  177. 153.90 s gammaloop-nextest-integration> [2026-09-18 22:30:14.577] @feyngen::diagram_... INFO : 0s | Δ=0s | Number of graphs after vertex info assignment: 2
  178. 153.90 s gammaloop-nextest-integration> [2026-09-18 22:30:14.577] @feyngen::diagram_... INFO : 0s | Δ=0s | Number of graphs after all complete graphs filters are applied: 2
  179. 153.90 s gammaloop-nextest-integration> [2026-09-18 22:30:14.580] @feyngen::diagram_... INFO : 0s | Δ=0s | Number of graphs after closed anticommutating chains analysis: 1
  180. 153.90 s gammaloop-nextest-integration> [2026-09-18 22:30:14.580] @feyngen::diagram_... INFO : 0s | Δ=0s | Number of graphs after symmetrization of external states: 1
  181. 153.90 s gammaloop-nextest-integration> [2026-09-18 22:30:14.583] @feyngen::diagram_... INFO : 0s | Δ=0s | Number of graphs after canonization of vertices, edges and flows (graph labels assigned here): 1
  182. 153.90 s gammaloop-nextest-integration> [2026-09-18 22:30:14.598] @feyngen::diagram_... INFO : 0s | Δ=0s | Number of graphs after numerator-aware grouping with strategy 'up to a scalar rescaling': 1 (1 isomorphically unique graph, 0 color zero, 0 lorentz zero, 0 grouped and 0 cancellation)
  183. 153.90 s gammaloop-nextest-integration> [2026-09-18 22:30:14.598] @feyngen::diagram_... INFO : ( Sum of the symmetry factors from each graph generated = -1/2 )
  184. 153.90 s gammaloop-nextest-integration> [2026-09-18 22:30:14.598] @commands::generate INFO : Generated amplitude 1 graphs.
  185. 153.90 s gammaloop-nextest-integration> [2026-09-18 22:30:14.599] @commands::generate INFO : Only diagram generation was requested, skipping integrand generation. You can generate integrands later using the 'generate existing <options>' command.
  186. 153.90 s gammaloop-nextest-integration> [2026-09-18 22:30:14.599] @gammaloop_api::se... INFO : Running command generate
  187. 153.90 s gammaloop-nextest-integration> The application panicked (crashed).
  188. 153.90 s gammaloop-nextest-integration> Message: label _func_power_ not found
  189. 153.90 s gammaloop-nextest-integration> Location: /nix/store/n9w914kh1cm59xx3spcs831cdyb56m32-vendor-cargo-deps/c19b7c6f923b580ac259164a89f2577984ad5ab09ee9d583b888f934adbbe8d0/symjit-2.25.6/src/symjit/assembler.rs:77
  190. 153.90 s gammaloop-nextest-integration>
  191. 153.90 s gammaloop-nextest-integration> ━━━━━━━━━━━━━━━━━━━━━━━━━━━━━━━━━━ BACKTRACE ━━━━━━━━━━━━━━━━━━━━━━━━━━━━━━━━━━━
  192. 153.90 s gammaloop-nextest-integration> 1: <color_eyre[51793ea62743adbd]::config::PanicHook>::panic_report<unknown>
  193. 153.90 s gammaloop-nextest-integration> at <unknown source file>:<unknown line>
  194. 153.90 s gammaloop-nextest-integration> 2: <color_eyre[51793ea62743adbd]::config::PanicHook>::into_panic_hook::{closure#0}<unknown>
  195. 153.90 s gammaloop-nextest-integration> at <unknown source file>:<unknown line>
  196. 153.90 s gammaloop-nextest-integration> 3: std[bcb96dfbba0ab899]::panicking::panic_with_hook<unknown>
  197. 153.90 s gammaloop-nextest-integration> at <unknown source file>:<unknown line>
  198. 153.90 s gammaloop-nextest-integration> 4: std[bcb96dfbba0ab899]::panicking::panic_handler::{closure#0}<unknown>
  199. 153.90 s gammaloop-nextest-integration> at <unknown source file>:<unknown line>
  200. 153.90 s gammaloop-nextest-integration> 5: std[bcb96dfbba0ab899]::sys::backtrace::__rust_end_short_backtrace::<std[bcb96dfbba0ab899]::panicking::panic_handler::{closure#0}, !><unknown>
  201. 153.90 s gammaloop-nextest-integration> at <unknown source file>:<unknown line>
  202. 153.90 s gammaloop-nextest-integration> 6: __rustc[6c289b9f9c454d21]::rust_begin_unwind<unknown>
  203. 153.90 s gammaloop-nextest-integration> at <unknown source file>:<unknown line>
  204. 153.90 s gammaloop-nextest-integration> 7: core[940e698046960fd5]::panicking::panic_fmt<unknown>
  205. 153.90 s gammaloop-nextest-integration> at <unknown source file>:<unknown line>
  206. 153.90 s gammaloop-nextest-integration> 8: <symjit[e408de789c333cd]::symjit::assembler::Assembler>::apply_jumps<unknown>
  207. 153.90 s gammaloop-nextest-integration> at <unknown source file>:<unknown line>
  208. 153.90 s gammaloop-nextest-integration> 9: <symjit[e408de789c333cd]::symjit::builder::Builder>::compile_from_mir::<symjit[e408de789c333cd]::symjit::amd::complex::AmdComplexGenerator><unknown>
  209. 153.90 s gammaloop-nextest-integration> at <unknown source file>:<unknown line>
  210. 153.90 s gammaloop-nextest-integration> 10: <symjit[e408de789c333cd]::symjit::runnable::Application>::compile_ty<unknown>
  211. 153.90 s gammaloop-nextest-integration> at <unknown source file>:<unknown line>
  212. 153.90 s gammaloop-nextest-integration> 11: <symjit[e408de789c333cd]::symjit::runnable::Application>::with_mir<unknown>
  213. 153.90 s gammaloop-nextest-integration> at <unknown source file>:<unknown line>
  214. 153.90 s gammaloop-nextest-integration> 12: <symjit[e408de789c333cd]::symjit::composer::DirectTranslator as symjit[e408de789c333cd]::symjit::composer::Composer>::compile<unknown>
  215. 153.90 s gammaloop-nextest-integration> at <unknown source file>:<unknown line>
  216. 153.90 s gammaloop-nextest-integration> 13: <symjit[e408de789c333cd]::symjit::compiler::Translator as symjit[e408de789c333cd]::symjit::composer::Composer>::compile<unknown>
  217. 153.90 s gammaloop-nextest-integration> at <unknown source file>:<unknown line>
  218. 153.90 s gammaloop-nextest-integration> 14: <numerica[124dab8567f4861e]::domains::float::complex::Complex<f64> as symbolica[10e259bab675d243]::evaluate::backend::JITCompiledNumber>::jit_compile<unknown>
  219. 153.90 s gammaloop-nextest-integration> at <unknown source file>:<unknown line>
  220. 153.90 s gammaloop-nextest-integration> 15: <gammalooprs[917cbd3df9e68f8f]::integrands::process::evaluators::GenericEvaluator>::activate_symjit<unknown>
  221. 153.90 s gammaloop-nextest-integration> at <unknown source file>:<unknown line>
  222. 153.90 s gammaloop-nextest-integration> 16: <gammalooprs[917cbd3df9e68f8f]::integrands::process::amplitude::AmplitudeIntegrand>::prepare_runtime_backends_after_generation_with_compile_times<unknown>
  223. 153.90 s gammaloop-nextest-integration> at <unknown source file>:<unknown line>
  224. 153.90 s gammaloop-nextest-integration> 17: <gammalooprs[917cbd3df9e68f8f]::processes::amplitude::Amplitude>::build_integrand<unknown>
  225. 153.90 s gammaloop-nextest-integration> at <unknown source file>:<unknown line>
  226. 153.90 s gammaloop-nextest-integration> 18: <gammalooprs[917cbd3df9e68f8f]::processes::process::Process>::generate_integrands<unknown>
  227. 153.90 s gammaloop-nextest-integration> at <unknown source file>:<unknown line>
  228. 153.90 s gammaloop-nextest-integration> 19: <gammalooprs[917cbd3df9e68f8f]::processes::ProcessList>::generate_integrands<unknown>
  229. 153.90 s gammaloop-nextest-integration> at <unknown source file>:<unknown line>
  230. 153.90 s gammaloop-nextest-integration> 20: <gammaloop_api[9ebf6628f97aeb57]::state::State>::generate_integrands<unknown>
  231. 153.90 s gammaloop-nextest-integration> at <unknown source file>:<unknown line>
  232. 153.90 s gammaloop-nextest-integration> 21: <gammaloop_api[9ebf6628f97aeb57]::commands::generate::Generate>::run::<&std[bcb96dfbba0ab899]::path::PathBuf><unknown>
  233. 153.90 s gammaloop-nextest-integration> at <unknown source file>:<unknown line>
  234. 153.90 s gammaloop-nextest-integration> 22: <gammaloop_api[9ebf6628f97aeb57]::commands::Commands>::run<unknown>
  235. 153.90 s gammaloop-nextest-integration> at <unknown source file>:<unknown line>
  236. 153.90 s gammaloop-nextest-integration> 23: <gammaloop_api[9ebf6628f97aeb57]::session::CliSession>::execute_prepared<unknown>
  237. 153.90 s gammaloop-nextest-integration> at <unknown source file>:<unknown line>
  238. 153.90 s gammaloop-nextest-integration> 24: <gammaloop_api[9ebf6628f97aeb57]::session::CliSession>::execute_prepared_commands<unknown>
  239. 153.90 s gammaloop-nextest-integration> at <unknown source file>:<unknown line>
  240. 153.90 s gammaloop-nextest-integration> 25: <gammaloop_api[9ebf6628f97aeb57]::session::CliSession>::execute_prepared<unknown>
  241. 153.90 s gammaloop-nextest-integration> at <unknown source file>:<unknown line>
  242. 153.90 s gammaloop-nextest-integration> 26: <gammaloop_api[9ebf6628f97aeb57]::session::CliSession>::execute_command<unknown>
  243. 153.90 s gammaloop-nextest-integration> at <unknown source file>:<unknown line>
  244. 153.90 s gammaloop-nextest-integration> 27: <gammaloop_integration_tests[191607b70c61cd5a]::CLIState>::run_command<unknown>
  245. 153.90 s gammaloop-nextest-integration> at <unknown source file>:<unknown line>
  246. 153.90 s gammaloop-nextest-integration> 28: uv[3c7454ef256d6487]::run_single_integrated_uv_case<unknown>
  247. 153.90 s gammaloop-nextest-integration> at <unknown source file>:<unknown line>
  248. 153.90 s gammaloop-nextest-integration> 29: <uv[3c7454ef256d6487]::thermal_sunrise_uv::{closure#0} as core[940e698046960fd5]::ops::function::FnOnce<()>>::call_once<unknown>
  249. 153.90 s gammaloop-nextest-integration> at <unknown source file>:<unknown line>
  250. 153.90 s gammaloop-nextest-integration> 30: test[75d6903177b1d7e9]::__rust_begin_short_backtrace::<core[940e698046960fd5]::result::Result<(), alloc[2ea6bcb46fca0c42]::string::String>, fn() -> core[940e698046960fd5]::result::Result<(), alloc[2ea6bcb46fca0c42]::string::String>><unknown>
  251. 153.90 s gammaloop-nextest-integration> at <unknown source file>:<unknown line>
  252. 153.90 s gammaloop-nextest-integration> 31: test[75d6903177b1d7e9]::run_test::{closure#0}<unknown>
  253. 153.90 s gammaloop-nextest-integration> at <unknown source file>:<unknown line>
  254. 153.90 s gammaloop-nextest-integration> 32: std[bcb96dfbba0ab899]::sys::backtrace::__rust_begin_short_backtrace::<test[75d6903177b1d7e9]::run_test::{closure#1}, ()><unknown>
  255. 153.90 s gammaloop-nextest-integration> at <unknown source file>:<unknown line>
  256. 153.90 s gammaloop-nextest-integration> 33: <std[bcb96dfbba0ab899]::thread::lifecycle::spawn_unchecked<test[75d6903177b1d7e9]::run_test::{closure#1}, ()>::{closure#1} as core[940e698046960fd5]::ops::function::FnOnce<()>>::call_once::{shim:vtable#0}<unknown>
  257. 153.90 s gammaloop-nextest-integration> at <unknown source file>:<unknown line>
  258. 153.90 s gammaloop-nextest-integration> 34: <std[bcb96dfbba0ab899]::sys::thread::unix::Thread>::new::thread_start<unknown>
  259. 153.90 s gammaloop-nextest-integration> at <unknown source file>:<unknown line>
  260. 153.90 s gammaloop-nextest-integration> 35: start_thread<unknown>
  261. 153.90 s gammaloop-nextest-integration> at <unknown source file>:<unknown line>
  262. 153.90 s gammaloop-nextest-integration> 36: __clone3<unknown>
  263. 153.90 s gammaloop-nextest-integration> at <unknown source file>:<unknown line>
  264. 153.90 s gammaloop-nextest-integration>
  265. 153.90 s gammaloop-nextest-integration> Run with COLORBT_SHOW_HIDDEN=1 environment variable to disable frame filtering.
  266. 153.90 s gammaloop-nextest-integration> Run with RUST_BACKTRACE=full to include source snippets.
  267. 153.90 s gammaloop-nextest-integration> Warning: SpanTrace capture is Unsupported.
  268. 153.90 s gammaloop-nextest-integration> Ensure that you've setup a tracing-error ErrorLayer and the semver versions are compatible
  269. 153.90 s gammaloop-nextest-integration>
  270. 209.51 s gammaloop-nextest-integration> ------------
  271. 209.51 s gammaloop-nextest-integration> Summary [ 186.204s] 170 tests run: 168 passed, 2 failed, 209 skipped
  272. 209.51 s gammaloop-nextest-integration> FAIL [ 2.786s] ( 55/170) gammaloop-integration-tests::test_runs aa_aa::important::aa_aa_local_inspect_backend_consistency
  273. 209.51 s gammaloop-nextest-integration> stdout ---
  274. 209.51 s gammaloop-nextest-integration>
  275. 209.51 s gammaloop-nextest-integration> running 1 test
  276. 209.51 s gammaloop-nextest-integration> test aa_aa::important::aa_aa_local_inspect_backend_consistency ... FAILED
  277. 209.51 s gammaloop-nextest-integration>
  278. 209.51 s gammaloop-nextest-integration> failures:
  279. 209.51 s gammaloop-nextest-integration>
  280. 209.51 s gammaloop-nextest-integration> failures:
  281. 209.51 s gammaloop-nextest-integration> aa_aa::important::aa_aa_local_inspect_backend_consistency
  282. 209.51 s gammaloop-nextest-integration>
  283. 209.51 s gammaloop-nextest-integration> test result: FAILED. 0 passed; 1 failed; 0 ignored; 0 measured; 274 filtered out; finished in 2.77s
  284. 209.51 s gammaloop-nextest-integration>
  285. 209.51 s gammaloop-nextest-integration> stderr ---
  286. 209.51 s gammaloop-nextest-integration> [2026-09-18 22:29:32.324] @gammaloop_api::se... INFO : Running command import model sm-default.json
  287. 209.51 s gammaloop-nextest-integration> [2026-09-18 22:29:32.324] @import::model INFO : Loading built-in JSON model sm-default
  288. 209.51 s gammaloop-nextest-integration> [2026-09-18 22:29:32.345] @gammalooprs::model INFO : The following 15 external parameters were forced to zero by the restriction card:
  289. 209.51 s gammaloop-nextest-integration> lamWS, AWS, rhoWS, etaWS, ymc, yme, ymm, MC, Me, MM, WTau, muQ, muLe, muLmu, muLtau
  290. 209.51 s gammaloop-nextest-integration> [2026-09-18 22:29:32.345] @gammalooprs::model INFO : The following 34 vertex rules were removed by the restriction card:
  291. 209.51 s gammaloop-nextest-integration> V_82 -> (c~, d, G+) | V_83 -> (t~, d, G+) | V_84 -> (c~, s, G+) | V_85 -> (t~, s, G+) | V_86 -> (u~, b, G+) | V_87 -> (c~, b, G+) | V_90 -> (c~, d, W+) | V_91 -> (t~, d, W+) | V_92 -> (u~, s, W+) | V_94 -> (t~, s, W+) | V_95 -> (u~, b, W+) | V_96 -> (c~, b, W+) | V_101 -> (e+, e-, G0) | V_102 -> (mu+, mu-, G0) | V_104 -> (e+, e-, H) | V_105 -> (mu+, mu-, H) | V_110 -> (ve~, e-, G+) | V_111 -> (vm~, mu-, G+) | V_116 -> (b~, u, G-) | V_117 -> (d~, c, G-) | V_118 -> (s~, c, G-) | V_119 -> (b~, c, G-) | V_120 -> (d~, t, G-) | V_121 -> (s~, t, G-) | V_124 -> (s~, u, W-) | V_125 -> (b~, u, W-) | V_126 -> (d~, c, W-) | V_128 -> (b~, c, W-) | V_129 -> (d~, t, W-) | V_130 -> (s~, t, W-) | V_138 -> (c~, c, G0) | V_140 -> (c~, c, H) | V_145 -> (e+, ve, G-) | V_146 -> (mu+, vm, G-)
  292. 209.51 s gammaloop-nextest-integration> [2026-09-18 22:29:32.345] @gammalooprs::model INFO : The following 36 couplings were removed by the restriction card:
  293. 209.51 s gammaloop-nextest-integration> GC_13, GC_14, GC_16, GC_17, GC_18, GC_19, GC_20, GC_22, GC_23, GC_24, GC_25, GC_26, GC_28, GC_29, GC_42, GC_43, GC_44, GC_46, GC_47, GC_48, GC_84, GC_85, GC_86, GC_87, GC_88, GC_89, GC_90, GC_91, GC_92, GC_93, GC_101, GC_102, GC_103, GC_105, GC_106, GC_107
  294. 209.51 s gammaloop-nextest-integration> [2026-09-18 22:29:32.345] @gammaloop_api::se... INFO : Running command run set_model_parameters
  295. 209.51 s gammaloop-nextest-integration> [2026-09-18 22:29:32.345] @gammaloop_api::se... INFO : Starting command block set_model_parameters
  296. 209.51 s gammaloop-nextest-integration> [2026-09-18 22:29:32.345] @gammaloop_api::se... INFO : Running command set model MT=173.0
  297. 209.51 s gammaloop-nextest-integration> [2026-09-18 22:29:32.349] @gammaloop_api::se... INFO : Running command set model WT=0.0
  298. 209.51 s gammaloop-nextest-integration> [2026-09-18 22:29:32.353] @gammaloop_api::se... INFO : Running command set model ymt=173.0
  299. 209.51 s gammaloop-nextest-integration> [2026-09-18 22:29:32.357] @gammaloop_api::se... INFO : Running command set model aS=0.118
  300. 209.51 s gammaloop-nextest-integration> [2026-09-18 22:29:32.361] @gammaloop_api::se... INFO : Running command set model aEWM1=137.036
  301. 209.51 s gammaloop-nextest-integration> [2026-09-18 22:29:32.364] @gammaloop_api::se... INFO : Running command set model Gf=1.166390e-05
  302. 209.51 s gammaloop-nextest-integration> [2026-09-18 22:29:32.368] @gammaloop_api::se... INFO : Running command set model MZ=91.188
  303. 209.51 s gammaloop-nextest-integration> [2026-09-18 22:29:32.372] @gammaloop_api::se... INFO : Running command set global string '
  304. 209.51 s gammaloop-nextest-integration> [global.generation.compile]
  305. 209.51 s gammaloop-nextest-integration> compilation_mode = "symjit"
  306. 209.51 s gammaloop-nextest-integration> optimization_level = "O0"
  307. 209.51 s gammaloop-nextest-integration> fast_math = false
  308. 209.51 s gammaloop-nextest-integration> [...]
  309. 209.51 s gammaloop-nextest-integration> [2026-09-18 22:29:32.372] @gammaloop_api::se... INFO : Running command import graphs ./examples/cli/aa_aa/1L/aa_aa_1L.dot -p aa_aa_all_helicities -i 1L_ppmm -o
  310. 209.51 s gammaloop-nextest-integration> [2026-09-18 22:29:32.373] @commands::import INFO : Loading graphs from '/build/source/examples/cli/aa_aa/1L/aa_aa_1L.dot'
  311. 209.51 s gammaloop-nextest-integration> [2026-09-18 22:29:32.381] @gammaloop_api::se... INFO : Running command generate existing -p aa_aa_all_helicities
  312. 209.51 s gammaloop-nextest-integration> The application panicked (crashed).
  313. 209.51 s gammaloop-nextest-integration> Message: label _func_power_ not found
  314. 209.51 s gammaloop-nextest-integration> Location: /nix/store/n9w914kh1cm59xx3spcs831cdyb56m32-vendor-cargo-deps/c19b7c6f923b580ac259164a89f2577984ad5ab09ee9d583b888f934adbbe8d0/symjit-2.25.6/src/symjit/assembler.rs:77
  315. 209.51 s gammaloop-nextest-integration>
  316. 209.51 s gammaloop-nextest-integration> ━━━━━━━━━━━━━━━━━━━━━━━━━━━━━━━━━━ BACKTRACE ━━━━━━━━━━━━━━━━━━━━━━━━━━━━━━━━━━━
  317. 209.51 s gammaloop-nextest-integration> 1: <color_eyre[51793ea62743adbd]::config::PanicHook>::panic_report<unknown>
  318. 209.51 s gammaloop-nextest-integration> at <unknown source file>:<unknown line>
  319. 209.51 s gammaloop-nextest-integration> 2: <color_eyre[51793ea62743adbd]::config::PanicHook>::into_panic_hook::{closure#0}<unknown>
  320. 209.51 s gammaloop-nextest-integration> at <unknown source file>:<unknown line>
  321. 209.51 s gammaloop-nextest-integration> 3: std[bcb96dfbba0ab899]::panicking::panic_with_hook<unknown>
  322. 209.51 s gammaloop-nextest-integration> at <unknown source file>:<unknown line>
  323. 209.51 s gammaloop-nextest-integration> 4: std[bcb96dfbba0ab899]::panicking::panic_handler::{closure#0}<unknown>
  324. 209.51 s gammaloop-nextest-integration> at <unknown source file>:<unknown line>
  325. 209.51 s gammaloop-nextest-integration> 5: std[bcb96dfbba0ab899]::sys::backtrace::__rust_end_short_backtrace::<std[bcb96dfbba0ab899]::panicking::panic_handler::{closure#0}, !><unknown>
  326. 209.51 s gammaloop-nextest-integration> at <unknown source file>:<unknown line>
  327. 209.51 s gammaloop-nextest-integration> 6: __rustc[6c289b9f9c454d21]::rust_begin_unwind<unknown>
  328. 209.51 s gammaloop-nextest-integration> at <unknown source file>:<unknown line>
  329. 209.51 s gammaloop-nextest-integration> 7: core[940e698046960fd5]::panicking::panic_fmt<unknown>
  330. 209.51 s gammaloop-nextest-integration> at <unknown source file>:<unknown line>
  331. 209.51 s gammaloop-nextest-integration> 8: <symjit[e408de789c333cd]::symjit::assembler::Assembler>::apply_jumps<unknown>
  332. 209.51 s gammaloop-nextest-integration> at <unknown source file>:<unknown line>
  333. 209.51 s gammaloop-nextest-integration> 9: <symjit[e408de789c333cd]::symjit::builder::Builder>::compile_from_mir::<symjit[e408de789c333cd]::symjit::amd::complex::AmdComplexGenerator><unknown>
  334. 209.51 s gammaloop-nextest-integration> at <unknown source file>:<unknown line>
  335. 209.51 s gammaloop-nextest-integration> 10: <symjit[e408de789c333cd]::symjit::runnable::Application>::compile_ty<unknown>
  336. 209.51 s gammaloop-nextest-integration> at <unknown source file>:<unknown line>
  337. 209.51 s gammaloop-nextest-integration> 11: <symjit[e408de789c333cd]::symjit::runnable::Application>::with_mir<unknown>
  338. 209.51 s gammaloop-nextest-integration> at <unknown source file>:<unknown line>
  339. 209.51 s gammaloop-nextest-integration> 12: <symjit[e408de789c333cd]::symjit::composer::DirectTranslator as symjit[e408de789c333cd]::symjit::composer::Composer>::compile<unknown>
  340. 209.51 s gammaloop-nextest-integration> at <unknown source file>:<unknown line>
  341. 209.51 s gammaloop-nextest-integration> 13: <symjit[e408de789c333cd]::symjit::compiler::Translator as symjit[e408de789c333cd]::symjit::composer::Composer>::compile<unknown>
  342. 209.51 s gammaloop-nextest-integration> at <unknown source file>:<unknown line>
  343. 209.51 s gammaloop-nextest-integration> 14: <numerica[124dab8567f4861e]::domains::float::complex::Complex<f64> as symbolica[10e259bab675d243]::evaluate::backend::JITCompiledNumber>::jit_compile<unknown>
  344. 209.51 s gammaloop-nextest-integration> at <unknown source file>:<unknown line>
  345. 209.51 s gammaloop-nextest-integration> 15: <gammalooprs[917cbd3df9e68f8f]::integrands::process::evaluators::GenericEvaluator>::activate_symjit<unknown>
  346. 209.51 s gammaloop-nextest-integration> at <unknown source file>:<unknown line>
  347. 209.51 s gammaloop-nextest-integration> 16: <gammalooprs[917cbd3df9e68f8f]::integrands::process::amplitude::AmplitudeIntegrand>::prepare_runtime_backends_after_generation_with_compile_times<unknown>
  348. 209.51 s gammaloop-nextest-integration> at <unknown source file>:<unknown line>
  349. 209.51 s gammaloop-nextest-integration> 17: <gammalooprs[917cbd3df9e68f8f]::processes::amplitude::Amplitude>::build_integrand<unknown>
  350. 209.51 s gammaloop-nextest-integration> at <unknown source file>:<unknown line>
  351. 209.51 s gammaloop-nextest-integration> 18: <gammalooprs[917cbd3df9e68f8f]::processes::process::Process>::generate_integrands<unknown>
  352. 209.51 s gammaloop-nextest-integration> at <unknown source file>:<unknown line>
  353. 209.51 s gammaloop-nextest-integration> 19: <gammaloop_api[9ebf6628f97aeb57]::state::State>::generate_integrand<unknown>
  354. 209.51 s gammaloop-nextest-integration> at <unknown source file>:<unknown line>
  355. 209.51 s gammaloop-nextest-integration> 20: <gammaloop_api[9ebf6628f97aeb57]::commands::generate::Generate>::run::<&std[bcb96dfbba0ab899]::path::PathBuf><unknown>
  356. 209.51 s gammaloop-nextest-integration> at <unknown source file>:<unknown line>
  357. 209.51 s gammaloop-nextest-integration> 21: <gammaloop_api[9ebf6628f97aeb57]::commands::Commands>::run<unknown>
  358. 209.51 s gammaloop-nextest-integration> at <unknown source file>:<unknown line>
  359. 209.51 s gammaloop-nextest-integration> 22: <gammaloop_api[9ebf6628f97aeb57]::session::CliSession>::execute_prepared<unknown>
  360. 209.51 s gammaloop-nextest-integration> at <unknown source file>:<unknown line>
  361. 209.51 s gammaloop-nextest-integration> 23: <gammaloop_api[9ebf6628f97aeb57]::session::CliSession>::execute_command<unknown>
  362. 209.51 s gammaloop-nextest-integration> at <unknown source file>:<unknown line>
  363. 209.51 s gammaloop-nextest-integration> 24: <gammaloop_integration_tests[191607b70c61cd5a]::CLIState>::run_command<unknown>
  364. 209.51 s gammaloop-nextest-integration> at <unknown source file>:<unknown line>
  365. 209.51 s gammaloop-nextest-integration> 25: test_runs[9b7e2dc2dc4f29b0]::aa_aa::generate_aa_aa_helicity_family<unknown>
  366. 209.51 s gammaloop-nextest-integration> at <unknown source file>:<unknown line>
  367. 209.51 s gammaloop-nextest-integration> 26: <test_runs[9b7e2dc2dc4f29b0]::aa_aa::important::aa_aa_local_inspect_backend_consistency::{closure#0} as core[940e698046960fd5]::ops::function::FnOnce<()>>::call_once<unknown>
  368. 209.51 s gammaloop-nextest-integration> at <unknown source file>:<unknown line>
  369. 209.51 s gammaloop-nextest-integration> 27: serial_test[cd99724524a2f1c0]::serial_code_lock::local_serial_core_with_return::<(), eyre[cb2fd339c0c40fca]::Report><unknown>
  370. 209.51 s gammaloop-nextest-integration> at <unknown source file>:<unknown line>
  371. 209.51 s gammaloop-nextest-integration> 28: <test_runs[9b7e2dc2dc4f29b0]::aa_aa::important::aa_aa_local_inspect_backend_consistency::{closure#0} as core[940e698046960fd5]::ops::function::FnOnce<()>>::call_once<unknown>
  372. 209.51 s gammaloop-nextest-integration> at <unknown source file>:<unknown line>
  373. 209.51 s gammaloop-nextest-integration> 29: test[75d6903177b1d7e9]::__rust_begin_short_backtrace::<core[940e698046960fd5]::result::Result<(), alloc[2ea6bcb46fca0c42]::string::String>, fn() -> core[940e698046960fd5]::result::Result<(), alloc[2ea6bcb46fca0c42]::string::String>><unknown>
  374. 209.51 s gammaloop-nextest-integration> at <unknown source file>:<unknown line>
  375. 209.51 s gammaloop-nextest-integration> 30: test[75d6903177b1d7e9]::run_test::{closure#0}<unknown>
  376. 209.51 s gammaloop-nextest-integration> at <unknown source file>:<unknown line>
  377. 209.51 s gammaloop-nextest-integration> 31: std[bcb96dfbba0ab899]::sys::backtrace::__rust_begin_short_backtrace::<test[75d6903177b1d7e9]::run_test::{closure#1}, ()><unknown>
  378. 209.51 s gammaloop-nextest-integration> at <unknown source file>:<unknown line>
  379. 209.51 s gammaloop-nextest-integration> 32: <std[bcb96dfbba0ab899]::thread::lifecycle::spawn_unchecked<test[75d6903177b1d7e9]::run_test::{closure#1}, ()>::{closure#1} as core[940e698046960fd5]::ops::function::FnOnce<()>>::call_once::{shim:vtable#0}<unknown>
  380. 209.51 s gammaloop-nextest-integration> at <unknown source file>:<unknown line>
  381. 209.51 s gammaloop-nextest-integration> 33: <std[bcb96dfbba0ab899]::sys::thread::unix::Thread>::new::thread_start<unknown>
  382. 209.51 s gammaloop-nextest-integration> at <unknown source file>:<unknown line>
  383. 209.51 s gammaloop-nextest-integration> 34: start_thread<unknown>
  384. 209.51 s gammaloop-nextest-integration> at <unknown source file>:<unknown line>
  385. 209.51 s gammaloop-nextest-integration> 35: __clone3<unknown>
  386. 209.51 s gammaloop-nextest-integration> at <unknown source file>:<unknown line>
  387. 209.51 s gammaloop-nextest-integration>
  388. 209.51 s gammaloop-nextest-integration> Run with COLORBT_SHOW_HIDDEN=1 environment variable to disable frame filtering.
  389. 209.51 s gammaloop-nextest-integration> Run with RUST_BACKTRACE=full to include source snippets.
  390. 209.51 s gammaloop-nextest-integration> Warning: SpanTrace capture is Unsupported.
  391. 209.51 s gammaloop-nextest-integration> Ensure that you've setup a tracing-error ErrorLayer and the semver versions are compatible
  392. 209.51 s gammaloop-nextest-integration>
  393. 209.51 s gammaloop-nextest-integration> FAIL [ 2.764s] (158/170) gammaloop-integration-tests::uv thermal_sunrise_uv
  394. 209.51 s gammaloop-nextest-integration> stdout ---
  395. 209.51 s gammaloop-nextest-integration>
  396. 209.51 s gammaloop-nextest-integration> running 1 test
  397. 209.51 s gammaloop-nextest-integration> test thermal_sunrise_uv ... FAILED
  398. 209.51 s gammaloop-nextest-integration>
  399. 209.51 s gammaloop-nextest-integration> failures:
  400. 209.51 s gammaloop-nextest-integration>
  401. 209.51 s gammaloop-nextest-integration> failures:
  402. 209.51 s gammaloop-nextest-integration> thermal_sunrise_uv
  403. 209.51 s gammaloop-nextest-integration>
  404. 209.51 s gammaloop-nextest-integration> test result: FAILED. 0 passed; 1 failed; 0 ignored; 0 measured; 31 filtered out; finished in 2.75s
  405. 209.51 s gammaloop-nextest-integration>
  406. 209.51 s gammaloop-nextest-integration> stderr ---
  407. 209.51 s gammaloop-nextest-integration> [2026-09-18 22:30:14.541] @gammaloop_api::se... INFO : Running command run generate
  408. 209.51 s gammaloop-nextest-integration> [2026-09-18 22:30:14.541] @gammaloop_api::se... INFO : Starting command block generate
  409. 209.51 s gammaloop-nextest-integration> [2026-09-18 22:30:14.541] @gammaloop_api::se... INFO : Running command import model sm-default.json
  410. 209.51 s gammaloop-nextest-integration> [2026-09-18 22:30:14.541] @import::model INFO : Loading built-in JSON model sm-default
  411. 209.51 s gammaloop-nextest-integration> [2026-09-18 22:30:14.572] @gammalooprs::model INFO : The following 15 external parameters were forced to zero by the restriction card:
  412. 209.51 s gammaloop-nextest-integration> lamWS, AWS, rhoWS, etaWS, ymc, yme, ymm, MC, Me, MM, WTau, muQ, muLe, muLmu, muLtau
  413. 209.51 s gammaloop-nextest-integration> [2026-09-18 22:30:14.572] @gammalooprs::model INFO : The following 34 vertex rules were removed by the restriction card:
  414. 209.51 s gammaloop-nextest-integration> V_82 -> (c~, d, G+) | V_83 -> (t~, d, G+) | V_84 -> (c~, s, G+) | V_85 -> (t~, s, G+) | V_86 -> (u~, b, G+) | V_87 -> (c~, b, G+) | V_90 -> (c~, d, W+) | V_91 -> (t~, d, W+) | V_92 -> (u~, s, W+) | V_94 -> (t~, s, W+) | V_95 -> (u~, b, W+) | V_96 -> (c~, b, W+) | V_101 -> (e+, e-, G0) | V_102 -> (mu+, mu-, G0) | V_104 -> (e+, e-, H) | V_105 -> (mu+, mu-, H) | V_110 -> (ve~, e-, G+) | V_111 -> (vm~, mu-, G+) | V_116 -> (b~, u, G-) | V_117 -> (d~, c, G-) | V_118 -> (s~, c, G-) | V_119 -> (b~, c, G-) | V_120 -> (d~, t, G-) | V_121 -> (s~, t, G-) | V_124 -> (s~, u, W-) | V_125 -> (b~, u, W-) | V_126 -> (d~, c, W-) | V_128 -> (b~, c, W-) | V_129 -> (d~, t, W-) | V_130 -> (s~, t, W-) | V_138 -> (c~, c, G0) | V_140 -> (c~, c, H) | V_145 -> (e+, ve, G-) | V_146 -> (mu+, vm, G-)
  415. 209.51 s gammaloop-nextest-integration> [2026-09-18 22:30:14.572] @gammalooprs::model INFO : The following 36 couplings were removed by the restriction card:
  416. 209.51 s gammaloop-nextest-integration> GC_13, GC_14, GC_16, GC_17, GC_18, GC_19, GC_20, GC_22, GC_23, GC_24, GC_25, GC_26, GC_28, GC_29, GC_42, GC_43, GC_44, GC_46, GC_47, GC_48, GC_84, GC_85, GC_86, GC_87, GC_88, GC_89, GC_90, GC_91, GC_92, GC_93, GC_101, GC_102, GC_103, GC_105, GC_106, GC_107
  417. 209.51 s gammaloop-nextest-integration> [2026-09-18 22:30:14.572] @gammaloop_api::se... INFO : Running command remove processes
  418. 209.51 s gammaloop-nextest-integration> [2026-09-18 22:30:14.573] @gammaloop_api::se... INFO : Running command generate amp {} > {} [{2}] | g u
  419. 209.51 s gammaloop-nextest-integration> --numerator-grouping group_identical_graphs_up_to_scalar_rescaling
  420. 209.51 s gammaloop-nextest-integration> --max-n-bridges 0
  421. 209.51 s gammaloop-nextest-integration> --number-of-factorized-loop-subtopologies 1 1
  422. 209.51 s gammaloop-nextest-integration> --number-of-anticommutating-loops 1 1
  423. 209.51 s gammaloop-nextest-integration> [...]
  424. 209.51 s gammaloop-nextest-integration> [2026-09-18 22:30:14.574] @feyngen::diagram_... INFO : 0s | Δ=0s | Starting Feynman graph generation with Symbolica...
  425. 209.51 s gammaloop-nextest-integration> [2026-09-18 22:30:14.574] @feyngen::diagram_... INFO : 0s | Δ=0s | Number of graphs resulting from Symbolica generation: 3
  426. 209.51 s gammaloop-nextest-integration> [2026-09-18 22:30:14.574] @feyngen::diagram_... INFO : 0s | Δ=0s | Number of graphs retained after removal of vetoed topologies: 2
  427. 209.51 s gammaloop-nextest-integration> [2026-09-18 22:30:14.577] @feyngen::diagram_... INFO : 0s | Δ=0s | Number of graphs after vertex info assignment: 2
  428. 209.51 s gammaloop-nextest-integration> [2026-09-18 22:30:14.577] @feyngen::diagram_... INFO : 0s | Δ=0s | Number of graphs after all complete graphs filters are applied: 2
  429. 209.51 s gammaloop-nextest-integration> [2026-09-18 22:30:14.580] @feyngen::diagram_... INFO : 0s | Δ=0s | Number of graphs after closed anticommutating chains analysis: 1
  430. 209.51 s gammaloop-nextest-integration> [2026-09-18 22:30:14.580] @feyngen::diagram_... INFO : 0s | Δ=0s | Number of graphs after symmetrization of external states: 1
  431. 209.51 s gammaloop-nextest-integration> [2026-09-18 22:30:14.583] @feyngen::diagram_... INFO : 0s | Δ=0s | Number of graphs after canonization of vertices, edges and flows (graph labels assigned here): 1
  432. 209.51 s gammaloop-nextest-integration> [2026-09-18 22:30:14.598] @feyngen::diagram_... INFO : 0s | Δ=0s | Number of graphs after numerator-aware grouping with strategy 'up to a scalar rescaling': 1 (1 isomorphically unique graph, 0 color zero, 0 lorentz zero, 0 grouped and 0 cancellation)
  433. 209.51 s gammaloop-nextest-integration> [2026-09-18 22:30:14.598] @feyngen::diagram_... INFO : ( Sum of the symmetry factors from each graph generated = -1/2 )
  434. 209.51 s gammaloop-nextest-integration> [2026-09-18 22:30:14.598] @commands::generate INFO : Generated amplitude 1 graphs.
  435. 209.51 s gammaloop-nextest-integration> [2026-09-18 22:30:14.599] @commands::generate INFO : Only diagram generation was requested, skipping integrand generation. You can generate integrands later using the 'generate existing <options>' command.
  436. 209.51 s gammaloop-nextest-integration> [2026-09-18 22:30:14.599] @gammaloop_api::se... INFO : Running command generate
  437. 209.51 s gammaloop-nextest-integration> The application panicked (crashed).
  438. 209.51 s gammaloop-nextest-integration> Message: label _func_power_ not found
  439. 209.51 s gammaloop-nextest-integration> Location: /nix/store/n9w914kh1cm59xx3spcs831cdyb56m32-vendor-cargo-deps/c19b7c6f923b580ac259164a89f2577984ad5ab09ee9d583b888f934adbbe8d0/symjit-2.25.6/src/symjit/assembler.rs:77
  440. 209.51 s gammaloop-nextest-integration>
  441. 209.51 s gammaloop-nextest-integration> ━━━━━━━━━━━━━━━━━━━━━━━━━━━━━━━━━━ BACKTRACE ━━━━━━━━━━━━━━━━━━━━━━━━━━━━━━━━━━━
  442. 209.51 s gammaloop-nextest-integration> 1: <color_eyre[51793ea62743adbd]::config::PanicHook>::panic_report<unknown>
  443. 209.51 s gammaloop-nextest-integration> at <unknown source file>:<unknown line>
  444. 209.51 s gammaloop-nextest-integration> 2: <color_eyre[51793ea62743adbd]::config::PanicHook>::into_panic_hook::{closure#0}<unknown>
  445. 209.51 s gammaloop-nextest-integration> at <unknown source file>:<unknown line>
  446. 209.51 s gammaloop-nextest-integration> 3: std[bcb96dfbba0ab899]::panicking::panic_with_hook<unknown>
  447. 209.51 s gammaloop-nextest-integration> at <unknown source file>:<unknown line>
  448. 209.51 s gammaloop-nextest-integration> 4: std[bcb96dfbba0ab899]::panicking::panic_handler::{closure#0}<unknown>
  449. 209.51 s gammaloop-nextest-integration> at <unknown source file>:<unknown line>
  450. 209.51 s gammaloop-nextest-integration> 5: std[bcb96dfbba0ab899]::sys::backtrace::__rust_end_short_backtrace::<std[bcb96dfbba0ab899]::panicking::panic_handler::{closure#0}, !><unknown>
  451. 209.51 s gammaloop-nextest-integration> at <unknown source file>:<unknown line>
  452. 209.51 s gammaloop-nextest-integration> 6: __rustc[6c289b9f9c454d21]::rust_begin_unwind<unknown>
  453. 209.51 s gammaloop-nextest-integration> at <unknown source file>:<unknown line>
  454. 209.51 s gammaloop-nextest-integration> 7: core[940e698046960fd5]::panicking::panic_fmt<unknown>
  455. 209.51 s gammaloop-nextest-integration> at <unknown source file>:<unknown line>
  456. 209.51 s gammaloop-nextest-integration> 8: <symjit[e408de789c333cd]::symjit::assembler::Assembler>::apply_jumps<unknown>
  457. 209.51 s gammaloop-nextest-integration> at <unknown source file>:<unknown line>
  458. 209.51 s gammaloop-nextest-integration> 9: <symjit[e408de789c333cd]::symjit::builder::Builder>::compile_from_mir::<symjit[e408de789c333cd]::symjit::amd::complex::AmdComplexGenerator><unknown>
  459. 209.51 s gammaloop-nextest-integration> at <unknown source file>:<unknown line>
  460. 209.51 s gammaloop-nextest-integration> 10: <symjit[e408de789c333cd]::symjit::runnable::Application>::compile_ty<unknown>
  461. 209.51 s gammaloop-nextest-integration> at <unknown source file>:<unknown line>
  462. 209.51 s gammaloop-nextest-integration> 11: <symjit[e408de789c333cd]::symjit::runnable::Application>::with_mir<unknown>
  463. 209.51 s gammaloop-nextest-integration> at <unknown source file>:<unknown line>
  464. 209.51 s gammaloop-nextest-integration> 12: <symjit[e408de789c333cd]::symjit::composer::DirectTranslator as symjit[e408de789c333cd]::symjit::composer::Composer>::compile<unknown>
  465. 209.51 s gammaloop-nextest-integration> at <unknown source file>:<unknown line>
  466. 209.51 s gammaloop-nextest-integration> 13: <symjit[e408de789c333cd]::symjit::compiler::Translator as symjit[e408de789c333cd]::symjit::composer::Composer>::compile<unknown>
  467. 209.51 s gammaloop-nextest-integration> at <unknown source file>:<unknown line>
  468. 209.51 s gammaloop-nextest-integration> 14: <numerica[124dab8567f4861e]::domains::float::complex::Complex<f64> as symbolica[10e259bab675d243]::evaluate::backend::JITCompiledNumber>::jit_compile<unknown>
  469. 209.51 s gammaloop-nextest-integration> at <unknown source file>:<unknown line>
  470. 209.51 s gammaloop-nextest-integration> 15: <gammalooprs[917cbd3df9e68f8f]::integrands::process::evaluators::GenericEvaluator>::activate_symjit<unknown>
  471. 209.51 s gammaloop-nextest-integration> at <unknown source file>:<unknown line>
  472. 209.51 s gammaloop-nextest-integration> 16: <gammalooprs[917cbd3df9e68f8f]::integrands::process::amplitude::AmplitudeIntegrand>::prepare_runtime_backends_after_generation_with_compile_times<unknown>
  473. 209.51 s gammaloop-nextest-integration> at <unknown source file>:<unknown line>
  474. 209.51 s gammaloop-nextest-integration> 17: <gammalooprs[917cbd3df9e68f8f]::processes::amplitude::Amplitude>::build_integrand<unknown>
  475. 209.51 s gammaloop-nextest-integration> at <unknown source file>:<unknown line>
  476. 209.51 s gammaloop-nextest-integration> 18: <gammalooprs[917cbd3df9e68f8f]::processes::process::Process>::generate_integrands<unknown>
  477. 209.51 s gammaloop-nextest-integration> at <unknown source file>:<unknown line>
  478. 209.51 s gammaloop-nextest-integration> 19: <gammalooprs[917cbd3df9e68f8f]::processes::ProcessList>::generate_integrands<unknown>
  479. 209.51 s gammaloop-nextest-integration> at <unknown source file>:<unknown line>
  480. 209.51 s gammaloop-nextest-integration> 20: <gammaloop_api[9ebf6628f97aeb57]::state::State>::generate_integrands<unknown>
  481. 209.51 s gammaloop-nextest-integration> at <unknown source file>:<unknown line>
  482. 209.51 s gammaloop-nextest-integration> 21: <gammaloop_api[9ebf6628f97aeb57]::commands::generate::Generate>::run::<&std[bcb96dfbba0ab899]::path::PathBuf><unknown>
  483. 209.51 s gammaloop-nextest-integration> at <unknown source file>:<unknown line>
  484. 209.51 s gammaloop-nextest-integration> 22: <gammaloop_api[9ebf6628f97aeb57]::commands::Commands>::run<unknown>
  485. 209.51 s gammaloop-nextest-integration> at <unknown source file>:<unknown line>
  486. 209.51 s gammaloop-nextest-integration> 23: <gammaloop_api[9ebf6628f97aeb57]::session::CliSession>::execute_prepared<unknown>
  487. 209.51 s gammaloop-nextest-integration> at <unknown source file>:<unknown line>
  488. 209.51 s gammaloop-nextest-integration> 24: <gammaloop_api[9ebf6628f97aeb57]::session::CliSession>::execute_prepared_commands<unknown>
  489. 209.51 s gammaloop-nextest-integration> at <unknown source file>:<unknown line>
  490. 209.51 s gammaloop-nextest-integration> 25: <gammaloop_api[9ebf6628f97aeb57]::session::CliSession>::execute_prepared<unknown>
  491. 209.51 s gammaloop-nextest-integration> at <unknown source file>:<unknown line>
  492. 209.51 s gammaloop-nextest-integration> 26: <gammaloop_api[9ebf6628f97aeb57]::session::CliSession>::execute_command<unknown>
  493. 209.51 s gammaloop-nextest-integration> at <unknown source file>:<unknown line>
  494. 209.51 s gammaloop-nextest-integration> 27: <gammaloop_integration_tests[191607b70c61cd5a]::CLIState>::run_command<unknown>
  495. 209.51 s gammaloop-nextest-integration> at <unknown source file>:<unknown line>
  496. 209.51 s gammaloop-nextest-integration> 28: uv[3c7454ef256d6487]::run_single_integrated_uv_case<unknown>
  497. 209.51 s gammaloop-nextest-integration> at <unknown source file>:<unknown line>
  498. 209.51 s gammaloop-nextest-integration> 29: <uv[3c7454ef256d6487]::thermal_sunrise_uv::{closure#0} as core[940e698046960fd5]::ops::function::FnOnce<()>>::call_once<unknown>
  499. 209.51 s gammaloop-nextest-integration> at <unknown source file>:<unknown line>
  500. 209.51 s gammaloop-nextest-integration> 30: test[75d6903177b1d7e9]::__rust_begin_short_backtrace::<core[940e698046960fd5]::result::Result<(), alloc[2ea6bcb46fca0c42]::string::String>, fn() -> core[940e698046960fd5]::result::Result<(), alloc[2ea6bcb46fca0c42]::string::String>><unknown>
  501. 209.51 s gammaloop-nextest-integration> at <unknown source file>:<unknown line>
  502. 209.51 s gammaloop-nextest-integration> 31: test[75d6903177b1d7e9]::run_test::{closure#0}<unknown>
  503. 209.51 s gammaloop-nextest-integration> at <unknown source file>:<unknown line>
  504. 209.51 s gammaloop-nextest-integration> 32: std[bcb96dfbba0ab899]::sys::backtrace::__rust_begin_short_backtrace::<test[75d6903177b1d7e9]::run_test::{closure#1}, ()><unknown>
  505. 209.51 s gammaloop-nextest-integration> at <unknown source file>:<unknown line>
  506. 209.51 s gammaloop-nextest-integration> 33: <std[bcb96dfbba0ab899]::thread::lifecycle::spawn_unchecked<test[75d6903177b1d7e9]::run_test::{closure#1}, ()>::{closure#1} as core[940e698046960fd5]::ops::function::FnOnce<()>>::call_once::{shim:vtable#0}<unknown>
  507. 209.51 s gammaloop-nextest-integration> at <unknown source file>:<unknown line>
  508. 209.51 s gammaloop-nextest-integration> 34: <std[bcb96dfbba0ab899]::sys::thread::unix::Thread>::new::thread_start<unknown>
  509. 209.51 s gammaloop-nextest-integration> at <unknown source file>:<unknown line>
  510. 209.51 s gammaloop-nextest-integration> 35: start_thread<unknown>
  511. 209.51 s gammaloop-nextest-integration> at <unknown source file>:<unknown line>
  512. 209.51 s gammaloop-nextest-integration> 36: __clone3<unknown>
  513. 209.51 s gammaloop-nextest-integration> at <unknown source file>:<unknown line>
  514. 209.51 s gammaloop-nextest-integration>
  515. 209.51 s gammaloop-nextest-integration> Run with COLORBT_SHOW_HIDDEN=1 environment variable to disable frame filtering.
  516. 209.51 s gammaloop-nextest-integration> Run with RUST_BACKTRACE=full to include source snippets.
  517. 209.51 s gammaloop-nextest-integration> Warning: SpanTrace capture is Unsupported.
  518. 209.51 s gammaloop-nextest-integration> Ensure that you've setup a tracing-error ErrorLayer and the semver versions are compatible
  519. 209.51 s gammaloop-nextest-integration>
  520. 209.73 s gammaloop-nextest-integration> error: test run failed
  521. 209.76 s gammaloop-nextest-integration>
  522. 209.76 s gammaloop-nextest-integration> ========== nextest test summary ==========
  523. 209.76 s gammaloop-nextest-integration> report: target/nextest/ci_gammaloop/junit.xml
  524. 209.76 s gammaloop-nextest-integration> tests: 170, failures: 2, errors: 0
  525. 209.76 s gammaloop-nextest-integration>
  526. 209.76 s gammaloop-nextest-integration> 1. gammaloop-integration-tests::test_runs::aa_aa::important::aa_aa_local_inspect_backend_consistency
  527. 209.76 s gammaloop-nextest-integration> failure: test failure with exit code 101
  528. 209.76 s gammaloop-nextest-integration> system-out
  529. 209.76 s gammaloop-nextest-integration> running 1 test
  530. 209.76 s gammaloop-nextest-integration> test aa_aa::important::aa_aa_local_inspect_backend_consistency ... FAILED
  531. 209.76 s gammaloop-nextest-integration>
  532. 209.76 s gammaloop-nextest-integration> failures:
  533. 209.76 s gammaloop-nextest-integration>
  534. 209.76 s gammaloop-nextest-integration> failures:
  535. 209.76 s gammaloop-nextest-integration> aa_aa::important::aa_aa_local_inspect_backend_consistency
  536. 209.76 s gammaloop-nextest-integration>
  537. 209.76 s gammaloop-nextest-integration> test result: FAILED. 0 passed; 1 failed; 0 ignored; 0 measured; 274 filtered out; finished in 2.77s
  538. 209.76 s gammaloop-nextest-integration> system-err
  539. 209.76 s gammaloop-nextest-integration> [2026-09-18 22:29:32.324] @gammaloop_api::se... INFO : Running command import model sm-default.json
  540. 209.76 s gammaloop-nextest-integration> [2026-09-18 22:29:32.324] @import::model INFO : Loading built-in JSON model sm-default
  541. 209.76 s gammaloop-nextest-integration> [2026-09-18 22:29:32.345] @gammalooprs::model INFO : The following 15 external parameters were forced to zero by the restriction card:
  542. 209.76 s gammaloop-nextest-integration> lamWS, AWS, rhoWS, etaWS, ymc, yme, ymm, MC, Me, MM, WTau, muQ, muLe, muLmu, muLtau
  543. 209.76 s gammaloop-nextest-integration> [2026-09-18 22:29:32.345] @gammalooprs::model INFO : The following 34 vertex rules were removed by the restriction card:
  544. 209.76 s gammaloop-nextest-integration> V_82 -> (c~, d, G+) | V_83 -> (t~, d, G+) | V_84 -> (c~, s, G+) | V_85 -> (t~, s, G+) | V_86 -> (u~, b, G+) | V_87 -> (c~, b, G+) | V_90 -> (c~, d, W+) | V_91 -> (t~, d, W+) | V_92 -> (u~, s, W+) | V_94 -> (t~, s, W+) | V_95 -> (u~, b, W+) | V_96 -> (c~, b, W+) | V_101 -> (e+, e-, G0) | V_102 -> (mu+, mu-, G0) | V_104 -> (e+, e-, H) | V_105 -> (mu+, mu-, H) | V_110 -> (ve~, e-, G+) | V_111 -> (vm~, mu-, G+) | V_116 -> (b~, u, G-) | V_117 -> (d~, c, G-) | V_118 -> (s~, c, G-) | V_119 -> (b~, c, G-) | V_120 -> (d~, t, G-) | V_121 -> (s~, t, G-) | V_124 -> (s~, u, W-) | V_125 -> (b~, u, W-) | V_126 -> (d~, c, W-) | V_128 -> (b~, c, W-) | V_129 -> (d~, t, W-) | V_130 -> (s~, t, W-) | V_138 -> (c~, c, G0) | V_140 -> (c~, c, H) | V_145 -> (e+, ve, G-) | V_146 -> (mu+, vm, G-)
  545. 209.76 s gammaloop-nextest-integration> [2026-09-18 22:29:32.345] @gammalooprs::model INFO : The following 36 couplings were removed by the restriction card:
  546. 209.76 s gammaloop-nextest-integration> GC_13, GC_14, GC_16, GC_17, GC_18, GC_19, GC_20, GC_22, GC_23, GC_24, GC_25, GC_26, GC_28, GC_29, GC_42, GC_43, GC_44, GC_46, GC_47, GC_48, GC_84, GC_85, GC_86, GC_87, GC_88, GC_89, GC_90, GC_91, GC_92, GC_93, GC_101, GC_102, GC_103, GC_105, GC_106, GC_107
  547. 209.76 s gammaloop-nextest-integration> [2026-09-18 22:29:32.345] @gammaloop_api::se... INFO : Running command run set_model_parameters
  548. 209.76 s gammaloop-nextest-integration> [2026-09-18 22:29:32.345] @gammaloop_api::se... INFO : Starting command block set_model_parameters
  549. 209.76 s gammaloop-nextest-integration> [2026-09-18 22:29:32.345] @gammaloop_api::se... INFO : Running command set model MT=173.0
  550. 209.76 s gammaloop-nextest-integration> [2026-09-18 22:29:32.349] @gammaloop_api::se... INFO : Running command set model WT=0.0
  551. 209.76 s gammaloop-nextest-integration> [2026-09-18 22:29:32.353] @gammaloop_api::se... INFO : Running command set model ymt=173.0
  552. 209.76 s gammaloop-nextest-integration> [2026-09-18 22:29:32.357] @gammaloop_api::se... INFO : Running command set model aS=0.118
  553. 209.76 s gammaloop-nextest-integration> [2026-09-18 22:29:32.361] @gammaloop_api::se... INFO : Running command set model aEWM1=137.036
  554. 209.76 s gammaloop-nextest-integration> [2026-09-18 22:29:32.364] @gammaloop_api::se... INFO : Running command set model Gf=1.166390e-05
  555. 209.76 s gammaloop-nextest-integration> [2026-09-18 22:29:32.368] @gammaloop_api::se... INFO : Running command set model MZ=91.188
  556. 209.76 s gammaloop-nextest-integration> [2026-09-18 22:29:32.372] @gammaloop_api::se... INFO : Running command set global string '
  557. 209.76 s gammaloop-nextest-integration> [global.generation.compile]
  558. 209.76 s gammaloop-nextest-integration> compilation_mode = "symjit"
  559. 209.76 s gammaloop-nextest-integration> optimization_level = "O0"
  560. 209.76 s gammaloop-nextest-integration> fast_math = false
  561. 209.76 s gammaloop-nextest-integration> [...]
  562. 209.76 s gammaloop-nextest-integration> [2026-09-18 22:29:32.372] @gammaloop_api::se... INFO : Running command import graphs ./examples/cli/aa_aa/1L/aa_aa_1L.dot -p aa_aa_all_helicities -i 1L_ppmm -o
  563. 209.76 s gammaloop-nextest-integration> [2026-09-18 22:29:32.373] @commands::import INFO : Loading graphs from '/build/source/examples/cli/aa_aa/1L/aa_aa_1L.dot'
  564. 209.76 s gammaloop-nextest-integration> [2026-09-18 22:29:32.381] @gammaloop_api::se... INFO : Running command generate existing -p aa_aa_all_helicities
  565. 209.76 s gammaloop-nextest-integration> The application panicked (crashed).
  566. 209.76 s gammaloop-nextest-integration> Message: label _func_power_ not found
  567. 209.76 s gammaloop-nextest-integration> Location: /nix/store/n9w914kh1cm59xx3spcs831cdyb56m32-vendor-cargo-deps/c19b7c6f923b580ac259164a89f2577984ad5ab09ee9d583b888f934adbbe8d0/symjit-2.25.6/src/symjit/assembler.rs:77
  568. 209.76 s gammaloop-nextest-integration>
  569. 209.76 s gammaloop-nextest-integration> ━━━━━━━━━━━━━━━━━━━━━━━━━━━━━━━━━━ BACKTRACE ━━━━━━━━━━━━━━━━━━━━━━━━━━━━━━━━━━━
  570. 209.76 s gammaloop-nextest-integration> 1: <color_eyre[51793ea62743adbd]::config::PanicHook>::panic_report<unknown>
  571. 209.76 s gammaloop-nextest-integration> at <unknown source file>:<unknown line>
  572. 209.76 s gammaloop-nextest-integration> 2: <color_eyre[51793ea62743adbd]::config::PanicHook>::into_panic_hook::{closure#0}<unknown>
  573. 209.76 s gammaloop-nextest-integration> at <unknown source file>:<unknown line>
  574. 209.76 s gammaloop-nextest-integration> 3: std[bcb96dfbba0ab899]::panicking::panic_with_hook<unknown>
  575. 209.76 s gammaloop-nextest-integration> at <unknown source file>:<unknown line>
  576. 209.76 s gammaloop-nextest-integration> 4: std[bcb96dfbba0ab899]::panicking::panic_handler::{closure#0}<unknown>
  577. 209.76 s gammaloop-nextest-integration> at <unknown source file>:<unknown line>
  578. 209.76 s gammaloop-nextest-integration> 5: std[bcb96dfbba0ab899]::sys::backtrace::__rust_end_short_backtrace::<std[bcb96dfbba0ab899]::panicking::panic_handler::{closure#0}, !><unknown>
  579. 209.76 s gammaloop-nextest-integration> at <unknown source file>:<unknown line>
  580. 209.76 s gammaloop-nextest-integration> 6: __rustc[6c289b9f9c454d21]::rust_begin_unwind<unknown>
  581. 209.76 s gammaloop-nextest-integration> at <unknown source file>:<unknown line>
  582. 209.76 s gammaloop-nextest-integration> 7: core[940e698046960fd5]::panicking::panic_fmt<unknown>
  583. 209.76 s gammaloop-nextest-integration> at <unknown source file>:<unknown line>
  584. 209.76 s gammaloop-nextest-integration> 8: <symjit[e408de789c333cd]::symjit::assembler::Assembler>::apply_jumps<unknown>
  585. 209.76 s gammaloop-nextest-integration> at <unknown source file>:<unknown line>
  586. 209.76 s gammaloop-nextest-integration> 9: <symjit[e408de789c333cd]::symjit::builder::Builder>::compile_from_mir::<symjit[e408de789c333cd]::symjit::amd::complex::AmdComplexGenerator><unknown>
  587. 209.76 s gammaloop-nextest-integration> at <unknown source file>:<unknown line>
  588. 209.76 s gammaloop-nextest-integration> 10: <symjit[e408de789c333cd]::symjit::runnable::Application>::compile_ty<unknown>
  589. 209.76 s gammaloop-nextest-integration> at <unknown source file>:<unknown line>
  590. 209.76 s gammaloop-nextest-integration> 11: <symjit[e408de789c333cd]::symjit::runnable::Application>::with_mir<unknown>
  591. 209.76 s gammaloop-nextest-integration> at <unknown source file>:<unknown line>
  592. 209.76 s gammaloop-nextest-integration> 12: <symjit[e408de789c333cd]::symjit::composer::DirectTranslator as symjit[e408de789c333cd]::symjit::composer::Composer>::compile<unknown>
  593. 209.76 s gammaloop-nextest-integration> at <unknown source file>:<unknown line>
  594. 209.76 s gammaloop-nextest-integration> 13: <symjit[e408de789c333cd]::symjit::compiler::Translator as symjit[e408de789c333cd]::symjit::composer::Composer>::compile<unknown>
  595. 209.76 s gammaloop-nextest-integration> at <unknown source file>:<unknown line>
  596. 209.76 s gammaloop-nextest-integration> 14: <numerica[124dab8567f4861e]::domains::float::complex::Complex<f64> as symbolica[10e259bab675d243]::evaluate::backend::JITCompiledNumber>::jit_compile<unknown>
  597. 209.76 s gammaloop-nextest-integration> at <unknown source file>:<unknown line>
  598. 209.76 s gammaloop-nextest-integration> 15: <gammalooprs[917cbd3df9e68f8f]::integrands::process::evaluators::GenericEvaluator>::activate_symjit<unknown>
  599. 209.76 s gammaloop-nextest-integration> at <unknown source file>:<unknown line>
  600. 209.76 s gammaloop-nextest-integration> 16: <gammalooprs[917cbd3df9e68f8f]::integrands::process::amplitude::AmplitudeIntegrand>::prepare_runtime_backends_after_generation_with_compile_times<unknown>
  601. 209.76 s gammaloop-nextest-integration> at <unknown source file>:<unknown line>
  602. 209.76 s gammaloop-nextest-integration> 17: <gammalooprs[917cbd3df9e68f8f]::processes::amplitude::Amplitude>::build_integrand<unknown>
  603. 209.76 s gammaloop-nextest-integration> at <unknown source file>:<unknown line>
  604. 209.76 s gammaloop-nextest-integration> 18: <gammalooprs[917cbd3df9e68f8f]::processes::process::Process>::generate_integrands<unknown>
  605. 209.76 s gammaloop-nextest-integration> at <unknown source file>:<unknown line>
  606. 209.76 s gammaloop-nextest-integration> 19: <gammaloop_api[9ebf6628f97aeb57]::state::State>::generate_integrand<unknown>
  607. 209.76 s gammaloop-nextest-integration> at <unknown source file>:<unknown line>
  608. 209.76 s gammaloop-nextest-integration> 20: <gammaloop_api[9ebf6628f97aeb57]::commands::generate::Generate>::run::<&std[bcb96dfbba0ab899]::path::PathBuf><unknown>
  609. 209.76 s gammaloop-nextest-integration> at <unknown source file>:<unknown line>
  610. 209.76 s gammaloop-nextest-integration> 21: <gammaloop_api[9ebf6628f97aeb57]::commands::Commands>::run<unknown>
  611. 209.76 s gammaloop-nextest-integration> at <unknown source file>:<unknown line>
  612. 209.76 s gammaloop-nextest-integration> 22: <gammaloop_api[9ebf6628f97aeb57]::session::CliSession>::execute_prepared<unknown>
  613. 209.76 s gammaloop-nextest-integration> at <unknown source file>:<unknown line>
  614. 209.76 s gammaloop-nextest-integration> 23: <gammaloop_api[9ebf6628f97aeb57]::session::CliSession>::execute_command<unknown>
  615. 209.76 s gammaloop-nextest-integration> at <unknown source file>:<unknown line>
  616. 209.76 s gammaloop-nextest-integration> 24: <gammaloop_integration_tests[191607b70c61cd5a]::CLIState>::run_command<unknown>
  617. 209.76 s gammaloop-nextest-integration> at <unknown source file>:<unknown line>
  618. 209.76 s gammaloop-nextest-integration> 25: test_runs[9b7e2dc2dc4f29b0]::aa_aa::generate_aa_aa_helicity_family<unknown>
  619. 209.76 s gammaloop-nextest-integration> at <unknown source file>:<unknown line>
  620. 209.76 s gammaloop-nextest-integration> 26: <test_runs[9b7e2dc2dc4f29b0]::aa_aa::important::aa_aa_local_inspect_backend_consistency::{closure#0} as core[940e698046960fd5]::ops::function::FnOnce<()>>::call_once<unknown>
  621. 209.76 s gammaloop-nextest-integration> at <unknown source file>:<unknown line>
  622. 209.76 s gammaloop-nextest-integration> 27: serial_test[cd99724524a2f1c0]::serial_code_lock::local_serial_core_with_return::<(), eyre[cb2fd339c0c40fca]::Report><unknown>
  623. 209.76 s gammaloop-nextest-integration> at <unknown source file>:<unknown line>
  624. 209.76 s gammaloop-nextest-integration> 28: <test_runs[9b7e2dc2dc4f29b0]::aa_aa::important::aa_aa_local_inspect_backend_consistency::{closure#0} as core[940e698046960fd5]::ops::function::FnOnce<()>>::call_once<unknown>
  625. 209.76 s gammaloop-nextest-integration> at <unknown source file>:<unknown line>
  626. 209.76 s gammaloop-nextest-integration> 29: test[75d6903177b1d7e9]::__rust_begin_short_backtrace::<core[940e698046960fd5]::result::Result<(), alloc[2ea6bcb46fca0c42]::string::String>, fn() -> core[940e698046960fd5]::result::Result<(), alloc[2ea6bcb46fca0c42]::string::String>><unknown>
  627. 209.76 s gammaloop-nextest-integration> at <unknown source file>:<unknown line>
  628. 209.76 s gammaloop-nextest-integration> 30: test[75d6903177b1d7e9]::run_test::{closure#0}<unknown>
  629. 209.76 s gammaloop-nextest-integration> at <unknown source file>:<unknown line>
  630. 209.76 s gammaloop-nextest-integration> 31: std[bcb96dfbba0ab899]::sys::backtrace::__rust_begin_short_backtrace::<test[75d6903177b1d7e9]::run_test::{closure#1}, ()><unknown>
  631. 209.76 s gammaloop-nextest-integration> at <unknown source file>:<unknown line>
  632. 209.76 s gammaloop-nextest-integration> 32: <std[bcb96dfbba0ab899]::thread::lifecycle::spawn_unchecked<test[75d6903177b1d7e9]::run_test::{closure#1}, ()>::{closure#1} as core[940e698046960fd5]::ops::function::FnOnce<()>>::call_once::{shim:vtable#0}<unknown>
  633. 209.76 s gammaloop-nextest-integration> at <unknown source file>:<unknown line>
  634. 209.76 s gammaloop-nextest-integration> 33: <std[bcb96dfbba0ab899]::sys::thread::unix::Thread>::new::thread_start<unknown>
  635. 209.76 s gammaloop-nextest-integration> at <unknown source file>:<unknown line>
  636. 209.76 s gammaloop-nextest-integration> 34: start_thread<unknown>
  637. 209.76 s gammaloop-nextest-integration> at <unknown source file>:<unknown line>
  638. 209.76 s gammaloop-nextest-integration> 35: __clone3<unknown>
  639. 209.76 s gammaloop-nextest-integration> at <unknown source file>:<unknown line>
  640. 209.76 s gammaloop-nextest-integration>
  641. 209.76 s gammaloop-nextest-integration> Run with COLORBT_SHOW_HIDDEN=1 environment variable to disable frame filtering.
  642. 209.76 s gammaloop-nextest-integration> Run with RUST_BACKTRACE=full to include source snippets.
  643. 209.76 s gammaloop-nextest-integration> Warning: SpanTrace capture is Unsupported.
  644. 209.76 s gammaloop-nextest-integration> Ensure that you've setup a tracing-error ErrorLayer and the semver versions are compatible
  645. 209.76 s gammaloop-nextest-integration>
  646. 209.76 s gammaloop-nextest-integration> 2. gammaloop-integration-tests::uv::thermal_sunrise_uv
  647. 209.76 s gammaloop-nextest-integration> failure: test failure with exit code 101
  648. 209.76 s gammaloop-nextest-integration> system-out
  649. 209.76 s gammaloop-nextest-integration> running 1 test
  650. 209.76 s gammaloop-nextest-integration> test thermal_sunrise_uv ... FAILED
  651. 209.76 s gammaloop-nextest-integration>
  652. 209.76 s gammaloop-nextest-integration> failures:
  653. 209.76 s gammaloop-nextest-integration>
  654. 209.76 s gammaloop-nextest-integration> failures:
  655. 209.76 s gammaloop-nextest-integration> thermal_sunrise_uv
  656. 209.76 s gammaloop-nextest-integration>
  657. 209.76 s gammaloop-nextest-integration> test result: FAILED. 0 passed; 1 failed; 0 ignored; 0 measured; 31 filtered out; finished in 2.75s
  658. 209.76 s gammaloop-nextest-integration> system-err
  659. 209.76 s gammaloop-nextest-integration> [2026-09-18 22:30:14.541] @gammaloop_api::se... INFO : Running command run generate
  660. 209.76 s gammaloop-nextest-integration> [2026-09-18 22:30:14.541] @gammaloop_api::se... INFO : Starting command block generate
  661. 209.76 s gammaloop-nextest-integration> [2026-09-18 22:30:14.541] @gammaloop_api::se... INFO : Running command import model sm-default.json
  662. 209.76 s gammaloop-nextest-integration> [2026-09-18 22:30:14.541] @import::model INFO : Loading built-in JSON model sm-default
  663. 209.76 s gammaloop-nextest-integration> [2026-09-18 22:30:14.572] @gammalooprs::model INFO : The following 15 external parameters were forced to zero by the restriction card:
  664. 209.76 s gammaloop-nextest-integration> lamWS, AWS, rhoWS, etaWS, ymc, yme, ymm, MC, Me, MM, WTau, muQ, muLe, muLmu, muLtau
  665. 209.76 s gammaloop-nextest-integration> [2026-09-18 22:30:14.572] @gammalooprs::model INFO : The following 34 vertex rules were removed by the restriction card:
  666. 209.76 s gammaloop-nextest-integration> V_82 -> (c~, d, G+) | V_83 -> (t~, d, G+) | V_84 -> (c~, s, G+) | V_85 -> (t~, s, G+) | V_86 -> (u~, b, G+) | V_87 -> (c~, b, G+) | V_90 -> (c~, d, W+) | V_91 -> (t~, d, W+) | V_92 -> (u~, s, W+) | V_94 -> (t~, s, W+) | V_95 -> (u~, b, W+) | V_96 -> (c~, b, W+) | V_101 -> (e+, e-, G0) | V_102 -> (mu+, mu-, G0) | V_104 -> (e+, e-, H) | V_105 -> (mu+, mu-, H) | V_110 -> (ve~, e-, G+) | V_111 -> (vm~, mu-, G+) | V_116 -> (b~, u, G-) | V_117 -> (d~, c, G-) | V_118 -> (s~, c, G-) | V_119 -> (b~, c, G-) | V_120 -> (d~, t, G-) | V_121 -> (s~, t, G-) | V_124 -> (s~, u, W-) | V_125 -> (b~, u, W-) | V_126 -> (d~, c, W-) | V_128 -> (b~, c, W-) | V_129 -> (d~, t, W-) | V_130 -> (s~, t, W-) | V_138 -> (c~, c, G0) | V_140 -> (c~, c, H) | V_145 -> (e+, ve, G-) | V_146 -> (mu+, vm, G-)
  667. 209.76 s gammaloop-nextest-integration> [2026-09-18 22:30:14.572] @gammalooprs::model INFO : The following 36 couplings were removed by the restriction card:
  668. 209.76 s gammaloop-nextest-integration> GC_13, GC_14, GC_16, GC_17, GC_18, GC_19, GC_20, GC_22, GC_23, GC_24, GC_25, GC_26, GC_28, GC_29, GC_42, GC_43, GC_44, GC_46, GC_47, GC_48, GC_84, GC_85, GC_86, GC_87, GC_88, GC_89, GC_90, GC_91, GC_92, GC_93, GC_101, GC_102, GC_103, GC_105, GC_106, GC_107
  669. 209.76 s gammaloop-nextest-integration> [2026-09-18 22:30:14.572] @gammaloop_api::se... INFO : Running command remove processes
  670. 209.76 s gammaloop-nextest-integration> [2026-09-18 22:30:14.573] @gammaloop_api::se... INFO : Running command generate amp {} > {} [{2}] | g u
  671. 209.76 s gammaloop-nextest-integration> --numerator-grouping group_identical_graphs_up_to_scalar_rescaling
  672. 209.76 s gammaloop-nextest-integration> --max-n-bridges 0
  673. 209.76 s gammaloop-nextest-integration> --number-of-factorized-loop-subtopologies 1 1
  674. 209.76 s gammaloop-nextest-integration> --number-of-anticommutating-loops 1 1
  675. 209.76 s gammaloop-nextest-integration> [...]
  676. 209.76 s gammaloop-nextest-integration> [2026-09-18 22:30:14.574] @feyngen::diagram_... INFO : 0s | Δ=0s | Starting Feynman graph generation with Symbolica...
  677. 209.76 s gammaloop-nextest-integration> [2026-09-18 22:30:14.574] @feyngen::diagram_... INFO : 0s | Δ=0s | Number of graphs resulting from Symbolica generation: 3
  678. 209.76 s gammaloop-nextest-integration> [2026-09-18 22:30:14.574] @feyngen::diagram_... INFO : 0s | Δ=0s | Number of graphs retained after removal of vetoed topologies: 2
  679. 209.76 s gammaloop-nextest-integration> [2026-09-18 22:30:14.577] @feyngen::diagram_... INFO : 0s | Δ=0s | Number of graphs after vertex info assignment: 2
  680. 209.76 s gammaloop-nextest-integration> [2026-09-18 22:30:14.577] @feyngen::diagram_... INFO : 0s | Δ=0s | Number of graphs after all complete graphs filters are applied: 2
  681. 209.76 s gammaloop-nextest-integration> [2026-09-18 22:30:14.580] @feyngen::diagram_... INFO : 0s | Δ=0s | Number of graphs after closed anticommutating chains analysis: 1
  682. 209.76 s gammaloop-nextest-integration> [2026-09-18 22:30:14.580] @feyngen::diagram_... INFO : 0s | Δ=0s | Number of graphs after symmetrization of external states: 1
  683. 209.76 s gammaloop-nextest-integration> [2026-09-18 22:30:14.583] @feyngen::diagram_... INFO : 0s | Δ=0s | Number of graphs after canonization of vertices, edges and flows (graph labels assigned here): 1
  684. 209.76 s gammaloop-nextest-integration> [2026-09-18 22:30:14.598] @feyngen::diagram_... INFO : 0s | Δ=0s | Number of graphs after numerator-aware grouping with strategy 'up to a scalar rescaling': 1 (1 isomorphically unique graph, 0 color zero, 0 lorentz zero, 0 grouped and 0 cancellation)
  685. 209.76 s gammaloop-nextest-integration> [2026-09-18 22:30:14.598] @feyngen::diagram_... INFO : ( Sum of the symmetry factors from each graph generated = -1/2 )
  686. 209.76 s gammaloop-nextest-integration> [2026-09-18 22:30:14.598] @commands::generate INFO : Generated amplitude 1 graphs.
  687. 209.76 s gammaloop-nextest-integration> [2026-09-18 22:30:14.599] @commands::generate INFO : Only diagram generation was requested, skipping integrand generation. You can generate integrands later using the 'generate existing <options>' command.
  688. 209.76 s gammaloop-nextest-integration> [2026-09-18 22:30:14.599] @gammaloop_api::se... INFO : Running command generate
  689. 209.76 s gammaloop-nextest-integration> The application panicked (crashed).
  690. 209.76 s gammaloop-nextest-integration> Message: label _func_power_ not found
  691. 209.76 s gammaloop-nextest-integration> Location: /nix/store/n9w914kh1cm59xx3spcs831cdyb56m32-vendor-cargo-deps/c19b7c6f923b580ac259164a89f2577984ad5ab09ee9d583b888f934adbbe8d0/symjit-2.25.6/src/symjit/assembler.rs:77
  692. 209.76 s gammaloop-nextest-integration>
  693. 209.76 s gammaloop-nextest-integration> ━━━━━━━━━━━━━━━━━━━━━━━━━━━━━━━━━━ BACKTRACE ━━━━━━━━━━━━━━━━━━━━━━━━━━━━━━━━━━━
  694. 209.76 s gammaloop-nextest-integration> 1: <color_eyre[51793ea62743adbd]::config::PanicHook>::panic_report<unknown>
  695. 209.76 s gammaloop-nextest-integration> at <unknown source file>:<unknown line>
  696. 209.76 s gammaloop-nextest-integration> 2: <color_eyre[51793ea62743adbd]::config::PanicHook>::into_panic_hook::{closure#0}<unknown>
  697. 209.76 s gammaloop-nextest-integration> at <unknown source file>:<unknown line>
  698. 209.76 s gammaloop-nextest-integration> 3: std[bcb96dfbba0ab899]::panicking::panic_with_hook<unknown>
  699. 209.76 s gammaloop-nextest-integration> at <unknown source file>:<unknown line>
  700. 209.76 s gammaloop-nextest-integration> 4: std[bcb96dfbba0ab899]::panicking::panic_handler::{closure#0}<unknown>
  701. 209.76 s gammaloop-nextest-integration> at <unknown source file>:<unknown line>
  702. 209.76 s gammaloop-nextest-integration> 5: std[bcb96dfbba0ab899]::sys::backtrace::__rust_end_short_backtrace::<std[bcb96dfbba0ab899]::panicking::panic_handler::{closure#0}, !><unknown>
  703. 209.76 s gammaloop-nextest-integration> at <unknown source file>:<unknown line>
  704. 209.76 s gammaloop-nextest-integration> 6: __rustc[6c289b9f9c454d21]::rust_begin_unwind<unknown>
  705. 209.76 s gammaloop-nextest-integration> at <unknown source file>:<unknown line>
  706. 209.76 s gammaloop-nextest-integration> 7: core[940e698046960fd5]::panicking::panic_fmt<unknown>
  707. 209.76 s gammaloop-nextest-integration> at <unknown source file>:<unknown line>
  708. 209.76 s gammaloop-nextest-integration> 8: <symjit[e408de789c333cd]::symjit::assembler::Assembler>::apply_jumps<unknown>
  709. 209.76 s gammaloop-nextest-integration> at <unknown source file>:<unknown line>
  710. 209.76 s gammaloop-nextest-integration> 9: <symjit[e408de789c333cd]::symjit::builder::Builder>::compile_from_mir::<symjit[e408de789c333cd]::symjit::amd::complex::AmdComplexGenerator><unknown>
  711. 209.76 s gammaloop-nextest-integration> at <unknown source file>:<unknown line>
  712. 209.76 s gammaloop-nextest-integration> 10: <symjit[e408de789c333cd]::symjit::runnable::Application>::compile_ty<unknown>
  713. 209.76 s gammaloop-nextest-integration> at <unknown source file>:<unknown line>
  714. 209.76 s gammaloop-nextest-integration> 11: <symjit[e408de789c333cd]::symjit::runnable::Application>::with_mir<unknown>
  715. 209.76 s gammaloop-nextest-integration> at <unknown source file>:<unknown line>
  716. 209.76 s gammaloop-nextest-integration> 12: <symjit[e408de789c333cd]::symjit::composer::DirectTranslator as symjit[e408de789c333cd]::symjit::composer::Composer>::compile<unknown>
  717. 209.76 s gammaloop-nextest-integration> at <unknown source file>:<unknown line>
  718. 209.76 s gammaloop-nextest-integration> 13: <symjit[e408de789c333cd]::symjit::compiler::Translator as symjit[e408de789c333cd]::symjit::composer::Composer>::compile<unknown>
  719. 209.76 s gammaloop-nextest-integration> at <unknown source file>:<unknown line>
  720. 209.76 s gammaloop-nextest-integration> 14: <numerica[124dab8567f4861e]::domains::float::complex::Complex<f64> as symbolica[10e259bab675d243]::evaluate::backend::JITCompiledNumber>::jit_compile<unknown>
  721. 209.76 s gammaloop-nextest-integration> at <unknown source file>:<unknown line>
  722. 209.76 s gammaloop-nextest-integration> 15: <gammalooprs[917cbd3df9e68f8f]::integrands::process::evaluators::GenericEvaluator>::activate_symjit<unknown>
  723. 209.76 s gammaloop-nextest-integration> at <unknown source file>:<unknown line>
  724. 209.76 s gammaloop-nextest-integration> 16: <gammalooprs[917cbd3df9e68f8f]::integrands::process::amplitude::AmplitudeIntegrand>::prepare_runtime_backends_after_generation_with_compile_times<unknown>
  725. 209.76 s gammaloop-nextest-integration> at <unknown source file>:<unknown line>
  726. 209.76 s gammaloop-nextest-integration> 17: <gammalooprs[917cbd3df9e68f8f]::processes::amplitude::Amplitude>::build_integrand<unknown>
  727. 209.76 s gammaloop-nextest-integration> at <unknown source file>:<unknown line>
  728. 209.76 s gammaloop-nextest-integration> 18: <gammalooprs[917cbd3df9e68f8f]::processes::process::Process>::generate_integrands<unknown>
  729. 209.76 s gammaloop-nextest-integration> at <unknown source file>:<unknown line>
  730. 209.76 s gammaloop-nextest-integration> 19: <gammalooprs[917cbd3df9e68f8f]::processes::ProcessList>::generate_integrands<unknown>
  731. 209.76 s gammaloop-nextest-integration> at <unknown source file>:<unknown line>
  732. 209.76 s gammaloop-nextest-integration> 20: <gammaloop_api[9ebf6628f97aeb57]::state::State>::generate_integrands<unknown>
  733. 209.76 s gammaloop-nextest-integration> at <unknown source file>:<unknown line>
  734. 209.76 s gammaloop-nextest-integration> 21: <gammaloop_api[9ebf6628f97aeb57]::commands::generate::Generate>::run::<&std[bcb96dfbba0ab899]::path::PathBuf><unknown>
  735. 209.76 s gammaloop-nextest-integration> at <unknown source file>:<unknown line>
  736. 209.76 s gammaloop-nextest-integration> 22: <gammaloop_api[9ebf6628f97aeb57]::commands::Commands>::run<unknown>
  737. 209.76 s gammaloop-nextest-integration> at <unknown source file>:<unknown line>
  738. 209.76 s gammaloop-nextest-integration> 23: <gammaloop_api[9ebf6628f97aeb57]::session::CliSession>::execute_prepared<unknown>
  739. 209.76 s gammaloop-nextest-integration> at <unknown source file>:<unknown line>
  740. 209.76 s gammaloop-nextest-integration> 24: <gammaloop_api[9ebf6628f97aeb57]::session::CliSession>::execute_prepared_commands<unknown>
  741. 209.76 s gammaloop-nextest-integration> at <unknown source file>:<unknown line>
  742. 209.76 s gammaloop-nextest-integration> 25: <gammaloop_api[9ebf6628f97aeb57]::session::CliSession>::execute_prepared<unknown>
  743. 209.76 s gammaloop-nextest-integration> at <unknown source file>:<unknown line>
  744. 209.76 s gammaloop-nextest-integration> 26: <gammaloop_api[9ebf6628f97aeb57]::session::CliSession>::execute_command<unknown>
  745. 209.76 s gammaloop-nextest-integration> at <unknown source file>:<unknown line>
  746. 209.76 s gammaloop-nextest-integration> 27: <gammaloop_integration_tests[191607b70c61cd5a]::CLIState>::run_command<unknown>
  747. 209.76 s gammaloop-nextest-integration> at <unknown source file>:<unknown line>
  748. 209.76 s gammaloop-nextest-integration> 28: uv[3c7454ef256d6487]::run_single_integrated_uv_case<unknown>
  749. 209.76 s gammaloop-nextest-integration> at <unknown source file>:<unknown line>
  750. 209.76 s gammaloop-nextest-integration> 29: <uv[3c7454ef256d6487]::thermal_sunrise_uv::{closure#0} as core[940e698046960fd5]::ops::function::FnOnce<()>>::call_once<unknown>
  751. 209.76 s gammaloop-nextest-integration> at <unknown source file>:<unknown line>
  752. 209.76 s gammaloop-nextest-integration> 30: test[75d6903177b1d7e9]::__rust_begin_short_backtrace::<core[940e698046960fd5]::result::Result<(), alloc[2ea6bcb46fca0c42]::string::String>, fn() -> core[940e698046960fd5]::result::Result<(), alloc[2ea6bcb46fca0c42]::string::String>><unknown>
  753. 209.76 s gammaloop-nextest-integration> at <unknown source file>:<unknown line>
  754. 209.76 s gammaloop-nextest-integration> 31: test[75d6903177b1d7e9]::run_test::{closure#0}<unknown>
  755. 209.76 s gammaloop-nextest-integration> at <unknown source file>:<unknown line>
  756. 209.76 s gammaloop-nextest-integration> 32: std[bcb96dfbba0ab899]::sys::backtrace::__rust_begin_short_backtrace::<test[75d6903177b1d7e9]::run_test::{closure#1}, ()><unknown>
  757. 209.76 s gammaloop-nextest-integration> at <unknown source file>:<unknown line>
  758. 209.76 s gammaloop-nextest-integration> 33: <std[bcb96dfbba0ab899]::thread::lifecycle::spawn_unchecked<test[75d6903177b1d7e9]::run_test::{closure#1}, ()>::{closure#1} as core[940e698046960fd5]::ops::function::FnOnce<()>>::call_once::{shim:vtable#0}<unknown>
  759. 209.76 s gammaloop-nextest-integration> at <unknown source file>:<unknown line>
  760. 209.76 s gammaloop-nextest-integration> 34: <std[bcb96dfbba0ab899]::sys::thread::unix::Thread>::new::thread_start<unknown>
  761. 209.76 s gammaloop-nextest-integration> at <unknown source file>:<unknown line>
  762. 209.76 s gammaloop-nextest-integration> 35: start_thread<unknown>
  763. 209.76 s gammaloop-nextest-integration> at <unknown source file>:<unknown line>
  764. 209.76 s gammaloop-nextest-integration> 36: __clone3<unknown>
  765. 209.76 s gammaloop-nextest-integration> at <unknown source file>:<unknown line>
  766. 209.76 s gammaloop-nextest-integration>
  767. 209.76 s gammaloop-nextest-integration> Run with COLORBT_SHOW_HIDDEN=1 environment variable to disable frame filtering.
  768. 209.76 s gammaloop-nextest-integration> Run with RUST_BACKTRACE=full to include source snippets.
  769. 209.76 s gammaloop-nextest-integration> Warning: SpanTrace capture is Unsupported.
  770. 209.76 s gammaloop-nextest-integration> Ensure that you've setup a tracing-error ErrorLayer and the semver versions are compatible
  771. 209.76 s gammaloop-nextest-integration> =========================================
  772. 209.85 s error: Cannot build '/nix/store/kwk339q5xvfx62zai4ay5j3qq0nfsqgw-gammaloop-nextest-integration.drv'.
  773. 209.85 s Reason: builder failed with exit code 100.
  774. 209.85 s Output paths:
  775. 209.85 s /nix/store/c3wp0hpqwzl785z84jxkkcyxx9cvpz4b-gammaloop-nextest-integration
  776. 209.85 s Last 755 log lines:
  777. 209.85 s > Extracting 13 binaries, 1 build script output directory, and 3 linked paths to /build/nextest-archive-YP4ubw
  778. 209.85 s > Extracted 30 files to /build/nextest-archive-YP4ubw in 2.10s
  779. 209.85 s > ------------
  780. 209.85 s > Nextest run ID 363b06b2-1b8f-4ee8-b83c-11bda896f208 with nextest profile: ci_gammaloop
  781. 209.85 s > Starting 170 tests across 13 binaries (209 tests skipped, including 208 tests via profile.ci_gammaloop.default-filter)
  782. 209.85 s > FAIL [ 2.786s] ( 55/170) gammaloop-integration-tests::test_runs aa_aa::important::aa_aa_local_inspect_backend_consistency
  783. 209.85 s > stdout ---
  784. 209.85 s >
  785. 209.85 s > running 1 test
  786. 209.85 s > test aa_aa::important::aa_aa_local_inspect_backend_consistency ... FAILED
  787. 209.85 s >
  788. 209.85 s > failures:
  789. 209.85 s >
  790. 209.85 s > failures:
  791. 209.85 s > aa_aa::important::aa_aa_local_inspect_backend_consistency
  792. 209.85 s >
  793. 209.85 s > test result: FAILED. 0 passed; 1 failed; 0 ignored; 0 measured; 274 filtered out; finished in 2.77s
  794. 209.85 s >
  795. 209.85 s > stderr ---
  796. 209.85 s > [2026-09-18 22:29:32.324] @gammaloop_api::se... INFO : Running command import model sm-default.json
  797. 209.85 s > [2026-09-18 22:29:32.324] @import::model INFO : Loading built-in JSON model sm-default
  798. 209.85 s > [2026-09-18 22:29:32.345] @gammalooprs::model INFO : The following 15 external parameters were forced to zero by the restriction card:
  799. 209.85 s > lamWS, AWS, rhoWS, etaWS, ymc, yme, ymm, MC, Me, MM, WTau, muQ, muLe, muLmu, muLtau
  800. 209.85 s > [2026-09-18 22:29:32.345] @gammalooprs::model INFO : The following 34 vertex rules were removed by the restriction card:
  801. 209.85 s > V_82 -> (c~, d, G+) | V_83 -> (t~, d, G+) | V_84 -> (c~, s, G+) | V_85 -> (t~, s, G+) | V_86 -> (u~, b, G+) | V_87 -> (c~, b, G+) | V_90 -> (c~, d, W+) | V_91 -> (t~, d, W+) | V_92 -> (u~, s, W+) | V_94 -> (t~, s, W+) | V_95 -> (u~, b, W+) | V_96 -> (c~, b, W+) | V_101 -> (e+, e-, G0) | V_102 -> (mu+, mu-, G0) | V_104 -> (e+, e-, H) | V_105 -> (mu+, mu-, H) | V_110 -> (ve~, e-, G+) | V_111 -> (vm~, mu-, G+) | V_116 -> (b~, u, G-) | V_117 -> (d~, c, G-) | V_118 -> (s~, c, G-) | V_119 -> (b~, c, G-) | V_120 -> (d~, t, G-) | V_121 -> (s~, t, G-) | V_124 -> (s~, u, W-) | V_125 -> (b~, u, W-) | V_126 -> (d~, c, W-) | V_128 -> (b~, c, W-) | V_129 -> (d~, t, W-) | V_130 -> (s~, t, W-) | V_138 -> (c~, c, G0) | V_140 -> (c~, c, H) | V_145 -> (e+, ve, G-) | V_146 -> (mu+, vm, G-)
  802. 209.85 s > [2026-09-18 22:29:32.345] @gammalooprs::model INFO : The following 36 couplings were removed by the restriction card:
  803. 209.85 s > GC_13, GC_14, GC_16, GC_17, GC_18, GC_19, GC_20, GC_22, GC_23, GC_24, GC_25, GC_26, GC_28, GC_29, GC_42, GC_43, GC_44, GC_46, GC_47, GC_48, GC_84, GC_85, GC_86, GC_87, GC_88, GC_89, GC_90, GC_91, GC_92, GC_93, GC_101, GC_102, GC_103, GC_105, GC_106, GC_107
  804. 209.85 s > [2026-09-18 22:29:32.345] @gammaloop_api::se... INFO : Running command run set_model_parameters
  805. 209.85 s > [2026-09-18 22:29:32.345] @gammaloop_api::se... INFO : Starting command block set_model_parameters
  806. 209.85 s > [2026-09-18 22:29:32.345] @gammaloop_api::se... INFO : Running command set model MT=173.0
  807. 209.85 s > [2026-09-18 22:29:32.349] @gammaloop_api::se... INFO : Running command set model WT=0.0
  808. 209.85 s > [2026-09-18 22:29:32.353] @gammaloop_api::se... INFO : Running command set model ymt=173.0
  809. 209.85 s > [2026-09-18 22:29:32.357] @gammaloop_api::se... INFO : Running command set model aS=0.118
  810. 209.85 s > [2026-09-18 22:29:32.361] @gammaloop_api::se... INFO : Running command set model aEWM1=137.036
  811. 209.85 s > [2026-09-18 22:29:32.364] @gammaloop_api::se... INFO : Running command set model Gf=1.166390e-05
  812. 209.85 s > [2026-09-18 22:29:32.368] @gammaloop_api::se... INFO : Running command set model MZ=91.188
  813. 209.85 s > [2026-09-18 22:29:32.372] @gammaloop_api::se... INFO : Running command set global string '
  814. 209.85 s > [global.generation.compile]
  815. 209.85 s > compilation_mode = "symjit"
  816. 209.85 s > optimization_level = "O0"
  817. 209.85 s > fast_math = false
  818. 209.85 s > [...]
  819. 209.85 s > [2026-09-18 22:29:32.372] @gammaloop_api::se... INFO : Running command import graphs ./examples/cli/aa_aa/1L/aa_aa_1L.dot -p aa_aa_all_helicities -i 1L_ppmm -o
  820. 209.85 s > [2026-09-18 22:29:32.373] @commands::import INFO : Loading graphs from '/build/source/examples/cli/aa_aa/1L/aa_aa_1L.dot'
  821. 209.85 s > [2026-09-18 22:29:32.381] @gammaloop_api::se... INFO : Running command generate existing -p aa_aa_all_helicities
  822. 209.85 s > The application panicked (crashed).
  823. 209.85 s > Message: label _func_power_ not found
  824. 209.85 s > Location: /nix/store/n9w914kh1cm59xx3spcs831cdyb56m32-vendor-cargo-deps/c19b7c6f923b580ac259164a89f2577984ad5ab09ee9d583b888f934adbbe8d0/symjit-2.25.6/src/symjit/assembler.rs:77
  825. 209.85 s >
  826. 209.85 s > ━━━━━━━━━━━━━━━━━━━━━━━━━━━━━━━━━━ BACKTRACE ━━━━━━━━━━━━━━━━━━━━━━━━━━━━━━━━━━━
  827. 209.85 s > 1: <color_eyre[51793ea62743adbd]::config::PanicHook>::panic_report<unknown>
  828. 209.85 s > at <unknown source file>:<unknown line>
  829. 209.85 s > 2: <color_eyre[51793ea62743adbd]::config::PanicHook>::into_panic_hook::{closure#0}<unknown>
  830. 209.85 s > at <unknown source file>:<unknown line>
  831. 209.85 s > 3: std[bcb96dfbba0ab899]::panicking::panic_with_hook<unknown>
  832. 209.85 s > at <unknown source file>:<unknown line>
  833. 209.85 s > 4: std[bcb96dfbba0ab899]::panicking::panic_handler::{closure#0}<unknown>
  834. 209.85 s > at <unknown source file>:<unknown line>
  835. 209.85 s > 5: std[bcb96dfbba0ab899]::sys::backtrace::__rust_end_short_backtrace::<std[bcb96dfbba0ab899]::panicking::panic_handler::{closure#0}, !><unknown>
  836. 209.85 s > at <unknown source file>:<unknown line>
  837. 209.85 s > 6: __rustc[6c289b9f9c454d21]::rust_begin_unwind<unknown>
  838. 209.85 s > at <unknown source file>:<unknown line>
  839. 209.85 s > 7: core[940e698046960fd5]::panicking::panic_fmt<unknown>
  840. 209.85 s > at <unknown source file>:<unknown line>
  841. 209.85 s > 8: <symjit[e408de789c333cd]::symjit::assembler::Assembler>::apply_jumps<unknown>
  842. 209.85 s > at <unknown source file>:<unknown line>
  843. 209.85 s > 9: <symjit[e408de789c333cd]::symjit::builder::Builder>::compile_from_mir::<symjit[e408de789c333cd]::symjit::amd::complex::AmdComplexGenerator><unknown>
  844. 209.85 s > at <unknown source file>:<unknown line>
  845. 209.85 s > 10: <symjit[e408de789c333cd]::symjit::runnable::Application>::compile_ty<unknown>
  846. 209.85 s > at <unknown source file>:<unknown line>
  847. 209.85 s > 11: <symjit[e408de789c333cd]::symjit::runnable::Application>::with_mir<unknown>
  848. 209.85 s > at <unknown source file>:<unknown line>
  849. 209.85 s > 12: <symjit[e408de789c333cd]::symjit::composer::DirectTranslator as symjit[e408de789c333cd]::symjit::composer::Composer>::compile<unknown>
  850. 209.85 s > at <unknown source file>:<unknown line>
  851. 209.85 s > 13: <symjit[e408de789c333cd]::symjit::compiler::Translator as symjit[e408de789c333cd]::symjit::composer::Composer>::compile<unknown>
  852. 209.85 s > at <unknown source file>:<unknown line>
  853. 209.85 s > 14: <numerica[124dab8567f4861e]::domains::float::complex::Complex<f64> as symbolica[10e259bab675d243]::evaluate::backend::JITCompiledNumber>::jit_compile<unknown>
  854. 209.85 s > at <unknown source file>:<unknown line>
  855. 209.85 s > 15: <gammalooprs[917cbd3df9e68f8f]::integrands::process::evaluators::GenericEvaluator>::activate_symjit<unknown>
  856. 209.85 s > at <unknown source file>:<unknown line>
  857. 209.85 s > 16: <gammalooprs[917cbd3df9e68f8f]::integrands::process::amplitude::AmplitudeIntegrand>::prepare_runtime_backends_after_generation_with_compile_times<unknown>
  858. 209.85 s > at <unknown source file>:<unknown line>
  859. 209.85 s > 17: <gammalooprs[917cbd3df9e68f8f]::processes::amplitude::Amplitude>::build_integrand<unknown>
  860. 209.85 s > at <unknown source file>:<unknown line>
  861. 209.85 s > 18: <gammalooprs[917cbd3df9e68f8f]::processes::process::Process>::generate_integrands<unknown>
  862. 209.85 s > at <unknown source file>:<unknown line>
  863. 209.85 s > 19: <gammaloop_api[9ebf6628f97aeb57]::state::State>::generate_integrand<unknown>
  864. 209.85 s > at <unknown source file>:<unknown line>
  865. 209.85 s > 20: <gammaloop_api[9ebf6628f97aeb57]::commands::generate::Generate>::run::<&std[bcb96dfbba0ab899]::path::PathBuf><unknown>
  866. 209.85 s > at <unknown source file>:<unknown line>
  867. 209.85 s > 21: <gammaloop_api[9ebf6628f97aeb57]::commands::Commands>::run<unknown>
  868. 209.85 s > at <unknown source file>:<unknown line>
  869. 209.85 s > 22: <gammaloop_api[9ebf6628f97aeb57]::session::CliSession>::execute_prepared<unknown>
  870. 209.85 s > at <unknown source file>:<unknown line>
  871. 209.85 s > 23: <gammaloop_api[9ebf6628f97aeb57]::session::CliSession>::execute_command<unknown>
  872. 209.85 s > at <unknown source file>:<unknown line>
  873. 209.85 s > 24: <gammaloop_integration_tests[191607b70c61cd5a]::CLIState>::run_command<unknown>
  874. 209.85 s > at <unknown source file>:<unknown line>
  875. 209.85 s > 25: test_runs[9b7e2dc2dc4f29b0]::aa_aa::generate_aa_aa_helicity_family<unknown>
  876. 209.85 s > at <unknown source file>:<unknown line>
  877. 209.85 s > 26: <test_runs[9b7e2dc2dc4f29b0]::aa_aa::important::aa_aa_local_inspect_backend_consistency::{closure#0} as core[940e698046960fd5]::ops::function::FnOnce<()>>::call_once<unknown>
  878. 209.85 s > at <unknown source file>:<unknown line>
  879. 209.85 s > 27: serial_test[cd99724524a2f1c0]::serial_code_lock::local_serial_core_with_return::<(), eyre[cb2fd339c0c40fca]::Report><unknown>
  880. 209.85 s > at <unknown source file>:<unknown line>
  881. 209.85 s > 28: <test_runs[9b7e2dc2dc4f29b0]::aa_aa::important::aa_aa_local_inspect_backend_consistency::{closure#0} as core[940e698046960fd5]::ops::function::FnOnce<()>>::call_once<unknown>
  882. 209.85 s > at <unknown source file>:<unknown line>
  883. 209.85 s > 29: test[75d6903177b1d7e9]::__rust_begin_short_backtrace::<core[940e698046960fd5]::result::Result<(), alloc[2ea6bcb46fca0c42]::string::String>, fn() -> core[940e698046960fd5]::result::Result<(), alloc[2ea6bcb46fca0c42]::string::String>><unknown>
  884. 209.85 s > at <unknown source file>:<unknown line>
  885. 209.85 s > 30: test[75d6903177b1d7e9]::run_test::{closure#0}<unknown>
  886. 209.85 s > at <unknown source file>:<unknown line>
  887. 209.85 s > 31: std[bcb96dfbba0ab899]::sys::backtrace::__rust_begin_short_backtrace::<test[75d6903177b1d7e9]::run_test::{closure#1}, ()><unknown>
  888. 209.85 s > at <unknown source file>:<unknown line>
  889. 209.85 s > 32: <std[bcb96dfbba0ab899]::thread::lifecycle::spawn_unchecked<test[75d6903177b1d7e9]::run_test::{closure#1}, ()>::{closure#1} as core[940e698046960fd5]::ops::function::FnOnce<()>>::call_once::{shim:vtable#0}<unknown>
  890. 209.85 s > at <unknown source file>:<unknown line>
  891. 209.85 s > 33: <std[bcb96dfbba0ab899]::sys::thread::unix::Thread>::new::thread_start<unknown>
  892. 209.85 s > at <unknown source file>:<unknown line>
  893. 209.85 s > 34: start_thread<unknown>
  894. 209.85 s > at <unknown source file>:<unknown line>
  895. 209.85 s > 35: __clone3<unknown>
  896. 209.85 s > at <unknown source file>:<unknown line>
  897. 209.85 s >
  898. 209.85 s > Run with COLORBT_SHOW_HIDDEN=1 environment variable to disable frame filtering.
  899. 209.85 s > Run with RUST_BACKTRACE=full to include source snippets.
  900. 209.85 s > Warning: SpanTrace capture is Unsupported.
  901. 209.85 s > Ensure that you've setup a tracing-error ErrorLayer and the semver versions are compatible
  902. 209.85 s >
  903. 209.85 s > FAIL [ 2.764s] (158/170) gammaloop-integration-tests::uv thermal_sunrise_uv
  904. 209.85 s > stdout ---
  905. 209.85 s >
  906. 209.85 s > running 1 test
  907. 209.85 s > test thermal_sunrise_uv ... FAILED
  908. 209.85 s >
  909. 209.85 s > failures:
  910. 209.85 s >
  911. 209.85 s > failures:
  912. 209.85 s > thermal_sunrise_uv
  913. 209.85 s >
  914. 209.85 s > test result: FAILED. 0 passed; 1 failed; 0 ignored; 0 measured; 31 filtered out; finished in 2.75s
  915. 209.85 s >
  916. 209.85 s > stderr ---
  917. 209.85 s > [2026-09-18 22:30:14.541] @gammaloop_api::se... INFO : Running command run generate
  918. 209.85 s > [2026-09-18 22:30:14.541] @gammaloop_api::se... INFO : Starting command block generate
  919. 209.85 s > [2026-09-18 22:30:14.541] @gammaloop_api::se... INFO : Running command import model sm-default.json
  920. 209.85 s > [2026-09-18 22:30:14.541] @import::model INFO : Loading built-in JSON model sm-default
  921. 209.85 s > [2026-09-18 22:30:14.572] @gammalooprs::model INFO : The following 15 external parameters were forced to zero by the restriction card:
  922. 209.85 s > lamWS, AWS, rhoWS, etaWS, ymc, yme, ymm, MC, Me, MM, WTau, muQ, muLe, muLmu, muLtau
  923. 209.85 s > [2026-09-18 22:30:14.572] @gammalooprs::model INFO : The following 34 vertex rules were removed by the restriction card:
  924. 209.85 s > V_82 -> (c~, d, G+) | V_83 -> (t~, d, G+) | V_84 -> (c~, s, G+) | V_85 -> (t~, s, G+) | V_86 -> (u~, b, G+) | V_87 -> (c~, b, G+) | V_90 -> (c~, d, W+) | V_91 -> (t~, d, W+) | V_92 -> (u~, s, W+) | V_94 -> (t~, s, W+) | V_95 -> (u~, b, W+) | V_96 -> (c~, b, W+) | V_101 -> (e+, e-, G0) | V_102 -> (mu+, mu-, G0) | V_104 -> (e+, e-, H) | V_105 -> (mu+, mu-, H) | V_110 -> (ve~, e-, G+) | V_111 -> (vm~, mu-, G+) | V_116 -> (b~, u, G-) | V_117 -> (d~, c, G-) | V_118 -> (s~, c, G-) | V_119 -> (b~, c, G-) | V_120 -> (d~, t, G-) | V_121 -> (s~, t, G-) | V_124 -> (s~, u, W-) | V_125 -> (b~, u, W-) | V_126 -> (d~, c, W-) | V_128 -> (b~, c, W-) | V_129 -> (d~, t, W-) | V_130 -> (s~, t, W-) | V_138 -> (c~, c, G0) | V_140 -> (c~, c, H) | V_145 -> (e+, ve, G-) | V_146 -> (mu+, vm, G-)
  925. 209.85 s > [2026-09-18 22:30:14.572] @gammalooprs::model INFO : The following 36 couplings were removed by the restriction card:
  926. 209.85 s > GC_13, GC_14, GC_16, GC_17, GC_18, GC_19, GC_20, GC_22, GC_23, GC_24, GC_25, GC_26, GC_28, GC_29, GC_42, GC_43, GC_44, GC_46, GC_47, GC_48, GC_84, GC_85, GC_86, GC_87, GC_88, GC_89, GC_90, GC_91, GC_92, GC_93, GC_101, GC_102, GC_103, GC_105, GC_106, GC_107
  927. 209.85 s > [2026-09-18 22:30:14.572] @gammaloop_api::se... INFO : Running command remove processes
  928. 209.85 s > [2026-09-18 22:30:14.573] @gammaloop_api::se... INFO : Running command generate amp {} > {} [{2}] | g u
  929. 209.85 s > --numerator-grouping group_identical_graphs_up_to_scalar_rescaling
  930. 209.85 s > --max-n-bridges 0
  931. 209.85 s > --number-of-factorized-loop-subtopologies 1 1
  932. 209.85 s > --number-of-anticommutating-loops 1 1
  933. 209.85 s > [...]
  934. 209.85 s > [2026-09-18 22:30:14.574] @feyngen::diagram_... INFO : 0s | Δ=0s | Starting Feynman graph generation with Symbolica...
  935. 209.85 s > [2026-09-18 22:30:14.574] @feyngen::diagram_... INFO : 0s | Δ=0s | Number of graphs resulting from Symbolica generation: 3
  936. 209.85 s > [2026-09-18 22:30:14.574] @feyngen::diagram_... INFO : 0s | Δ=0s | Number of graphs retained after removal of vetoed topologies: 2
  937. 209.85 s > [2026-09-18 22:30:14.577] @feyngen::diagram_... INFO : 0s | Δ=0s | Number of graphs after vertex info assignment: 2
  938. 209.85 s > [2026-09-18 22:30:14.577] @feyngen::diagram_... INFO : 0s | Δ=0s | Number of graphs after all complete graphs filters are applied: 2
  939. 209.85 s > [2026-09-18 22:30:14.580] @feyngen::diagram_... INFO : 0s | Δ=0s | Number of graphs after closed anticommutating chains analysis: 1
  940. 209.85 s > [2026-09-18 22:30:14.580] @feyngen::diagram_... INFO : 0s | Δ=0s | Number of graphs after symmetrization of external states: 1
  941. 209.85 s > [2026-09-18 22:30:14.583] @feyngen::diagram_... INFO : 0s | Δ=0s | Number of graphs after canonization of vertices, edges and flows (graph labels assigned here): 1
  942. 209.85 s > [2026-09-18 22:30:14.598] @feyngen::diagram_... INFO : 0s | Δ=0s | Number of graphs after numerator-aware grouping with strategy 'up to a scalar rescaling': 1 (1 isomorphically unique graph, 0 color zero, 0 lorentz zero, 0 grouped and 0 cancellation)
  943. 209.85 s > [2026-09-18 22:30:14.598] @feyngen::diagram_... INFO : ( Sum of the symmetry factors from each graph generated = -1/2 )
  944. 209.85 s > [2026-09-18 22:30:14.598] @commands::generate INFO : Generated amplitude 1 graphs.
  945. 209.85 s > [2026-09-18 22:30:14.599] @commands::generate INFO : Only diagram generation was requested, skipping integrand generation. You can generate integrands later using the 'generate existing <options>' command.
  946. 209.85 s > [2026-09-18 22:30:14.599] @gammaloop_api::se... INFO : Running command generate
  947. 209.85 s > The application panicked (crashed).
  948. 209.85 s > Message: label _func_power_ not found
  949. 209.85 s > Location: /nix/store/n9w914kh1cm59xx3spcs831cdyb56m32-vendor-cargo-deps/c19b7c6f923b580ac259164a89f2577984ad5ab09ee9d583b888f934adbbe8d0/symjit-2.25.6/src/symjit/assembler.rs:77
  950. 209.85 s >
  951. 209.85 s > ━━━━━━━━━━━━━━━━━━━━━━━━━━━━━━━━━━ BACKTRACE ━━━━━━━━━━━━━━━━━━━━━━━━━━━━━━━━━━━
  952. 209.85 s > 1: <color_eyre[51793ea62743adbd]::config::PanicHook>::panic_report<unknown>
  953. 209.85 s > at <unknown source file>:<unknown line>
  954. 209.85 s > 2: <color_eyre[51793ea62743adbd]::config::PanicHook>::into_panic_hook::{closure#0}<unknown>
  955. 209.85 s > at <unknown source file>:<unknown line>
  956. 209.85 s > 3: std[bcb96dfbba0ab899]::panicking::panic_with_hook<unknown>
  957. 209.85 s > at <unknown source file>:<unknown line>
  958. 209.85 s > 4: std[bcb96dfbba0ab899]::panicking::panic_handler::{closure#0}<unknown>
  959. 209.85 s > at <unknown source file>:<unknown line>
  960. 209.85 s > 5: std[bcb96dfbba0ab899]::sys::backtrace::__rust_end_short_backtrace::<std[bcb96dfbba0ab899]::panicking::panic_handler::{closure#0}, !><unknown>
  961. 209.85 s > at <unknown source file>:<unknown line>
  962. 209.85 s > 6: __rustc[6c289b9f9c454d21]::rust_begin_unwind<unknown>
  963. 209.85 s > at <unknown source file>:<unknown line>
  964. 209.85 s > 7: core[940e698046960fd5]::panicking::panic_fmt<unknown>
  965. 209.85 s > at <unknown source file>:<unknown line>
  966. 209.85 s > 8: <symjit[e408de789c333cd]::symjit::assembler::Assembler>::apply_jumps<unknown>
  967. 209.85 s > at <unknown source file>:<unknown line>
  968. 209.85 s > 9: <symjit[e408de789c333cd]::symjit::builder::Builder>::compile_from_mir::<symjit[e408de789c333cd]::symjit::amd::complex::AmdComplexGenerator><unknown>
  969. 209.85 s > at <unknown source file>:<unknown line>
  970. 209.85 s > 10: <symjit[e408de789c333cd]::symjit::runnable::Application>::compile_ty<unknown>
  971. 209.85 s > at <unknown source file>:<unknown line>
  972. 209.85 s > 11: <symjit[e408de789c333cd]::symjit::runnable::Application>::with_mir<unknown>
  973. 209.85 s > at <unknown source file>:<unknown line>
  974. 209.85 s > 12: <symjit[e408de789c333cd]::symjit::composer::DirectTranslator as symjit[e408de789c333cd]::symjit::composer::Composer>::compile<unknown>
  975. 209.85 s > at <unknown source file>:<unknown line>
  976. 209.85 s > 13: <symjit[e408de789c333cd]::symjit::compiler::Translator as symjit[e408de789c333cd]::symjit::composer::Composer>::compile<unknown>
  977. 209.85 s > at <unknown source file>:<unknown line>
  978. 209.85 s > 14: <numerica[124dab8567f4861e]::domains::float::complex::Complex<f64> as symbolica[10e259bab675d243]::evaluate::backend::JITCompiledNumber>::jit_compile<unknown>
  979. 209.85 s > at <unknown source file>:<unknown line>
  980. 209.85 s > 15: <gammalooprs[917cbd3df9e68f8f]::integrands::process::evaluators::GenericEvaluator>::activate_symjit<unknown>
  981. 209.85 s > at <unknown source file>:<unknown line>
  982. 209.85 s > 16: <gammalooprs[917cbd3df9e68f8f]::integrands::process::amplitude::AmplitudeIntegrand>::prepare_runtime_backends_after_generation_with_compile_times<unknown>
  983. 209.85 s > at <unknown source file>:<unknown line>
  984. 209.85 s > 17: <gammalooprs[917cbd3df9e68f8f]::processes::amplitude::Amplitude>::build_integrand<unknown>
  985. 209.85 s > at <unknown source file>:<unknown line>
  986. 209.85 s > 18: <gammalooprs[917cbd3df9e68f8f]::processes::process::Process>::generate_integrands<unknown>
  987. 209.85 s > at <unknown source file>:<unknown line>
  988. 209.85 s > 19: <gammalooprs[917cbd3df9e68f8f]::processes::ProcessList>::generate_integrands<unknown>
  989. 209.85 s > at <unknown source file>:<unknown line>
  990. 209.85 s > 20: <gammaloop_api[9ebf6628f97aeb57]::state::State>::generate_integrands<unknown>
  991. 209.85 s > at <unknown source file>:<unknown line>
  992. 209.85 s > 21: <gammaloop_api[9ebf6628f97aeb57]::commands::generate::Generate>::run::<&std[bcb96dfbba0ab899]::path::PathBuf><unknown>
  993. 209.85 s > at <unknown source file>:<unknown line>
  994. 209.85 s > 22: <gammaloop_api[9ebf6628f97aeb57]::commands::Commands>::run<unknown>
  995. 209.85 s > at <unknown source file>:<unknown line>
  996. 209.85 s > 23: <gammaloop_api[9ebf6628f97aeb57]::session::CliSession>::execute_prepared<unknown>
  997. 209.85 s > at <unknown source file>:<unknown line>
  998. 209.85 s > 24: <gammaloop_api[9ebf6628f97aeb57]::session::CliSession>::execute_prepared_commands<unknown>
  999. 209.85 s > at <unknown source file>:<unknown line>
  1000. 209.85 s > 25: <gammaloop_api[9ebf6628f97aeb57]::session::CliSession>::execute_prepared<unknown>
  1001. 209.85 s > at <unknown source file>:<unknown line>
  1002. 209.85 s > 26: <gammaloop_api[9ebf6628f97aeb57]::session::CliSession>::execute_command<unknown>
  1003. 209.85 s > at <unknown source file>:<unknown line>
  1004. 209.85 s > 27: <gammaloop_integration_tests[191607b70c61cd5a]::CLIState>::run_command<unknown>
  1005. 209.85 s > at <unknown source file>:<unknown line>
  1006. 209.85 s > 28: uv[3c7454ef256d6487]::run_single_integrated_uv_case<unknown>
  1007. 209.85 s > at <unknown source file>:<unknown line>
  1008. 209.85 s > 29: <uv[3c7454ef256d6487]::thermal_sunrise_uv::{closure#0} as core[940e698046960fd5]::ops::function::FnOnce<()>>::call_once<unknown>
  1009. 209.85 s > at <unknown source file>:<unknown line>
  1010. 209.85 s > 30: test[75d6903177b1d7e9]::__rust_begin_short_backtrace::<core[940e698046960fd5]::result::Result<(), alloc[2ea6bcb46fca0c42]::string::String>, fn() -> core[940e698046960fd5]::result::Result<(), alloc[2ea6bcb46fca0c42]::string::String>><unknown>
  1011. 209.85 s > at <unknown source file>:<unknown line>
  1012. 209.85 s > 31: test[75d6903177b1d7e9]::run_test::{closure#0}<unknown>
  1013. 209.85 s > at <unknown source file>:<unknown line>
  1014. 209.85 s > 32: std[bcb96dfbba0ab899]::sys::backtrace::__rust_begin_short_backtrace::<test[75d6903177b1d7e9]::run_test::{closure#1}, ()><unknown>
  1015. 209.85 s > at <unknown source file>:<unknown line>
  1016. 209.85 s > 33: <std[bcb96dfbba0ab899]::thread::lifecycle::spawn_unchecked<test[75d6903177b1d7e9]::run_test::{closure#1}, ()>::{closure#1} as core[940e698046960fd5]::ops::function::FnOnce<()>>::call_once::{shim:vtable#0}<unknown>
  1017. 209.85 s > at <unknown source file>:<unknown line>
  1018. 209.85 s > 34: <std[bcb96dfbba0ab899]::sys::thread::unix::Thread>::new::thread_start<unknown>
  1019. 209.85 s > at <unknown source file>:<unknown line>
  1020. 209.85 s > 35: start_thread<unknown>
  1021. 209.85 s > at <unknown source file>:<unknown line>
  1022. 209.85 s > 36: __clone3<unknown>
  1023. 209.85 s > at <unknown source file>:<unknown line>
  1024. 209.85 s >
  1025. 209.85 s > Run with COLORBT_SHOW_HIDDEN=1 environment variable to disable frame filtering.
  1026. 209.85 s > Run with RUST_BACKTRACE=full to include source snippets.
  1027. 209.85 s > Warning: SpanTrace capture is Unsupported.
  1028. 209.85 s > Ensure that you've setup a tracing-error ErrorLayer and the semver versions are compatible
  1029. 209.85 s >
  1030. 209.85 s > ------------
  1031. 209.85 s > Summary [ 186.204s] 170 tests run: 168 passed, 2 failed, 209 skipped
  1032. 209.85 s > FAIL [ 2.786s] ( 55/170) gammaloop-integration-tests::test_runs aa_aa::important::aa_aa_local_inspect_backend_consistency
  1033. 209.85 s > stdout ---
  1034. 209.85 s >
  1035. 209.85 s > running 1 test
  1036. 209.85 s > test aa_aa::important::aa_aa_local_inspect_backend_consistency ... FAILED
  1037. 209.85 s >
  1038. 209.85 s > failures:
  1039. 209.85 s >
  1040. 209.85 s > failures:
  1041. 209.85 s > aa_aa::important::aa_aa_local_inspect_backend_consistency
  1042. 209.85 s >
  1043. 209.85 s > test result: FAILED. 0 passed; 1 failed; 0 ignored; 0 measured; 274 filtered out; finished in 2.77s
  1044. 209.85 s >
  1045. 209.85 s > stderr ---
  1046. 209.85 s > [2026-09-18 22:29:32.324] @gammaloop_api::se... INFO : Running command import model sm-default.json
  1047. 209.85 s > [2026-09-18 22:29:32.324] @import::model INFO : Loading built-in JSON model sm-default
  1048. 209.85 s > [2026-09-18 22:29:32.345] @gammalooprs::model INFO : The following 15 external parameters were forced to zero by the restriction card:
  1049. 209.85 s > lamWS, AWS, rhoWS, etaWS, ymc, yme, ymm, MC, Me, MM, WTau, muQ, muLe, muLmu, muLtau
  1050. 209.85 s > [2026-09-18 22:29:32.345] @gammalooprs::model INFO : The following 34 vertex rules were removed by the restriction card:
  1051. 209.85 s > V_82 -> (c~, d, G+) | V_83 -> (t~, d, G+) | V_84 -> (c~, s, G+) | V_85 -> (t~, s, G+) | V_86 -> (u~, b, G+) | V_87 -> (c~, b, G+) | V_90 -> (c~, d, W+) | V_91 -> (t~, d, W+) | V_92 -> (u~, s, W+) | V_94 -> (t~, s, W+) | V_95 -> (u~, b, W+) | V_96 -> (c~, b, W+) | V_101 -> (e+, e-, G0) | V_102 -> (mu+, mu-, G0) | V_104 -> (e+, e-, H) | V_105 -> (mu+, mu-, H) | V_110 -> (ve~, e-, G+) | V_111 -> (vm~, mu-, G+) | V_116 -> (b~, u, G-) | V_117 -> (d~, c, G-) | V_118 -> (s~, c, G-) | V_119 -> (b~, c, G-) | V_120 -> (d~, t, G-) | V_121 -> (s~, t, G-) | V_124 -> (s~, u, W-) | V_125 -> (b~, u, W-) | V_126 -> (d~, c, W-) | V_128 -> (b~, c, W-) | V_129 -> (d~, t, W-) | V_130 -> (s~, t, W-) | V_138 -> (c~, c, G0) | V_140 -> (c~, c, H) | V_145 -> (e+, ve, G-) | V_146 -> (mu+, vm, G-)
  1052. 209.85 s > [2026-09-18 22:29:32.345] @gammalooprs::model INFO : The following 36 couplings were removed by the restriction card:
  1053. 209.85 s > GC_13, GC_14, GC_16, GC_17, GC_18, GC_19, GC_20, GC_22, GC_23, GC_24, GC_25, GC_26, GC_28, GC_29, GC_42, GC_43, GC_44, GC_46, GC_47, GC_48, GC_84, GC_85, GC_86, GC_87, GC_88, GC_89, GC_90, GC_91, GC_92, GC_93, GC_101, GC_102, GC_103, GC_105, GC_106, GC_107
  1054. 209.85 s > [2026-09-18 22:29:32.345] @gammaloop_api::se... INFO : Running command run set_model_parameters
  1055. 209.85 s > [2026-09-18 22:29:32.345] @gammaloop_api::se... INFO : Starting command block set_model_parameters
  1056. 209.85 s > [2026-09-18 22:29:32.345] @gammaloop_api::se... INFO : Running command set model MT=173.0
  1057. 209.85 s > [2026-09-18 22:29:32.349] @gammaloop_api::se... INFO : Running command set model WT=0.0
  1058. 209.85 s > [2026-09-18 22:29:32.353] @gammaloop_api::se... INFO : Running command set model ymt=173.0
  1059. 209.85 s > [2026-09-18 22:29:32.357] @gammaloop_api::se... INFO : Running command set model aS=0.118
  1060. 209.85 s > [2026-09-18 22:29:32.361] @gammaloop_api::se... INFO : Running command set model aEWM1=137.036
  1061. 209.85 s > [2026-09-18 22:29:32.364] @gammaloop_api::se... INFO : Running command set model Gf=1.166390e-05
  1062. 209.85 s > [2026-09-18 22:29:32.368] @gammaloop_api::se... INFO : Running command set model MZ=91.188
  1063. 209.85 s > [2026-09-18 22:29:32.372] @gammaloop_api::se... INFO : Running command set global string '
  1064. 209.85 s > [global.generation.compile]
  1065. 209.85 s > compilation_mode = "symjit"
  1066. 209.85 s > optimization_level = "O0"
  1067. 209.85 s > fast_math = false
  1068. 209.85 s > [...]
  1069. 209.85 s > [2026-09-18 22:29:32.372] @gammaloop_api::se... INFO : Running command import graphs ./examples/cli/aa_aa/1L/aa_aa_1L.dot -p aa_aa_all_helicities -i 1L_ppmm -o
  1070. 209.85 s > [2026-09-18 22:29:32.373] @commands::import INFO : Loading graphs from '/build/source/examples/cli/aa_aa/1L/aa_aa_1L.dot'
  1071. 209.85 s > [2026-09-18 22:29:32.381] @gammaloop_api::se... INFO : Running command generate existing -p aa_aa_all_helicities
  1072. 209.85 s > The application panicked (crashed).
  1073. 209.85 s > Message: label _func_power_ not found
  1074. 209.85 s > Location: /nix/store/n9w914kh1cm59xx3spcs831cdyb56m32-vendor-cargo-deps/c19b7c6f923b580ac259164a89f2577984ad5ab09ee9d583b888f934adbbe8d0/symjit-2.25.6/src/symjit/assembler.rs:77
  1075. 209.85 s >
  1076. 209.85 s > ━━━━━━━━━━━━━━━━━━━━━━━━━━━━━━━━━━ BACKTRACE ━━━━━━━━━━━━━━━━━━━━━━━━━━━━━━━━━━━
  1077. 209.85 s > 1: <color_eyre[51793ea62743adbd]::config::PanicHook>::panic_report<unknown>
  1078. 209.85 s > at <unknown source file>:<unknown line>
  1079. 209.85 s > 2: <color_eyre[51793ea62743adbd]::config::PanicHook>::into_panic_hook::{closure#0}<unknown>
  1080. 209.85 s > at <unknown source file>:<unknown line>
  1081. 209.85 s > 3: std[bcb96dfbba0ab899]::panicking::panic_with_hook<unknown>
  1082. 209.85 s > at <unknown source file>:<unknown line>
  1083. 209.85 s > 4: std[bcb96dfbba0ab899]::panicking::panic_handler::{closure#0}<unknown>
  1084. 209.85 s > at <unknown source file>:<unknown line>
  1085. 209.85 s > 5: std[bcb96dfbba0ab899]::sys::backtrace::__rust_end_short_backtrace::<std[bcb96dfbba0ab899]::panicking::panic_handler::{closure#0}, !><unknown>
  1086. 209.85 s > at <unknown source file>:<unknown line>
  1087. 209.85 s > 6: __rustc[6c289b9f9c454d21]::rust_begin_unwind<unknown>
  1088. 209.85 s > at <unknown source file>:<unknown line>
  1089. 209.85 s > 7: core[940e698046960fd5]::panicking::panic_fmt<unknown>
  1090. 209.85 s > at <unknown source file>:<unknown line>
  1091. 209.85 s > 8: <symjit[e408de789c333cd]::symjit::assembler::Assembler>::apply_jumps<unknown>
  1092. 209.85 s > at <unknown source file>:<unknown line>
  1093. 209.85 s > 9: <symjit[e408de789c333cd]::symjit::builder::Builder>::compile_from_mir::<symjit[e408de789c333cd]::symjit::amd::complex::AmdComplexGenerator><unknown>
  1094. 209.85 s > at <unknown source file>:<unknown line>
  1095. 209.85 s > 10: <symjit[e408de789c333cd]::symjit::runnable::Application>::compile_ty<unknown>
  1096. 209.85 s > at <unknown source file>:<unknown line>
  1097. 209.85 s > 11: <symjit[e408de789c333cd]::symjit::runnable::Application>::with_mir<unknown>
  1098. 209.85 s > at <unknown source file>:<unknown line>
  1099. 209.85 s > 12: <symjit[e408de789c333cd]::symjit::composer::DirectTranslator as symjit[e408de789c333cd]::symjit::composer::Composer>::compile<unknown>
  1100. 209.85 s > at <unknown source file>:<unknown line>
  1101. 209.85 s > 13: <symjit[e408de789c333cd]::symjit::compiler::Translator as symjit[e408de789c333cd]::symjit::composer::Composer>::compile<unknown>
  1102. 209.85 s > at <unknown source file>:<unknown line>
  1103. 209.85 s > 14: <numerica[124dab8567f4861e]::domains::float::complex::Complex<f64> as symbolica[10e259bab675d243]::evaluate::backend::JITCompiledNumber>::jit_compile<unknown>
  1104. 209.85 s > at <unknown source file>:<unknown line>
  1105. 209.85 s > 15: <gammalooprs[917cbd3df9e68f8f]::integrands::process::evaluators::GenericEvaluator>::activate_symjit<unknown>
  1106. 209.85 s > at <unknown source file>:<unknown line>
  1107. 209.85 s > 16: <gammalooprs[917cbd3df9e68f8f]::integrands::process::amplitude::AmplitudeIntegrand>::prepare_runtime_backends_after_generation_with_compile_times<unknown>
  1108. 209.85 s > at <unknown source file>:<unknown line>
  1109. 209.85 s > 17: <gammalooprs[917cbd3df9e68f8f]::processes::amplitude::Amplitude>::build_integrand<unknown>
  1110. 209.85 s > at <unknown source file>:<unknown line>
  1111. 209.85 s > 18: <gammalooprs[917cbd3df9e68f8f]::processes::process::Process>::generate_integrands<unknown>
  1112. 209.85 s > at <unknown source file>:<unknown line>
  1113. 209.85 s > 19: <gammaloop_api[9ebf6628f97aeb57]::state::State>::generate_integrand<unknown>
  1114. 209.85 s > at <unknown source file>:<unknown line>
  1115. 209.85 s > 20: <gammaloop_api[9ebf6628f97aeb57]::commands::generate::Generate>::run::<&std[bcb96dfbba0ab899]::path::PathBuf><unknown>
  1116. 209.85 s > at <unknown source file>:<unknown line>
  1117. 209.85 s > 21: <gammaloop_api[9ebf6628f97aeb57]::commands::Commands>::run<unknown>
  1118. 209.85 s > at <unknown source file>:<unknown line>
  1119. 209.85 s > 22: <gammaloop_api[9ebf6628f97aeb57]::session::CliSession>::execute_prepared<unknown>
  1120. 209.85 s > at <unknown source file>:<unknown line>
  1121. 209.85 s > 23: <gammaloop_api[9ebf6628f97aeb57]::session::CliSession>::execute_command<unknown>
  1122. 209.85 s > at <unknown source file>:<unknown line>
  1123. 209.85 s > 24: <gammaloop_integration_tests[191607b70c61cd5a]::CLIState>::run_command<unknown>
  1124. 209.85 s > at <unknown source file>:<unknown line>
  1125. 209.85 s > 25: test_runs[9b7e2dc2dc4f29b0]::aa_aa::generate_aa_aa_helicity_family<unknown>
  1126. 209.85 s > at <unknown source file>:<unknown line>
  1127. 209.85 s > 26: <test_runs[9b7e2dc2dc4f29b0]::aa_aa::important::aa_aa_local_inspect_backend_consistency::{closure#0} as core[940e698046960fd5]::ops::function::FnOnce<()>>::call_once<unknown>
  1128. 209.85 s > at <unknown source file>:<unknown line>
  1129. 209.85 s > 27: serial_test[cd99724524a2f1c0]::serial_code_lock::local_serial_core_with_return::<(), eyre[cb2fd339c0c40fca]::Report><unknown>
  1130. 209.85 s > at <unknown source file>:<unknown line>
  1131. 209.85 s > 28: <test_runs[9b7e2dc2dc4f29b0]::aa_aa::important::aa_aa_local_inspect_backend_consistency::{closure#0} as core[940e698046960fd5]::ops::function::FnOnce<()>>::call_once<unknown>
  1132. 209.85 s > at <unknown source file>:<unknown line>
  1133. 209.85 s > 29: test[75d6903177b1d7e9]::__rust_begin_short_backtrace::<core[940e698046960fd5]::result::Result<(), alloc[2ea6bcb46fca0c42]::string::String>, fn() -> core[940e698046960fd5]::result::Result<(), alloc[2ea6bcb46fca0c42]::string::String>><unknown>
  1134. 209.85 s > at <unknown source file>:<unknown line>
  1135. 209.85 s > 30: test[75d6903177b1d7e9]::run_test::{closure#0}<unknown>
  1136. 209.85 s > at <unknown source file>:<unknown line>
  1137. 209.85 s > 31: std[bcb96dfbba0ab899]::sys::backtrace::__rust_begin_short_backtrace::<test[75d6903177b1d7e9]::run_test::{closure#1}, ()><unknown>
  1138. 209.85 s > at <unknown source file>:<unknown line>
  1139. 209.85 s > 32: <std[bcb96dfbba0ab899]::thread::lifecycle::spawn_unchecked<test[75d6903177b1d7e9]::run_test::{closure#1}, ()>::{closure#1} as core[940e698046960fd5]::ops::function::FnOnce<()>>::call_once::{shim:vtable#0}<unknown>
  1140. 209.85 s > at <unknown source file>:<unknown line>
  1141. 209.85 s > 33: <std[bcb96dfbba0ab899]::sys::thread::unix::Thread>::new::thread_start<unknown>
  1142. 209.85 s > at <unknown source file>:<unknown line>
  1143. 209.85 s > 34: start_thread<unknown>
  1144. 209.85 s > at <unknown source file>:<unknown line>
  1145. 209.85 s > 35: __clone3<unknown>
  1146. 209.85 s > at <unknown source file>:<unknown line>
  1147. 209.85 s >
  1148. 209.85 s > Run with COLORBT_SHOW_HIDDEN=1 environment variable to disable frame filtering.
  1149. 209.85 s > Run with RUST_BACKTRACE=full to include source snippets.
  1150. 209.85 s > Warning: SpanTrace capture is Unsupported.
  1151. 209.85 s > Ensure that you've setup a tracing-error ErrorLayer and the semver versions are compatible
  1152. 209.85 s >
  1153. 209.85 s > FAIL [ 2.764s] (158/170) gammaloop-integration-tests::uv thermal_sunrise_uv
  1154. 209.85 s > stdout ---
  1155. 209.85 s >
  1156. 209.85 s > running 1 test
  1157. 209.85 s > test thermal_sunrise_uv ... FAILED
  1158. 209.85 s >
  1159. 209.85 s > failures:
  1160. 209.85 s >
  1161. 209.85 s > failures:
  1162. 209.85 s > thermal_sunrise_uv
  1163. 209.85 s >
  1164. 209.85 s > test result: FAILED. 0 passed; 1 failed; 0 ignored; 0 measured; 31 filtered out; finished in 2.75s
  1165. 209.85 s >
  1166. 209.85 s > stderr ---
  1167. 209.85 s > [2026-09-18 22:30:14.541] @gammaloop_api::se... INFO : Running command run generate
  1168. 209.85 s > [2026-09-18 22:30:14.541] @gammaloop_api::se... INFO : Starting command block generate
  1169. 209.85 s > [2026-09-18 22:30:14.541] @gammaloop_api::se... INFO : Running command import model sm-default.json
  1170. 209.85 s > [2026-09-18 22:30:14.541] @import::model INFO : Loading built-in JSON model sm-default
  1171. 209.85 s > [2026-09-18 22:30:14.572] @gammalooprs::model INFO : The following 15 external parameters were forced to zero by the restriction card:
  1172. 209.85 s > lamWS, AWS, rhoWS, etaWS, ymc, yme, ymm, MC, Me, MM, WTau, muQ, muLe, muLmu, muLtau
  1173. 209.85 s > [2026-09-18 22:30:14.572] @gammalooprs::model INFO : The following 34 vertex rules were removed by the restriction card:
  1174. 209.85 s > V_82 -> (c~, d, G+) | V_83 -> (t~, d, G+) | V_84 -> (c~, s, G+) | V_85 -> (t~, s, G+) | V_86 -> (u~, b, G+) | V_87 -> (c~, b, G+) | V_90 -> (c~, d, W+) | V_91 -> (t~, d, W+) | V_92 -> (u~, s, W+) | V_94 -> (t~, s, W+) | V_95 -> (u~, b, W+) | V_96 -> (c~, b, W+) | V_101 -> (e+, e-, G0) | V_102 -> (mu+, mu-, G0) | V_104 -> (e+, e-, H) | V_105 -> (mu+, mu-, H) | V_110 -> (ve~, e-, G+) | V_111 -> (vm~, mu-, G+) | V_116 -> (b~, u, G-) | V_117 -> (d~, c, G-) | V_118 -> (s~, c, G-) | V_119 -> (b~, c, G-) | V_120 -> (d~, t, G-) | V_121 -> (s~, t, G-) | V_124 -> (s~, u, W-) | V_125 -> (b~, u, W-) | V_126 -> (d~, c, W-) | V_128 -> (b~, c, W-) | V_129 -> (d~, t, W-) | V_130 -> (s~, t, W-) | V_138 -> (c~, c, G0) | V_140 -> (c~, c, H) | V_145 -> (e+, ve, G-) | V_146 -> (mu+, vm, G-)
  1175. 209.85 s > [2026-09-18 22:30:14.572] @gammalooprs::model INFO : The following 36 couplings were removed by the restriction card:
  1176. 209.85 s > GC_13, GC_14, GC_16, GC_17, GC_18, GC_19, GC_20, GC_22, GC_23, GC_24, GC_25, GC_26, GC_28, GC_29, GC_42, GC_43, GC_44, GC_46, GC_47, GC_48, GC_84, GC_85, GC_86, GC_87, GC_88, GC_89, GC_90, GC_91, GC_92, GC_93, GC_101, GC_102, GC_103, GC_105, GC_106, GC_107
  1177. 209.85 s > [2026-09-18 22:30:14.572] @gammaloop_api::se... INFO : Running command remove processes
  1178. 209.85 s > [2026-09-18 22:30:14.573] @gammaloop_api::se... INFO : Running command generate amp {} > {} [{2}] | g u
  1179. 209.85 s > --numerator-grouping group_identical_graphs_up_to_scalar_rescaling
  1180. 209.85 s > --max-n-bridges 0
  1181. 209.85 s > --number-of-factorized-loop-subtopologies 1 1
  1182. 209.85 s > --number-of-anticommutating-loops 1 1
  1183. 209.85 s > [...]
  1184. 209.85 s > [2026-09-18 22:30:14.574] @feyngen::diagram_... INFO : 0s | Δ=0s | Starting Feynman graph generation with Symbolica...
  1185. 209.85 s > [2026-09-18 22:30:14.574] @feyngen::diagram_... INFO : 0s | Δ=0s | Number of graphs resulting from Symbolica generation: 3
  1186. 209.85 s > [2026-09-18 22:30:14.574] @feyngen::diagram_... INFO : 0s | Δ=0s | Number of graphs retained after removal of vetoed topologies: 2
  1187. 209.85 s > [2026-09-18 22:30:14.577] @feyngen::diagram_... INFO : 0s | Δ=0s | Number of graphs after vertex info assignment: 2
  1188. 209.85 s > [2026-09-18 22:30:14.577] @feyngen::diagram_... INFO : 0s | Δ=0s | Number of graphs after all complete graphs filters are applied: 2
  1189. 209.85 s > [2026-09-18 22:30:14.580] @feyngen::diagram_... INFO : 0s | Δ=0s | Number of graphs after closed anticommutating chains analysis: 1
  1190. 209.85 s > [2026-09-18 22:30:14.580] @feyngen::diagram_... INFO : 0s | Δ=0s | Number of graphs after symmetrization of external states: 1
  1191. 209.85 s > [2026-09-18 22:30:14.583] @feyngen::diagram_... INFO : 0s | Δ=0s | Number of graphs after canonization of vertices, edges and flows (graph labels assigned here): 1
  1192. 209.85 s > [2026-09-18 22:30:14.598] @feyngen::diagram_... INFO : 0s | Δ=0s | Number of graphs after numerator-aware grouping with strategy 'up to a scalar rescaling': 1 (1 isomorphically unique graph, 0 color zero, 0 lorentz zero, 0 grouped and 0 cancellation)
  1193. 209.85 s > [2026-09-18 22:30:14.598] @feyngen::diagram_... INFO : ( Sum of the symmetry factors from each graph generated = -1/2 )
  1194. 209.85 s > [2026-09-18 22:30:14.598] @commands::generate INFO : Generated amplitude 1 graphs.
  1195. 209.85 s > [2026-09-18 22:30:14.599] @commands::generate INFO : Only diagram generation was requested, skipping integrand generation. You can generate integrands later using the 'generate existing <options>' command.
  1196. 209.85 s > [2026-09-18 22:30:14.599] @gammaloop_api::se... INFO : Running command generate
  1197. 209.85 s > The application panicked (crashed).
  1198. 209.85 s > Message: label _func_power_ not found
  1199. 209.85 s > Location: /nix/store/n9w914kh1cm59xx3spcs831cdyb56m32-vendor-cargo-deps/c19b7c6f923b580ac259164a89f2577984ad5ab09ee9d583b888f934adbbe8d0/symjit-2.25.6/src/symjit/assembler.rs:77
  1200. 209.85 s >
  1201. 209.85 s > ━━━━━━━━━━━━━━━━━━━━━━━━━━━━━━━━━━ BACKTRACE ━━━━━━━━━━━━━━━━━━━━━━━━━━━━━━━━━━━
  1202. 209.85 s > 1: <color_eyre[51793ea62743adbd]::config::PanicHook>::panic_report<unknown>
  1203. 209.85 s > at <unknown source file>:<unknown line>
  1204. 209.85 s > 2: <color_eyre[51793ea62743adbd]::config::PanicHook>::into_panic_hook::{closure#0}<unknown>
  1205. 209.85 s > at <unknown source file>:<unknown line>
  1206. 209.85 s > 3: std[bcb96dfbba0ab899]::panicking::panic_with_hook<unknown>
  1207. 209.85 s > at <unknown source file>:<unknown line>
  1208. 209.85 s > 4: std[bcb96dfbba0ab899]::panicking::panic_handler::{closure#0}<unknown>
  1209. 209.85 s > at <unknown source file>:<unknown line>
  1210. 209.85 s > 5: std[bcb96dfbba0ab899]::sys::backtrace::__rust_end_short_backtrace::<std[bcb96dfbba0ab899]::panicking::panic_handler::{closure#0}, !><unknown>
  1211. 209.85 s > at <unknown source file>:<unknown line>
  1212. 209.85 s > 6: __rustc[6c289b9f9c454d21]::rust_begin_unwind<unknown>
  1213. 209.85 s > at <unknown source file>:<unknown line>
  1214. 209.85 s > 7: core[940e698046960fd5]::panicking::panic_fmt<unknown>
  1215. 209.85 s > at <unknown source file>:<unknown line>
  1216. 209.85 s > 8: <symjit[e408de789c333cd]::symjit::assembler::Assembler>::apply_jumps<unknown>
  1217. 209.85 s > at <unknown source file>:<unknown line>
  1218. 209.85 s > 9: <symjit[e408de789c333cd]::symjit::builder::Builder>::compile_from_mir::<symjit[e408de789c333cd]::symjit::amd::complex::AmdComplexGenerator><unknown>
  1219. 209.85 s > at <unknown source file>:<unknown line>
  1220. 209.85 s > 10: <symjit[e408de789c333cd]::symjit::runnable::Application>::compile_ty<unknown>
  1221. 209.85 s > at <unknown source file>:<unknown line>
  1222. 209.85 s > 11: <symjit[e408de789c333cd]::symjit::runnable::Application>::with_mir<unknown>
  1223. 209.85 s > at <unknown source file>:<unknown line>
  1224. 209.85 s > 12: <symjit[e408de789c333cd]::symjit::composer::DirectTranslator as symjit[e408de789c333cd]::symjit::composer::Composer>::compile<unknown>
  1225. 209.85 s > at <unknown source file>:<unknown line>
  1226. 209.85 s > 13: <symjit[e408de789c333cd]::symjit::compiler::Translator as symjit[e408de789c333cd]::symjit::composer::Composer>::compile<unknown>
  1227. 209.85 s > at <unknown source file>:<unknown line>
  1228. 209.85 s > 14: <numerica[124dab8567f4861e]::domains::float::complex::Complex<f64> as symbolica[10e259bab675d243]::evaluate::backend::JITCompiledNumber>::jit_compile<unknown>
  1229. 209.85 s > at <unknown source file>:<unknown line>
  1230. 209.85 s > 15: <gammalooprs[917cbd3df9e68f8f]::integrands::process::evaluators::GenericEvaluator>::activate_symjit<unknown>
  1231. 209.85 s > at <unknown source file>:<unknown line>
  1232. 209.85 s > 16: <gammalooprs[917cbd3df9e68f8f]::integrands::process::amplitude::AmplitudeIntegrand>::prepare_runtime_backends_after_generation_with_compile_times<unknown>
  1233. 209.85 s > at <unknown source file>:<unknown line>
  1234. 209.85 s > 17: <gammalooprs[917cbd3df9e68f8f]::processes::amplitude::Amplitude>::build_integrand<unknown>
  1235. 209.85 s > at <unknown source file>:<unknown line>
  1236. 209.85 s > 18: <gammalooprs[917cbd3df9e68f8f]::processes::process::Process>::generate_integrands<unknown>
  1237. 209.85 s > at <unknown source file>:<unknown line>
  1238. 209.85 s > 19: <gammalooprs[917cbd3df9e68f8f]::processes::ProcessList>::generate_integrands<unknown>
  1239. 209.85 s > at <unknown source file>:<unknown line>
  1240. 209.85 s > 20: <gammaloop_api[9ebf6628f97aeb57]::state::State>::generate_integrands<unknown>
  1241. 209.85 s > at <unknown source file>:<unknown line>
  1242. 209.85 s > 21: <gammaloop_api[9ebf6628f97aeb57]::commands::generate::Generate>::run::<&std[bcb96dfbba0ab899]::path::PathBuf><unknown>
  1243. 209.85 s > at <unknown source file>:<unknown line>
  1244. 209.85 s > 22: <gammaloop_api[9ebf6628f97aeb57]::commands::Commands>::run<unknown>
  1245. 209.85 s > at <unknown source file>:<unknown line>
  1246. 209.85 s > 23: <gammaloop_api[9ebf6628f97aeb57]::session::CliSession>::execute_prepared<unknown>
  1247. 209.85 s > at <unknown source file>:<unknown line>
  1248. 209.85 s > 24: <gammaloop_api[9ebf6628f97aeb57]::session::CliSession>::execute_prepared_commands<unknown>
  1249. 209.85 s > at <unknown source file>:<unknown line>
  1250. 209.85 s > 25: <gammaloop_api[9ebf6628f97aeb57]::session::CliSession>::execute_prepared<unknown>
  1251. 209.85 s > at <unknown source file>:<unknown line>
  1252. 209.85 s > 26: <gammaloop_api[9ebf6628f97aeb57]::session::CliSession>::execute_command<unknown>
  1253. 209.85 s > at <unknown source file>:<unknown line>
  1254. 209.85 s > 27: <gammaloop_integration_tests[191607b70c61cd5a]::CLIState>::run_command<unknown>
  1255. 209.85 s > at <unknown source file>:<unknown line>
  1256. 209.85 s > 28: uv[3c7454ef256d6487]::run_single_integrated_uv_case<unknown>
  1257. 209.85 s > at <unknown source file>:<unknown line>
  1258. 209.85 s > 29: <uv[3c7454ef256d6487]::thermal_sunrise_uv::{closure#0} as core[940e698046960fd5]::ops::function::FnOnce<()>>::call_once<unknown>
  1259. 209.85 s > at <unknown source file>:<unknown line>
  1260. 209.85 s > 30: test[75d6903177b1d7e9]::__rust_begin_short_backtrace::<core[940e698046960fd5]::result::Result<(), alloc[2ea6bcb46fca0c42]::string::String>, fn() -> core[940e698046960fd5]::result::Result<(), alloc[2ea6bcb46fca0c42]::string::String>><unknown>
  1261. 209.85 s > at <unknown source file>:<unknown line>
  1262. 209.85 s > 31: test[75d6903177b1d7e9]::run_test::{closure#0}<unknown>
  1263. 209.85 s > at <unknown source file>:<unknown line>
  1264. 209.85 s > 32: std[bcb96dfbba0ab899]::sys::backtrace::__rust_begin_short_backtrace::<test[75d6903177b1d7e9]::run_test::{closure#1}, ()><unknown>
  1265. 209.85 s > at <unknown source file>:<unknown line>
  1266. 209.85 s > 33: <std[bcb96dfbba0ab899]::thread::lifecycle::spawn_unchecked<test[75d6903177b1d7e9]::run_test::{closure#1}, ()>::{closure#1} as core[940e698046960fd5]::ops::function::FnOnce<()>>::call_once::{shim:vtable#0}<unknown>
  1267. 209.85 s > at <unknown source file>:<unknown line>
  1268. 209.85 s > 34: <std[bcb96dfbba0ab899]::sys::thread::unix::Thread>::new::thread_start<unknown>
  1269. 209.85 s > at <unknown source file>:<unknown line>
  1270. 209.85 s > 35: start_thread<unknown>
  1271. 209.85 s > at <unknown source file>:<unknown line>
  1272. 209.85 s > 36: __clone3<unknown>
  1273. 209.85 s > at <unknown source file>:<unknown line>
  1274. 209.85 s >
  1275. 209.85 s > Run with COLORBT_SHOW_HIDDEN=1 environment variable to disable frame filtering.
  1276. 209.85 s > Run with RUST_BACKTRACE=full to include source snippets.
  1277. 209.85 s > Warning: SpanTrace capture is Unsupported.
  1278. 209.85 s > Ensure that you've setup a tracing-error ErrorLayer and the semver versions are compatible
  1279. 209.85 s >
  1280. 209.85 s > error: test run failed
  1281. 209.85 s >
  1282. 209.85 s > ========== nextest test summary ==========
  1283. 209.85 s > report: target/nextest/ci_gammaloop/junit.xml
  1284. 209.85 s > tests: 170, failures: 2, errors: 0
  1285. 209.85 s >
  1286. 209.85 s > 1. gammaloop-integration-tests::test_runs::aa_aa::important::aa_aa_local_inspect_backend_consistency
  1287. 209.85 s > failure: test failure with exit code 101
  1288. 209.85 s > system-out
  1289. 209.85 s > running 1 test
  1290. 209.85 s > test aa_aa::important::aa_aa_local_inspect_backend_consistency ... FAILED
  1291. 209.85 s >
  1292. 209.85 s > failures:
  1293. 209.85 s >
  1294. 209.85 s > failures:
  1295. 209.85 s > aa_aa::important::aa_aa_local_inspect_backend_consistency
  1296. 209.85 s >
  1297. 209.85 s > test result: FAILED. 0 passed; 1 failed; 0 ignored; 0 measured; 274 filtered out; finished in 2.77s
  1298. 209.85 s > system-err
  1299. 209.85 s > [2026-09-18 22:29:32.324] @gammaloop_api::se... INFO : Running command import model sm-default.json
  1300. 209.85 s > [2026-09-18 22:29:32.324] @import::model INFO : Loading built-in JSON model sm-default
  1301. 209.85 s > [2026-09-18 22:29:32.345] @gammalooprs::model INFO : The following 15 external parameters were forced to zero by the restriction card:
  1302. 209.85 s > lamWS, AWS, rhoWS, etaWS, ymc, yme, ymm, MC, Me, MM, WTau, muQ, muLe, muLmu, muLtau
  1303. 209.85 s > [2026-09-18 22:29:32.345] @gammalooprs::model INFO : The following 34 vertex rules were removed by the restriction card:
  1304. 209.85 s > V_82 -> (c~, d, G+) | V_83 -> (t~, d, G+) | V_84 -> (c~, s, G+) | V_85 -> (t~, s, G+) | V_86 -> (u~, b, G+) | V_87 -> (c~, b, G+) | V_90 -> (c~, d, W+) | V_91 -> (t~, d, W+) | V_92 -> (u~, s, W+) | V_94 -> (t~, s, W+) | V_95 -> (u~, b, W+) | V_96 -> (c~, b, W+) | V_101 -> (e+, e-, G0) | V_102 -> (mu+, mu-, G0) | V_104 -> (e+, e-, H) | V_105 -> (mu+, mu-, H) | V_110 -> (ve~, e-, G+) | V_111 -> (vm~, mu-, G+) | V_116 -> (b~, u, G-) | V_117 -> (d~, c, G-) | V_118 -> (s~, c, G-) | V_119 -> (b~, c, G-) | V_120 -> (d~, t, G-) | V_121 -> (s~, t, G-) | V_124 -> (s~, u, W-) | V_125 -> (b~, u, W-) | V_126 -> (d~, c, W-) | V_128 -> (b~, c, W-) | V_129 -> (d~, t, W-) | V_130 -> (s~, t, W-) | V_138 -> (c~, c, G0) | V_140 -> (c~, c, H) | V_145 -> (e+, ve, G-) | V_146 -> (mu+, vm, G-)
  1305. 209.85 s > [2026-09-18 22:29:32.345] @gammalooprs::model INFO : The following 36 couplings were removed by the restriction card:
  1306. 209.85 s > GC_13, GC_14, GC_16, GC_17, GC_18, GC_19, GC_20, GC_22, GC_23, GC_24, GC_25, GC_26, GC_28, GC_29, GC_42, GC_43, GC_44, GC_46, GC_47, GC_48, GC_84, GC_85, GC_86, GC_87, GC_88, GC_89, GC_90, GC_91, GC_92, GC_93, GC_101, GC_102, GC_103, GC_105, GC_106, GC_107
  1307. 209.85 s > [2026-09-18 22:29:32.345] @gammaloop_api::se... INFO : Running command run set_model_parameters
  1308. 209.85 s > [2026-09-18 22:29:32.345] @gammaloop_api::se... INFO : Starting command block set_model_parameters
  1309. 209.85 s > [2026-09-18 22:29:32.345] @gammaloop_api::se... INFO : Running command set model MT=173.0
  1310. 209.85 s > [2026-09-18 22:29:32.349] @gammaloop_api::se... INFO : Running command set model WT=0.0
  1311. 209.85 s > [2026-09-18 22:29:32.353] @gammaloop_api::se... INFO : Running command set model ymt=173.0
  1312. 209.85 s > [2026-09-18 22:29:32.357] @gammaloop_api::se... INFO : Running command set model aS=0.118
  1313. 209.85 s > [2026-09-18 22:29:32.361] @gammaloop_api::se... INFO : Running command set model aEWM1=137.036
  1314. 209.85 s > [2026-09-18 22:29:32.364] @gammaloop_api::se... INFO : Running command set model Gf=1.166390e-05
  1315. 209.85 s > [2026-09-18 22:29:32.368] @gammaloop_api::se... INFO : Running command set model MZ=91.188
  1316. 209.85 s > [2026-09-18 22:29:32.372] @gammaloop_api::se... INFO : Running command set global string '
  1317. 209.85 s > [global.generation.compile]
  1318. 209.85 s > compilation_mode = "symjit"
  1319. 209.85 s > optimization_level = "O0"
  1320. 209.85 s > fast_math = false
  1321. 209.85 s > [...]
  1322. 209.85 s > [2026-09-18 22:29:32.372] @gammaloop_api::se... INFO : Running command import graphs ./examples/cli/aa_aa/1L/aa_aa_1L.dot -p aa_aa_all_helicities -i 1L_ppmm -o
  1323. 209.85 s > [2026-09-18 22:29:32.373] @commands::import INFO : Loading graphs from '/build/source/examples/cli/aa_aa/1L/aa_aa_1L.dot'
  1324. 209.85 s > [2026-09-18 22:29:32.381] @gammaloop_api::se... INFO : Running command generate existing -p aa_aa_all_helicities
  1325. 209.85 s > The application panicked (crashed).
  1326. 209.85 s > Message: label _func_power_ not found
  1327. 209.85 s > Location: /nix/store/n9w914kh1cm59xx3spcs831cdyb56m32-vendor-cargo-deps/c19b7c6f923b580ac259164a89f2577984ad5ab09ee9d583b888f934adbbe8d0/symjit-2.25.6/src/symjit/assembler.rs:77
  1328. 209.85 s >
  1329. 209.85 s > ━━━━━━━━━━━━━━━━━━━━━━━━━━━━━━━━━━ BACKTRACE ━━━━━━━━━━━━━━━━━━━━━━━━━━━━━━━━━━━
  1330. 209.85 s > 1: <color_eyre[51793ea62743adbd]::config::PanicHook>::panic_report<unknown>
  1331. 209.85 s > at <unknown source file>:<unknown line>
  1332. 209.85 s > 2: <color_eyre[51793ea62743adbd]::config::PanicHook>::into_panic_hook::{closure#0}<unknown>
  1333. 209.85 s > at <unknown source file>:<unknown line>
  1334. 209.85 s > 3: std[bcb96dfbba0ab899]::panicking::panic_with_hook<unknown>
  1335. 209.85 s > at <unknown source file>:<unknown line>
  1336. 209.85 s > 4: std[bcb96dfbba0ab899]::panicking::panic_handler::{closure#0}<unknown>
  1337. 209.85 s > at <unknown source file>:<unknown line>
  1338. 209.85 s > 5: std[bcb96dfbba0ab899]::sys::backtrace::__rust_end_short_backtrace::<std[bcb96dfbba0ab899]::panicking::panic_handler::{closure#0}, !><unknown>
  1339. 209.85 s > at <unknown source file>:<unknown line>
  1340. 209.85 s > 6: __rustc[6c289b9f9c454d21]::rust_begin_unwind<unknown>
  1341. 209.85 s > at <unknown source file>:<unknown line>
  1342. 209.85 s > 7: core[940e698046960fd5]::panicking::panic_fmt<unknown>
  1343. 209.85 s > at <unknown source file>:<unknown line>
  1344. 209.85 s > 8: <symjit[e408de789c333cd]::symjit::assembler::Assembler>::apply_jumps<unknown>
  1345. 209.85 s > at <unknown source file>:<unknown line>
  1346. 209.85 s > 9: <symjit[e408de789c333cd]::symjit::builder::Builder>::compile_from_mir::<symjit[e408de789c333cd]::symjit::amd::complex::AmdComplexGenerator><unknown>
  1347. 209.85 s > at <unknown source file>:<unknown line>
  1348. 209.85 s > 10: <symjit[e408de789c333cd]::symjit::runnable::Application>::compile_ty<unknown>
  1349. 209.85 s > at <unknown source file>:<unknown line>
  1350. 209.85 s > 11: <symjit[e408de789c333cd]::symjit::runnable::Application>::with_mir<unknown>
  1351. 209.85 s > at <unknown source file>:<unknown line>
  1352. 209.85 s > 12: <symjit[e408de789c333cd]::symjit::composer::DirectTranslator as symjit[e408de789c333cd]::symjit::composer::Composer>::compile<unknown>
  1353. 209.85 s > at <unknown source file>:<unknown line>
  1354. 209.85 s > 13: <symjit[e408de789c333cd]::symjit::compiler::Translator as symjit[e408de789c333cd]::symjit::composer::Composer>::compile<unknown>
  1355. 209.85 s > at <unknown source file>:<unknown line>
  1356. 209.85 s > 14: <numerica[124dab8567f4861e]::domains::float::complex::Complex<f64> as symbolica[10e259bab675d243]::evaluate::backend::JITCompiledNumber>::jit_compile<unknown>
  1357. 209.85 s > at <unknown source file>:<unknown line>
  1358. 209.85 s > 15: <gammalooprs[917cbd3df9e68f8f]::integrands::process::evaluators::GenericEvaluator>::activate_symjit<unknown>
  1359. 209.85 s > at <unknown source file>:<unknown line>
  1360. 209.85 s > 16: <gammalooprs[917cbd3df9e68f8f]::integrands::process::amplitude::AmplitudeIntegrand>::prepare_runtime_backends_after_generation_with_compile_times<unknown>
  1361. 209.85 s > at <unknown source file>:<unknown line>
  1362. 209.85 s > 17: <gammalooprs[917cbd3df9e68f8f]::processes::amplitude::Amplitude>::build_integrand<unknown>
  1363. 209.85 s > at <unknown source file>:<unknown line>
  1364. 209.85 s > 18: <gammalooprs[917cbd3df9e68f8f]::processes::process::Process>::generate_integrands<unknown>
  1365. 209.85 s > at <unknown source file>:<unknown line>
  1366. 209.85 s > 19: <gammaloop_api[9ebf6628f97aeb57]::state::State>::generate_integrand<unknown>
  1367. 209.85 s > at <unknown source file>:<unknown line>
  1368. 209.85 s > 20: <gammaloop_api[9ebf6628f97aeb57]::commands::generate::Generate>::run::<&std[bcb96dfbba0ab899]::path::PathBuf><unknown>
  1369. 209.85 s > at <unknown source file>:<unknown line>
  1370. 209.85 s > 21: <gammaloop_api[9ebf6628f97aeb57]::commands::Commands>::run<unknown>
  1371. 209.85 s > at <unknown source file>:<unknown line>
  1372. 209.85 s > 22: <gammaloop_api[9ebf6628f97aeb57]::session::CliSession>::execute_prepared<unknown>
  1373. 209.85 s > at <unknown source file>:<unknown line>
  1374. 209.85 s > 23: <gammaloop_api[9ebf6628f97aeb57]::session::CliSession>::execute_command<unknown>
  1375. 209.85 s > at <unknown source file>:<unknown line>
  1376. 209.85 s > 24: <gammaloop_integration_tests[191607b70c61cd5a]::CLIState>::run_command<unknown>
  1377. 209.85 s > at <unknown source file>:<unknown line>
  1378. 209.85 s > 25: test_runs[9b7e2dc2dc4f29b0]::aa_aa::generate_aa_aa_helicity_family<unknown>
  1379. 209.85 s > at <unknown source file>:<unknown line>
  1380. 209.85 s > 26: <test_runs[9b7e2dc2dc4f29b0]::aa_aa::important::aa_aa_local_inspect_backend_consistency::{closure#0} as core[940e698046960fd5]::ops::function::FnOnce<()>>::call_once<unknown>
  1381. 209.85 s > at <unknown source file>:<unknown line>
  1382. 209.85 s > 27: serial_test[cd99724524a2f1c0]::serial_code_lock::local_serial_core_with_return::<(), eyre[cb2fd339c0c40fca]::Report><unknown>
  1383. 209.85 s > at <unknown source file>:<unknown line>
  1384. 209.85 s > 28: <test_runs[9b7e2dc2dc4f29b0]::aa_aa::important::aa_aa_local_inspect_backend_consistency::{closure#0} as core[940e698046960fd5]::ops::function::FnOnce<()>>::call_once<unknown>
  1385. 209.85 s > at <unknown source file>:<unknown line>
  1386. 209.85 s > 29: test[75d6903177b1d7e9]::__rust_begin_short_backtrace::<core[940e698046960fd5]::result::Result<(), alloc[2ea6bcb46fca0c42]::string::String>, fn() -> core[940e698046960fd5]::result::Result<(), alloc[2ea6bcb46fca0c42]::string::String>><unknown>
  1387. 209.85 s > at <unknown source file>:<unknown line>
  1388. 209.85 s > 30: test[75d6903177b1d7e9]::run_test::{closure#0}<unknown>
  1389. 209.85 s > at <unknown source file>:<unknown line>
  1390. 209.85 s > 31: std[bcb96dfbba0ab899]::sys::backtrace::__rust_begin_short_backtrace::<test[75d6903177b1d7e9]::run_test::{closure#1}, ()><unknown>
  1391. 209.85 s > at <unknown source file>:<unknown line>
  1392. 209.85 s > 32: <std[bcb96dfbba0ab899]::thread::lifecycle::spawn_unchecked<test[75d6903177b1d7e9]::run_test::{closure#1}, ()>::{closure#1} as core[940e698046960fd5]::ops::function::FnOnce<()>>::call_once::{shim:vtable#0}<unknown>
  1393. 209.85 s > at <unknown source file>:<unknown line>
  1394. 209.85 s > 33: <std[bcb96dfbba0ab899]::sys::thread::unix::Thread>::new::thread_start<unknown>
  1395. 209.85 s > at <unknown source file>:<unknown line>
  1396. 209.85 s > 34: start_thread<unknown>
  1397. 209.85 s > at <unknown source file>:<unknown line>
  1398. 209.85 s > 35: __clone3<unknown>
  1399. 209.85 s > at <unknown source file>:<unknown line>
  1400. 209.85 s >
  1401. 209.85 s > Run with COLORBT_SHOW_HIDDEN=1 environment variable to disable frame filtering.
  1402. 209.85 s > Run with RUST_BACKTRACE=full to include source snippets.
  1403. 209.85 s > Warning: SpanTrace capture is Unsupported.
  1404. 209.85 s > Ensure that you've setup a tracing-error ErrorLayer and the semver versions are compatible
  1405. 209.85 s >
  1406. 209.85 s > 2. gammaloop-integration-tests::uv::thermal_sunrise_uv
  1407. 209.85 s > failure: test failure with exit code 101
  1408. 209.85 s > system-out
  1409. 209.85 s > running 1 test
  1410. 209.85 s > test thermal_sunrise_uv ... FAILED
  1411. 209.85 s >
  1412. 209.85 s > failures:
  1413. 209.85 s >
  1414. 209.85 s > failures:
  1415. 209.85 s > thermal_sunrise_uv
  1416. 209.85 s >
  1417. 209.85 s > test result: FAILED. 0 passed; 1 failed; 0 ignored; 0 measured; 31 filtered out; finished in 2.75s
  1418. 209.85 s > system-err
  1419. 209.85 s > [2026-09-18 22:30:14.541] @gammaloop_api::se... INFO : Running command run generate
  1420. 209.85 s > [2026-09-18 22:30:14.541] @gammaloop_api::se... INFO : Starting command block generate
  1421. 209.85 s > [2026-09-18 22:30:14.541] @gammaloop_api::se... INFO : Running command import model sm-default.json
  1422. 209.85 s > [2026-09-18 22:30:14.541] @import::model INFO : Loading built-in JSON model sm-default
  1423. 209.85 s > [2026-09-18 22:30:14.572] @gammalooprs::model INFO : The following 15 external parameters were forced to zero by the restriction card:
  1424. 209.85 s > lamWS, AWS, rhoWS, etaWS, ymc, yme, ymm, MC, Me, MM, WTau, muQ, muLe, muLmu, muLtau
  1425. 209.85 s > [2026-09-18 22:30:14.572] @gammalooprs::model INFO : The following 34 vertex rules were removed by the restriction card:
  1426. 209.85 s > V_82 -> (c~, d, G+) | V_83 -> (t~, d, G+) | V_84 -> (c~, s, G+) | V_85 -> (t~, s, G+) | V_86 -> (u~, b, G+) | V_87 -> (c~, b, G+) | V_90 -> (c~, d, W+) | V_91 -> (t~, d, W+) | V_92 -> (u~, s, W+) | V_94 -> (t~, s, W+) | V_95 -> (u~, b, W+) | V_96 -> (c~, b, W+) | V_101 -> (e+, e-, G0) | V_102 -> (mu+, mu-, G0) | V_104 -> (e+, e-, H) | V_105 -> (mu+, mu-, H) | V_110 -> (ve~, e-, G+) | V_111 -> (vm~, mu-, G+) | V_116 -> (b~, u, G-) | V_117 -> (d~, c, G-) | V_118 -> (s~, c, G-) | V_119 -> (b~, c, G-) | V_120 -> (d~, t, G-) | V_121 -> (s~, t, G-) | V_124 -> (s~, u, W-) | V_125 -> (b~, u, W-) | V_126 -> (d~, c, W-) | V_128 -> (b~, c, W-) | V_129 -> (d~, t, W-) | V_130 -> (s~, t, W-) | V_138 -> (c~, c, G0) | V_140 -> (c~, c, H) | V_145 -> (e+, ve, G-) | V_146 -> (mu+, vm, G-)
  1427. 209.85 s > [2026-09-18 22:30:14.572] @gammalooprs::model INFO : The following 36 couplings were removed by the restriction card:
  1428. 209.85 s > GC_13, GC_14, GC_16, GC_17, GC_18, GC_19, GC_20, GC_22, GC_23, GC_24, GC_25, GC_26, GC_28, GC_29, GC_42, GC_43, GC_44, GC_46, GC_47, GC_48, GC_84, GC_85, GC_86, GC_87, GC_88, GC_89, GC_90, GC_91, GC_92, GC_93, GC_101, GC_102, GC_103, GC_105, GC_106, GC_107
  1429. 209.85 s > [2026-09-18 22:30:14.572] @gammaloop_api::se... INFO : Running command remove processes
  1430. 209.85 s > [2026-09-18 22:30:14.573] @gammaloop_api::se... INFO : Running command generate amp {} > {} [{2}] | g u
  1431. 209.85 s > --numerator-grouping group_identical_graphs_up_to_scalar_rescaling
  1432. 209.85 s > --max-n-bridges 0
  1433. 209.85 s > --number-of-factorized-loop-subtopologies 1 1
  1434. 209.85 s > --number-of-anticommutating-loops 1 1
  1435. 209.85 s > [...]
  1436. 209.85 s > [2026-09-18 22:30:14.574] @feyngen::diagram_... INFO : 0s | Δ=0s | Starting Feynman graph generation with Symbolica...
  1437. 209.85 s > [2026-09-18 22:30:14.574] @feyngen::diagram_... INFO : 0s | Δ=0s | Number of graphs resulting from Symbolica generation: 3
  1438. 209.85 s > [2026-09-18 22:30:14.574] @feyngen::diagram_... INFO : 0s | Δ=0s | Number of graphs retained after removal of vetoed topologies: 2
  1439. 209.85 s > [2026-09-18 22:30:14.577] @feyngen::diagram_... INFO : 0s | Δ=0s | Number of graphs after vertex info assignment: 2
  1440. 209.85 s > [2026-09-18 22:30:14.577] @feyngen::diagram_... INFO : 0s | Δ=0s | Number of graphs after all complete graphs filters are applied: 2
  1441. 209.85 s > [2026-09-18 22:30:14.580] @feyngen::diagram_... INFO : 0s | Δ=0s | Number of graphs after closed anticommutating chains analysis: 1
  1442. 209.85 s > [2026-09-18 22:30:14.580] @feyngen::diagram_... INFO : 0s | Δ=0s | Number of graphs after symmetrization of external states: 1
  1443. 209.85 s > [2026-09-18 22:30:14.583] @feyngen::diagram_... INFO : 0s | Δ=0s | Number of graphs after canonization of vertices, edges and flows (graph labels assigned here): 1
  1444. 209.85 s > [2026-09-18 22:30:14.598] @feyngen::diagram_... INFO : 0s | Δ=0s | Number of graphs after numerator-aware grouping with strategy 'up to a scalar rescaling': 1 (1 isomorphically unique graph, 0 color zero, 0 lorentz zero, 0 grouped and 0 cancellation)
  1445. 209.85 s > [2026-09-18 22:30:14.598] @feyngen::diagram_... INFO : ( Sum of the symmetry factors from each graph generated = -1/2 )
  1446. 209.85 s > [2026-09-18 22:30:14.598] @commands::generate INFO : Generated amplitude 1 graphs.
  1447. 209.85 s > [2026-09-18 22:30:14.599] @commands::generate INFO : Only diagram generation was requested, skipping integrand generation. You can generate integrands later using the 'generate existing <options>' command.
  1448. 209.85 s > [2026-09-18 22:30:14.599] @gammaloop_api::se... INFO : Running command generate
  1449. 209.85 s > The application panicked (crashed).
  1450. 209.85 s > Message: label _func_power_ not found
  1451. 209.85 s > Location: /nix/store/n9w914kh1cm59xx3spcs831cdyb56m32-vendor-cargo-deps/c19b7c6f923b580ac259164a89f2577984ad5ab09ee9d583b888f934adbbe8d0/symjit-2.25.6/src/symjit/assembler.rs:77
  1452. 209.85 s >
  1453. 209.85 s > ━━━━━━━━━━━━━━━━━━━━━━━━━━━━━━━━━━ BACKTRACE ━━━━━━━━━━━━━━━━━━━━━━━━━━━━━━━━━━━
  1454. 209.85 s > 1: <color_eyre[51793ea62743adbd]::config::PanicHook>::panic_report<unknown>
  1455. 209.85 s > at <unknown source file>:<unknown line>
  1456. 209.85 s > 2: <color_eyre[51793ea62743adbd]::config::PanicHook>::into_panic_hook::{closure#0}<unknown>
  1457. 209.85 s > at <unknown source file>:<unknown line>
  1458. 209.85 s > 3: std[bcb96dfbba0ab899]::panicking::panic_with_hook<unknown>
  1459. 209.85 s > at <unknown source file>:<unknown line>
  1460. 209.85 s > 4: std[bcb96dfbba0ab899]::panicking::panic_handler::{closure#0}<unknown>
  1461. 209.85 s > at <unknown source file>:<unknown line>
  1462. 209.85 s > 5: std[bcb96dfbba0ab899]::sys::backtrace::__rust_end_short_backtrace::<std[bcb96dfbba0ab899]::panicking::panic_handler::{closure#0}, !><unknown>
  1463. 209.85 s > at <unknown source file>:<unknown line>
  1464. 209.85 s > 6: __rustc[6c289b9f9c454d21]::rust_begin_unwind<unknown>
  1465. 209.85 s > at <unknown source file>:<unknown line>
  1466. 209.85 s > 7: core[940e698046960fd5]::panicking::panic_fmt<unknown>
  1467. 209.85 s > at <unknown source file>:<unknown line>
  1468. 209.85 s > 8: <symjit[e408de789c333cd]::symjit::assembler::Assembler>::apply_jumps<unknown>
  1469. 209.85 s > at <unknown source file>:<unknown line>
  1470. 209.85 s > 9: <symjit[e408de789c333cd]::symjit::builder::Builder>::compile_from_mir::<symjit[e408de789c333cd]::symjit::amd::complex::AmdComplexGenerator><unknown>
  1471. 209.85 s > at <unknown source file>:<unknown line>
  1472. 209.85 s > 10: <symjit[e408de789c333cd]::symjit::runnable::Application>::compile_ty<unknown>
  1473. 209.85 s > at <unknown source file>:<unknown line>
  1474. 209.85 s > 11: <symjit[e408de789c333cd]::symjit::runnable::Application>::with_mir<unknown>
  1475. 209.85 s > at <unknown source file>:<unknown line>
  1476. 209.85 s > 12: <symjit[e408de789c333cd]::symjit::composer::DirectTranslator as symjit[e408de789c333cd]::symjit::composer::Composer>::compile<unknown>
  1477. 209.85 s > at <unknown source file>:<unknown line>
  1478. 209.85 s > 13: <symjit[e408de789c333cd]::symjit::compiler::Translator as symjit[e408de789c333cd]::symjit::composer::Composer>::compile<unknown>
  1479. 209.85 s > at <unknown source file>:<unknown line>
  1480. 209.85 s > 14: <numerica[124dab8567f4861e]::domains::float::complex::Complex<f64> as symbolica[10e259bab675d243]::evaluate::backend::JITCompiledNumber>::jit_compile<unknown>
  1481. 209.85 s > at <unknown source file>:<unknown line>
  1482. 209.85 s > 15: <gammalooprs[917cbd3df9e68f8f]::integrands::process::evaluators::GenericEvaluator>::activate_symjit<unknown>
  1483. 209.85 s > at <unknown source file>:<unknown line>
  1484. 209.85 s > 16: <gammalooprs[917cbd3df9e68f8f]::integrands::process::amplitude::AmplitudeIntegrand>::prepare_runtime_backends_after_generation_with_compile_times<unknown>
  1485. 209.85 s > at <unknown source file>:<unknown line>
  1486. 209.85 s > 17: <gammalooprs[917cbd3df9e68f8f]::processes::amplitude::Amplitude>::build_integrand<unknown>
  1487. 209.85 s > at <unknown source file>:<unknown line>
  1488. 209.85 s > 18: <gammalooprs[917cbd3df9e68f8f]::processes::process::Process>::generate_integrands<unknown>
  1489. 209.85 s > at <unknown source file>:<unknown line>
  1490. 209.85 s > 19: <gammalooprs[917cbd3df9e68f8f]::processes::ProcessList>::generate_integrands<unknown>
  1491. 209.85 s > at <unknown source file>:<unknown line>
  1492. 209.85 s > 20: <gammaloop_api[9ebf6628f97aeb57]::state::State>::generate_integrands<unknown>
  1493. 209.85 s > at <unknown source file>:<unknown line>
  1494. 209.85 s > 21: <gammaloop_api[9ebf6628f97aeb57]::commands::generate::Generate>::run::<&std[bcb96dfbba0ab899]::path::PathBuf><unknown>
  1495. 209.85 s > at <unknown source file>:<unknown line>
  1496. 209.85 s > 22: <gammaloop_api[9ebf6628f97aeb57]::commands::Commands>::run<unknown>
  1497. 209.85 s > at <unknown source file>:<unknown line>
  1498. 209.85 s > 23: <gammaloop_api[9ebf6628f97aeb57]::session::CliSession>::execute_prepared<unknown>
  1499. 209.85 s > at <unknown source file>:<unknown line>
  1500. 209.85 s > 24: <gammaloop_api[9ebf6628f97aeb57]::session::CliSession>::execute_prepared_commands<unknown>
  1501. 209.85 s > at <unknown source file>:<unknown line>
  1502. 209.85 s > 25: <gammaloop_api[9ebf6628f97aeb57]::session::CliSession>::execute_prepared<unknown>
  1503. 209.85 s > at <unknown source file>:<unknown line>
  1504. 209.85 s > 26: <gammaloop_api[9ebf6628f97aeb57]::session::CliSession>::execute_command<unknown>
  1505. 209.85 s > at <unknown source file>:<unknown line>
  1506. 209.85 s > 27: <gammaloop_integration_tests[191607b70c61cd5a]::CLIState>::run_command<unknown>
  1507. 209.85 s > at <unknown source file>:<unknown line>
  1508. 209.85 s > 28: uv[3c7454ef256d6487]::run_single_integrated_uv_case<unknown>
  1509. 209.85 s > at <unknown source file>:<unknown line>
  1510. 209.85 s > 29: <uv[3c7454ef256d6487]::thermal_sunrise_uv::{closure#0} as core[940e698046960fd5]::ops::function::FnOnce<()>>::call_once<unknown>
  1511. 209.85 s > at <unknown source file>:<unknown line>
  1512. 209.85 s > 30: test[75d6903177b1d7e9]::__rust_begin_short_backtrace::<core[940e698046960fd5]::result::Result<(), alloc[2ea6bcb46fca0c42]::string::String>, fn() -> core[940e698046960fd5]::result::Result<(), alloc[2ea6bcb46fca0c42]::string::String>><unknown>
  1513. 209.85 s > at <unknown source file>:<unknown line>
  1514. 209.85 s > 31: test[75d6903177b1d7e9]::run_test::{closure#0}<unknown>
  1515. 209.85 s > at <unknown source file>:<unknown line>
  1516. 209.85 s > 32: std[bcb96dfbba0ab899]::sys::backtrace::__rust_begin_short_backtrace::<test[75d6903177b1d7e9]::run_test::{closure#1}, ()><unknown>
  1517. 209.85 s > at <unknown source file>:<unknown line>
  1518. 209.85 s > 33: <std[bcb96dfbba0ab899]::thread::lifecycle::spawn_unchecked<test[75d6903177b1d7e9]::run_test::{closure#1}, ()>::{closure#1} as core[940e698046960fd5]::ops::function::FnOnce<()>>::call_once::{shim:vtable#0}<unknown>
  1519. 209.85 s > at <unknown source file>:<unknown line>
  1520. 209.85 s > 34: <std[bcb96dfbba0ab899]::sys::thread::unix::Thread>::new::thread_start<unknown>
  1521. 209.85 s > at <unknown source file>:<unknown line>
  1522. 209.85 s > 35: start_thread<unknown>
  1523. 209.85 s > at <unknown source file>:<unknown line>
  1524. 209.85 s > 36: __clone3<unknown>
  1525. 209.85 s > at <unknown source file>:<unknown line>
  1526. 209.85 s >
  1527. 209.85 s > Run with COLORBT_SHOW_HIDDEN=1 environment variable to disable frame filtering.
  1528. 209.85 s > Run with RUST_BACKTRACE=full to include source snippets.
  1529. 209.85 s > Warning: SpanTrace capture is Unsupported.
  1530. 209.85 s > Ensure that you've setup a tracing-error ErrorLayer and the semver versions are compatible
  1531. 209.85 s > =========================================
  1532. 209.85 s For full logs, run:
  1533. 209.85 s nix log /nix/store/kwk339q5xvfx62zai4ay5j3qq0nfsqgw-gammaloop-nextest-integration.drv
  1534. 210.00 s [0 built (1 failed)]Run failed.