test packages.x86_64-linux.nix-ci-check-gammaloop-nextest-integration

Reproduce this run
Retry Run
  1. 0.00 s $ /nix/store/61685rbaxmpigwi3z23i33sv3jyfl70q-coreutils-9.11/bin/timeout --kill-after=15s 7200s /nix/store/wknkybkzrc16r11vk5vrykh4wmw7a353-nix-2.34.8/bin/nix --extra-experimental-features nix-command --extra-experimental-features flakes flake clone git+https://github.com/alphal00p/gammaloop --dest /tmp/nix-ci-worker/stable-pwd/repo/
  2. 0.09 s Cloning into '/tmp/nix-ci-worker/stable-pwd/repo'...
  3. 0.76 s remote: Enumerating objects: 103438, done.
  4. 0.87 s remote: Counting objects: 0% (1/10061) remote: Counting objects: 1% (101/10061) remote: Counting objects: 2% (202/10061) remote: Counting objects: 3% (302/10061) remote: Counting objects: 4% (403/10061) remote: Counting objects: 5% (504/10061) remote: Counting objects: 6% (604/10061) remote: Counting objects: 7% (705/10061) remote: Counting objects: 8% (805/10061) remote: Counting objects: 9% (906/10061) remote: Counting objects: 10% (1007/10061) remote: Counting objects: 11% (1107/10061) remote: Counting objects: 12% (1208/10061) remote: Counting objects: 13% (1308/10061) remote: Counting objects: 14% (1409/10061) remote: Counting objects: 15% (1510/10061) remote: Counting objects: 16% (1610/10061) remote: Counting objects: 17% (1711/10061) remote: Counting objects: 18% (1811/10061) remote: Counting objects: 19% (1912/10061) remote: Counting objects: 20% (2013/10061) remote: Counting objects: 21% (2113/10061) remote: Counting objects: 22% (2214/10061) remote: Counting objects: 23% (2315/10061) remote: Counting objects: 24% (2415/10061) remote: Counting objects: 25% (2516/10061) remote: Counting objects: 26% (2616/10061) remote: Counting objects: 27% (2717/10061) remote: Counting objects: 28% (2818/10061) remote: Counting objects: 29% (2918/10061) remote: Counting objects: 30% (3019/10061) remote: Counting objects: 31% (3119/10061) remote: Counting objects: 32% (3220/10061) remote: Counting objects: 33% (3321/10061) remote: Counting objects: 34% (3421/10061) remote: Counting objects: 35% (3522/10061) remote: Counting objects: 36% (3622/10061) remote: Counting objects: 37% (3723/10061) remote: Counting objects: 38% (3824/10061) remote: Counting objects: 39% (3924/10061) remote: Counting objects: 40% (4025/10061) remote: Counting objects: 41% (4126/10061) remote: Counting objects: 42% (4226/10061) remote: Counting objects: 43% (4327/10061) remote: Counting objects: 44% (4427/10061) remote: Counting objects: 45% (4528/10061) remote: Counting objects: 46% (4629/10061) remote: Counting objects: 47% (4729/10061) remote: Counting objects: 48% (4830/10061) remote: Counting objects: 49% (4930/10061) remote: Counting objects: 50% (5031/10061) remote: Counting objects: 51% (5132/10061) remote: Counting objects: 52% (5232/10061) remote: Counting objects: 53% (5333/10061) remote: Counting objects: 54% (5433/10061) remote: Counting objects: 55% (5534/10061) remote: Counting objects: 56% (5635/10061) remote: Counting objects: 57% (5735/10061) remote: Counting objects: 58% (5836/10061) remote: Counting objects: 59% (5936/10061) remote: Counting objects: 60% (6037/10061) remote: Counting objects: 61% (6138/10061) remote: Counting objects: 62% (6238/10061) remote: Counting objects: 63% (6339/10061) remote: Counting objects: 64% (6440/10061) remote: Counting objects: 65% (6540/10061) remote: Counting objects: 66% (6641/10061) remote: Counting objects: 67% (6741/10061) remote: Counting objects: 68% (6842/10061) remote: Counting objects: 69% (6943/10061) remote: Counting objects: 70% (7043/10061) remote: Counting objects: 71% (7144/10061) remote: Counting objects: 72% (7244/10061) remote: Counting objects: 73% (7345/10061) remote: Counting objects: 74% (7446/10061) remote: Counting objects: 75% (7546/10061) remote: Counting objects: 76% (7647/10061) remote: Counting objects: 77% (7747/10061) remote: Counting objects: 78% (7848/10061) remote: Counting objects: 79% (7949/10061) remote: Counting objects: 80% (8049/10061) remote: Counting objects: 81% (8150/10061) remote: Counting objects: 82% (8251/10061) remote: Counting objects: 83% (8351/10061) remote: Counting objects: 84% (8452/10061) remote: Counting objects: 85% (8552/10061) remote: Counting objects: 86% (8653/10061) remote: Counting objects: 87% (8754/10061) remote: Counting objects: 88% (8854/10061) remote: Counting objects: 89% (8955/10061) remote: Counting objects: 90% (9055/10061) remote: Counting objects: 91% (9156/10061) remote: Counting objects: 92% (9257/10061) remote: Counting objects: 93% (9357/10061) remote: Counting objects: 94% (9458/10061) remote: Counting objects: 95% (9558/10061) remote: Counting objects: 96% (9659/10061) remote: Counting objects: 97% (9760/10061) remote: Counting objects: 98% (9860/10061) remote: Counting objects: 99% (9961/10061) remote: Counting objects: 100% (10061/10061) remote: Counting objects: 100% (10061/10061), done.
  5. 3.32 s remote: Compressing objects: 0% (1/2240) remote: Compressing objects: 1% (23/2240) remote: Compressing objects: 2% (45/2240) remote: Compressing objects: 3% (68/2240) remote: Compressing objects: 4% (90/2240) remote: Compressing objects: 5% (112/2240) remote: Compressing objects: 6% (135/2240) remote: Compressing objects: 7% (157/2240) remote: Compressing objects: 8% (180/2240) remote: Compressing objects: 9% (202/2240) remote: Compressing objects: 9% (203/2240) remote: Compressing objects: 10% (224/2240) remote: Compressing objects: 11% (247/2240) remote: Compressing objects: 12% (269/2240) remote: Compressing objects: 13% (292/2240) remote: Compressing objects: 14% (314/2240) remote: Compressing objects: 15% (336/2240) remote: Compressing objects: 16% (359/2240) remote: Compressing objects: 17% (381/2240) remote: Compressing objects: 18% (404/2240) remote: Compressing objects: 19% (426/2240) remote: Compressing objects: 20% (448/2240) remote: Compressing objects: 21% (471/2240) remote: Compressing objects: 22% (493/2240) remote: Compressing objects: 23% (516/2240) remote: Compressing objects: 24% (538/2240) remote: Compressing objects: 25% (560/2240) remote: Compressing objects: 26% (583/2240) remote: Compressing objects: 27% (605/2240) remote: Compressing objects: 28% (628/2240) remote: Compressing objects: 29% (650/2240) remote: Compressing objects: 30% (672/2240) remote: Compressing objects: 31% (695/2240) remote: Compressing objects: 32% (717/2240) remote: Compressing objects: 33% (740/2240) remote: Compressing objects: 34% (762/2240) remote: Compressing objects: 35% (784/2240) remote: Compressing objects: 36% (807/2240) remote: Compressing objects: 37% (829/2240) remote: Compressing objects: 38% (852/2240) remote: Compressing objects: 39% (874/2240) remote: Compressing objects: 40% (896/2240) remote: Compressing objects: 41% (919/2240) remote: Compressing objects: 42% (941/2240) remote: Compressing objects: 43% (964/2240) remote: Compressing objects: 44% (986/2240) remote: Compressing objects: 45% (1008/2240) remote: Compressing objects: 46% (1031/2240) remote: Compressing objects: 47% (1053/2240) remote: Compressing objects: 48% (1076/2240) remote: Compressing objects: 49% (1098/2240) remote: Compressing objects: 50% (1120/2240) remote: Compressing objects: 51% (1143/2240) remote: Compressing objects: 52% (1165/2240) remote: Compressing objects: 53% (1188/2240) remote: Compressing objects: 54% (1210/2240) remote: Compressing objects: 55% (1232/2240) remote: Compressing objects: 56% (1255/2240) remote: Compressing objects: 57% (1277/2240) remote: Compressing objects: 58% (1300/2240) remote: Compressing objects: 59% (1322/2240) remote: Compressing objects: 60% (1344/2240) remote: Compressing objects: 61% (1367/2240) remote: Compressing objects: 62% (1389/2240) remote: Compressing objects: 63% (1412/2240) remote: Compressing objects: 64% (1434/2240) remote: Compressing objects: 65% (1456/2240) remote: Compressing objects: 66% (1479/2240) remote: Compressing objects: 67% (1501/2240) remote: Compressing objects: 68% (1524/2240) remote: Compressing objects: 69% (1546/2240) remote: Compressing objects: 70% (1568/2240) remote: Compressing objects: 71% (1591/2240) remote: Compressing objects: 72% (1613/2240) remote: Compressing objects: 73% (1636/2240) remote: Compressing objects: 74% (1658/2240) remote: Compressing objects: 75% (1680/2240) remote: Compressing objects: 76% (1703/2240) remote: Compressing objects: 77% (1725/2240) remote: Compressing objects: 78% (1748/2240) remote: Compressing objects: 79% (1770/2240) remote: Compressing objects: 80% (1792/2240) remote: Compressing objects: 81% (1815/2240) remote: Compressing objects: 82% (1837/2240) remote: Compressing objects: 83% (1860/2240) remote: Compressing objects: 84% (1882/2240) remote: Compressing objects: 85% (1904/2240) remote: Compressing objects: 86% (1927/2240) remote: Compressing objects: 87% (1949/2240) remote: Compressing objects: 88% (1972/2240) remote: Compressing objects: 89% (1994/2240) remote: Compressing objects: 90% (2016/2240) remote: Compressing objects: 91% (2039/2240) remote: Compressing objects: 92% (2061/2240) remote: Compressing objects: 93% (2084/2240) remote: Compressing objects: 94% (2106/2240) remote: Compressing objects: 95% (2128/2240) remote: Compressing objects: 96% (2151/2240) remote: Compressing objects: 97% (2173/2240) remote: Compressing objects: 98% (2196/2240) remote: Compressing objects: 99% (2218/2240) remote: Compressing objects: 100% (2240/2240) remote: Compressing objects: 100% (2240/2240), done.
  6. 15.51 s Receiving objects: 0% (1/103438) Receiving objects: 1% (1035/103438) Receiving objects: 2% (2069/103438) Receiving objects: 3% (3104/103438) Receiving objects: 4% (4138/103438) Receiving objects: 5% (5172/103438) Receiving objects: 6% (6207/103438) Receiving objects: 7% (7241/103438), 15.83 MiB | 31.65 MiB/s Receiving objects: 8% (8276/103438), 15.83 MiB | 31.65 MiB/s Receiving objects: 9% (9310/103438), 15.83 MiB | 31.65 MiB/s Receiving objects: 10% (10344/103438), 15.83 MiB | 31.65 MiB/s Receiving objects: 11% (11379/103438), 15.83 MiB | 31.65 MiB/s Receiving objects: 12% (12413/103438), 15.83 MiB | 31.65 MiB/s Receiving objects: 13% (13447/103438), 15.83 MiB | 31.65 MiB/s Receiving objects: 14% (14482/103438), 15.83 MiB | 31.65 MiB/s Receiving objects: 15% (15516/103438), 15.83 MiB | 31.65 MiB/s Receiving objects: 16% (16551/103438), 15.83 MiB | 31.65 MiB/s Receiving objects: 17% (17585/103438), 15.83 MiB | 31.65 MiB/s Receiving objects: 18% (18619/103438), 15.83 MiB | 31.65 MiB/s Receiving objects: 19% (19654/103438), 15.83 MiB | 31.65 MiB/s Receiving objects: 20% (20688/103438), 15.83 MiB | 31.65 MiB/s Receiving objects: 21% (21722/103438), 15.83 MiB | 31.65 MiB/s Receiving objects: 22% (22757/103438), 15.83 MiB | 31.65 MiB/s Receiving objects: 23% (23791/103438), 15.83 MiB | 31.65 MiB/s Receiving objects: 24% (24826/103438), 15.83 MiB | 31.65 MiB/s Receiving objects: 25% (25860/103438), 15.83 MiB | 31.65 MiB/s Receiving objects: 26% (26894/103438), 15.83 MiB | 31.65 MiB/s Receiving objects: 27% (27929/103438), 15.83 MiB | 31.65 MiB/s Receiving objects: 28% (28963/103438), 15.83 MiB | 31.65 MiB/s Receiving objects: 29% (29998/103438), 15.83 MiB | 31.65 MiB/s Receiving objects: 30% (31032/103438), 15.83 MiB | 31.65 MiB/s Receiving objects: 31% (32066/103438), 15.83 MiB | 31.65 MiB/s Receiving objects: 32% (33101/103438), 15.83 MiB | 31.65 MiB/s Receiving objects: 33% (34135/103438), 15.83 MiB | 31.65 MiB/s Receiving objects: 33% (34351/103438), 32.85 MiB | 31.72 MiB/s Receiving objects: 34% (35169/103438), 32.85 MiB | 31.72 MiB/s Receiving objects: 35% (36204/103438), 32.85 MiB | 31.72 MiB/s Receiving objects: 36% (37238/103438), 32.85 MiB | 31.72 MiB/s Receiving objects: 37% (38273/103438), 32.85 MiB | 31.72 MiB/s Receiving objects: 38% (39307/103438), 32.85 MiB | 31.72 MiB/s Receiving objects: 39% (40341/103438), 32.85 MiB | 31.72 MiB/s Receiving objects: 40% (41376/103438), 32.85 MiB | 31.72 MiB/s Receiving objects: 41% (42410/103438), 50.12 MiB | 32.65 MiB/s Receiving objects: 42% (43444/103438), 50.12 MiB | 32.65 MiB/s Receiving objects: 43% (44479/103438), 50.12 MiB | 32.65 MiB/s Receiving objects: 44% (45513/103438), 50.12 MiB | 32.65 MiB/s Receiving objects: 45% (46548/103438), 50.12 MiB | 32.65 MiB/s Receiving objects: 46% (47582/103438), 50.12 MiB | 32.65 MiB/s Receiving objects: 47% (48616/103438), 50.12 MiB | 32.65 MiB/s Receiving objects: 47% (48737/103438), 50.12 MiB | 32.65 MiB/s Receiving objects: 48% (49651/103438), 66.89 MiB | 32.19 MiB/s Receiving objects: 49% (50685/103438), 66.89 MiB | 32.19 MiB/s Receiving objects: 50% (51719/103438), 66.89 MiB | 32.19 MiB/s Receiving objects: 51% (52754/103438), 66.89 MiB | 32.19 MiB/s Receiving objects: 52% (53788/103438), 66.89 MiB | 32.19 MiB/s Receiving objects: 53% (54823/103438), 66.89 MiB | 32.19 MiB/s Receiving objects: 54% (55857/103438), 66.89 MiB | 32.19 MiB/s Receiving objects: 55% (56891/103438), 66.89 MiB | 32.19 MiB/s Receiving objects: 55% (57067/103438), 101.13 MiB | 32.41 MiB/s Receiving objects: 55% (57162/103438), 118.81 MiB | 32.82 MiB/s Receiving objects: 55% (57612/103438), 150.12 MiB | 32.40 MiB/s Receiving objects: 56% (57926/103438), 150.12 MiB | 32.40 MiB/s Receiving objects: 57% (58960/103438), 150.12 MiB | 32.40 MiB/s Receiving objects: 58% (59995/103438), 150.12 MiB | 32.40 MiB/s Receiving objects: 59% (61029/103438), 167.80 MiB | 32.81 MiB/s Receiving objects: 60% (62063/103438), 167.80 MiB | 32.81 MiB/s Receiving objects: 61% (63098/103438), 167.80 MiB | 32.81 MiB/s Receiving objects: 62% (64132/103438), 167.80 MiB | 32.81 MiB/s Receiving objects: 63% (65166/103438), 184.31 MiB | 32.90 MiB/s Receiving objects: 64% (66201/103438), 184.31 MiB | 32.90 MiB/s Receiving objects: 65% (67235/103438), 184.31 MiB | 32.90 MiB/s Receiving objects: 66% (68270/103438), 184.31 MiB | 32.90 MiB/s Receiving objects: 67% (69304/103438), 184.31 MiB | 32.90 MiB/s Receiving objects: 68% (70338/103438), 184.31 MiB | 32.90 MiB/s Receiving objects: 69% (71373/103438), 184.31 MiB | 32.90 MiB/s Receiving objects: 70% (72407/103438), 184.31 MiB | 32.90 MiB/s Receiving objects: 70% (72540/103438), 184.31 MiB | 32.90 MiB/s Receiving objects: 71% (73441/103438), 184.31 MiB | 32.90 MiB/s Receiving objects: 72% (74476/103438), 200.41 MiB | 32.65 MiB/s Receiving objects: 73% (75510/103438), 200.41 MiB | 32.65 MiB/s Receiving objects: 74% (76545/103438), 200.41 MiB | 32.65 MiB/s Receiving objects: 74% (76738/103438), 215.80 MiB | 32.65 MiB/s Receiving objects: 75% (77579/103438), 225.07 MiB | 30.74 MiB/s Receiving objects: 76% (78613/103438), 225.07 MiB | 30.74 MiB/s Receiving objects: 77% (79648/103438), 225.07 MiB | 30.74 MiB/s Receiving objects: 78% (80682/103438), 241.56 MiB | 31.04 MiB/s Receiving objects: 79% (81717/103438), 241.56 MiB | 31.04 MiB/s Receiving objects: 80% (82751/103438), 241.56 MiB | 31.04 MiB/s Receiving objects: 80% (83783/103438), 241.56 MiB | 31.04 MiB/s Receiving objects: 81% (83785/103438), 241.56 MiB | 31.04 MiB/s Receiving objects: 81% (84502/103438), 290.27 MiB | 30.98 MiB/s Receiving objects: 82% (84820/103438), 307.70 MiB | 30.92 MiB/s Receiving objects: 82% (84881/103438), 307.70 MiB | 30.92 MiB/s Receiving objects: 83% (85854/103438), 307.70 MiB | 30.92 MiB/s Receiving objects: 84% (86888/103438), 324.31 MiB | 30.98 MiB/s Receiving objects: 85% (87923/103438), 324.31 MiB | 30.98 MiB/s Receiving objects: 86% (88957/103438), 324.31 MiB | 30.98 MiB/s Receiving objects: 87% (89992/103438), 324.31 MiB | 30.98 MiB/s Receiving objects: 88% (91026/103438), 340.89 MiB | 31.06 MiB/s Receiving objects: 88% (91426/103438), 340.89 MiB | 31.06 MiB/s Receiving objects: 89% (92060/103438), 374.39 MiB | 33.06 MiB/s Receiving objects: 90% (93095/103438), 374.39 MiB | 33.06 MiB/s Receiving objects: 91% (94129/103438), 374.39 MiB | 33.06 MiB/s Receiving objects: 92% (95163/103438), 374.39 MiB | 33.06 MiB/s Receiving objects: 93% (96198/103438), 374.39 MiB | 33.06 MiB/s Receiving objects: 94% (97232/103438), 374.39 MiB | 33.06 MiB/s Receiving objects: 94% (97933/103438), 374.39 MiB | 33.06 MiB/s Receiving objects: 95% (98267/103438), 374.39 MiB | 33.06 MiB/s Receiving objects: 96% (99301/103438), 374.39 MiB | 33.06 MiB/s Receiving objects: 97% (100335/103438), 374.39 MiB | 33.06 MiB/s Receiving objects: 98% (101370/103438), 374.39 MiB | 33.06 MiB/s Receiving objects: 99% (102404/103438), 374.39 MiB | 33.06 MiB/s remote: Total 103438 (delta 8585), reused 8019 (delta 7796), pack-reused 93377 (from 4)
  7. 15.51 s Receiving objects: 100% (103438/103438), 391.04 MiB | 33.09 MiB/s Receiving objects: 100% (103438/103438), 391.84 MiB | 32.15 MiB/s, done.
  8. 17.17 s Resolving deltas: 0% (0/67773) Resolving deltas: 1% (678/67773) Resolving deltas: 2% (1357/67773) Resolving deltas: 3% (2034/67773) Resolving deltas: 4% (2711/67773) Resolving deltas: 5% (3389/67773) Resolving deltas: 6% (4067/67773) Resolving deltas: 7% (4745/67773) Resolving deltas: 8% (5422/67773) Resolving deltas: 9% (6100/67773) Resolving deltas: 10% (6778/67773) Resolving deltas: 11% (7456/67773) Resolving deltas: 12% (8133/67773) Resolving deltas: 13% (8812/67773) Resolving deltas: 14% (9489/67773) Resolving deltas: 15% (10166/67773) Resolving deltas: 16% (10844/67773) Resolving deltas: 17% (11523/67773) Resolving deltas: 18% (12200/67773) Resolving deltas: 19% (12877/67773) Resolving deltas: 20% (13555/67773) Resolving deltas: 21% (14233/67773) Resolving deltas: 22% (14911/67773) Resolving deltas: 23% (15588/67773) Resolving deltas: 24% (16266/67773) Resolving deltas: 25% (16944/67773) Resolving deltas: 26% (17621/67773) Resolving deltas: 27% (18299/67773) Resolving deltas: 28% (18977/67773) Resolving deltas: 29% (19655/67773) Resolving deltas: 30% (20332/67773) Resolving deltas: 31% (21011/67773) Resolving deltas: 32% (21688/67773) Resolving deltas: 33% (22366/67773) Resolving deltas: 34% (23044/67773) Resolving deltas: 35% (23721/67773) Resolving deltas: 36% (24399/67773) Resolving deltas: 37% (25077/67773) Resolving deltas: 38% (25754/67773) Resolving deltas: 39% (26432/67773) Resolving deltas: 40% (27111/67773) Resolving deltas: 41% (27788/67773) Resolving deltas: 42% (28467/67773) Resolving deltas: 43% (29144/67773) Resolving deltas: 44% (29821/67773) Resolving deltas: 45% (30498/67773) Resolving deltas: 46% (31176/67773) Resolving deltas: 47% (31854/67773) Resolving deltas: 48% (32532/67773) Resolving deltas: 49% (33210/67773) Resolving deltas: 50% (33887/67773) Resolving deltas: 51% (34565/67773) Resolving deltas: 52% (35243/67773) Resolving deltas: 53% (35921/67773) Resolving deltas: 54% (36599/67773) Resolving deltas: 55% (37276/67773) Resolving deltas: 56% (37953/67773) Resolving deltas: 57% (38631/67773) Resolving deltas: 58% (39309/67773) Resolving deltas: 59% (39987/67773) Resolving deltas: 60% (40664/67773) Resolving deltas: 61% (41344/67773) Resolving deltas: 62% (42020/67773) Resolving deltas: 63% (42697/67773) Resolving deltas: 64% (43376/67773) Resolving deltas: 65% (44053/67773) Resolving deltas: 66% (44731/67773) Resolving deltas: 67% (45408/67773) Resolving deltas: 68% (46086/67773) Resolving deltas: 69% (46764/67773) Resolving deltas: 70% (47442/67773) Resolving deltas: 71% (48119/67773) Resolving deltas: 72% (48797/67773) Resolving deltas: 73% (49477/67773) Resolving deltas: 74% (50153/67773) Resolving deltas: 75% (50830/67773) Resolving deltas: 75% (51045/67773) Resolving deltas: 76% (51508/67773) Resolving deltas: 77% (52186/67773) Resolving deltas: 78% (52864/67773) Resolving deltas: 79% (53541/67773) Resolving deltas: 80% (54219/67773) Resolving deltas: 81% (54897/67773) Resolving deltas: 82% (55574/67773) Resolving deltas: 83% (56252/67773) Resolving deltas: 84% (56930/67773) Resolving deltas: 85% (57608/67773) Resolving deltas: 86% (58285/67773) Resolving deltas: 87% (58963/67773) Resolving deltas: 88% (59641/67773) Resolving deltas: 89% (60319/67773) Resolving deltas: 90% (60996/67773) Resolving deltas: 91% (61674/67773) Resolving deltas: 92% (62352/67773) Resolving deltas: 93% (63029/67773) Resolving deltas: 94% (63707/67773) Resolving deltas: 95% (64385/67773) Resolving deltas: 96% (65063/67773) Resolving deltas: 97% (65740/67773) Resolving deltas: 98% (66419/67773) Resolving deltas: 99% (67096/67773) Resolving deltas: 100% (67773/67773) Resolving deltas: 100% (67773/67773), done.
  9. 17.87 s Fetching commit 5771856b10d744e1d21d497095c24f885b591f6d for finite_T_and_mu ...
  10. 17.87 s $ /nix/store/5vpcfsdx1lcnlb2y4k7xyc74shp5qwbh-git-2.54.0/bin/git fetch origin 5771856b10d744e1d21d497095c24f885b591f6d
  11. 18.31 s From https://github.com/alphal00p/gammaloop
  12. 18.31 s * branch 5771856b10d744e1d21d497095c24f885b591f6d -> FETCH_HEAD
  13. 18.33 s $ /nix/store/61685rbaxmpigwi3z23i33sv3jyfl70q-coreutils-9.11/bin/timeout --kill-after=15s 7200s /nix/store/5vpcfsdx1lcnlb2y4k7xyc74shp5qwbh-git-2.54.0/bin/git -c advice.detachedHead=false checkout 5771856b10d744e1d21d497095c24f885b591f6d
  14. 18.65 s HEAD is now at 5771856b1 test higher energy power treatment through inverse-propagator cancellation in both vacuum and medium mode
  15. 18.66 s $ /nix/store/61685rbaxmpigwi3z23i33sv3jyfl70q-coreutils-9.11/bin/timeout --kill-after=15s 7200s /nix/store/wknkybkzrc16r11vk5vrykh4wmw7a353-nix-2.34.8/bin/nix --extra-experimental-features nix-command --extra-experimental-features flakes --log-format internal-json run .#packages.x86_64-linux.nix-ci-check-gammaloop-nextest-integration --print-build-logs
  16. 23.17 s
  17. 28.51 s evaluating derivation 'g copying '/nix/store/73ca evaluating derivation 'g copying '/nix/store/73ca evaluating derivation 'g copying '/nix/store/73ca evaluating derivation 'g copying '/nix/store/73ca evaluating derivation 'g copying '/nix/store/73ca evaluating derivation 'g copying '/nix/store/73ca evaluating derivation 'g querying gammaloop-nexte querying info about miss querying gammaloop-nexte [0/1 built, 0.0 KiB DL] [1/0/1 built, 0.0 KiB DLgammaloop-nextest-integration> Extracting 13 binaries, 1 build script output directory, and 3 linked paths to /build/nextest-archive-xN7UED
  18. 30.93 s gammaloop-nextest-integration> Extracted 30 files to /build/nextest-archive-xN7UED in 2.42s
  19. 30.95 s gammaloop-nextest-integration> ------------
  20. 30.95 s gammaloop-nextest-integration> Nextest run ID 8da6a9c2-91d2-4a36-b78b-c0bbd6a67703 with nextest profile: ci_gammaloop
  21. 30.95 s gammaloop-nextest-integration> Starting 170 tests across 13 binaries (209 tests skipped, including 208 tests via profile.ci_gammaloop.default-filter)
  22. 125.54 s gammaloop-nextest-integration> FAIL [ 2.789s] ( 55/170) gammaloop-integration-tests::test_runs aa_aa::important::aa_aa_local_inspect_backend_consistency
  23. 125.54 s gammaloop-nextest-integration> stdout ---
  24. 125.54 s gammaloop-nextest-integration>
  25. 125.54 s gammaloop-nextest-integration> running 1 test
  26. 125.54 s gammaloop-nextest-integration> test aa_aa::important::aa_aa_local_inspect_backend_consistency ... FAILED
  27. 125.54 s gammaloop-nextest-integration>
  28. 125.54 s gammaloop-nextest-integration> failures:
  29. 125.54 s gammaloop-nextest-integration>
  30. 125.54 s gammaloop-nextest-integration> failures:
  31. 125.54 s gammaloop-nextest-integration> aa_aa::important::aa_aa_local_inspect_backend_consistency
  32. 125.54 s gammaloop-nextest-integration>
  33. 125.54 s gammaloop-nextest-integration> test result: FAILED. 0 passed; 1 failed; 0 ignored; 0 measured; 274 filtered out; finished in 2.78s
  34. 125.54 s gammaloop-nextest-integration>
  35. 125.54 s gammaloop-nextest-integration> stderr ---
  36. 125.54 s gammaloop-nextest-integration> [2026-09-18 22:25:58.332] @gammaloop_api::se... INFO : Running command import model sm-default.json
  37. 125.54 s gammaloop-nextest-integration> [2026-09-18 22:25:58.332] @import::model INFO : Loading built-in JSON model sm-default
  38. 125.54 s gammaloop-nextest-integration> [2026-09-18 22:25:58.354] @gammalooprs::model INFO : The following 15 external parameters were forced to zero by the restriction card:
  39. 125.54 s gammaloop-nextest-integration> lamWS, AWS, rhoWS, etaWS, ymc, yme, ymm, MC, Me, MM, WTau, muQ, muLe, muLmu, muLtau
  40. 125.54 s gammaloop-nextest-integration> [2026-09-18 22:25:58.354] @gammalooprs::model INFO : The following 34 vertex rules were removed by the restriction card:
  41. 125.54 s gammaloop-nextest-integration> V_82 -> (c~, d, G+) | V_83 -> (t~, d, G+) | V_84 -> (c~, s, G+) | V_85 -> (t~, s, G+) | V_86 -> (u~, b, G+) | V_87 -> (c~, b, G+) | V_90 -> (c~, d, W+) | V_91 -> (t~, d, W+) | V_92 -> (u~, s, W+) | V_94 -> (t~, s, W+) | V_95 -> (u~, b, W+) | V_96 -> (c~, b, W+) | V_101 -> (e+, e-, G0) | V_102 -> (mu+, mu-, G0) | V_104 -> (e+, e-, H) | V_105 -> (mu+, mu-, H) | V_110 -> (ve~, e-, G+) | V_111 -> (vm~, mu-, G+) | V_116 -> (b~, u, G-) | V_117 -> (d~, c, G-) | V_118 -> (s~, c, G-) | V_119 -> (b~, c, G-) | V_120 -> (d~, t, G-) | V_121 -> (s~, t, G-) | V_124 -> (s~, u, W-) | V_125 -> (b~, u, W-) | V_126 -> (d~, c, W-) | V_128 -> (b~, c, W-) | V_129 -> (d~, t, W-) | V_130 -> (s~, t, W-) | V_138 -> (c~, c, G0) | V_140 -> (c~, c, H) | V_145 -> (e+, ve, G-) | V_146 -> (mu+, vm, G-)
  42. 125.54 s gammaloop-nextest-integration> [2026-09-18 22:25:58.354] @gammalooprs::model INFO : The following 36 couplings were removed by the restriction card:
  43. 125.54 s gammaloop-nextest-integration> GC_13, GC_14, GC_16, GC_17, GC_18, GC_19, GC_20, GC_22, GC_23, GC_24, GC_25, GC_26, GC_28, GC_29, GC_42, GC_43, GC_44, GC_46, GC_47, GC_48, GC_84, GC_85, GC_86, GC_87, GC_88, GC_89, GC_90, GC_91, GC_92, GC_93, GC_101, GC_102, GC_103, GC_105, GC_106, GC_107
  44. 125.54 s gammaloop-nextest-integration> [2026-09-18 22:25:58.354] @gammaloop_api::se... INFO : Running command run set_model_parameters
  45. 125.54 s gammaloop-nextest-integration> [2026-09-18 22:25:58.354] @gammaloop_api::se... INFO : Starting command block set_model_parameters
  46. 125.54 s gammaloop-nextest-integration> [2026-09-18 22:25:58.354] @gammaloop_api::se... INFO : Running command set model MT=173.0
  47. 125.54 s gammaloop-nextest-integration> [2026-09-18 22:25:58.359] @gammaloop_api::se... INFO : Running command set model WT=0.0
  48. 125.54 s gammaloop-nextest-integration> [2026-09-18 22:25:58.363] @gammaloop_api::se... INFO : Running command set model ymt=173.0
  49. 125.54 s gammaloop-nextest-integration> [2026-09-18 22:25:58.368] @gammaloop_api::se... INFO : Running command set model aS=0.118
  50. 125.54 s gammaloop-nextest-integration> [2026-09-18 22:25:58.372] @gammaloop_api::se... INFO : Running command set model aEWM1=137.036
  51. 125.54 s gammaloop-nextest-integration> [2026-09-18 22:25:58.376] @gammaloop_api::se... INFO : Running command set model Gf=1.166390e-05
  52. 125.54 s gammaloop-nextest-integration> [2026-09-18 22:25:58.381] @gammaloop_api::se... INFO : Running command set model MZ=91.188
  53. 125.54 s gammaloop-nextest-integration> [2026-09-18 22:25:58.386] @gammaloop_api::se... INFO : Running command set global string '
  54. 125.54 s gammaloop-nextest-integration> [global.generation.compile]
  55. 125.54 s gammaloop-nextest-integration> compilation_mode = "symjit"
  56. 125.54 s gammaloop-nextest-integration> optimization_level = "O0"
  57. 125.54 s gammaloop-nextest-integration> fast_math = false
  58. 125.54 s gammaloop-nextest-integration> [...]
  59. 125.54 s gammaloop-nextest-integration> [2026-09-18 22:25:58.386] @gammaloop_api::se... INFO : Running command import graphs ./examples/cli/aa_aa/1L/aa_aa_1L.dot -p aa_aa_all_helicities -i 1L_ppmm -o
  60. 125.54 s gammaloop-nextest-integration> [2026-09-18 22:25:58.386] @commands::import INFO : Loading graphs from '/build/source/examples/cli/aa_aa/1L/aa_aa_1L.dot'
  61. 125.54 s gammaloop-nextest-integration> [2026-09-18 22:25:58.396] @gammaloop_api::se... INFO : Running command generate existing -p aa_aa_all_helicities
  62. 125.54 s gammaloop-nextest-integration> The application panicked (crashed).
  63. 125.54 s gammaloop-nextest-integration> Message: label _func_power_ not found
  64. 125.54 s gammaloop-nextest-integration> Location: /nix/store/n9w914kh1cm59xx3spcs831cdyb56m32-vendor-cargo-deps/c19b7c6f923b580ac259164a89f2577984ad5ab09ee9d583b888f934adbbe8d0/symjit-2.25.6/src/symjit/assembler.rs:77
  65. 125.54 s gammaloop-nextest-integration>
  66. 125.54 s gammaloop-nextest-integration> ━━━━━━━━━━━━━━━━━━━━━━━━━━━━━━━━━━ BACKTRACE ━━━━━━━━━━━━━━━━━━━━━━━━━━━━━━━━━━━
  67. 125.54 s gammaloop-nextest-integration> 1: <color_eyre[51793ea62743adbd]::config::PanicHook>::panic_report<unknown>
  68. 125.54 s gammaloop-nextest-integration> at <unknown source file>:<unknown line>
  69. 125.54 s gammaloop-nextest-integration> 2: <color_eyre[51793ea62743adbd]::config::PanicHook>::into_panic_hook::{closure#0}<unknown>
  70. 125.54 s gammaloop-nextest-integration> at <unknown source file>:<unknown line>
  71. 125.54 s gammaloop-nextest-integration> 3: std[bcb96dfbba0ab899]::panicking::panic_with_hook<unknown>
  72. 125.54 s gammaloop-nextest-integration> at <unknown source file>:<unknown line>
  73. 125.54 s gammaloop-nextest-integration> 4: std[bcb96dfbba0ab899]::panicking::panic_handler::{closure#0}<unknown>
  74. 125.54 s gammaloop-nextest-integration> at <unknown source file>:<unknown line>
  75. 125.54 s gammaloop-nextest-integration> 5: std[bcb96dfbba0ab899]::sys::backtrace::__rust_end_short_backtrace::<std[bcb96dfbba0ab899]::panicking::panic_handler::{closure#0}, !><unknown>
  76. 125.54 s gammaloop-nextest-integration> at <unknown source file>:<unknown line>
  77. 125.54 s gammaloop-nextest-integration> 6: __rustc[6c289b9f9c454d21]::rust_begin_unwind<unknown>
  78. 125.54 s gammaloop-nextest-integration> at <unknown source file>:<unknown line>
  79. 125.54 s gammaloop-nextest-integration> 7: core[940e698046960fd5]::panicking::panic_fmt<unknown>
  80. 125.54 s gammaloop-nextest-integration> at <unknown source file>:<unknown line>
  81. 125.54 s gammaloop-nextest-integration> 8: <symjit[e408de789c333cd]::symjit::assembler::Assembler>::apply_jumps<unknown>
  82. 125.54 s gammaloop-nextest-integration> at <unknown source file>:<unknown line>
  83. 125.54 s gammaloop-nextest-integration> 9: <symjit[e408de789c333cd]::symjit::builder::Builder>::compile_from_mir::<symjit[e408de789c333cd]::symjit::amd::complex::AmdComplexGenerator><unknown>
  84. 125.54 s gammaloop-nextest-integration> at <unknown source file>:<unknown line>
  85. 125.54 s gammaloop-nextest-integration> 10: <symjit[e408de789c333cd]::symjit::runnable::Application>::compile_ty<unknown>
  86. 125.54 s gammaloop-nextest-integration> at <unknown source file>:<unknown line>
  87. 125.54 s gammaloop-nextest-integration> 11: <symjit[e408de789c333cd]::symjit::runnable::Application>::with_mir<unknown>
  88. 125.54 s gammaloop-nextest-integration> at <unknown source file>:<unknown line>
  89. 125.54 s gammaloop-nextest-integration> 12: <symjit[e408de789c333cd]::symjit::composer::DirectTranslator as symjit[e408de789c333cd]::symjit::composer::Composer>::compile<unknown>
  90. 125.54 s gammaloop-nextest-integration> at <unknown source file>:<unknown line>
  91. 125.54 s gammaloop-nextest-integration> 13: <symjit[e408de789c333cd]::symjit::compiler::Translator as symjit[e408de789c333cd]::symjit::composer::Composer>::compile<unknown>
  92. 125.54 s gammaloop-nextest-integration> at <unknown source file>:<unknown line>
  93. 125.54 s gammaloop-nextest-integration> 14: <numerica[124dab8567f4861e]::domains::float::complex::Complex<f64> as symbolica[10e259bab675d243]::evaluate::backend::JITCompiledNumber>::jit_compile<unknown>
  94. 125.54 s gammaloop-nextest-integration> at <unknown source file>:<unknown line>
  95. 125.54 s gammaloop-nextest-integration> 15: <gammalooprs[917cbd3df9e68f8f]::integrands::process::evaluators::GenericEvaluator>::activate_symjit<unknown>
  96. 125.54 s gammaloop-nextest-integration> at <unknown source file>:<unknown line>
  97. 125.54 s gammaloop-nextest-integration> 16: <gammalooprs[917cbd3df9e68f8f]::integrands::process::amplitude::AmplitudeIntegrand>::prepare_runtime_backends_after_generation_with_compile_times<unknown>
  98. 125.54 s gammaloop-nextest-integration> at <unknown source file>:<unknown line>
  99. 125.54 s gammaloop-nextest-integration> 17: <gammalooprs[917cbd3df9e68f8f]::processes::amplitude::Amplitude>::build_integrand<unknown>
  100. 125.54 s gammaloop-nextest-integration> at <unknown source file>:<unknown line>
  101. 125.54 s gammaloop-nextest-integration> 18: <gammalooprs[917cbd3df9e68f8f]::processes::process::Process>::generate_integrands<unknown>
  102. 125.54 s gammaloop-nextest-integration> at <unknown source file>:<unknown line>
  103. 125.54 s gammaloop-nextest-integration> 19: <gammaloop_api[9ebf6628f97aeb57]::state::State>::generate_integrand<unknown>
  104. 125.54 s gammaloop-nextest-integration> at <unknown source file>:<unknown line>
  105. 125.54 s gammaloop-nextest-integration> 20: <gammaloop_api[9ebf6628f97aeb57]::commands::generate::Generate>::run::<&std[bcb96dfbba0ab899]::path::PathBuf><unknown>
  106. 125.54 s gammaloop-nextest-integration> at <unknown source file>:<unknown line>
  107. 125.54 s gammaloop-nextest-integration> 21: <gammaloop_api[9ebf6628f97aeb57]::commands::Commands>::run<unknown>
  108. 125.54 s gammaloop-nextest-integration> at <unknown source file>:<unknown line>
  109. 125.54 s gammaloop-nextest-integration> 22: <gammaloop_api[9ebf6628f97aeb57]::session::CliSession>::execute_prepared<unknown>
  110. 125.54 s gammaloop-nextest-integration> at <unknown source file>:<unknown line>
  111. 125.54 s gammaloop-nextest-integration> 23: <gammaloop_api[9ebf6628f97aeb57]::session::CliSession>::execute_command<unknown>
  112. 125.54 s gammaloop-nextest-integration> at <unknown source file>:<unknown line>
  113. 125.54 s gammaloop-nextest-integration> 24: <gammaloop_integration_tests[191607b70c61cd5a]::CLIState>::run_command<unknown>
  114. 125.54 s gammaloop-nextest-integration> at <unknown source file>:<unknown line>
  115. 125.54 s gammaloop-nextest-integration> 25: test_runs[9b7e2dc2dc4f29b0]::aa_aa::generate_aa_aa_helicity_family<unknown>
  116. 125.54 s gammaloop-nextest-integration> at <unknown source file>:<unknown line>
  117. 125.54 s gammaloop-nextest-integration> 26: <test_runs[9b7e2dc2dc4f29b0]::aa_aa::important::aa_aa_local_inspect_backend_consistency::{closure#0} as core[940e698046960fd5]::ops::function::FnOnce<()>>::call_once<unknown>
  118. 125.54 s gammaloop-nextest-integration> at <unknown source file>:<unknown line>
  119. 125.54 s gammaloop-nextest-integration> 27: serial_test[cd99724524a2f1c0]::serial_code_lock::local_serial_core_with_return::<(), eyre[cb2fd339c0c40fca]::Report><unknown>
  120. 125.54 s gammaloop-nextest-integration> at <unknown source file>:<unknown line>
  121. 125.54 s gammaloop-nextest-integration> 28: <test_runs[9b7e2dc2dc4f29b0]::aa_aa::important::aa_aa_local_inspect_backend_consistency::{closure#0} as core[940e698046960fd5]::ops::function::FnOnce<()>>::call_once<unknown>
  122. 125.54 s gammaloop-nextest-integration> at <unknown source file>:<unknown line>
  123. 125.54 s gammaloop-nextest-integration> 29: test[75d6903177b1d7e9]::__rust_begin_short_backtrace::<core[940e698046960fd5]::result::Result<(), alloc[2ea6bcb46fca0c42]::string::String>, fn() -> core[940e698046960fd5]::result::Result<(), alloc[2ea6bcb46fca0c42]::string::String>><unknown>
  124. 125.54 s gammaloop-nextest-integration> at <unknown source file>:<unknown line>
  125. 125.54 s gammaloop-nextest-integration> 30: test[75d6903177b1d7e9]::run_test::{closure#0}<unknown>
  126. 125.54 s gammaloop-nextest-integration> at <unknown source file>:<unknown line>
  127. 125.54 s gammaloop-nextest-integration> 31: std[bcb96dfbba0ab899]::sys::backtrace::__rust_begin_short_backtrace::<test[75d6903177b1d7e9]::run_test::{closure#1}, ()><unknown>
  128. 125.54 s gammaloop-nextest-integration> at <unknown source file>:<unknown line>
  129. 125.54 s gammaloop-nextest-integration> 32: <std[bcb96dfbba0ab899]::thread::lifecycle::spawn_unchecked<test[75d6903177b1d7e9]::run_test::{closure#1}, ()>::{closure#1} as core[940e698046960fd5]::ops::function::FnOnce<()>>::call_once::{shim:vtable#0}<unknown>
  130. 125.54 s gammaloop-nextest-integration> at <unknown source file>:<unknown line>
  131. 125.54 s gammaloop-nextest-integration> 33: <std[bcb96dfbba0ab899]::sys::thread::unix::Thread>::new::thread_start<unknown>
  132. 125.54 s gammaloop-nextest-integration> at <unknown source file>:<unknown line>
  133. 125.54 s gammaloop-nextest-integration> 34: start_thread<unknown>
  134. 125.54 s gammaloop-nextest-integration> at <unknown source file>:<unknown line>
  135. 125.54 s gammaloop-nextest-integration> 35: __clone3<unknown>
  136. 125.54 s gammaloop-nextest-integration> at <unknown source file>:<unknown line>
  137. 125.54 s gammaloop-nextest-integration>
  138. 125.54 s gammaloop-nextest-integration> Run with COLORBT_SHOW_HIDDEN=1 environment variable to disable frame filtering.
  139. 125.54 s gammaloop-nextest-integration> Run with RUST_BACKTRACE=full to include source snippets.
  140. 125.54 s gammaloop-nextest-integration> Warning: SpanTrace capture is Unsupported.
  141. 125.54 s gammaloop-nextest-integration> Ensure that you've setup a tracing-error ErrorLayer and the semver versions are compatible
  142. 125.54 s gammaloop-nextest-integration>
  143. 167.71 s gammaloop-nextest-integration> FAIL [ 2.965s] (157/170) gammaloop-integration-tests::uv thermal_sunrise_uv
  144. 167.71 s gammaloop-nextest-integration> stdout ---
  145. 167.71 s gammaloop-nextest-integration>
  146. 167.71 s gammaloop-nextest-integration> running 1 test
  147. 167.71 s gammaloop-nextest-integration> test thermal_sunrise_uv ... FAILED
  148. 167.71 s gammaloop-nextest-integration>
  149. 167.71 s gammaloop-nextest-integration> failures:
  150. 167.71 s gammaloop-nextest-integration>
  151. 167.71 s gammaloop-nextest-integration> failures:
  152. 167.71 s gammaloop-nextest-integration> thermal_sunrise_uv
  153. 167.71 s gammaloop-nextest-integration>
  154. 167.71 s gammaloop-nextest-integration> test result: FAILED. 0 passed; 1 failed; 0 ignored; 0 measured; 31 filtered out; finished in 2.95s
  155. 167.71 s gammaloop-nextest-integration>
  156. 167.71 s gammaloop-nextest-integration> stderr ---
  157. 167.71 s gammaloop-nextest-integration> [2026-09-18 22:26:40.402] @gammaloop_api::se... INFO : Running command run generate
  158. 167.71 s gammaloop-nextest-integration> [2026-09-18 22:26:40.402] @gammaloop_api::se... INFO : Starting command block generate
  159. 167.71 s gammaloop-nextest-integration> [2026-09-18 22:26:40.402] @gammaloop_api::se... INFO : Running command import model sm-default.json
  160. 167.71 s gammaloop-nextest-integration> [2026-09-18 22:26:40.402] @import::model INFO : Loading built-in JSON model sm-default
  161. 167.71 s gammaloop-nextest-integration> [2026-09-18 22:26:40.429] @gammalooprs::model INFO : The following 15 external parameters were forced to zero by the restriction card:
  162. 167.71 s gammaloop-nextest-integration> lamWS, AWS, rhoWS, etaWS, ymc, yme, ymm, MC, Me, MM, WTau, muQ, muLe, muLmu, muLtau
  163. 167.71 s gammaloop-nextest-integration> [2026-09-18 22:26:40.429] @gammalooprs::model INFO : The following 34 vertex rules were removed by the restriction card:
  164. 167.71 s gammaloop-nextest-integration> V_82 -> (c~, d, G+) | V_83 -> (t~, d, G+) | V_84 -> (c~, s, G+) | V_85 -> (t~, s, G+) | V_86 -> (u~, b, G+) | V_87 -> (c~, b, G+) | V_90 -> (c~, d, W+) | V_91 -> (t~, d, W+) | V_92 -> (u~, s, W+) | V_94 -> (t~, s, W+) | V_95 -> (u~, b, W+) | V_96 -> (c~, b, W+) | V_101 -> (e+, e-, G0) | V_102 -> (mu+, mu-, G0) | V_104 -> (e+, e-, H) | V_105 -> (mu+, mu-, H) | V_110 -> (ve~, e-, G+) | V_111 -> (vm~, mu-, G+) | V_116 -> (b~, u, G-) | V_117 -> (d~, c, G-) | V_118 -> (s~, c, G-) | V_119 -> (b~, c, G-) | V_120 -> (d~, t, G-) | V_121 -> (s~, t, G-) | V_124 -> (s~, u, W-) | V_125 -> (b~, u, W-) | V_126 -> (d~, c, W-) | V_128 -> (b~, c, W-) | V_129 -> (d~, t, W-) | V_130 -> (s~, t, W-) | V_138 -> (c~, c, G0) | V_140 -> (c~, c, H) | V_145 -> (e+, ve, G-) | V_146 -> (mu+, vm, G-)
  165. 167.71 s gammaloop-nextest-integration> [2026-09-18 22:26:40.429] @gammalooprs::model INFO : The following 36 couplings were removed by the restriction card:
  166. 167.71 s gammaloop-nextest-integration> GC_13, GC_14, GC_16, GC_17, GC_18, GC_19, GC_20, GC_22, GC_23, GC_24, GC_25, GC_26, GC_28, GC_29, GC_42, GC_43, GC_44, GC_46, GC_47, GC_48, GC_84, GC_85, GC_86, GC_87, GC_88, GC_89, GC_90, GC_91, GC_92, GC_93, GC_101, GC_102, GC_103, GC_105, GC_106, GC_107
  167. 167.71 s gammaloop-nextest-integration> [2026-09-18 22:26:40.429] @gammaloop_api::se... INFO : Running command remove processes
  168. 167.71 s gammaloop-nextest-integration> [2026-09-18 22:26:40.429] @gammaloop_api::se... INFO : Running command generate amp {} > {} [{2}] | g u
  169. 167.71 s gammaloop-nextest-integration> --numerator-grouping group_identical_graphs_up_to_scalar_rescaling
  170. 167.71 s gammaloop-nextest-integration> --max-n-bridges 0
  171. 167.71 s gammaloop-nextest-integration> --number-of-factorized-loop-subtopologies 1 1
  172. 167.71 s gammaloop-nextest-integration> --number-of-anticommutating-loops 1 1
  173. 167.71 s gammaloop-nextest-integration> [...]
  174. 167.71 s gammaloop-nextest-integration> [2026-09-18 22:26:40.431] @feyngen::diagram_... INFO : 0s | Δ=0s | Starting Feynman graph generation with Symbolica...
  175. 167.71 s gammaloop-nextest-integration> [2026-09-18 22:26:40.431] @feyngen::diagram_... INFO : 0s | Δ=0s | Number of graphs resulting from Symbolica generation: 3
  176. 167.71 s gammaloop-nextest-integration> [2026-09-18 22:26:40.431] @feyngen::diagram_... INFO : 0s | Δ=0s | Number of graphs retained after removal of vetoed topologies: 2
  177. 167.71 s gammaloop-nextest-integration> [2026-09-18 22:26:40.431] @feyngen::diagram_... INFO : 0s | Δ=0s | Number of graphs after vertex info assignment: 2
  178. 167.71 s gammaloop-nextest-integration> [2026-09-18 22:26:40.431] @feyngen::diagram_... INFO : 0s | Δ=0s | Number of graphs after all complete graphs filters are applied: 2
  179. 167.71 s gammaloop-nextest-integration> [2026-09-18 22:26:40.431] @feyngen::diagram_... INFO : 0s | Δ=0s | Number of graphs after closed anticommutating chains analysis: 1
  180. 167.71 s gammaloop-nextest-integration> [2026-09-18 22:26:40.431] @feyngen::diagram_... INFO : 0s | Δ=0s | Number of graphs after symmetrization of external states: 1
  181. 167.71 s gammaloop-nextest-integration> [2026-09-18 22:26:40.431] @feyngen::diagram_... INFO : 0s | Δ=0s | Number of graphs after canonization of vertices, edges and flows (graph labels assigned here): 1
  182. 167.71 s gammaloop-nextest-integration> [2026-09-18 22:26:40.444] @feyngen::diagram_... INFO : 0s | Δ=0s | Number of graphs after numerator-aware grouping with strategy 'up to a scalar rescaling': 1 (1 isomorphically unique graph, 0 color zero, 0 lorentz zero, 0 grouped and 0 cancellation)
  183. 167.71 s gammaloop-nextest-integration> [2026-09-18 22:26:40.444] @feyngen::diagram_... INFO : ( Sum of the symmetry factors from each graph generated = -1/2 )
  184. 167.71 s gammaloop-nextest-integration> [2026-09-18 22:26:40.444] @commands::generate INFO : Generated amplitude 1 graphs.
  185. 167.71 s gammaloop-nextest-integration> [2026-09-18 22:26:40.444] @commands::generate INFO : Only diagram generation was requested, skipping integrand generation. You can generate integrands later using the 'generate existing <options>' command.
  186. 167.71 s gammaloop-nextest-integration> [2026-09-18 22:26:40.444] @gammaloop_api::se... INFO : Running command generate
  187. 167.71 s gammaloop-nextest-integration> The application panicked (crashed).
  188. 167.71 s gammaloop-nextest-integration> Message: label _func_power_ not found
  189. 167.71 s gammaloop-nextest-integration> Location: /nix/store/n9w914kh1cm59xx3spcs831cdyb56m32-vendor-cargo-deps/c19b7c6f923b580ac259164a89f2577984ad5ab09ee9d583b888f934adbbe8d0/symjit-2.25.6/src/symjit/assembler.rs:77
  190. 167.71 s gammaloop-nextest-integration>
  191. 167.71 s gammaloop-nextest-integration> ━━━━━━━━━━━━━━━━━━━━━━━━━━━━━━━━━━ BACKTRACE ━━━━━━━━━━━━━━━━━━━━━━━━━━━━━━━━━━━
  192. 167.71 s gammaloop-nextest-integration> 1: <color_eyre[51793ea62743adbd]::config::PanicHook>::panic_report<unknown>
  193. 167.71 s gammaloop-nextest-integration> at <unknown source file>:<unknown line>
  194. 167.71 s gammaloop-nextest-integration> 2: <color_eyre[51793ea62743adbd]::config::PanicHook>::into_panic_hook::{closure#0}<unknown>
  195. 167.71 s gammaloop-nextest-integration> at <unknown source file>:<unknown line>
  196. 167.71 s gammaloop-nextest-integration> 3: std[bcb96dfbba0ab899]::panicking::panic_with_hook<unknown>
  197. 167.71 s gammaloop-nextest-integration> at <unknown source file>:<unknown line>
  198. 167.71 s gammaloop-nextest-integration> 4: std[bcb96dfbba0ab899]::panicking::panic_handler::{closure#0}<unknown>
  199. 167.71 s gammaloop-nextest-integration> at <unknown source file>:<unknown line>
  200. 167.71 s gammaloop-nextest-integration> 5: std[bcb96dfbba0ab899]::sys::backtrace::__rust_end_short_backtrace::<std[bcb96dfbba0ab899]::panicking::panic_handler::{closure#0}, !><unknown>
  201. 167.71 s gammaloop-nextest-integration> at <unknown source file>:<unknown line>
  202. 167.71 s gammaloop-nextest-integration> 6: __rustc[6c289b9f9c454d21]::rust_begin_unwind<unknown>
  203. 167.71 s gammaloop-nextest-integration> at <unknown source file>:<unknown line>
  204. 167.71 s gammaloop-nextest-integration> 7: core[940e698046960fd5]::panicking::panic_fmt<unknown>
  205. 167.71 s gammaloop-nextest-integration> at <unknown source file>:<unknown line>
  206. 167.71 s gammaloop-nextest-integration> 8: <symjit[e408de789c333cd]::symjit::assembler::Assembler>::apply_jumps<unknown>
  207. 167.71 s gammaloop-nextest-integration> at <unknown source file>:<unknown line>
  208. 167.71 s gammaloop-nextest-integration> 9: <symjit[e408de789c333cd]::symjit::builder::Builder>::compile_from_mir::<symjit[e408de789c333cd]::symjit::amd::complex::AmdComplexGenerator><unknown>
  209. 167.71 s gammaloop-nextest-integration> at <unknown source file>:<unknown line>
  210. 167.71 s gammaloop-nextest-integration> 10: <symjit[e408de789c333cd]::symjit::runnable::Application>::compile_ty<unknown>
  211. 167.71 s gammaloop-nextest-integration> at <unknown source file>:<unknown line>
  212. 167.71 s gammaloop-nextest-integration> 11: <symjit[e408de789c333cd]::symjit::runnable::Application>::with_mir<unknown>
  213. 167.71 s gammaloop-nextest-integration> at <unknown source file>:<unknown line>
  214. 167.71 s gammaloop-nextest-integration> 12: <symjit[e408de789c333cd]::symjit::composer::DirectTranslator as symjit[e408de789c333cd]::symjit::composer::Composer>::compile<unknown>
  215. 167.71 s gammaloop-nextest-integration> at <unknown source file>:<unknown line>
  216. 167.71 s gammaloop-nextest-integration> 13: <symjit[e408de789c333cd]::symjit::compiler::Translator as symjit[e408de789c333cd]::symjit::composer::Composer>::compile<unknown>
  217. 167.71 s gammaloop-nextest-integration> at <unknown source file>:<unknown line>
  218. 167.71 s gammaloop-nextest-integration> 14: <numerica[124dab8567f4861e]::domains::float::complex::Complex<f64> as symbolica[10e259bab675d243]::evaluate::backend::JITCompiledNumber>::jit_compile<unknown>
  219. 167.71 s gammaloop-nextest-integration> at <unknown source file>:<unknown line>
  220. 167.71 s gammaloop-nextest-integration> 15: <gammalooprs[917cbd3df9e68f8f]::integrands::process::evaluators::GenericEvaluator>::activate_symjit<unknown>
  221. 167.71 s gammaloop-nextest-integration> at <unknown source file>:<unknown line>
  222. 167.71 s gammaloop-nextest-integration> 16: <gammalooprs[917cbd3df9e68f8f]::integrands::process::amplitude::AmplitudeIntegrand>::prepare_runtime_backends_after_generation_with_compile_times<unknown>
  223. 167.71 s gammaloop-nextest-integration> at <unknown source file>:<unknown line>
  224. 167.71 s gammaloop-nextest-integration> 17: <gammalooprs[917cbd3df9e68f8f]::processes::amplitude::Amplitude>::build_integrand<unknown>
  225. 167.71 s gammaloop-nextest-integration> at <unknown source file>:<unknown line>
  226. 167.71 s gammaloop-nextest-integration> 18: <gammalooprs[917cbd3df9e68f8f]::processes::process::Process>::generate_integrands<unknown>
  227. 167.71 s gammaloop-nextest-integration> at <unknown source file>:<unknown line>
  228. 167.71 s gammaloop-nextest-integration> 19: <gammalooprs[917cbd3df9e68f8f]::processes::ProcessList>::generate_integrands<unknown>
  229. 167.71 s gammaloop-nextest-integration> at <unknown source file>:<unknown line>
  230. 167.71 s gammaloop-nextest-integration> 20: <gammaloop_api[9ebf6628f97aeb57]::state::State>::generate_integrands<unknown>
  231. 167.71 s gammaloop-nextest-integration> at <unknown source file>:<unknown line>
  232. 167.71 s gammaloop-nextest-integration> 21: <gammaloop_api[9ebf6628f97aeb57]::commands::generate::Generate>::run::<&std[bcb96dfbba0ab899]::path::PathBuf><unknown>
  233. 167.71 s gammaloop-nextest-integration> at <unknown source file>:<unknown line>
  234. 167.71 s gammaloop-nextest-integration> 22: <gammaloop_api[9ebf6628f97aeb57]::commands::Commands>::run<unknown>
  235. 167.71 s gammaloop-nextest-integration> at <unknown source file>:<unknown line>
  236. 167.71 s gammaloop-nextest-integration> 23: <gammaloop_api[9ebf6628f97aeb57]::session::CliSession>::execute_prepared<unknown>
  237. 167.71 s gammaloop-nextest-integration> at <unknown source file>:<unknown line>
  238. 167.71 s gammaloop-nextest-integration> 24: <gammaloop_api[9ebf6628f97aeb57]::session::CliSession>::execute_prepared_commands<unknown>
  239. 167.71 s gammaloop-nextest-integration> at <unknown source file>:<unknown line>
  240. 167.71 s gammaloop-nextest-integration> 25: <gammaloop_api[9ebf6628f97aeb57]::session::CliSession>::execute_prepared<unknown>
  241. 167.71 s gammaloop-nextest-integration> at <unknown source file>:<unknown line>
  242. 167.71 s gammaloop-nextest-integration> 26: <gammaloop_api[9ebf6628f97aeb57]::session::CliSession>::execute_command<unknown>
  243. 167.71 s gammaloop-nextest-integration> at <unknown source file>:<unknown line>
  244. 167.71 s gammaloop-nextest-integration> 27: <gammaloop_integration_tests[191607b70c61cd5a]::CLIState>::run_command<unknown>
  245. 167.71 s gammaloop-nextest-integration> at <unknown source file>:<unknown line>
  246. 167.71 s gammaloop-nextest-integration> 28: uv[3c7454ef256d6487]::run_single_integrated_uv_case<unknown>
  247. 167.71 s gammaloop-nextest-integration> at <unknown source file>:<unknown line>
  248. 167.71 s gammaloop-nextest-integration> 29: <uv[3c7454ef256d6487]::thermal_sunrise_uv::{closure#0} as core[940e698046960fd5]::ops::function::FnOnce<()>>::call_once<unknown>
  249. 167.71 s gammaloop-nextest-integration> at <unknown source file>:<unknown line>
  250. 167.71 s gammaloop-nextest-integration> 30: test[75d6903177b1d7e9]::__rust_begin_short_backtrace::<core[940e698046960fd5]::result::Result<(), alloc[2ea6bcb46fca0c42]::string::String>, fn() -> core[940e698046960fd5]::result::Result<(), alloc[2ea6bcb46fca0c42]::string::String>><unknown>
  251. 167.71 s gammaloop-nextest-integration> at <unknown source file>:<unknown line>
  252. 167.71 s gammaloop-nextest-integration> 31: test[75d6903177b1d7e9]::run_test::{closure#0}<unknown>
  253. 167.71 s gammaloop-nextest-integration> at <unknown source file>:<unknown line>
  254. 167.71 s gammaloop-nextest-integration> 32: std[bcb96dfbba0ab899]::sys::backtrace::__rust_begin_short_backtrace::<test[75d6903177b1d7e9]::run_test::{closure#1}, ()><unknown>
  255. 167.71 s gammaloop-nextest-integration> at <unknown source file>:<unknown line>
  256. 167.71 s gammaloop-nextest-integration> 33: <std[bcb96dfbba0ab899]::thread::lifecycle::spawn_unchecked<test[75d6903177b1d7e9]::run_test::{closure#1}, ()>::{closure#1} as core[940e698046960fd5]::ops::function::FnOnce<()>>::call_once::{shim:vtable#0}<unknown>
  257. 167.71 s gammaloop-nextest-integration> at <unknown source file>:<unknown line>
  258. 167.71 s gammaloop-nextest-integration> 34: <std[bcb96dfbba0ab899]::sys::thread::unix::Thread>::new::thread_start<unknown>
  259. 167.71 s gammaloop-nextest-integration> at <unknown source file>:<unknown line>
  260. 167.71 s gammaloop-nextest-integration> 35: start_thread<unknown>
  261. 167.71 s gammaloop-nextest-integration> at <unknown source file>:<unknown line>
  262. 167.71 s gammaloop-nextest-integration> 36: __clone3<unknown>
  263. 167.71 s gammaloop-nextest-integration> at <unknown source file>:<unknown line>
  264. 167.71 s gammaloop-nextest-integration>
  265. 167.71 s gammaloop-nextest-integration> Run with COLORBT_SHOW_HIDDEN=1 environment variable to disable frame filtering.
  266. 167.71 s gammaloop-nextest-integration> Run with RUST_BACKTRACE=full to include source snippets.
  267. 167.71 s gammaloop-nextest-integration> Warning: SpanTrace capture is Unsupported.
  268. 167.71 s gammaloop-nextest-integration> Ensure that you've setup a tracing-error ErrorLayer and the semver versions are compatible
  269. 167.71 s gammaloop-nextest-integration>
  270. 223.48 s gammaloop-nextest-integration> ------------
  271. 223.48 s gammaloop-nextest-integration> Summary [ 192.526s] 170 tests run: 168 passed, 2 failed, 209 skipped
  272. 223.48 s gammaloop-nextest-integration> FAIL [ 2.789s] ( 55/170) gammaloop-integration-tests::test_runs aa_aa::important::aa_aa_local_inspect_backend_consistency
  273. 223.48 s gammaloop-nextest-integration> stdout ---
  274. 223.48 s gammaloop-nextest-integration>
  275. 223.48 s gammaloop-nextest-integration> running 1 test
  276. 223.48 s gammaloop-nextest-integration> test aa_aa::important::aa_aa_local_inspect_backend_consistency ... FAILED
  277. 223.48 s gammaloop-nextest-integration>
  278. 223.48 s gammaloop-nextest-integration> failures:
  279. 223.48 s gammaloop-nextest-integration>
  280. 223.48 s gammaloop-nextest-integration> failures:
  281. 223.48 s gammaloop-nextest-integration> aa_aa::important::aa_aa_local_inspect_backend_consistency
  282. 223.48 s gammaloop-nextest-integration>
  283. 223.48 s gammaloop-nextest-integration> test result: FAILED. 0 passed; 1 failed; 0 ignored; 0 measured; 274 filtered out; finished in 2.78s
  284. 223.48 s gammaloop-nextest-integration>
  285. 223.48 s gammaloop-nextest-integration> stderr ---
  286. 223.48 s gammaloop-nextest-integration> [2026-09-18 22:25:58.332] @gammaloop_api::se... INFO : Running command import model sm-default.json
  287. 223.48 s gammaloop-nextest-integration> [2026-09-18 22:25:58.332] @import::model INFO : Loading built-in JSON model sm-default
  288. 223.48 s gammaloop-nextest-integration> [2026-09-18 22:25:58.354] @gammalooprs::model INFO : The following 15 external parameters were forced to zero by the restriction card:
  289. 223.48 s gammaloop-nextest-integration> lamWS, AWS, rhoWS, etaWS, ymc, yme, ymm, MC, Me, MM, WTau, muQ, muLe, muLmu, muLtau
  290. 223.48 s gammaloop-nextest-integration> [2026-09-18 22:25:58.354] @gammalooprs::model INFO : The following 34 vertex rules were removed by the restriction card:
  291. 223.48 s gammaloop-nextest-integration> V_82 -> (c~, d, G+) | V_83 -> (t~, d, G+) | V_84 -> (c~, s, G+) | V_85 -> (t~, s, G+) | V_86 -> (u~, b, G+) | V_87 -> (c~, b, G+) | V_90 -> (c~, d, W+) | V_91 -> (t~, d, W+) | V_92 -> (u~, s, W+) | V_94 -> (t~, s, W+) | V_95 -> (u~, b, W+) | V_96 -> (c~, b, W+) | V_101 -> (e+, e-, G0) | V_102 -> (mu+, mu-, G0) | V_104 -> (e+, e-, H) | V_105 -> (mu+, mu-, H) | V_110 -> (ve~, e-, G+) | V_111 -> (vm~, mu-, G+) | V_116 -> (b~, u, G-) | V_117 -> (d~, c, G-) | V_118 -> (s~, c, G-) | V_119 -> (b~, c, G-) | V_120 -> (d~, t, G-) | V_121 -> (s~, t, G-) | V_124 -> (s~, u, W-) | V_125 -> (b~, u, W-) | V_126 -> (d~, c, W-) | V_128 -> (b~, c, W-) | V_129 -> (d~, t, W-) | V_130 -> (s~, t, W-) | V_138 -> (c~, c, G0) | V_140 -> (c~, c, H) | V_145 -> (e+, ve, G-) | V_146 -> (mu+, vm, G-)
  292. 223.48 s gammaloop-nextest-integration> [2026-09-18 22:25:58.354] @gammalooprs::model INFO : The following 36 couplings were removed by the restriction card:
  293. 223.48 s gammaloop-nextest-integration> GC_13, GC_14, GC_16, GC_17, GC_18, GC_19, GC_20, GC_22, GC_23, GC_24, GC_25, GC_26, GC_28, GC_29, GC_42, GC_43, GC_44, GC_46, GC_47, GC_48, GC_84, GC_85, GC_86, GC_87, GC_88, GC_89, GC_90, GC_91, GC_92, GC_93, GC_101, GC_102, GC_103, GC_105, GC_106, GC_107
  294. 223.48 s gammaloop-nextest-integration> [2026-09-18 22:25:58.354] @gammaloop_api::se... INFO : Running command run set_model_parameters
  295. 223.48 s gammaloop-nextest-integration> [2026-09-18 22:25:58.354] @gammaloop_api::se... INFO : Starting command block set_model_parameters
  296. 223.48 s gammaloop-nextest-integration> [2026-09-18 22:25:58.354] @gammaloop_api::se... INFO : Running command set model MT=173.0
  297. 223.48 s gammaloop-nextest-integration> [2026-09-18 22:25:58.359] @gammaloop_api::se... INFO : Running command set model WT=0.0
  298. 223.48 s gammaloop-nextest-integration> [2026-09-18 22:25:58.363] @gammaloop_api::se... INFO : Running command set model ymt=173.0
  299. 223.48 s gammaloop-nextest-integration> [2026-09-18 22:25:58.368] @gammaloop_api::se... INFO : Running command set model aS=0.118
  300. 223.48 s gammaloop-nextest-integration> [2026-09-18 22:25:58.372] @gammaloop_api::se... INFO : Running command set model aEWM1=137.036
  301. 223.48 s gammaloop-nextest-integration> [2026-09-18 22:25:58.376] @gammaloop_api::se... INFO : Running command set model Gf=1.166390e-05
  302. 223.48 s gammaloop-nextest-integration> [2026-09-18 22:25:58.381] @gammaloop_api::se... INFO : Running command set model MZ=91.188
  303. 223.48 s gammaloop-nextest-integration> [2026-09-18 22:25:58.386] @gammaloop_api::se... INFO : Running command set global string '
  304. 223.48 s gammaloop-nextest-integration> [global.generation.compile]
  305. 223.48 s gammaloop-nextest-integration> compilation_mode = "symjit"
  306. 223.48 s gammaloop-nextest-integration> optimization_level = "O0"
  307. 223.48 s gammaloop-nextest-integration> fast_math = false
  308. 223.48 s gammaloop-nextest-integration> [...]
  309. 223.48 s gammaloop-nextest-integration> [2026-09-18 22:25:58.386] @gammaloop_api::se... INFO : Running command import graphs ./examples/cli/aa_aa/1L/aa_aa_1L.dot -p aa_aa_all_helicities -i 1L_ppmm -o
  310. 223.48 s gammaloop-nextest-integration> [2026-09-18 22:25:58.386] @commands::import INFO : Loading graphs from '/build/source/examples/cli/aa_aa/1L/aa_aa_1L.dot'
  311. 223.48 s gammaloop-nextest-integration> [2026-09-18 22:25:58.396] @gammaloop_api::se... INFO : Running command generate existing -p aa_aa_all_helicities
  312. 223.48 s gammaloop-nextest-integration> The application panicked (crashed).
  313. 223.48 s gammaloop-nextest-integration> Message: label _func_power_ not found
  314. 223.48 s gammaloop-nextest-integration> Location: /nix/store/n9w914kh1cm59xx3spcs831cdyb56m32-vendor-cargo-deps/c19b7c6f923b580ac259164a89f2577984ad5ab09ee9d583b888f934adbbe8d0/symjit-2.25.6/src/symjit/assembler.rs:77
  315. 223.48 s gammaloop-nextest-integration>
  316. 223.48 s gammaloop-nextest-integration> ━━━━━━━━━━━━━━━━━━━━━━━━━━━━━━━━━━ BACKTRACE ━━━━━━━━━━━━━━━━━━━━━━━━━━━━━━━━━━━
  317. 223.48 s gammaloop-nextest-integration> 1: <color_eyre[51793ea62743adbd]::config::PanicHook>::panic_report<unknown>
  318. 223.48 s gammaloop-nextest-integration> at <unknown source file>:<unknown line>
  319. 223.48 s gammaloop-nextest-integration> 2: <color_eyre[51793ea62743adbd]::config::PanicHook>::into_panic_hook::{closure#0}<unknown>
  320. 223.48 s gammaloop-nextest-integration> at <unknown source file>:<unknown line>
  321. 223.48 s gammaloop-nextest-integration> 3: std[bcb96dfbba0ab899]::panicking::panic_with_hook<unknown>
  322. 223.48 s gammaloop-nextest-integration> at <unknown source file>:<unknown line>
  323. 223.48 s gammaloop-nextest-integration> 4: std[bcb96dfbba0ab899]::panicking::panic_handler::{closure#0}<unknown>
  324. 223.48 s gammaloop-nextest-integration> at <unknown source file>:<unknown line>
  325. 223.48 s gammaloop-nextest-integration> 5: std[bcb96dfbba0ab899]::sys::backtrace::__rust_end_short_backtrace::<std[bcb96dfbba0ab899]::panicking::panic_handler::{closure#0}, !><unknown>
  326. 223.48 s gammaloop-nextest-integration> at <unknown source file>:<unknown line>
  327. 223.48 s gammaloop-nextest-integration> 6: __rustc[6c289b9f9c454d21]::rust_begin_unwind<unknown>
  328. 223.48 s gammaloop-nextest-integration> at <unknown source file>:<unknown line>
  329. 223.48 s gammaloop-nextest-integration> 7: core[940e698046960fd5]::panicking::panic_fmt<unknown>
  330. 223.48 s gammaloop-nextest-integration> at <unknown source file>:<unknown line>
  331. 223.48 s gammaloop-nextest-integration> 8: <symjit[e408de789c333cd]::symjit::assembler::Assembler>::apply_jumps<unknown>
  332. 223.48 s gammaloop-nextest-integration> at <unknown source file>:<unknown line>
  333. 223.48 s gammaloop-nextest-integration> 9: <symjit[e408de789c333cd]::symjit::builder::Builder>::compile_from_mir::<symjit[e408de789c333cd]::symjit::amd::complex::AmdComplexGenerator><unknown>
  334. 223.48 s gammaloop-nextest-integration> at <unknown source file>:<unknown line>
  335. 223.48 s gammaloop-nextest-integration> 10: <symjit[e408de789c333cd]::symjit::runnable::Application>::compile_ty<unknown>
  336. 223.48 s gammaloop-nextest-integration> at <unknown source file>:<unknown line>
  337. 223.48 s gammaloop-nextest-integration> 11: <symjit[e408de789c333cd]::symjit::runnable::Application>::with_mir<unknown>
  338. 223.48 s gammaloop-nextest-integration> at <unknown source file>:<unknown line>
  339. 223.48 s gammaloop-nextest-integration> 12: <symjit[e408de789c333cd]::symjit::composer::DirectTranslator as symjit[e408de789c333cd]::symjit::composer::Composer>::compile<unknown>
  340. 223.48 s gammaloop-nextest-integration> at <unknown source file>:<unknown line>
  341. 223.48 s gammaloop-nextest-integration> 13: <symjit[e408de789c333cd]::symjit::compiler::Translator as symjit[e408de789c333cd]::symjit::composer::Composer>::compile<unknown>
  342. 223.48 s gammaloop-nextest-integration> at <unknown source file>:<unknown line>
  343. 223.48 s gammaloop-nextest-integration> 14: <numerica[124dab8567f4861e]::domains::float::complex::Complex<f64> as symbolica[10e259bab675d243]::evaluate::backend::JITCompiledNumber>::jit_compile<unknown>
  344. 223.48 s gammaloop-nextest-integration> at <unknown source file>:<unknown line>
  345. 223.48 s gammaloop-nextest-integration> 15: <gammalooprs[917cbd3df9e68f8f]::integrands::process::evaluators::GenericEvaluator>::activate_symjit<unknown>
  346. 223.48 s gammaloop-nextest-integration> at <unknown source file>:<unknown line>
  347. 223.48 s gammaloop-nextest-integration> 16: <gammalooprs[917cbd3df9e68f8f]::integrands::process::amplitude::AmplitudeIntegrand>::prepare_runtime_backends_after_generation_with_compile_times<unknown>
  348. 223.48 s gammaloop-nextest-integration> at <unknown source file>:<unknown line>
  349. 223.48 s gammaloop-nextest-integration> 17: <gammalooprs[917cbd3df9e68f8f]::processes::amplitude::Amplitude>::build_integrand<unknown>
  350. 223.48 s gammaloop-nextest-integration> at <unknown source file>:<unknown line>
  351. 223.48 s gammaloop-nextest-integration> 18: <gammalooprs[917cbd3df9e68f8f]::processes::process::Process>::generate_integrands<unknown>
  352. 223.48 s gammaloop-nextest-integration> at <unknown source file>:<unknown line>
  353. 223.48 s gammaloop-nextest-integration> 19: <gammaloop_api[9ebf6628f97aeb57]::state::State>::generate_integrand<unknown>
  354. 223.48 s gammaloop-nextest-integration> at <unknown source file>:<unknown line>
  355. 223.48 s gammaloop-nextest-integration> 20: <gammaloop_api[9ebf6628f97aeb57]::commands::generate::Generate>::run::<&std[bcb96dfbba0ab899]::path::PathBuf><unknown>
  356. 223.48 s gammaloop-nextest-integration> at <unknown source file>:<unknown line>
  357. 223.48 s gammaloop-nextest-integration> 21: <gammaloop_api[9ebf6628f97aeb57]::commands::Commands>::run<unknown>
  358. 223.48 s gammaloop-nextest-integration> at <unknown source file>:<unknown line>
  359. 223.48 s gammaloop-nextest-integration> 22: <gammaloop_api[9ebf6628f97aeb57]::session::CliSession>::execute_prepared<unknown>
  360. 223.48 s gammaloop-nextest-integration> at <unknown source file>:<unknown line>
  361. 223.48 s gammaloop-nextest-integration> 23: <gammaloop_api[9ebf6628f97aeb57]::session::CliSession>::execute_command<unknown>
  362. 223.48 s gammaloop-nextest-integration> at <unknown source file>:<unknown line>
  363. 223.48 s gammaloop-nextest-integration> 24: <gammaloop_integration_tests[191607b70c61cd5a]::CLIState>::run_command<unknown>
  364. 223.48 s gammaloop-nextest-integration> at <unknown source file>:<unknown line>
  365. 223.48 s gammaloop-nextest-integration> 25: test_runs[9b7e2dc2dc4f29b0]::aa_aa::generate_aa_aa_helicity_family<unknown>
  366. 223.48 s gammaloop-nextest-integration> at <unknown source file>:<unknown line>
  367. 223.48 s gammaloop-nextest-integration> 26: <test_runs[9b7e2dc2dc4f29b0]::aa_aa::important::aa_aa_local_inspect_backend_consistency::{closure#0} as core[940e698046960fd5]::ops::function::FnOnce<()>>::call_once<unknown>
  368. 223.48 s gammaloop-nextest-integration> at <unknown source file>:<unknown line>
  369. 223.48 s gammaloop-nextest-integration> 27: serial_test[cd99724524a2f1c0]::serial_code_lock::local_serial_core_with_return::<(), eyre[cb2fd339c0c40fca]::Report><unknown>
  370. 223.48 s gammaloop-nextest-integration> at <unknown source file>:<unknown line>
  371. 223.48 s gammaloop-nextest-integration> 28: <test_runs[9b7e2dc2dc4f29b0]::aa_aa::important::aa_aa_local_inspect_backend_consistency::{closure#0} as core[940e698046960fd5]::ops::function::FnOnce<()>>::call_once<unknown>
  372. 223.48 s gammaloop-nextest-integration> at <unknown source file>:<unknown line>
  373. 223.48 s gammaloop-nextest-integration> 29: test[75d6903177b1d7e9]::__rust_begin_short_backtrace::<core[940e698046960fd5]::result::Result<(), alloc[2ea6bcb46fca0c42]::string::String>, fn() -> core[940e698046960fd5]::result::Result<(), alloc[2ea6bcb46fca0c42]::string::String>><unknown>
  374. 223.48 s gammaloop-nextest-integration> at <unknown source file>:<unknown line>
  375. 223.48 s gammaloop-nextest-integration> 30: test[75d6903177b1d7e9]::run_test::{closure#0}<unknown>
  376. 223.48 s gammaloop-nextest-integration> at <unknown source file>:<unknown line>
  377. 223.48 s gammaloop-nextest-integration> 31: std[bcb96dfbba0ab899]::sys::backtrace::__rust_begin_short_backtrace::<test[75d6903177b1d7e9]::run_test::{closure#1}, ()><unknown>
  378. 223.48 s gammaloop-nextest-integration> at <unknown source file>:<unknown line>
  379. 223.48 s gammaloop-nextest-integration> 32: <std[bcb96dfbba0ab899]::thread::lifecycle::spawn_unchecked<test[75d6903177b1d7e9]::run_test::{closure#1}, ()>::{closure#1} as core[940e698046960fd5]::ops::function::FnOnce<()>>::call_once::{shim:vtable#0}<unknown>
  380. 223.48 s gammaloop-nextest-integration> at <unknown source file>:<unknown line>
  381. 223.48 s gammaloop-nextest-integration> 33: <std[bcb96dfbba0ab899]::sys::thread::unix::Thread>::new::thread_start<unknown>
  382. 223.48 s gammaloop-nextest-integration> at <unknown source file>:<unknown line>
  383. 223.48 s gammaloop-nextest-integration> 34: start_thread<unknown>
  384. 223.48 s gammaloop-nextest-integration> at <unknown source file>:<unknown line>
  385. 223.48 s gammaloop-nextest-integration> 35: __clone3<unknown>
  386. 223.48 s gammaloop-nextest-integration> at <unknown source file>:<unknown line>
  387. 223.48 s gammaloop-nextest-integration>
  388. 223.48 s gammaloop-nextest-integration> Run with COLORBT_SHOW_HIDDEN=1 environment variable to disable frame filtering.
  389. 223.48 s gammaloop-nextest-integration> Run with RUST_BACKTRACE=full to include source snippets.
  390. 223.48 s gammaloop-nextest-integration> Warning: SpanTrace capture is Unsupported.
  391. 223.48 s gammaloop-nextest-integration> Ensure that you've setup a tracing-error ErrorLayer and the semver versions are compatible
  392. 223.48 s gammaloop-nextest-integration>
  393. 223.48 s gammaloop-nextest-integration> FAIL [ 2.965s] (157/170) gammaloop-integration-tests::uv thermal_sunrise_uv
  394. 223.48 s gammaloop-nextest-integration> stdout ---
  395. 223.48 s gammaloop-nextest-integration>
  396. 223.48 s gammaloop-nextest-integration> running 1 test
  397. 223.48 s gammaloop-nextest-integration> test thermal_sunrise_uv ... FAILED
  398. 223.48 s gammaloop-nextest-integration>
  399. 223.48 s gammaloop-nextest-integration> failures:
  400. 223.48 s gammaloop-nextest-integration>
  401. 223.48 s gammaloop-nextest-integration> failures:
  402. 223.48 s gammaloop-nextest-integration> thermal_sunrise_uv
  403. 223.48 s gammaloop-nextest-integration>
  404. 223.48 s gammaloop-nextest-integration> test result: FAILED. 0 passed; 1 failed; 0 ignored; 0 measured; 31 filtered out; finished in 2.95s
  405. 223.48 s gammaloop-nextest-integration>
  406. 223.48 s gammaloop-nextest-integration> stderr ---
  407. 223.48 s gammaloop-nextest-integration> [2026-09-18 22:26:40.402] @gammaloop_api::se... INFO : Running command run generate
  408. 223.48 s gammaloop-nextest-integration> [2026-09-18 22:26:40.402] @gammaloop_api::se... INFO : Starting command block generate
  409. 223.48 s gammaloop-nextest-integration> [2026-09-18 22:26:40.402] @gammaloop_api::se... INFO : Running command import model sm-default.json
  410. 223.48 s gammaloop-nextest-integration> [2026-09-18 22:26:40.402] @import::model INFO : Loading built-in JSON model sm-default
  411. 223.48 s gammaloop-nextest-integration> [2026-09-18 22:26:40.429] @gammalooprs::model INFO : The following 15 external parameters were forced to zero by the restriction card:
  412. 223.48 s gammaloop-nextest-integration> lamWS, AWS, rhoWS, etaWS, ymc, yme, ymm, MC, Me, MM, WTau, muQ, muLe, muLmu, muLtau
  413. 223.48 s gammaloop-nextest-integration> [2026-09-18 22:26:40.429] @gammalooprs::model INFO : The following 34 vertex rules were removed by the restriction card:
  414. 223.48 s gammaloop-nextest-integration> V_82 -> (c~, d, G+) | V_83 -> (t~, d, G+) | V_84 -> (c~, s, G+) | V_85 -> (t~, s, G+) | V_86 -> (u~, b, G+) | V_87 -> (c~, b, G+) | V_90 -> (c~, d, W+) | V_91 -> (t~, d, W+) | V_92 -> (u~, s, W+) | V_94 -> (t~, s, W+) | V_95 -> (u~, b, W+) | V_96 -> (c~, b, W+) | V_101 -> (e+, e-, G0) | V_102 -> (mu+, mu-, G0) | V_104 -> (e+, e-, H) | V_105 -> (mu+, mu-, H) | V_110 -> (ve~, e-, G+) | V_111 -> (vm~, mu-, G+) | V_116 -> (b~, u, G-) | V_117 -> (d~, c, G-) | V_118 -> (s~, c, G-) | V_119 -> (b~, c, G-) | V_120 -> (d~, t, G-) | V_121 -> (s~, t, G-) | V_124 -> (s~, u, W-) | V_125 -> (b~, u, W-) | V_126 -> (d~, c, W-) | V_128 -> (b~, c, W-) | V_129 -> (d~, t, W-) | V_130 -> (s~, t, W-) | V_138 -> (c~, c, G0) | V_140 -> (c~, c, H) | V_145 -> (e+, ve, G-) | V_146 -> (mu+, vm, G-)
  415. 223.48 s gammaloop-nextest-integration> [2026-09-18 22:26:40.429] @gammalooprs::model INFO : The following 36 couplings were removed by the restriction card:
  416. 223.48 s gammaloop-nextest-integration> GC_13, GC_14, GC_16, GC_17, GC_18, GC_19, GC_20, GC_22, GC_23, GC_24, GC_25, GC_26, GC_28, GC_29, GC_42, GC_43, GC_44, GC_46, GC_47, GC_48, GC_84, GC_85, GC_86, GC_87, GC_88, GC_89, GC_90, GC_91, GC_92, GC_93, GC_101, GC_102, GC_103, GC_105, GC_106, GC_107
  417. 223.48 s gammaloop-nextest-integration> [2026-09-18 22:26:40.429] @gammaloop_api::se... INFO : Running command remove processes
  418. 223.48 s gammaloop-nextest-integration> [2026-09-18 22:26:40.429] @gammaloop_api::se... INFO : Running command generate amp {} > {} [{2}] | g u
  419. 223.48 s gammaloop-nextest-integration> --numerator-grouping group_identical_graphs_up_to_scalar_rescaling
  420. 223.48 s gammaloop-nextest-integration> --max-n-bridges 0
  421. 223.48 s gammaloop-nextest-integration> --number-of-factorized-loop-subtopologies 1 1
  422. 223.48 s gammaloop-nextest-integration> --number-of-anticommutating-loops 1 1
  423. 223.48 s gammaloop-nextest-integration> [...]
  424. 223.48 s gammaloop-nextest-integration> [2026-09-18 22:26:40.431] @feyngen::diagram_... INFO : 0s | Δ=0s | Starting Feynman graph generation with Symbolica...
  425. 223.48 s gammaloop-nextest-integration> [2026-09-18 22:26:40.431] @feyngen::diagram_... INFO : 0s | Δ=0s | Number of graphs resulting from Symbolica generation: 3
  426. 223.48 s gammaloop-nextest-integration> [2026-09-18 22:26:40.431] @feyngen::diagram_... INFO : 0s | Δ=0s | Number of graphs retained after removal of vetoed topologies: 2
  427. 223.48 s gammaloop-nextest-integration> [2026-09-18 22:26:40.431] @feyngen::diagram_... INFO : 0s | Δ=0s | Number of graphs after vertex info assignment: 2
  428. 223.48 s gammaloop-nextest-integration> [2026-09-18 22:26:40.431] @feyngen::diagram_... INFO : 0s | Δ=0s | Number of graphs after all complete graphs filters are applied: 2
  429. 223.48 s gammaloop-nextest-integration> [2026-09-18 22:26:40.431] @feyngen::diagram_... INFO : 0s | Δ=0s | Number of graphs after closed anticommutating chains analysis: 1
  430. 223.48 s gammaloop-nextest-integration> [2026-09-18 22:26:40.431] @feyngen::diagram_... INFO : 0s | Δ=0s | Number of graphs after symmetrization of external states: 1
  431. 223.48 s gammaloop-nextest-integration> [2026-09-18 22:26:40.431] @feyngen::diagram_... INFO : 0s | Δ=0s | Number of graphs after canonization of vertices, edges and flows (graph labels assigned here): 1
  432. 223.48 s gammaloop-nextest-integration> [2026-09-18 22:26:40.444] @feyngen::diagram_... INFO : 0s | Δ=0s | Number of graphs after numerator-aware grouping with strategy 'up to a scalar rescaling': 1 (1 isomorphically unique graph, 0 color zero, 0 lorentz zero, 0 grouped and 0 cancellation)
  433. 223.48 s gammaloop-nextest-integration> [2026-09-18 22:26:40.444] @feyngen::diagram_... INFO : ( Sum of the symmetry factors from each graph generated = -1/2 )
  434. 223.48 s gammaloop-nextest-integration> [2026-09-18 22:26:40.444] @commands::generate INFO : Generated amplitude 1 graphs.
  435. 223.48 s gammaloop-nextest-integration> [2026-09-18 22:26:40.444] @commands::generate INFO : Only diagram generation was requested, skipping integrand generation. You can generate integrands later using the 'generate existing <options>' command.
  436. 223.48 s gammaloop-nextest-integration> [2026-09-18 22:26:40.444] @gammaloop_api::se... INFO : Running command generate
  437. 223.48 s gammaloop-nextest-integration> The application panicked (crashed).
  438. 223.48 s gammaloop-nextest-integration> Message: label _func_power_ not found
  439. 223.48 s gammaloop-nextest-integration> Location: /nix/store/n9w914kh1cm59xx3spcs831cdyb56m32-vendor-cargo-deps/c19b7c6f923b580ac259164a89f2577984ad5ab09ee9d583b888f934adbbe8d0/symjit-2.25.6/src/symjit/assembler.rs:77
  440. 223.48 s gammaloop-nextest-integration>
  441. 223.48 s gammaloop-nextest-integration> ━━━━━━━━━━━━━━━━━━━━━━━━━━━━━━━━━━ BACKTRACE ━━━━━━━━━━━━━━━━━━━━━━━━━━━━━━━━━━━
  442. 223.48 s gammaloop-nextest-integration> 1: <color_eyre[51793ea62743adbd]::config::PanicHook>::panic_report<unknown>
  443. 223.48 s gammaloop-nextest-integration> at <unknown source file>:<unknown line>
  444. 223.48 s gammaloop-nextest-integration> 2: <color_eyre[51793ea62743adbd]::config::PanicHook>::into_panic_hook::{closure#0}<unknown>
  445. 223.48 s gammaloop-nextest-integration> at <unknown source file>:<unknown line>
  446. 223.48 s gammaloop-nextest-integration> 3: std[bcb96dfbba0ab899]::panicking::panic_with_hook<unknown>
  447. 223.48 s gammaloop-nextest-integration> at <unknown source file>:<unknown line>
  448. 223.48 s gammaloop-nextest-integration> 4: std[bcb96dfbba0ab899]::panicking::panic_handler::{closure#0}<unknown>
  449. 223.48 s gammaloop-nextest-integration> at <unknown source file>:<unknown line>
  450. 223.48 s gammaloop-nextest-integration> 5: std[bcb96dfbba0ab899]::sys::backtrace::__rust_end_short_backtrace::<std[bcb96dfbba0ab899]::panicking::panic_handler::{closure#0}, !><unknown>
  451. 223.48 s gammaloop-nextest-integration> at <unknown source file>:<unknown line>
  452. 223.48 s gammaloop-nextest-integration> 6: __rustc[6c289b9f9c454d21]::rust_begin_unwind<unknown>
  453. 223.48 s gammaloop-nextest-integration> at <unknown source file>:<unknown line>
  454. 223.48 s gammaloop-nextest-integration> 7: core[940e698046960fd5]::panicking::panic_fmt<unknown>
  455. 223.48 s gammaloop-nextest-integration> at <unknown source file>:<unknown line>
  456. 223.48 s gammaloop-nextest-integration> 8: <symjit[e408de789c333cd]::symjit::assembler::Assembler>::apply_jumps<unknown>
  457. 223.48 s gammaloop-nextest-integration> at <unknown source file>:<unknown line>
  458. 223.48 s gammaloop-nextest-integration> 9: <symjit[e408de789c333cd]::symjit::builder::Builder>::compile_from_mir::<symjit[e408de789c333cd]::symjit::amd::complex::AmdComplexGenerator><unknown>
  459. 223.48 s gammaloop-nextest-integration> at <unknown source file>:<unknown line>
  460. 223.48 s gammaloop-nextest-integration> 10: <symjit[e408de789c333cd]::symjit::runnable::Application>::compile_ty<unknown>
  461. 223.48 s gammaloop-nextest-integration> at <unknown source file>:<unknown line>
  462. 223.48 s gammaloop-nextest-integration> 11: <symjit[e408de789c333cd]::symjit::runnable::Application>::with_mir<unknown>
  463. 223.48 s gammaloop-nextest-integration> at <unknown source file>:<unknown line>
  464. 223.48 s gammaloop-nextest-integration> 12: <symjit[e408de789c333cd]::symjit::composer::DirectTranslator as symjit[e408de789c333cd]::symjit::composer::Composer>::compile<unknown>
  465. 223.48 s gammaloop-nextest-integration> at <unknown source file>:<unknown line>
  466. 223.48 s gammaloop-nextest-integration> 13: <symjit[e408de789c333cd]::symjit::compiler::Translator as symjit[e408de789c333cd]::symjit::composer::Composer>::compile<unknown>
  467. 223.48 s gammaloop-nextest-integration> at <unknown source file>:<unknown line>
  468. 223.48 s gammaloop-nextest-integration> 14: <numerica[124dab8567f4861e]::domains::float::complex::Complex<f64> as symbolica[10e259bab675d243]::evaluate::backend::JITCompiledNumber>::jit_compile<unknown>
  469. 223.48 s gammaloop-nextest-integration> at <unknown source file>:<unknown line>
  470. 223.48 s gammaloop-nextest-integration> 15: <gammalooprs[917cbd3df9e68f8f]::integrands::process::evaluators::GenericEvaluator>::activate_symjit<unknown>
  471. 223.48 s gammaloop-nextest-integration> at <unknown source file>:<unknown line>
  472. 223.48 s gammaloop-nextest-integration> 16: <gammalooprs[917cbd3df9e68f8f]::integrands::process::amplitude::AmplitudeIntegrand>::prepare_runtime_backends_after_generation_with_compile_times<unknown>
  473. 223.48 s gammaloop-nextest-integration> at <unknown source file>:<unknown line>
  474. 223.48 s gammaloop-nextest-integration> 17: <gammalooprs[917cbd3df9e68f8f]::processes::amplitude::Amplitude>::build_integrand<unknown>
  475. 223.48 s gammaloop-nextest-integration> at <unknown source file>:<unknown line>
  476. 223.48 s gammaloop-nextest-integration> 18: <gammalooprs[917cbd3df9e68f8f]::processes::process::Process>::generate_integrands<unknown>
  477. 223.48 s gammaloop-nextest-integration> at <unknown source file>:<unknown line>
  478. 223.48 s gammaloop-nextest-integration> 19: <gammalooprs[917cbd3df9e68f8f]::processes::ProcessList>::generate_integrands<unknown>
  479. 223.48 s gammaloop-nextest-integration> at <unknown source file>:<unknown line>
  480. 223.48 s gammaloop-nextest-integration> 20: <gammaloop_api[9ebf6628f97aeb57]::state::State>::generate_integrands<unknown>
  481. 223.48 s gammaloop-nextest-integration> at <unknown source file>:<unknown line>
  482. 223.48 s gammaloop-nextest-integration> 21: <gammaloop_api[9ebf6628f97aeb57]::commands::generate::Generate>::run::<&std[bcb96dfbba0ab899]::path::PathBuf><unknown>
  483. 223.48 s gammaloop-nextest-integration> at <unknown source file>:<unknown line>
  484. 223.48 s gammaloop-nextest-integration> 22: <gammaloop_api[9ebf6628f97aeb57]::commands::Commands>::run<unknown>
  485. 223.48 s gammaloop-nextest-integration> at <unknown source file>:<unknown line>
  486. 223.48 s gammaloop-nextest-integration> 23: <gammaloop_api[9ebf6628f97aeb57]::session::CliSession>::execute_prepared<unknown>
  487. 223.48 s gammaloop-nextest-integration> at <unknown source file>:<unknown line>
  488. 223.48 s gammaloop-nextest-integration> 24: <gammaloop_api[9ebf6628f97aeb57]::session::CliSession>::execute_prepared_commands<unknown>
  489. 223.48 s gammaloop-nextest-integration> at <unknown source file>:<unknown line>
  490. 223.48 s gammaloop-nextest-integration> 25: <gammaloop_api[9ebf6628f97aeb57]::session::CliSession>::execute_prepared<unknown>
  491. 223.48 s gammaloop-nextest-integration> at <unknown source file>:<unknown line>
  492. 223.48 s gammaloop-nextest-integration> 26: <gammaloop_api[9ebf6628f97aeb57]::session::CliSession>::execute_command<unknown>
  493. 223.48 s gammaloop-nextest-integration> at <unknown source file>:<unknown line>
  494. 223.48 s gammaloop-nextest-integration> 27: <gammaloop_integration_tests[191607b70c61cd5a]::CLIState>::run_command<unknown>
  495. 223.48 s gammaloop-nextest-integration> at <unknown source file>:<unknown line>
  496. 223.48 s gammaloop-nextest-integration> 28: uv[3c7454ef256d6487]::run_single_integrated_uv_case<unknown>
  497. 223.48 s gammaloop-nextest-integration> at <unknown source file>:<unknown line>
  498. 223.48 s gammaloop-nextest-integration> 29: <uv[3c7454ef256d6487]::thermal_sunrise_uv::{closure#0} as core[940e698046960fd5]::ops::function::FnOnce<()>>::call_once<unknown>
  499. 223.48 s gammaloop-nextest-integration> at <unknown source file>:<unknown line>
  500. 223.48 s gammaloop-nextest-integration> 30: test[75d6903177b1d7e9]::__rust_begin_short_backtrace::<core[940e698046960fd5]::result::Result<(), alloc[2ea6bcb46fca0c42]::string::String>, fn() -> core[940e698046960fd5]::result::Result<(), alloc[2ea6bcb46fca0c42]::string::String>><unknown>
  501. 223.48 s gammaloop-nextest-integration> at <unknown source file>:<unknown line>
  502. 223.48 s gammaloop-nextest-integration> 31: test[75d6903177b1d7e9]::run_test::{closure#0}<unknown>
  503. 223.48 s gammaloop-nextest-integration> at <unknown source file>:<unknown line>
  504. 223.48 s gammaloop-nextest-integration> 32: std[bcb96dfbba0ab899]::sys::backtrace::__rust_begin_short_backtrace::<test[75d6903177b1d7e9]::run_test::{closure#1}, ()><unknown>
  505. 223.48 s gammaloop-nextest-integration> at <unknown source file>:<unknown line>
  506. 223.48 s gammaloop-nextest-integration> 33: <std[bcb96dfbba0ab899]::thread::lifecycle::spawn_unchecked<test[75d6903177b1d7e9]::run_test::{closure#1}, ()>::{closure#1} as core[940e698046960fd5]::ops::function::FnOnce<()>>::call_once::{shim:vtable#0}<unknown>
  507. 223.48 s gammaloop-nextest-integration> at <unknown source file>:<unknown line>
  508. 223.48 s gammaloop-nextest-integration> 34: <std[bcb96dfbba0ab899]::sys::thread::unix::Thread>::new::thread_start<unknown>
  509. 223.48 s gammaloop-nextest-integration> at <unknown source file>:<unknown line>
  510. 223.48 s gammaloop-nextest-integration> 35: start_thread<unknown>
  511. 223.48 s gammaloop-nextest-integration> at <unknown source file>:<unknown line>
  512. 223.48 s gammaloop-nextest-integration> 36: __clone3<unknown>
  513. 223.48 s gammaloop-nextest-integration> at <unknown source file>:<unknown line>
  514. 223.48 s gammaloop-nextest-integration>
  515. 223.48 s gammaloop-nextest-integration> Run with COLORBT_SHOW_HIDDEN=1 environment variable to disable frame filtering.
  516. 223.48 s gammaloop-nextest-integration> Run with RUST_BACKTRACE=full to include source snippets.
  517. 223.48 s gammaloop-nextest-integration> Warning: SpanTrace capture is Unsupported.
  518. 223.48 s gammaloop-nextest-integration> Ensure that you've setup a tracing-error ErrorLayer and the semver versions are compatible
  519. 223.48 s gammaloop-nextest-integration>
  520. 223.71 s gammaloop-nextest-integration> error: test run failed
  521. 223.73 s gammaloop-nextest-integration>
  522. 223.73 s gammaloop-nextest-integration> ========== nextest test summary ==========
  523. 223.73 s gammaloop-nextest-integration> report: target/nextest/ci_gammaloop/junit.xml
  524. 223.73 s gammaloop-nextest-integration> tests: 170, failures: 2, errors: 0
  525. 223.73 s gammaloop-nextest-integration>
  526. 223.73 s gammaloop-nextest-integration> 1. gammaloop-integration-tests::test_runs::aa_aa::important::aa_aa_local_inspect_backend_consistency
  527. 223.73 s gammaloop-nextest-integration> failure: test failure with exit code 101
  528. 223.73 s gammaloop-nextest-integration> system-out
  529. 223.73 s gammaloop-nextest-integration> running 1 test
  530. 223.73 s gammaloop-nextest-integration> test aa_aa::important::aa_aa_local_inspect_backend_consistency ... FAILED
  531. 223.73 s gammaloop-nextest-integration>
  532. 223.73 s gammaloop-nextest-integration> failures:
  533. 223.73 s gammaloop-nextest-integration>
  534. 223.73 s gammaloop-nextest-integration> failures:
  535. 223.73 s gammaloop-nextest-integration> aa_aa::important::aa_aa_local_inspect_backend_consistency
  536. 223.73 s gammaloop-nextest-integration>
  537. 223.73 s gammaloop-nextest-integration> test result: FAILED. 0 passed; 1 failed; 0 ignored; 0 measured; 274 filtered out; finished in 2.78s
  538. 223.73 s gammaloop-nextest-integration> system-err
  539. 223.73 s gammaloop-nextest-integration> [2026-09-18 22:25:58.332] @gammaloop_api::se... INFO : Running command import model sm-default.json
  540. 223.73 s gammaloop-nextest-integration> [2026-09-18 22:25:58.332] @import::model INFO : Loading built-in JSON model sm-default
  541. 223.73 s gammaloop-nextest-integration> [2026-09-18 22:25:58.354] @gammalooprs::model INFO : The following 15 external parameters were forced to zero by the restriction card:
  542. 223.73 s gammaloop-nextest-integration> lamWS, AWS, rhoWS, etaWS, ymc, yme, ymm, MC, Me, MM, WTau, muQ, muLe, muLmu, muLtau
  543. 223.73 s gammaloop-nextest-integration> [2026-09-18 22:25:58.354] @gammalooprs::model INFO : The following 34 vertex rules were removed by the restriction card:
  544. 223.73 s gammaloop-nextest-integration> V_82 -> (c~, d, G+) | V_83 -> (t~, d, G+) | V_84 -> (c~, s, G+) | V_85 -> (t~, s, G+) | V_86 -> (u~, b, G+) | V_87 -> (c~, b, G+) | V_90 -> (c~, d, W+) | V_91 -> (t~, d, W+) | V_92 -> (u~, s, W+) | V_94 -> (t~, s, W+) | V_95 -> (u~, b, W+) | V_96 -> (c~, b, W+) | V_101 -> (e+, e-, G0) | V_102 -> (mu+, mu-, G0) | V_104 -> (e+, e-, H) | V_105 -> (mu+, mu-, H) | V_110 -> (ve~, e-, G+) | V_111 -> (vm~, mu-, G+) | V_116 -> (b~, u, G-) | V_117 -> (d~, c, G-) | V_118 -> (s~, c, G-) | V_119 -> (b~, c, G-) | V_120 -> (d~, t, G-) | V_121 -> (s~, t, G-) | V_124 -> (s~, u, W-) | V_125 -> (b~, u, W-) | V_126 -> (d~, c, W-) | V_128 -> (b~, c, W-) | V_129 -> (d~, t, W-) | V_130 -> (s~, t, W-) | V_138 -> (c~, c, G0) | V_140 -> (c~, c, H) | V_145 -> (e+, ve, G-) | V_146 -> (mu+, vm, G-)
  545. 223.73 s gammaloop-nextest-integration> [2026-09-18 22:25:58.354] @gammalooprs::model INFO : The following 36 couplings were removed by the restriction card:
  546. 223.73 s gammaloop-nextest-integration> GC_13, GC_14, GC_16, GC_17, GC_18, GC_19, GC_20, GC_22, GC_23, GC_24, GC_25, GC_26, GC_28, GC_29, GC_42, GC_43, GC_44, GC_46, GC_47, GC_48, GC_84, GC_85, GC_86, GC_87, GC_88, GC_89, GC_90, GC_91, GC_92, GC_93, GC_101, GC_102, GC_103, GC_105, GC_106, GC_107
  547. 223.73 s gammaloop-nextest-integration> [2026-09-18 22:25:58.354] @gammaloop_api::se... INFO : Running command run set_model_parameters
  548. 223.73 s gammaloop-nextest-integration> [2026-09-18 22:25:58.354] @gammaloop_api::se... INFO : Starting command block set_model_parameters
  549. 223.73 s gammaloop-nextest-integration> [2026-09-18 22:25:58.354] @gammaloop_api::se... INFO : Running command set model MT=173.0
  550. 223.73 s gammaloop-nextest-integration> [2026-09-18 22:25:58.359] @gammaloop_api::se... INFO : Running command set model WT=0.0
  551. 223.73 s gammaloop-nextest-integration> [2026-09-18 22:25:58.363] @gammaloop_api::se... INFO : Running command set model ymt=173.0
  552. 223.73 s gammaloop-nextest-integration> [2026-09-18 22:25:58.368] @gammaloop_api::se... INFO : Running command set model aS=0.118
  553. 223.73 s gammaloop-nextest-integration> [2026-09-18 22:25:58.372] @gammaloop_api::se... INFO : Running command set model aEWM1=137.036
  554. 223.73 s gammaloop-nextest-integration> [2026-09-18 22:25:58.376] @gammaloop_api::se... INFO : Running command set model Gf=1.166390e-05
  555. 223.73 s gammaloop-nextest-integration> [2026-09-18 22:25:58.381] @gammaloop_api::se... INFO : Running command set model MZ=91.188
  556. 223.73 s gammaloop-nextest-integration> [2026-09-18 22:25:58.386] @gammaloop_api::se... INFO : Running command set global string '
  557. 223.73 s gammaloop-nextest-integration> [global.generation.compile]
  558. 223.73 s gammaloop-nextest-integration> compilation_mode = "symjit"
  559. 223.73 s gammaloop-nextest-integration> optimization_level = "O0"
  560. 223.73 s gammaloop-nextest-integration> fast_math = false
  561. 223.73 s gammaloop-nextest-integration> [...]
  562. 223.73 s gammaloop-nextest-integration> [2026-09-18 22:25:58.386] @gammaloop_api::se... INFO : Running command import graphs ./examples/cli/aa_aa/1L/aa_aa_1L.dot -p aa_aa_all_helicities -i 1L_ppmm -o
  563. 223.73 s gammaloop-nextest-integration> [2026-09-18 22:25:58.386] @commands::import INFO : Loading graphs from '/build/source/examples/cli/aa_aa/1L/aa_aa_1L.dot'
  564. 223.73 s gammaloop-nextest-integration> [2026-09-18 22:25:58.396] @gammaloop_api::se... INFO : Running command generate existing -p aa_aa_all_helicities
  565. 223.73 s gammaloop-nextest-integration> The application panicked (crashed).
  566. 223.73 s gammaloop-nextest-integration> Message: label _func_power_ not found
  567. 223.73 s gammaloop-nextest-integration> Location: /nix/store/n9w914kh1cm59xx3spcs831cdyb56m32-vendor-cargo-deps/c19b7c6f923b580ac259164a89f2577984ad5ab09ee9d583b888f934adbbe8d0/symjit-2.25.6/src/symjit/assembler.rs:77
  568. 223.73 s gammaloop-nextest-integration>
  569. 223.73 s gammaloop-nextest-integration> ━━━━━━━━━━━━━━━━━━━━━━━━━━━━━━━━━━ BACKTRACE ━━━━━━━━━━━━━━━━━━━━━━━━━━━━━━━━━━━
  570. 223.73 s gammaloop-nextest-integration> 1: <color_eyre[51793ea62743adbd]::config::PanicHook>::panic_report<unknown>
  571. 223.73 s gammaloop-nextest-integration> at <unknown source file>:<unknown line>
  572. 223.73 s gammaloop-nextest-integration> 2: <color_eyre[51793ea62743adbd]::config::PanicHook>::into_panic_hook::{closure#0}<unknown>
  573. 223.73 s gammaloop-nextest-integration> at <unknown source file>:<unknown line>
  574. 223.73 s gammaloop-nextest-integration> 3: std[bcb96dfbba0ab899]::panicking::panic_with_hook<unknown>
  575. 223.73 s gammaloop-nextest-integration> at <unknown source file>:<unknown line>
  576. 223.73 s gammaloop-nextest-integration> 4: std[bcb96dfbba0ab899]::panicking::panic_handler::{closure#0}<unknown>
  577. 223.73 s gammaloop-nextest-integration> at <unknown source file>:<unknown line>
  578. 223.73 s gammaloop-nextest-integration> 5: std[bcb96dfbba0ab899]::sys::backtrace::__rust_end_short_backtrace::<std[bcb96dfbba0ab899]::panicking::panic_handler::{closure#0}, !><unknown>
  579. 223.73 s gammaloop-nextest-integration> at <unknown source file>:<unknown line>
  580. 223.73 s gammaloop-nextest-integration> 6: __rustc[6c289b9f9c454d21]::rust_begin_unwind<unknown>
  581. 223.73 s gammaloop-nextest-integration> at <unknown source file>:<unknown line>
  582. 223.73 s gammaloop-nextest-integration> 7: core[940e698046960fd5]::panicking::panic_fmt<unknown>
  583. 223.73 s gammaloop-nextest-integration> at <unknown source file>:<unknown line>
  584. 223.73 s gammaloop-nextest-integration> 8: <symjit[e408de789c333cd]::symjit::assembler::Assembler>::apply_jumps<unknown>
  585. 223.73 s gammaloop-nextest-integration> at <unknown source file>:<unknown line>
  586. 223.73 s gammaloop-nextest-integration> 9: <symjit[e408de789c333cd]::symjit::builder::Builder>::compile_from_mir::<symjit[e408de789c333cd]::symjit::amd::complex::AmdComplexGenerator><unknown>
  587. 223.73 s gammaloop-nextest-integration> at <unknown source file>:<unknown line>
  588. 223.73 s gammaloop-nextest-integration> 10: <symjit[e408de789c333cd]::symjit::runnable::Application>::compile_ty<unknown>
  589. 223.73 s gammaloop-nextest-integration> at <unknown source file>:<unknown line>
  590. 223.73 s gammaloop-nextest-integration> 11: <symjit[e408de789c333cd]::symjit::runnable::Application>::with_mir<unknown>
  591. 223.73 s gammaloop-nextest-integration> at <unknown source file>:<unknown line>
  592. 223.73 s gammaloop-nextest-integration> 12: <symjit[e408de789c333cd]::symjit::composer::DirectTranslator as symjit[e408de789c333cd]::symjit::composer::Composer>::compile<unknown>
  593. 223.73 s gammaloop-nextest-integration> at <unknown source file>:<unknown line>
  594. 223.73 s gammaloop-nextest-integration> 13: <symjit[e408de789c333cd]::symjit::compiler::Translator as symjit[e408de789c333cd]::symjit::composer::Composer>::compile<unknown>
  595. 223.73 s gammaloop-nextest-integration> at <unknown source file>:<unknown line>
  596. 223.73 s gammaloop-nextest-integration> 14: <numerica[124dab8567f4861e]::domains::float::complex::Complex<f64> as symbolica[10e259bab675d243]::evaluate::backend::JITCompiledNumber>::jit_compile<unknown>
  597. 223.73 s gammaloop-nextest-integration> at <unknown source file>:<unknown line>
  598. 223.73 s gammaloop-nextest-integration> 15: <gammalooprs[917cbd3df9e68f8f]::integrands::process::evaluators::GenericEvaluator>::activate_symjit<unknown>
  599. 223.73 s gammaloop-nextest-integration> at <unknown source file>:<unknown line>
  600. 223.73 s gammaloop-nextest-integration> 16: <gammalooprs[917cbd3df9e68f8f]::integrands::process::amplitude::AmplitudeIntegrand>::prepare_runtime_backends_after_generation_with_compile_times<unknown>
  601. 223.73 s gammaloop-nextest-integration> at <unknown source file>:<unknown line>
  602. 223.73 s gammaloop-nextest-integration> 17: <gammalooprs[917cbd3df9e68f8f]::processes::amplitude::Amplitude>::build_integrand<unknown>
  603. 223.73 s gammaloop-nextest-integration> at <unknown source file>:<unknown line>
  604. 223.73 s gammaloop-nextest-integration> 18: <gammalooprs[917cbd3df9e68f8f]::processes::process::Process>::generate_integrands<unknown>
  605. 223.73 s gammaloop-nextest-integration> at <unknown source file>:<unknown line>
  606. 223.73 s gammaloop-nextest-integration> 19: <gammaloop_api[9ebf6628f97aeb57]::state::State>::generate_integrand<unknown>
  607. 223.73 s gammaloop-nextest-integration> at <unknown source file>:<unknown line>
  608. 223.73 s gammaloop-nextest-integration> 20: <gammaloop_api[9ebf6628f97aeb57]::commands::generate::Generate>::run::<&std[bcb96dfbba0ab899]::path::PathBuf><unknown>
  609. 223.73 s gammaloop-nextest-integration> at <unknown source file>:<unknown line>
  610. 223.73 s gammaloop-nextest-integration> 21: <gammaloop_api[9ebf6628f97aeb57]::commands::Commands>::run<unknown>
  611. 223.73 s gammaloop-nextest-integration> at <unknown source file>:<unknown line>
  612. 223.73 s gammaloop-nextest-integration> 22: <gammaloop_api[9ebf6628f97aeb57]::session::CliSession>::execute_prepared<unknown>
  613. 223.73 s gammaloop-nextest-integration> at <unknown source file>:<unknown line>
  614. 223.73 s gammaloop-nextest-integration> 23: <gammaloop_api[9ebf6628f97aeb57]::session::CliSession>::execute_command<unknown>
  615. 223.73 s gammaloop-nextest-integration> at <unknown source file>:<unknown line>
  616. 223.73 s gammaloop-nextest-integration> 24: <gammaloop_integration_tests[191607b70c61cd5a]::CLIState>::run_command<unknown>
  617. 223.73 s gammaloop-nextest-integration> at <unknown source file>:<unknown line>
  618. 223.73 s gammaloop-nextest-integration> 25: test_runs[9b7e2dc2dc4f29b0]::aa_aa::generate_aa_aa_helicity_family<unknown>
  619. 223.73 s gammaloop-nextest-integration> at <unknown source file>:<unknown line>
  620. 223.73 s gammaloop-nextest-integration> 26: <test_runs[9b7e2dc2dc4f29b0]::aa_aa::important::aa_aa_local_inspect_backend_consistency::{closure#0} as core[940e698046960fd5]::ops::function::FnOnce<()>>::call_once<unknown>
  621. 223.73 s gammaloop-nextest-integration> at <unknown source file>:<unknown line>
  622. 223.73 s gammaloop-nextest-integration> 27: serial_test[cd99724524a2f1c0]::serial_code_lock::local_serial_core_with_return::<(), eyre[cb2fd339c0c40fca]::Report><unknown>
  623. 223.73 s gammaloop-nextest-integration> at <unknown source file>:<unknown line>
  624. 223.73 s gammaloop-nextest-integration> 28: <test_runs[9b7e2dc2dc4f29b0]::aa_aa::important::aa_aa_local_inspect_backend_consistency::{closure#0} as core[940e698046960fd5]::ops::function::FnOnce<()>>::call_once<unknown>
  625. 223.73 s gammaloop-nextest-integration> at <unknown source file>:<unknown line>
  626. 223.73 s gammaloop-nextest-integration> 29: test[75d6903177b1d7e9]::__rust_begin_short_backtrace::<core[940e698046960fd5]::result::Result<(), alloc[2ea6bcb46fca0c42]::string::String>, fn() -> core[940e698046960fd5]::result::Result<(), alloc[2ea6bcb46fca0c42]::string::String>><unknown>
  627. 223.73 s gammaloop-nextest-integration> at <unknown source file>:<unknown line>
  628. 223.73 s gammaloop-nextest-integration> 30: test[75d6903177b1d7e9]::run_test::{closure#0}<unknown>
  629. 223.73 s gammaloop-nextest-integration> at <unknown source file>:<unknown line>
  630. 223.73 s gammaloop-nextest-integration> 31: std[bcb96dfbba0ab899]::sys::backtrace::__rust_begin_short_backtrace::<test[75d6903177b1d7e9]::run_test::{closure#1}, ()><unknown>
  631. 223.73 s gammaloop-nextest-integration> at <unknown source file>:<unknown line>
  632. 223.73 s gammaloop-nextest-integration> 32: <std[bcb96dfbba0ab899]::thread::lifecycle::spawn_unchecked<test[75d6903177b1d7e9]::run_test::{closure#1}, ()>::{closure#1} as core[940e698046960fd5]::ops::function::FnOnce<()>>::call_once::{shim:vtable#0}<unknown>
  633. 223.73 s gammaloop-nextest-integration> at <unknown source file>:<unknown line>
  634. 223.73 s gammaloop-nextest-integration> 33: <std[bcb96dfbba0ab899]::sys::thread::unix::Thread>::new::thread_start<unknown>
  635. 223.73 s gammaloop-nextest-integration> at <unknown source file>:<unknown line>
  636. 223.73 s gammaloop-nextest-integration> 34: start_thread<unknown>
  637. 223.73 s gammaloop-nextest-integration> at <unknown source file>:<unknown line>
  638. 223.73 s gammaloop-nextest-integration> 35: __clone3<unknown>
  639. 223.73 s gammaloop-nextest-integration> at <unknown source file>:<unknown line>
  640. 223.73 s gammaloop-nextest-integration>
  641. 223.73 s gammaloop-nextest-integration> Run with COLORBT_SHOW_HIDDEN=1 environment variable to disable frame filtering.
  642. 223.73 s gammaloop-nextest-integration> Run with RUST_BACKTRACE=full to include source snippets.
  643. 223.73 s gammaloop-nextest-integration> Warning: SpanTrace capture is Unsupported.
  644. 223.73 s gammaloop-nextest-integration> Ensure that you've setup a tracing-error ErrorLayer and the semver versions are compatible
  645. 223.73 s gammaloop-nextest-integration>
  646. 223.73 s gammaloop-nextest-integration> 2. gammaloop-integration-tests::uv::thermal_sunrise_uv
  647. 223.73 s gammaloop-nextest-integration> failure: test failure with exit code 101
  648. 223.73 s gammaloop-nextest-integration> system-out
  649. 223.73 s gammaloop-nextest-integration> running 1 test
  650. 223.73 s gammaloop-nextest-integration> test thermal_sunrise_uv ... FAILED
  651. 223.73 s gammaloop-nextest-integration>
  652. 223.73 s gammaloop-nextest-integration> failures:
  653. 223.73 s gammaloop-nextest-integration>
  654. 223.73 s gammaloop-nextest-integration> failures:
  655. 223.73 s gammaloop-nextest-integration> thermal_sunrise_uv
  656. 223.73 s gammaloop-nextest-integration>
  657. 223.73 s gammaloop-nextest-integration> test result: FAILED. 0 passed; 1 failed; 0 ignored; 0 measured; 31 filtered out; finished in 2.95s
  658. 223.73 s gammaloop-nextest-integration> system-err
  659. 223.73 s gammaloop-nextest-integration> [2026-09-18 22:26:40.402] @gammaloop_api::se... INFO : Running command run generate
  660. 223.73 s gammaloop-nextest-integration> [2026-09-18 22:26:40.402] @gammaloop_api::se... INFO : Starting command block generate
  661. 223.73 s gammaloop-nextest-integration> [2026-09-18 22:26:40.402] @gammaloop_api::se... INFO : Running command import model sm-default.json
  662. 223.73 s gammaloop-nextest-integration> [2026-09-18 22:26:40.402] @import::model INFO : Loading built-in JSON model sm-default
  663. 223.73 s gammaloop-nextest-integration> [2026-09-18 22:26:40.429] @gammalooprs::model INFO : The following 15 external parameters were forced to zero by the restriction card:
  664. 223.73 s gammaloop-nextest-integration> lamWS, AWS, rhoWS, etaWS, ymc, yme, ymm, MC, Me, MM, WTau, muQ, muLe, muLmu, muLtau
  665. 223.73 s gammaloop-nextest-integration> [2026-09-18 22:26:40.429] @gammalooprs::model INFO : The following 34 vertex rules were removed by the restriction card:
  666. 223.73 s gammaloop-nextest-integration> V_82 -> (c~, d, G+) | V_83 -> (t~, d, G+) | V_84 -> (c~, s, G+) | V_85 -> (t~, s, G+) | V_86 -> (u~, b, G+) | V_87 -> (c~, b, G+) | V_90 -> (c~, d, W+) | V_91 -> (t~, d, W+) | V_92 -> (u~, s, W+) | V_94 -> (t~, s, W+) | V_95 -> (u~, b, W+) | V_96 -> (c~, b, W+) | V_101 -> (e+, e-, G0) | V_102 -> (mu+, mu-, G0) | V_104 -> (e+, e-, H) | V_105 -> (mu+, mu-, H) | V_110 -> (ve~, e-, G+) | V_111 -> (vm~, mu-, G+) | V_116 -> (b~, u, G-) | V_117 -> (d~, c, G-) | V_118 -> (s~, c, G-) | V_119 -> (b~, c, G-) | V_120 -> (d~, t, G-) | V_121 -> (s~, t, G-) | V_124 -> (s~, u, W-) | V_125 -> (b~, u, W-) | V_126 -> (d~, c, W-) | V_128 -> (b~, c, W-) | V_129 -> (d~, t, W-) | V_130 -> (s~, t, W-) | V_138 -> (c~, c, G0) | V_140 -> (c~, c, H) | V_145 -> (e+, ve, G-) | V_146 -> (mu+, vm, G-)
  667. 223.73 s gammaloop-nextest-integration> [2026-09-18 22:26:40.429] @gammalooprs::model INFO : The following 36 couplings were removed by the restriction card:
  668. 223.73 s gammaloop-nextest-integration> GC_13, GC_14, GC_16, GC_17, GC_18, GC_19, GC_20, GC_22, GC_23, GC_24, GC_25, GC_26, GC_28, GC_29, GC_42, GC_43, GC_44, GC_46, GC_47, GC_48, GC_84, GC_85, GC_86, GC_87, GC_88, GC_89, GC_90, GC_91, GC_92, GC_93, GC_101, GC_102, GC_103, GC_105, GC_106, GC_107
  669. 223.73 s gammaloop-nextest-integration> [2026-09-18 22:26:40.429] @gammaloop_api::se... INFO : Running command remove processes
  670. 223.73 s gammaloop-nextest-integration> [2026-09-18 22:26:40.429] @gammaloop_api::se... INFO : Running command generate amp {} > {} [{2}] | g u
  671. 223.73 s gammaloop-nextest-integration> --numerator-grouping group_identical_graphs_up_to_scalar_rescaling
  672. 223.73 s gammaloop-nextest-integration> --max-n-bridges 0
  673. 223.73 s gammaloop-nextest-integration> --number-of-factorized-loop-subtopologies 1 1
  674. 223.73 s gammaloop-nextest-integration> --number-of-anticommutating-loops 1 1
  675. 223.73 s gammaloop-nextest-integration> [...]
  676. 223.73 s gammaloop-nextest-integration> [2026-09-18 22:26:40.431] @feyngen::diagram_... INFO : 0s | Δ=0s | Starting Feynman graph generation with Symbolica...
  677. 223.73 s gammaloop-nextest-integration> [2026-09-18 22:26:40.431] @feyngen::diagram_... INFO : 0s | Δ=0s | Number of graphs resulting from Symbolica generation: 3
  678. 223.73 s gammaloop-nextest-integration> [2026-09-18 22:26:40.431] @feyngen::diagram_... INFO : 0s | Δ=0s | Number of graphs retained after removal of vetoed topologies: 2
  679. 223.73 s gammaloop-nextest-integration> [2026-09-18 22:26:40.431] @feyngen::diagram_... INFO : 0s | Δ=0s | Number of graphs after vertex info assignment: 2
  680. 223.73 s gammaloop-nextest-integration> [2026-09-18 22:26:40.431] @feyngen::diagram_... INFO : 0s | Δ=0s | Number of graphs after all complete graphs filters are applied: 2
  681. 223.73 s gammaloop-nextest-integration> [2026-09-18 22:26:40.431] @feyngen::diagram_... INFO : 0s | Δ=0s | Number of graphs after closed anticommutating chains analysis: 1
  682. 223.73 s gammaloop-nextest-integration> [2026-09-18 22:26:40.431] @feyngen::diagram_... INFO : 0s | Δ=0s | Number of graphs after symmetrization of external states: 1
  683. 223.73 s gammaloop-nextest-integration> [2026-09-18 22:26:40.431] @feyngen::diagram_... INFO : 0s | Δ=0s | Number of graphs after canonization of vertices, edges and flows (graph labels assigned here): 1
  684. 223.73 s gammaloop-nextest-integration> [2026-09-18 22:26:40.444] @feyngen::diagram_... INFO : 0s | Δ=0s | Number of graphs after numerator-aware grouping with strategy 'up to a scalar rescaling': 1 (1 isomorphically unique graph, 0 color zero, 0 lorentz zero, 0 grouped and 0 cancellation)
  685. 223.73 s gammaloop-nextest-integration> [2026-09-18 22:26:40.444] @feyngen::diagram_... INFO : ( Sum of the symmetry factors from each graph generated = -1/2 )
  686. 223.73 s gammaloop-nextest-integration> [2026-09-18 22:26:40.444] @commands::generate INFO : Generated amplitude 1 graphs.
  687. 223.73 s gammaloop-nextest-integration> [2026-09-18 22:26:40.444] @commands::generate INFO : Only diagram generation was requested, skipping integrand generation. You can generate integrands later using the 'generate existing <options>' command.
  688. 223.73 s gammaloop-nextest-integration> [2026-09-18 22:26:40.444] @gammaloop_api::se... INFO : Running command generate
  689. 223.73 s gammaloop-nextest-integration> The application panicked (crashed).
  690. 223.73 s gammaloop-nextest-integration> Message: label _func_power_ not found
  691. 223.73 s gammaloop-nextest-integration> Location: /nix/store/n9w914kh1cm59xx3spcs831cdyb56m32-vendor-cargo-deps/c19b7c6f923b580ac259164a89f2577984ad5ab09ee9d583b888f934adbbe8d0/symjit-2.25.6/src/symjit/assembler.rs:77
  692. 223.73 s gammaloop-nextest-integration>
  693. 223.73 s gammaloop-nextest-integration> ━━━━━━━━━━━━━━━━━━━━━━━━━━━━━━━━━━ BACKTRACE ━━━━━━━━━━━━━━━━━━━━━━━━━━━━━━━━━━━
  694. 223.73 s gammaloop-nextest-integration> 1: <color_eyre[51793ea62743adbd]::config::PanicHook>::panic_report<unknown>
  695. 223.73 s gammaloop-nextest-integration> at <unknown source file>:<unknown line>
  696. 223.73 s gammaloop-nextest-integration> 2: <color_eyre[51793ea62743adbd]::config::PanicHook>::into_panic_hook::{closure#0}<unknown>
  697. 223.73 s gammaloop-nextest-integration> at <unknown source file>:<unknown line>
  698. 223.73 s gammaloop-nextest-integration> 3: std[bcb96dfbba0ab899]::panicking::panic_with_hook<unknown>
  699. 223.73 s gammaloop-nextest-integration> at <unknown source file>:<unknown line>
  700. 223.73 s gammaloop-nextest-integration> 4: std[bcb96dfbba0ab899]::panicking::panic_handler::{closure#0}<unknown>
  701. 223.73 s gammaloop-nextest-integration> at <unknown source file>:<unknown line>
  702. 223.73 s gammaloop-nextest-integration> 5: std[bcb96dfbba0ab899]::sys::backtrace::__rust_end_short_backtrace::<std[bcb96dfbba0ab899]::panicking::panic_handler::{closure#0}, !><unknown>
  703. 223.73 s gammaloop-nextest-integration> at <unknown source file>:<unknown line>
  704. 223.73 s gammaloop-nextest-integration> 6: __rustc[6c289b9f9c454d21]::rust_begin_unwind<unknown>
  705. 223.73 s gammaloop-nextest-integration> at <unknown source file>:<unknown line>
  706. 223.73 s gammaloop-nextest-integration> 7: core[940e698046960fd5]::panicking::panic_fmt<unknown>
  707. 223.73 s gammaloop-nextest-integration> at <unknown source file>:<unknown line>
  708. 223.73 s gammaloop-nextest-integration> 8: <symjit[e408de789c333cd]::symjit::assembler::Assembler>::apply_jumps<unknown>
  709. 223.73 s gammaloop-nextest-integration> at <unknown source file>:<unknown line>
  710. 223.73 s gammaloop-nextest-integration> 9: <symjit[e408de789c333cd]::symjit::builder::Builder>::compile_from_mir::<symjit[e408de789c333cd]::symjit::amd::complex::AmdComplexGenerator><unknown>
  711. 223.73 s gammaloop-nextest-integration> at <unknown source file>:<unknown line>
  712. 223.73 s gammaloop-nextest-integration> 10: <symjit[e408de789c333cd]::symjit::runnable::Application>::compile_ty<unknown>
  713. 223.73 s gammaloop-nextest-integration> at <unknown source file>:<unknown line>
  714. 223.73 s gammaloop-nextest-integration> 11: <symjit[e408de789c333cd]::symjit::runnable::Application>::with_mir<unknown>
  715. 223.73 s gammaloop-nextest-integration> at <unknown source file>:<unknown line>
  716. 223.73 s gammaloop-nextest-integration> 12: <symjit[e408de789c333cd]::symjit::composer::DirectTranslator as symjit[e408de789c333cd]::symjit::composer::Composer>::compile<unknown>
  717. 223.73 s gammaloop-nextest-integration> at <unknown source file>:<unknown line>
  718. 223.73 s gammaloop-nextest-integration> 13: <symjit[e408de789c333cd]::symjit::compiler::Translator as symjit[e408de789c333cd]::symjit::composer::Composer>::compile<unknown>
  719. 223.73 s gammaloop-nextest-integration> at <unknown source file>:<unknown line>
  720. 223.73 s gammaloop-nextest-integration> 14: <numerica[124dab8567f4861e]::domains::float::complex::Complex<f64> as symbolica[10e259bab675d243]::evaluate::backend::JITCompiledNumber>::jit_compile<unknown>
  721. 223.73 s gammaloop-nextest-integration> at <unknown source file>:<unknown line>
  722. 223.73 s gammaloop-nextest-integration> 15: <gammalooprs[917cbd3df9e68f8f]::integrands::process::evaluators::GenericEvaluator>::activate_symjit<unknown>
  723. 223.73 s gammaloop-nextest-integration> at <unknown source file>:<unknown line>
  724. 223.73 s gammaloop-nextest-integration> 16: <gammalooprs[917cbd3df9e68f8f]::integrands::process::amplitude::AmplitudeIntegrand>::prepare_runtime_backends_after_generation_with_compile_times<unknown>
  725. 223.73 s gammaloop-nextest-integration> at <unknown source file>:<unknown line>
  726. 223.73 s gammaloop-nextest-integration> 17: <gammalooprs[917cbd3df9e68f8f]::processes::amplitude::Amplitude>::build_integrand<unknown>
  727. 223.73 s gammaloop-nextest-integration> at <unknown source file>:<unknown line>
  728. 223.73 s gammaloop-nextest-integration> 18: <gammalooprs[917cbd3df9e68f8f]::processes::process::Process>::generate_integrands<unknown>
  729. 223.73 s gammaloop-nextest-integration> at <unknown source file>:<unknown line>
  730. 223.73 s gammaloop-nextest-integration> 19: <gammalooprs[917cbd3df9e68f8f]::processes::ProcessList>::generate_integrands<unknown>
  731. 223.73 s gammaloop-nextest-integration> at <unknown source file>:<unknown line>
  732. 223.73 s gammaloop-nextest-integration> 20: <gammaloop_api[9ebf6628f97aeb57]::state::State>::generate_integrands<unknown>
  733. 223.73 s gammaloop-nextest-integration> at <unknown source file>:<unknown line>
  734. 223.73 s gammaloop-nextest-integration> 21: <gammaloop_api[9ebf6628f97aeb57]::commands::generate::Generate>::run::<&std[bcb96dfbba0ab899]::path::PathBuf><unknown>
  735. 223.73 s gammaloop-nextest-integration> at <unknown source file>:<unknown line>
  736. 223.73 s gammaloop-nextest-integration> 22: <gammaloop_api[9ebf6628f97aeb57]::commands::Commands>::run<unknown>
  737. 223.73 s gammaloop-nextest-integration> at <unknown source file>:<unknown line>
  738. 223.73 s gammaloop-nextest-integration> 23: <gammaloop_api[9ebf6628f97aeb57]::session::CliSession>::execute_prepared<unknown>
  739. 223.73 s gammaloop-nextest-integration> at <unknown source file>:<unknown line>
  740. 223.73 s gammaloop-nextest-integration> 24: <gammaloop_api[9ebf6628f97aeb57]::session::CliSession>::execute_prepared_commands<unknown>
  741. 223.73 s gammaloop-nextest-integration> at <unknown source file>:<unknown line>
  742. 223.73 s gammaloop-nextest-integration> 25: <gammaloop_api[9ebf6628f97aeb57]::session::CliSession>::execute_prepared<unknown>
  743. 223.73 s gammaloop-nextest-integration> at <unknown source file>:<unknown line>
  744. 223.73 s gammaloop-nextest-integration> 26: <gammaloop_api[9ebf6628f97aeb57]::session::CliSession>::execute_command<unknown>
  745. 223.73 s gammaloop-nextest-integration> at <unknown source file>:<unknown line>
  746. 223.73 s gammaloop-nextest-integration> 27: <gammaloop_integration_tests[191607b70c61cd5a]::CLIState>::run_command<unknown>
  747. 223.73 s gammaloop-nextest-integration> at <unknown source file>:<unknown line>
  748. 223.73 s gammaloop-nextest-integration> 28: uv[3c7454ef256d6487]::run_single_integrated_uv_case<unknown>
  749. 223.73 s gammaloop-nextest-integration> at <unknown source file>:<unknown line>
  750. 223.73 s gammaloop-nextest-integration> 29: <uv[3c7454ef256d6487]::thermal_sunrise_uv::{closure#0} as core[940e698046960fd5]::ops::function::FnOnce<()>>::call_once<unknown>
  751. 223.73 s gammaloop-nextest-integration> at <unknown source file>:<unknown line>
  752. 223.73 s gammaloop-nextest-integration> 30: test[75d6903177b1d7e9]::__rust_begin_short_backtrace::<core[940e698046960fd5]::result::Result<(), alloc[2ea6bcb46fca0c42]::string::String>, fn() -> core[940e698046960fd5]::result::Result<(), alloc[2ea6bcb46fca0c42]::string::String>><unknown>
  753. 223.73 s gammaloop-nextest-integration> at <unknown source file>:<unknown line>
  754. 223.73 s gammaloop-nextest-integration> 31: test[75d6903177b1d7e9]::run_test::{closure#0}<unknown>
  755. 223.73 s gammaloop-nextest-integration> at <unknown source file>:<unknown line>
  756. 223.73 s gammaloop-nextest-integration> 32: std[bcb96dfbba0ab899]::sys::backtrace::__rust_begin_short_backtrace::<test[75d6903177b1d7e9]::run_test::{closure#1}, ()><unknown>
  757. 223.73 s gammaloop-nextest-integration> at <unknown source file>:<unknown line>
  758. 223.73 s gammaloop-nextest-integration> 33: <std[bcb96dfbba0ab899]::thread::lifecycle::spawn_unchecked<test[75d6903177b1d7e9]::run_test::{closure#1}, ()>::{closure#1} as core[940e698046960fd5]::ops::function::FnOnce<()>>::call_once::{shim:vtable#0}<unknown>
  759. 223.73 s gammaloop-nextest-integration> at <unknown source file>:<unknown line>
  760. 223.73 s gammaloop-nextest-integration> 34: <std[bcb96dfbba0ab899]::sys::thread::unix::Thread>::new::thread_start<unknown>
  761. 223.73 s gammaloop-nextest-integration> at <unknown source file>:<unknown line>
  762. 223.73 s gammaloop-nextest-integration> 35: start_thread<unknown>
  763. 223.73 s gammaloop-nextest-integration> at <unknown source file>:<unknown line>
  764. 223.73 s gammaloop-nextest-integration> 36: __clone3<unknown>
  765. 223.73 s gammaloop-nextest-integration> at <unknown source file>:<unknown line>
  766. 223.73 s gammaloop-nextest-integration>
  767. 223.73 s gammaloop-nextest-integration> Run with COLORBT_SHOW_HIDDEN=1 environment variable to disable frame filtering.
  768. 223.73 s gammaloop-nextest-integration> Run with RUST_BACKTRACE=full to include source snippets.
  769. 223.73 s gammaloop-nextest-integration> Warning: SpanTrace capture is Unsupported.
  770. 223.73 s gammaloop-nextest-integration> Ensure that you've setup a tracing-error ErrorLayer and the semver versions are compatible
  771. 223.73 s gammaloop-nextest-integration> =========================================
  772. 223.83 s error: Cannot build '/nix/store/kwk339q5xvfx62zai4ay5j3qq0nfsqgw-gammaloop-nextest-integration.drv'.
  773. 223.83 s Reason: builder failed with exit code 100.
  774. 223.83 s Output paths:
  775. 223.83 s /nix/store/c3wp0hpqwzl785z84jxkkcyxx9cvpz4b-gammaloop-nextest-integration
  776. 223.83 s Last 755 log lines:
  777. 223.83 s > Extracting 13 binaries, 1 build script output directory, and 3 linked paths to /build/nextest-archive-xN7UED
  778. 223.83 s > Extracted 30 files to /build/nextest-archive-xN7UED in 2.42s
  779. 223.83 s > ------------
  780. 223.83 s > Nextest run ID 8da6a9c2-91d2-4a36-b78b-c0bbd6a67703 with nextest profile: ci_gammaloop
  781. 223.83 s > Starting 170 tests across 13 binaries (209 tests skipped, including 208 tests via profile.ci_gammaloop.default-filter)
  782. 223.83 s > FAIL [ 2.789s] ( 55/170) gammaloop-integration-tests::test_runs aa_aa::important::aa_aa_local_inspect_backend_consistency
  783. 223.83 s > stdout ---
  784. 223.83 s >
  785. 223.83 s > running 1 test
  786. 223.83 s > test aa_aa::important::aa_aa_local_inspect_backend_consistency ... FAILED
  787. 223.83 s >
  788. 223.83 s > failures:
  789. 223.83 s >
  790. 223.83 s > failures:
  791. 223.83 s > aa_aa::important::aa_aa_local_inspect_backend_consistency
  792. 223.83 s >
  793. 223.83 s > test result: FAILED. 0 passed; 1 failed; 0 ignored; 0 measured; 274 filtered out; finished in 2.78s
  794. 223.83 s >
  795. 223.83 s > stderr ---
  796. 223.83 s > [2026-09-18 22:25:58.332] @gammaloop_api::se... INFO : Running command import model sm-default.json
  797. 223.83 s > [2026-09-18 22:25:58.332] @import::model INFO : Loading built-in JSON model sm-default
  798. 223.83 s > [2026-09-18 22:25:58.354] @gammalooprs::model INFO : The following 15 external parameters were forced to zero by the restriction card:
  799. 223.83 s > lamWS, AWS, rhoWS, etaWS, ymc, yme, ymm, MC, Me, MM, WTau, muQ, muLe, muLmu, muLtau
  800. 223.83 s > [2026-09-18 22:25:58.354] @gammalooprs::model INFO : The following 34 vertex rules were removed by the restriction card:
  801. 223.83 s > V_82 -> (c~, d, G+) | V_83 -> (t~, d, G+) | V_84 -> (c~, s, G+) | V_85 -> (t~, s, G+) | V_86 -> (u~, b, G+) | V_87 -> (c~, b, G+) | V_90 -> (c~, d, W+) | V_91 -> (t~, d, W+) | V_92 -> (u~, s, W+) | V_94 -> (t~, s, W+) | V_95 -> (u~, b, W+) | V_96 -> (c~, b, W+) | V_101 -> (e+, e-, G0) | V_102 -> (mu+, mu-, G0) | V_104 -> (e+, e-, H) | V_105 -> (mu+, mu-, H) | V_110 -> (ve~, e-, G+) | V_111 -> (vm~, mu-, G+) | V_116 -> (b~, u, G-) | V_117 -> (d~, c, G-) | V_118 -> (s~, c, G-) | V_119 -> (b~, c, G-) | V_120 -> (d~, t, G-) | V_121 -> (s~, t, G-) | V_124 -> (s~, u, W-) | V_125 -> (b~, u, W-) | V_126 -> (d~, c, W-) | V_128 -> (b~, c, W-) | V_129 -> (d~, t, W-) | V_130 -> (s~, t, W-) | V_138 -> (c~, c, G0) | V_140 -> (c~, c, H) | V_145 -> (e+, ve, G-) | V_146 -> (mu+, vm, G-)
  802. 223.83 s > [2026-09-18 22:25:58.354] @gammalooprs::model INFO : The following 36 couplings were removed by the restriction card:
  803. 223.83 s > GC_13, GC_14, GC_16, GC_17, GC_18, GC_19, GC_20, GC_22, GC_23, GC_24, GC_25, GC_26, GC_28, GC_29, GC_42, GC_43, GC_44, GC_46, GC_47, GC_48, GC_84, GC_85, GC_86, GC_87, GC_88, GC_89, GC_90, GC_91, GC_92, GC_93, GC_101, GC_102, GC_103, GC_105, GC_106, GC_107
  804. 223.83 s > [2026-09-18 22:25:58.354] @gammaloop_api::se... INFO : Running command run set_model_parameters
  805. 223.83 s > [2026-09-18 22:25:58.354] @gammaloop_api::se... INFO : Starting command block set_model_parameters
  806. 223.83 s > [2026-09-18 22:25:58.354] @gammaloop_api::se... INFO : Running command set model MT=173.0
  807. 223.83 s > [2026-09-18 22:25:58.359] @gammaloop_api::se... INFO : Running command set model WT=0.0
  808. 223.83 s > [2026-09-18 22:25:58.363] @gammaloop_api::se... INFO : Running command set model ymt=173.0
  809. 223.83 s > [2026-09-18 22:25:58.368] @gammaloop_api::se... INFO : Running command set model aS=0.118
  810. 223.83 s > [2026-09-18 22:25:58.372] @gammaloop_api::se... INFO : Running command set model aEWM1=137.036
  811. 223.83 s > [2026-09-18 22:25:58.376] @gammaloop_api::se... INFO : Running command set model Gf=1.166390e-05
  812. 223.83 s > [2026-09-18 22:25:58.381] @gammaloop_api::se... INFO : Running command set model MZ=91.188
  813. 223.83 s > [2026-09-18 22:25:58.386] @gammaloop_api::se... INFO : Running command set global string '
  814. 223.83 s > [global.generation.compile]
  815. 223.83 s > compilation_mode = "symjit"
  816. 223.83 s > optimization_level = "O0"
  817. 223.83 s > fast_math = false
  818. 223.83 s > [...]
  819. 223.83 s > [2026-09-18 22:25:58.386] @gammaloop_api::se... INFO : Running command import graphs ./examples/cli/aa_aa/1L/aa_aa_1L.dot -p aa_aa_all_helicities -i 1L_ppmm -o
  820. 223.83 s > [2026-09-18 22:25:58.386] @commands::import INFO : Loading graphs from '/build/source/examples/cli/aa_aa/1L/aa_aa_1L.dot'
  821. 223.83 s > [2026-09-18 22:25:58.396] @gammaloop_api::se... INFO : Running command generate existing -p aa_aa_all_helicities
  822. 223.83 s > The application panicked (crashed).
  823. 223.83 s > Message: label _func_power_ not found
  824. 223.83 s > Location: /nix/store/n9w914kh1cm59xx3spcs831cdyb56m32-vendor-cargo-deps/c19b7c6f923b580ac259164a89f2577984ad5ab09ee9d583b888f934adbbe8d0/symjit-2.25.6/src/symjit/assembler.rs:77
  825. 223.83 s >
  826. 223.83 s > ━━━━━━━━━━━━━━━━━━━━━━━━━━━━━━━━━━ BACKTRACE ━━━━━━━━━━━━━━━━━━━━━━━━━━━━━━━━━━━
  827. 223.83 s > 1: <color_eyre[51793ea62743adbd]::config::PanicHook>::panic_report<unknown>
  828. 223.83 s > at <unknown source file>:<unknown line>
  829. 223.83 s > 2: <color_eyre[51793ea62743adbd]::config::PanicHook>::into_panic_hook::{closure#0}<unknown>
  830. 223.83 s > at <unknown source file>:<unknown line>
  831. 223.83 s > 3: std[bcb96dfbba0ab899]::panicking::panic_with_hook<unknown>
  832. 223.83 s > at <unknown source file>:<unknown line>
  833. 223.83 s > 4: std[bcb96dfbba0ab899]::panicking::panic_handler::{closure#0}<unknown>
  834. 223.83 s > at <unknown source file>:<unknown line>
  835. 223.83 s > 5: std[bcb96dfbba0ab899]::sys::backtrace::__rust_end_short_backtrace::<std[bcb96dfbba0ab899]::panicking::panic_handler::{closure#0}, !><unknown>
  836. 223.83 s > at <unknown source file>:<unknown line>
  837. 223.83 s > 6: __rustc[6c289b9f9c454d21]::rust_begin_unwind<unknown>
  838. 223.83 s > at <unknown source file>:<unknown line>
  839. 223.83 s > 7: core[940e698046960fd5]::panicking::panic_fmt<unknown>
  840. 223.83 s > at <unknown source file>:<unknown line>
  841. 223.83 s > 8: <symjit[e408de789c333cd]::symjit::assembler::Assembler>::apply_jumps<unknown>
  842. 223.83 s > at <unknown source file>:<unknown line>
  843. 223.83 s > 9: <symjit[e408de789c333cd]::symjit::builder::Builder>::compile_from_mir::<symjit[e408de789c333cd]::symjit::amd::complex::AmdComplexGenerator><unknown>
  844. 223.83 s > at <unknown source file>:<unknown line>
  845. 223.83 s > 10: <symjit[e408de789c333cd]::symjit::runnable::Application>::compile_ty<unknown>
  846. 223.83 s > at <unknown source file>:<unknown line>
  847. 223.83 s > 11: <symjit[e408de789c333cd]::symjit::runnable::Application>::with_mir<unknown>
  848. 223.83 s > at <unknown source file>:<unknown line>
  849. 223.83 s > 12: <symjit[e408de789c333cd]::symjit::composer::DirectTranslator as symjit[e408de789c333cd]::symjit::composer::Composer>::compile<unknown>
  850. 223.83 s > at <unknown source file>:<unknown line>
  851. 223.83 s > 13: <symjit[e408de789c333cd]::symjit::compiler::Translator as symjit[e408de789c333cd]::symjit::composer::Composer>::compile<unknown>
  852. 223.83 s > at <unknown source file>:<unknown line>
  853. 223.83 s > 14: <numerica[124dab8567f4861e]::domains::float::complex::Complex<f64> as symbolica[10e259bab675d243]::evaluate::backend::JITCompiledNumber>::jit_compile<unknown>
  854. 223.83 s > at <unknown source file>:<unknown line>
  855. 223.83 s > 15: <gammalooprs[917cbd3df9e68f8f]::integrands::process::evaluators::GenericEvaluator>::activate_symjit<unknown>
  856. 223.83 s > at <unknown source file>:<unknown line>
  857. 223.83 s > 16: <gammalooprs[917cbd3df9e68f8f]::integrands::process::amplitude::AmplitudeIntegrand>::prepare_runtime_backends_after_generation_with_compile_times<unknown>
  858. 223.83 s > at <unknown source file>:<unknown line>
  859. 223.83 s > 17: <gammalooprs[917cbd3df9e68f8f]::processes::amplitude::Amplitude>::build_integrand<unknown>
  860. 223.83 s > at <unknown source file>:<unknown line>
  861. 223.83 s > 18: <gammalooprs[917cbd3df9e68f8f]::processes::process::Process>::generate_integrands<unknown>
  862. 223.83 s > at <unknown source file>:<unknown line>
  863. 223.83 s > 19: <gammaloop_api[9ebf6628f97aeb57]::state::State>::generate_integrand<unknown>
  864. 223.83 s > at <unknown source file>:<unknown line>
  865. 223.83 s > 20: <gammaloop_api[9ebf6628f97aeb57]::commands::generate::Generate>::run::<&std[bcb96dfbba0ab899]::path::PathBuf><unknown>
  866. 223.83 s > at <unknown source file>:<unknown line>
  867. 223.83 s > 21: <gammaloop_api[9ebf6628f97aeb57]::commands::Commands>::run<unknown>
  868. 223.83 s > at <unknown source file>:<unknown line>
  869. 223.83 s > 22: <gammaloop_api[9ebf6628f97aeb57]::session::CliSession>::execute_prepared<unknown>
  870. 223.83 s > at <unknown source file>:<unknown line>
  871. 223.83 s > 23: <gammaloop_api[9ebf6628f97aeb57]::session::CliSession>::execute_command<unknown>
  872. 223.83 s > at <unknown source file>:<unknown line>
  873. 223.83 s > 24: <gammaloop_integration_tests[191607b70c61cd5a]::CLIState>::run_command<unknown>
  874. 223.83 s > at <unknown source file>:<unknown line>
  875. 223.83 s > 25: test_runs[9b7e2dc2dc4f29b0]::aa_aa::generate_aa_aa_helicity_family<unknown>
  876. 223.83 s > at <unknown source file>:<unknown line>
  877. 223.83 s > 26: <test_runs[9b7e2dc2dc4f29b0]::aa_aa::important::aa_aa_local_inspect_backend_consistency::{closure#0} as core[940e698046960fd5]::ops::function::FnOnce<()>>::call_once<unknown>
  878. 223.83 s > at <unknown source file>:<unknown line>
  879. 223.83 s > 27: serial_test[cd99724524a2f1c0]::serial_code_lock::local_serial_core_with_return::<(), eyre[cb2fd339c0c40fca]::Report><unknown>
  880. 223.83 s > at <unknown source file>:<unknown line>
  881. 223.83 s > 28: <test_runs[9b7e2dc2dc4f29b0]::aa_aa::important::aa_aa_local_inspect_backend_consistency::{closure#0} as core[940e698046960fd5]::ops::function::FnOnce<()>>::call_once<unknown>
  882. 223.83 s > at <unknown source file>:<unknown line>
  883. 223.83 s > 29: test[75d6903177b1d7e9]::__rust_begin_short_backtrace::<core[940e698046960fd5]::result::Result<(), alloc[2ea6bcb46fca0c42]::string::String>, fn() -> core[940e698046960fd5]::result::Result<(), alloc[2ea6bcb46fca0c42]::string::String>><unknown>
  884. 223.83 s > at <unknown source file>:<unknown line>
  885. 223.83 s > 30: test[75d6903177b1d7e9]::run_test::{closure#0}<unknown>
  886. 223.83 s > at <unknown source file>:<unknown line>
  887. 223.83 s > 31: std[bcb96dfbba0ab899]::sys::backtrace::__rust_begin_short_backtrace::<test[75d6903177b1d7e9]::run_test::{closure#1}, ()><unknown>
  888. 223.83 s > at <unknown source file>:<unknown line>
  889. 223.83 s > 32: <std[bcb96dfbba0ab899]::thread::lifecycle::spawn_unchecked<test[75d6903177b1d7e9]::run_test::{closure#1}, ()>::{closure#1} as core[940e698046960fd5]::ops::function::FnOnce<()>>::call_once::{shim:vtable#0}<unknown>
  890. 223.83 s > at <unknown source file>:<unknown line>
  891. 223.83 s > 33: <std[bcb96dfbba0ab899]::sys::thread::unix::Thread>::new::thread_start<unknown>
  892. 223.83 s > at <unknown source file>:<unknown line>
  893. 223.83 s > 34: start_thread<unknown>
  894. 223.83 s > at <unknown source file>:<unknown line>
  895. 223.83 s > 35: __clone3<unknown>
  896. 223.83 s > at <unknown source file>:<unknown line>
  897. 223.83 s >
  898. 223.83 s > Run with COLORBT_SHOW_HIDDEN=1 environment variable to disable frame filtering.
  899. 223.83 s > Run with RUST_BACKTRACE=full to include source snippets.
  900. 223.83 s > Warning: SpanTrace capture is Unsupported.
  901. 223.83 s > Ensure that you've setup a tracing-error ErrorLayer and the semver versions are compatible
  902. 223.83 s >
  903. 223.83 s > FAIL [ 2.965s] (157/170) gammaloop-integration-tests::uv thermal_sunrise_uv
  904. 223.83 s > stdout ---
  905. 223.83 s >
  906. 223.83 s > running 1 test
  907. 223.83 s > test thermal_sunrise_uv ... FAILED
  908. 223.83 s >
  909. 223.83 s > failures:
  910. 223.83 s >
  911. 223.83 s > failures:
  912. 223.83 s > thermal_sunrise_uv
  913. 223.83 s >
  914. 223.83 s > test result: FAILED. 0 passed; 1 failed; 0 ignored; 0 measured; 31 filtered out; finished in 2.95s
  915. 223.83 s >
  916. 223.83 s > stderr ---
  917. 223.83 s > [2026-09-18 22:26:40.402] @gammaloop_api::se... INFO : Running command run generate
  918. 223.83 s > [2026-09-18 22:26:40.402] @gammaloop_api::se... INFO : Starting command block generate
  919. 223.83 s > [2026-09-18 22:26:40.402] @gammaloop_api::se... INFO : Running command import model sm-default.json
  920. 223.83 s > [2026-09-18 22:26:40.402] @import::model INFO : Loading built-in JSON model sm-default
  921. 223.83 s > [2026-09-18 22:26:40.429] @gammalooprs::model INFO : The following 15 external parameters were forced to zero by the restriction card:
  922. 223.83 s > lamWS, AWS, rhoWS, etaWS, ymc, yme, ymm, MC, Me, MM, WTau, muQ, muLe, muLmu, muLtau
  923. 223.83 s > [2026-09-18 22:26:40.429] @gammalooprs::model INFO : The following 34 vertex rules were removed by the restriction card:
  924. 223.83 s > V_82 -> (c~, d, G+) | V_83 -> (t~, d, G+) | V_84 -> (c~, s, G+) | V_85 -> (t~, s, G+) | V_86 -> (u~, b, G+) | V_87 -> (c~, b, G+) | V_90 -> (c~, d, W+) | V_91 -> (t~, d, W+) | V_92 -> (u~, s, W+) | V_94 -> (t~, s, W+) | V_95 -> (u~, b, W+) | V_96 -> (c~, b, W+) | V_101 -> (e+, e-, G0) | V_102 -> (mu+, mu-, G0) | V_104 -> (e+, e-, H) | V_105 -> (mu+, mu-, H) | V_110 -> (ve~, e-, G+) | V_111 -> (vm~, mu-, G+) | V_116 -> (b~, u, G-) | V_117 -> (d~, c, G-) | V_118 -> (s~, c, G-) | V_119 -> (b~, c, G-) | V_120 -> (d~, t, G-) | V_121 -> (s~, t, G-) | V_124 -> (s~, u, W-) | V_125 -> (b~, u, W-) | V_126 -> (d~, c, W-) | V_128 -> (b~, c, W-) | V_129 -> (d~, t, W-) | V_130 -> (s~, t, W-) | V_138 -> (c~, c, G0) | V_140 -> (c~, c, H) | V_145 -> (e+, ve, G-) | V_146 -> (mu+, vm, G-)
  925. 223.83 s > [2026-09-18 22:26:40.429] @gammalooprs::model INFO : The following 36 couplings were removed by the restriction card:
  926. 223.83 s > GC_13, GC_14, GC_16, GC_17, GC_18, GC_19, GC_20, GC_22, GC_23, GC_24, GC_25, GC_26, GC_28, GC_29, GC_42, GC_43, GC_44, GC_46, GC_47, GC_48, GC_84, GC_85, GC_86, GC_87, GC_88, GC_89, GC_90, GC_91, GC_92, GC_93, GC_101, GC_102, GC_103, GC_105, GC_106, GC_107
  927. 223.83 s > [2026-09-18 22:26:40.429] @gammaloop_api::se... INFO : Running command remove processes
  928. 223.83 s > [2026-09-18 22:26:40.429] @gammaloop_api::se... INFO : Running command generate amp {} > {} [{2}] | g u
  929. 223.83 s > --numerator-grouping group_identical_graphs_up_to_scalar_rescaling
  930. 223.83 s > --max-n-bridges 0
  931. 223.83 s > --number-of-factorized-loop-subtopologies 1 1
  932. 223.83 s > --number-of-anticommutating-loops 1 1
  933. 223.83 s > [...]
  934. 223.83 s > [2026-09-18 22:26:40.431] @feyngen::diagram_... INFO : 0s | Δ=0s | Starting Feynman graph generation with Symbolica...
  935. 223.83 s > [2026-09-18 22:26:40.431] @feyngen::diagram_... INFO : 0s | Δ=0s | Number of graphs resulting from Symbolica generation: 3
  936. 223.83 s > [2026-09-18 22:26:40.431] @feyngen::diagram_... INFO : 0s | Δ=0s | Number of graphs retained after removal of vetoed topologies: 2
  937. 223.83 s > [2026-09-18 22:26:40.431] @feyngen::diagram_... INFO : 0s | Δ=0s | Number of graphs after vertex info assignment: 2
  938. 223.83 s > [2026-09-18 22:26:40.431] @feyngen::diagram_... INFO : 0s | Δ=0s | Number of graphs after all complete graphs filters are applied: 2
  939. 223.83 s > [2026-09-18 22:26:40.431] @feyngen::diagram_... INFO : 0s | Δ=0s | Number of graphs after closed anticommutating chains analysis: 1
  940. 223.83 s > [2026-09-18 22:26:40.431] @feyngen::diagram_... INFO : 0s | Δ=0s | Number of graphs after symmetrization of external states: 1
  941. 223.83 s > [2026-09-18 22:26:40.431] @feyngen::diagram_... INFO : 0s | Δ=0s | Number of graphs after canonization of vertices, edges and flows (graph labels assigned here): 1
  942. 223.83 s > [2026-09-18 22:26:40.444] @feyngen::diagram_... INFO : 0s | Δ=0s | Number of graphs after numerator-aware grouping with strategy 'up to a scalar rescaling': 1 (1 isomorphically unique graph, 0 color zero, 0 lorentz zero, 0 grouped and 0 cancellation)
  943. 223.83 s > [2026-09-18 22:26:40.444] @feyngen::diagram_... INFO : ( Sum of the symmetry factors from each graph generated = -1/2 )
  944. 223.83 s > [2026-09-18 22:26:40.444] @commands::generate INFO : Generated amplitude 1 graphs.
  945. 223.83 s > [2026-09-18 22:26:40.444] @commands::generate INFO : Only diagram generation was requested, skipping integrand generation. You can generate integrands later using the 'generate existing <options>' command.
  946. 223.83 s > [2026-09-18 22:26:40.444] @gammaloop_api::se... INFO : Running command generate
  947. 223.83 s > The application panicked (crashed).
  948. 223.83 s > Message: label _func_power_ not found
  949. 223.83 s > Location: /nix/store/n9w914kh1cm59xx3spcs831cdyb56m32-vendor-cargo-deps/c19b7c6f923b580ac259164a89f2577984ad5ab09ee9d583b888f934adbbe8d0/symjit-2.25.6/src/symjit/assembler.rs:77
  950. 223.83 s >
  951. 223.83 s > ━━━━━━━━━━━━━━━━━━━━━━━━━━━━━━━━━━ BACKTRACE ━━━━━━━━━━━━━━━━━━━━━━━━━━━━━━━━━━━
  952. 223.83 s > 1: <color_eyre[51793ea62743adbd]::config::PanicHook>::panic_report<unknown>
  953. 223.83 s > at <unknown source file>:<unknown line>
  954. 223.83 s > 2: <color_eyre[51793ea62743adbd]::config::PanicHook>::into_panic_hook::{closure#0}<unknown>
  955. 223.83 s > at <unknown source file>:<unknown line>
  956. 223.83 s > 3: std[bcb96dfbba0ab899]::panicking::panic_with_hook<unknown>
  957. 223.83 s > at <unknown source file>:<unknown line>
  958. 223.83 s > 4: std[bcb96dfbba0ab899]::panicking::panic_handler::{closure#0}<unknown>
  959. 223.83 s > at <unknown source file>:<unknown line>
  960. 223.83 s > 5: std[bcb96dfbba0ab899]::sys::backtrace::__rust_end_short_backtrace::<std[bcb96dfbba0ab899]::panicking::panic_handler::{closure#0}, !><unknown>
  961. 223.83 s > at <unknown source file>:<unknown line>
  962. 223.83 s > 6: __rustc[6c289b9f9c454d21]::rust_begin_unwind<unknown>
  963. 223.83 s > at <unknown source file>:<unknown line>
  964. 223.83 s > 7: core[940e698046960fd5]::panicking::panic_fmt<unknown>
  965. 223.83 s > at <unknown source file>:<unknown line>
  966. 223.83 s > 8: <symjit[e408de789c333cd]::symjit::assembler::Assembler>::apply_jumps<unknown>
  967. 223.83 s > at <unknown source file>:<unknown line>
  968. 223.83 s > 9: <symjit[e408de789c333cd]::symjit::builder::Builder>::compile_from_mir::<symjit[e408de789c333cd]::symjit::amd::complex::AmdComplexGenerator><unknown>
  969. 223.83 s > at <unknown source file>:<unknown line>
  970. 223.83 s > 10: <symjit[e408de789c333cd]::symjit::runnable::Application>::compile_ty<unknown>
  971. 223.83 s > at <unknown source file>:<unknown line>
  972. 223.83 s > 11: <symjit[e408de789c333cd]::symjit::runnable::Application>::with_mir<unknown>
  973. 223.83 s > at <unknown source file>:<unknown line>
  974. 223.83 s > 12: <symjit[e408de789c333cd]::symjit::composer::DirectTranslator as symjit[e408de789c333cd]::symjit::composer::Composer>::compile<unknown>
  975. 223.83 s > at <unknown source file>:<unknown line>
  976. 223.83 s > 13: <symjit[e408de789c333cd]::symjit::compiler::Translator as symjit[e408de789c333cd]::symjit::composer::Composer>::compile<unknown>
  977. 223.83 s > at <unknown source file>:<unknown line>
  978. 223.83 s > 14: <numerica[124dab8567f4861e]::domains::float::complex::Complex<f64> as symbolica[10e259bab675d243]::evaluate::backend::JITCompiledNumber>::jit_compile<unknown>
  979. 223.83 s > at <unknown source file>:<unknown line>
  980. 223.83 s > 15: <gammalooprs[917cbd3df9e68f8f]::integrands::process::evaluators::GenericEvaluator>::activate_symjit<unknown>
  981. 223.83 s > at <unknown source file>:<unknown line>
  982. 223.83 s > 16: <gammalooprs[917cbd3df9e68f8f]::integrands::process::amplitude::AmplitudeIntegrand>::prepare_runtime_backends_after_generation_with_compile_times<unknown>
  983. 223.83 s > at <unknown source file>:<unknown line>
  984. 223.83 s > 17: <gammalooprs[917cbd3df9e68f8f]::processes::amplitude::Amplitude>::build_integrand<unknown>
  985. 223.83 s > at <unknown source file>:<unknown line>
  986. 223.83 s > 18: <gammalooprs[917cbd3df9e68f8f]::processes::process::Process>::generate_integrands<unknown>
  987. 223.83 s > at <unknown source file>:<unknown line>
  988. 223.83 s > 19: <gammalooprs[917cbd3df9e68f8f]::processes::ProcessList>::generate_integrands<unknown>
  989. 223.83 s > at <unknown source file>:<unknown line>
  990. 223.83 s > 20: <gammaloop_api[9ebf6628f97aeb57]::state::State>::generate_integrands<unknown>
  991. 223.83 s > at <unknown source file>:<unknown line>
  992. 223.83 s > 21: <gammaloop_api[9ebf6628f97aeb57]::commands::generate::Generate>::run::<&std[bcb96dfbba0ab899]::path::PathBuf><unknown>
  993. 223.83 s > at <unknown source file>:<unknown line>
  994. 223.83 s > 22: <gammaloop_api[9ebf6628f97aeb57]::commands::Commands>::run<unknown>
  995. 223.83 s > at <unknown source file>:<unknown line>
  996. 223.83 s > 23: <gammaloop_api[9ebf6628f97aeb57]::session::CliSession>::execute_prepared<unknown>
  997. 223.83 s > at <unknown source file>:<unknown line>
  998. 223.83 s > 24: <gammaloop_api[9ebf6628f97aeb57]::session::CliSession>::execute_prepared_commands<unknown>
  999. 223.83 s > at <unknown source file>:<unknown line>
  1000. 223.83 s > 25: <gammaloop_api[9ebf6628f97aeb57]::session::CliSession>::execute_prepared<unknown>
  1001. 223.83 s > at <unknown source file>:<unknown line>
  1002. 223.83 s > 26: <gammaloop_api[9ebf6628f97aeb57]::session::CliSession>::execute_command<unknown>
  1003. 223.83 s > at <unknown source file>:<unknown line>
  1004. 223.83 s > 27: <gammaloop_integration_tests[191607b70c61cd5a]::CLIState>::run_command<unknown>
  1005. 223.83 s > at <unknown source file>:<unknown line>
  1006. 223.83 s > 28: uv[3c7454ef256d6487]::run_single_integrated_uv_case<unknown>
  1007. 223.83 s > at <unknown source file>:<unknown line>
  1008. 223.83 s > 29: <uv[3c7454ef256d6487]::thermal_sunrise_uv::{closure#0} as core[940e698046960fd5]::ops::function::FnOnce<()>>::call_once<unknown>
  1009. 223.83 s > at <unknown source file>:<unknown line>
  1010. 223.83 s > 30: test[75d6903177b1d7e9]::__rust_begin_short_backtrace::<core[940e698046960fd5]::result::Result<(), alloc[2ea6bcb46fca0c42]::string::String>, fn() -> core[940e698046960fd5]::result::Result<(), alloc[2ea6bcb46fca0c42]::string::String>><unknown>
  1011. 223.83 s > at <unknown source file>:<unknown line>
  1012. 223.83 s > 31: test[75d6903177b1d7e9]::run_test::{closure#0}<unknown>
  1013. 223.83 s > at <unknown source file>:<unknown line>
  1014. 223.83 s > 32: std[bcb96dfbba0ab899]::sys::backtrace::__rust_begin_short_backtrace::<test[75d6903177b1d7e9]::run_test::{closure#1}, ()><unknown>
  1015. 223.83 s > at <unknown source file>:<unknown line>
  1016. 223.83 s > 33: <std[bcb96dfbba0ab899]::thread::lifecycle::spawn_unchecked<test[75d6903177b1d7e9]::run_test::{closure#1}, ()>::{closure#1} as core[940e698046960fd5]::ops::function::FnOnce<()>>::call_once::{shim:vtable#0}<unknown>
  1017. 223.83 s > at <unknown source file>:<unknown line>
  1018. 223.83 s > 34: <std[bcb96dfbba0ab899]::sys::thread::unix::Thread>::new::thread_start<unknown>
  1019. 223.83 s > at <unknown source file>:<unknown line>
  1020. 223.83 s > 35: start_thread<unknown>
  1021. 223.83 s > at <unknown source file>:<unknown line>
  1022. 223.83 s > 36: __clone3<unknown>
  1023. 223.83 s > at <unknown source file>:<unknown line>
  1024. 223.83 s >
  1025. 223.83 s > Run with COLORBT_SHOW_HIDDEN=1 environment variable to disable frame filtering.
  1026. 223.83 s > Run with RUST_BACKTRACE=full to include source snippets.
  1027. 223.83 s > Warning: SpanTrace capture is Unsupported.
  1028. 223.83 s > Ensure that you've setup a tracing-error ErrorLayer and the semver versions are compatible
  1029. 223.83 s >
  1030. 223.83 s > ------------
  1031. 223.83 s > Summary [ 192.526s] 170 tests run: 168 passed, 2 failed, 209 skipped
  1032. 223.83 s > FAIL [ 2.789s] ( 55/170) gammaloop-integration-tests::test_runs aa_aa::important::aa_aa_local_inspect_backend_consistency
  1033. 223.83 s > stdout ---
  1034. 223.83 s >
  1035. 223.83 s > running 1 test
  1036. 223.83 s > test aa_aa::important::aa_aa_local_inspect_backend_consistency ... FAILED
  1037. 223.83 s >
  1038. 223.83 s > failures:
  1039. 223.83 s >
  1040. 223.83 s > failures:
  1041. 223.83 s > aa_aa::important::aa_aa_local_inspect_backend_consistency
  1042. 223.83 s >
  1043. 223.83 s > test result: FAILED. 0 passed; 1 failed; 0 ignored; 0 measured; 274 filtered out; finished in 2.78s
  1044. 223.83 s >
  1045. 223.83 s > stderr ---
  1046. 223.83 s > [2026-09-18 22:25:58.332] @gammaloop_api::se... INFO : Running command import model sm-default.json
  1047. 223.83 s > [2026-09-18 22:25:58.332] @import::model INFO : Loading built-in JSON model sm-default
  1048. 223.83 s > [2026-09-18 22:25:58.354] @gammalooprs::model INFO : The following 15 external parameters were forced to zero by the restriction card:
  1049. 223.83 s > lamWS, AWS, rhoWS, etaWS, ymc, yme, ymm, MC, Me, MM, WTau, muQ, muLe, muLmu, muLtau
  1050. 223.83 s > [2026-09-18 22:25:58.354] @gammalooprs::model INFO : The following 34 vertex rules were removed by the restriction card:
  1051. 223.83 s > V_82 -> (c~, d, G+) | V_83 -> (t~, d, G+) | V_84 -> (c~, s, G+) | V_85 -> (t~, s, G+) | V_86 -> (u~, b, G+) | V_87 -> (c~, b, G+) | V_90 -> (c~, d, W+) | V_91 -> (t~, d, W+) | V_92 -> (u~, s, W+) | V_94 -> (t~, s, W+) | V_95 -> (u~, b, W+) | V_96 -> (c~, b, W+) | V_101 -> (e+, e-, G0) | V_102 -> (mu+, mu-, G0) | V_104 -> (e+, e-, H) | V_105 -> (mu+, mu-, H) | V_110 -> (ve~, e-, G+) | V_111 -> (vm~, mu-, G+) | V_116 -> (b~, u, G-) | V_117 -> (d~, c, G-) | V_118 -> (s~, c, G-) | V_119 -> (b~, c, G-) | V_120 -> (d~, t, G-) | V_121 -> (s~, t, G-) | V_124 -> (s~, u, W-) | V_125 -> (b~, u, W-) | V_126 -> (d~, c, W-) | V_128 -> (b~, c, W-) | V_129 -> (d~, t, W-) | V_130 -> (s~, t, W-) | V_138 -> (c~, c, G0) | V_140 -> (c~, c, H) | V_145 -> (e+, ve, G-) | V_146 -> (mu+, vm, G-)
  1052. 223.83 s > [2026-09-18 22:25:58.354] @gammalooprs::model INFO : The following 36 couplings were removed by the restriction card:
  1053. 223.83 s > GC_13, GC_14, GC_16, GC_17, GC_18, GC_19, GC_20, GC_22, GC_23, GC_24, GC_25, GC_26, GC_28, GC_29, GC_42, GC_43, GC_44, GC_46, GC_47, GC_48, GC_84, GC_85, GC_86, GC_87, GC_88, GC_89, GC_90, GC_91, GC_92, GC_93, GC_101, GC_102, GC_103, GC_105, GC_106, GC_107
  1054. 223.83 s > [2026-09-18 22:25:58.354] @gammaloop_api::se... INFO : Running command run set_model_parameters
  1055. 223.83 s > [2026-09-18 22:25:58.354] @gammaloop_api::se... INFO : Starting command block set_model_parameters
  1056. 223.83 s > [2026-09-18 22:25:58.354] @gammaloop_api::se... INFO : Running command set model MT=173.0
  1057. 223.83 s > [2026-09-18 22:25:58.359] @gammaloop_api::se... INFO : Running command set model WT=0.0
  1058. 223.83 s > [2026-09-18 22:25:58.363] @gammaloop_api::se... INFO : Running command set model ymt=173.0
  1059. 223.83 s > [2026-09-18 22:25:58.368] @gammaloop_api::se... INFO : Running command set model aS=0.118
  1060. 223.83 s > [2026-09-18 22:25:58.372] @gammaloop_api::se... INFO : Running command set model aEWM1=137.036
  1061. 223.83 s > [2026-09-18 22:25:58.376] @gammaloop_api::se... INFO : Running command set model Gf=1.166390e-05
  1062. 223.83 s > [2026-09-18 22:25:58.381] @gammaloop_api::se... INFO : Running command set model MZ=91.188
  1063. 223.83 s > [2026-09-18 22:25:58.386] @gammaloop_api::se... INFO : Running command set global string '
  1064. 223.83 s > [global.generation.compile]
  1065. 223.83 s > compilation_mode = "symjit"
  1066. 223.83 s > optimization_level = "O0"
  1067. 223.83 s > fast_math = false
  1068. 223.83 s > [...]
  1069. 223.83 s > [2026-09-18 22:25:58.386] @gammaloop_api::se... INFO : Running command import graphs ./examples/cli/aa_aa/1L/aa_aa_1L.dot -p aa_aa_all_helicities -i 1L_ppmm -o
  1070. 223.83 s > [2026-09-18 22:25:58.386] @commands::import INFO : Loading graphs from '/build/source/examples/cli/aa_aa/1L/aa_aa_1L.dot'
  1071. 223.83 s > [2026-09-18 22:25:58.396] @gammaloop_api::se... INFO : Running command generate existing -p aa_aa_all_helicities
  1072. 223.83 s > The application panicked (crashed).
  1073. 223.83 s > Message: label _func_power_ not found
  1074. 223.83 s > Location: /nix/store/n9w914kh1cm59xx3spcs831cdyb56m32-vendor-cargo-deps/c19b7c6f923b580ac259164a89f2577984ad5ab09ee9d583b888f934adbbe8d0/symjit-2.25.6/src/symjit/assembler.rs:77
  1075. 223.83 s >
  1076. 223.83 s > ━━━━━━━━━━━━━━━━━━━━━━━━━━━━━━━━━━ BACKTRACE ━━━━━━━━━━━━━━━━━━━━━━━━━━━━━━━━━━━
  1077. 223.83 s > 1: <color_eyre[51793ea62743adbd]::config::PanicHook>::panic_report<unknown>
  1078. 223.83 s > at <unknown source file>:<unknown line>
  1079. 223.83 s > 2: <color_eyre[51793ea62743adbd]::config::PanicHook>::into_panic_hook::{closure#0}<unknown>
  1080. 223.83 s > at <unknown source file>:<unknown line>
  1081. 223.83 s > 3: std[bcb96dfbba0ab899]::panicking::panic_with_hook<unknown>
  1082. 223.83 s > at <unknown source file>:<unknown line>
  1083. 223.83 s > 4: std[bcb96dfbba0ab899]::panicking::panic_handler::{closure#0}<unknown>
  1084. 223.83 s > at <unknown source file>:<unknown line>
  1085. 223.83 s > 5: std[bcb96dfbba0ab899]::sys::backtrace::__rust_end_short_backtrace::<std[bcb96dfbba0ab899]::panicking::panic_handler::{closure#0}, !><unknown>
  1086. 223.83 s > at <unknown source file>:<unknown line>
  1087. 223.83 s > 6: __rustc[6c289b9f9c454d21]::rust_begin_unwind<unknown>
  1088. 223.83 s > at <unknown source file>:<unknown line>
  1089. 223.83 s > 7: core[940e698046960fd5]::panicking::panic_fmt<unknown>
  1090. 223.83 s > at <unknown source file>:<unknown line>
  1091. 223.83 s > 8: <symjit[e408de789c333cd]::symjit::assembler::Assembler>::apply_jumps<unknown>
  1092. 223.83 s > at <unknown source file>:<unknown line>
  1093. 223.83 s > 9: <symjit[e408de789c333cd]::symjit::builder::Builder>::compile_from_mir::<symjit[e408de789c333cd]::symjit::amd::complex::AmdComplexGenerator><unknown>
  1094. 223.83 s > at <unknown source file>:<unknown line>
  1095. 223.83 s > 10: <symjit[e408de789c333cd]::symjit::runnable::Application>::compile_ty<unknown>
  1096. 223.83 s > at <unknown source file>:<unknown line>
  1097. 223.83 s > 11: <symjit[e408de789c333cd]::symjit::runnable::Application>::with_mir<unknown>
  1098. 223.83 s > at <unknown source file>:<unknown line>
  1099. 223.83 s > 12: <symjit[e408de789c333cd]::symjit::composer::DirectTranslator as symjit[e408de789c333cd]::symjit::composer::Composer>::compile<unknown>
  1100. 223.83 s > at <unknown source file>:<unknown line>
  1101. 223.83 s > 13: <symjit[e408de789c333cd]::symjit::compiler::Translator as symjit[e408de789c333cd]::symjit::composer::Composer>::compile<unknown>
  1102. 223.83 s > at <unknown source file>:<unknown line>
  1103. 223.83 s > 14: <numerica[124dab8567f4861e]::domains::float::complex::Complex<f64> as symbolica[10e259bab675d243]::evaluate::backend::JITCompiledNumber>::jit_compile<unknown>
  1104. 223.83 s > at <unknown source file>:<unknown line>
  1105. 223.83 s > 15: <gammalooprs[917cbd3df9e68f8f]::integrands::process::evaluators::GenericEvaluator>::activate_symjit<unknown>
  1106. 223.83 s > at <unknown source file>:<unknown line>
  1107. 223.83 s > 16: <gammalooprs[917cbd3df9e68f8f]::integrands::process::amplitude::AmplitudeIntegrand>::prepare_runtime_backends_after_generation_with_compile_times<unknown>
  1108. 223.83 s > at <unknown source file>:<unknown line>
  1109. 223.83 s > 17: <gammalooprs[917cbd3df9e68f8f]::processes::amplitude::Amplitude>::build_integrand<unknown>
  1110. 223.83 s > at <unknown source file>:<unknown line>
  1111. 223.83 s > 18: <gammalooprs[917cbd3df9e68f8f]::processes::process::Process>::generate_integrands<unknown>
  1112. 223.83 s > at <unknown source file>:<unknown line>
  1113. 223.83 s > 19: <gammaloop_api[9ebf6628f97aeb57]::state::State>::generate_integrand<unknown>
  1114. 223.83 s > at <unknown source file>:<unknown line>
  1115. 223.83 s > 20: <gammaloop_api[9ebf6628f97aeb57]::commands::generate::Generate>::run::<&std[bcb96dfbba0ab899]::path::PathBuf><unknown>
  1116. 223.83 s > at <unknown source file>:<unknown line>
  1117. 223.83 s > 21: <gammaloop_api[9ebf6628f97aeb57]::commands::Commands>::run<unknown>
  1118. 223.83 s > at <unknown source file>:<unknown line>
  1119. 223.83 s > 22: <gammaloop_api[9ebf6628f97aeb57]::session::CliSession>::execute_prepared<unknown>
  1120. 223.83 s > at <unknown source file>:<unknown line>
  1121. 223.83 s > 23: <gammaloop_api[9ebf6628f97aeb57]::session::CliSession>::execute_command<unknown>
  1122. 223.83 s > at <unknown source file>:<unknown line>
  1123. 223.83 s > 24: <gammaloop_integration_tests[191607b70c61cd5a]::CLIState>::run_command<unknown>
  1124. 223.83 s > at <unknown source file>:<unknown line>
  1125. 223.83 s > 25: test_runs[9b7e2dc2dc4f29b0]::aa_aa::generate_aa_aa_helicity_family<unknown>
  1126. 223.83 s > at <unknown source file>:<unknown line>
  1127. 223.83 s > 26: <test_runs[9b7e2dc2dc4f29b0]::aa_aa::important::aa_aa_local_inspect_backend_consistency::{closure#0} as core[940e698046960fd5]::ops::function::FnOnce<()>>::call_once<unknown>
  1128. 223.83 s > at <unknown source file>:<unknown line>
  1129. 223.83 s > 27: serial_test[cd99724524a2f1c0]::serial_code_lock::local_serial_core_with_return::<(), eyre[cb2fd339c0c40fca]::Report><unknown>
  1130. 223.83 s > at <unknown source file>:<unknown line>
  1131. 223.83 s > 28: <test_runs[9b7e2dc2dc4f29b0]::aa_aa::important::aa_aa_local_inspect_backend_consistency::{closure#0} as core[940e698046960fd5]::ops::function::FnOnce<()>>::call_once<unknown>
  1132. 223.83 s > at <unknown source file>:<unknown line>
  1133. 223.83 s > 29: test[75d6903177b1d7e9]::__rust_begin_short_backtrace::<core[940e698046960fd5]::result::Result<(), alloc[2ea6bcb46fca0c42]::string::String>, fn() -> core[940e698046960fd5]::result::Result<(), alloc[2ea6bcb46fca0c42]::string::String>><unknown>
  1134. 223.83 s > at <unknown source file>:<unknown line>
  1135. 223.83 s > 30: test[75d6903177b1d7e9]::run_test::{closure#0}<unknown>
  1136. 223.83 s > at <unknown source file>:<unknown line>
  1137. 223.83 s > 31: std[bcb96dfbba0ab899]::sys::backtrace::__rust_begin_short_backtrace::<test[75d6903177b1d7e9]::run_test::{closure#1}, ()><unknown>
  1138. 223.83 s > at <unknown source file>:<unknown line>
  1139. 223.83 s > 32: <std[bcb96dfbba0ab899]::thread::lifecycle::spawn_unchecked<test[75d6903177b1d7e9]::run_test::{closure#1}, ()>::{closure#1} as core[940e698046960fd5]::ops::function::FnOnce<()>>::call_once::{shim:vtable#0}<unknown>
  1140. 223.83 s > at <unknown source file>:<unknown line>
  1141. 223.83 s > 33: <std[bcb96dfbba0ab899]::sys::thread::unix::Thread>::new::thread_start<unknown>
  1142. 223.83 s > at <unknown source file>:<unknown line>
  1143. 223.83 s > 34: start_thread<unknown>
  1144. 223.83 s > at <unknown source file>:<unknown line>
  1145. 223.83 s > 35: __clone3<unknown>
  1146. 223.83 s > at <unknown source file>:<unknown line>
  1147. 223.83 s >
  1148. 223.83 s > Run with COLORBT_SHOW_HIDDEN=1 environment variable to disable frame filtering.
  1149. 223.83 s > Run with RUST_BACKTRACE=full to include source snippets.
  1150. 223.83 s > Warning: SpanTrace capture is Unsupported.
  1151. 223.83 s > Ensure that you've setup a tracing-error ErrorLayer and the semver versions are compatible
  1152. 223.83 s >
  1153. 223.83 s > FAIL [ 2.965s] (157/170) gammaloop-integration-tests::uv thermal_sunrise_uv
  1154. 223.83 s > stdout ---
  1155. 223.83 s >
  1156. 223.83 s > running 1 test
  1157. 223.83 s > test thermal_sunrise_uv ... FAILED
  1158. 223.83 s >
  1159. 223.83 s > failures:
  1160. 223.83 s >
  1161. 223.83 s > failures:
  1162. 223.83 s > thermal_sunrise_uv
  1163. 223.83 s >
  1164. 223.83 s > test result: FAILED. 0 passed; 1 failed; 0 ignored; 0 measured; 31 filtered out; finished in 2.95s
  1165. 223.83 s >
  1166. 223.83 s > stderr ---
  1167. 223.83 s > [2026-09-18 22:26:40.402] @gammaloop_api::se... INFO : Running command run generate
  1168. 223.83 s > [2026-09-18 22:26:40.402] @gammaloop_api::se... INFO : Starting command block generate
  1169. 223.83 s > [2026-09-18 22:26:40.402] @gammaloop_api::se... INFO : Running command import model sm-default.json
  1170. 223.83 s > [2026-09-18 22:26:40.402] @import::model INFO : Loading built-in JSON model sm-default
  1171. 223.83 s > [2026-09-18 22:26:40.429] @gammalooprs::model INFO : The following 15 external parameters were forced to zero by the restriction card:
  1172. 223.83 s > lamWS, AWS, rhoWS, etaWS, ymc, yme, ymm, MC, Me, MM, WTau, muQ, muLe, muLmu, muLtau
  1173. 223.83 s > [2026-09-18 22:26:40.429] @gammalooprs::model INFO : The following 34 vertex rules were removed by the restriction card:
  1174. 223.83 s > V_82 -> (c~, d, G+) | V_83 -> (t~, d, G+) | V_84 -> (c~, s, G+) | V_85 -> (t~, s, G+) | V_86 -> (u~, b, G+) | V_87 -> (c~, b, G+) | V_90 -> (c~, d, W+) | V_91 -> (t~, d, W+) | V_92 -> (u~, s, W+) | V_94 -> (t~, s, W+) | V_95 -> (u~, b, W+) | V_96 -> (c~, b, W+) | V_101 -> (e+, e-, G0) | V_102 -> (mu+, mu-, G0) | V_104 -> (e+, e-, H) | V_105 -> (mu+, mu-, H) | V_110 -> (ve~, e-, G+) | V_111 -> (vm~, mu-, G+) | V_116 -> (b~, u, G-) | V_117 -> (d~, c, G-) | V_118 -> (s~, c, G-) | V_119 -> (b~, c, G-) | V_120 -> (d~, t, G-) | V_121 -> (s~, t, G-) | V_124 -> (s~, u, W-) | V_125 -> (b~, u, W-) | V_126 -> (d~, c, W-) | V_128 -> (b~, c, W-) | V_129 -> (d~, t, W-) | V_130 -> (s~, t, W-) | V_138 -> (c~, c, G0) | V_140 -> (c~, c, H) | V_145 -> (e+, ve, G-) | V_146 -> (mu+, vm, G-)
  1175. 223.83 s > [2026-09-18 22:26:40.429] @gammalooprs::model INFO : The following 36 couplings were removed by the restriction card:
  1176. 223.83 s > GC_13, GC_14, GC_16, GC_17, GC_18, GC_19, GC_20, GC_22, GC_23, GC_24, GC_25, GC_26, GC_28, GC_29, GC_42, GC_43, GC_44, GC_46, GC_47, GC_48, GC_84, GC_85, GC_86, GC_87, GC_88, GC_89, GC_90, GC_91, GC_92, GC_93, GC_101, GC_102, GC_103, GC_105, GC_106, GC_107
  1177. 223.83 s > [2026-09-18 22:26:40.429] @gammaloop_api::se... INFO : Running command remove processes
  1178. 223.83 s > [2026-09-18 22:26:40.429] @gammaloop_api::se... INFO : Running command generate amp {} > {} [{2}] | g u
  1179. 223.83 s > --numerator-grouping group_identical_graphs_up_to_scalar_rescaling
  1180. 223.83 s > --max-n-bridges 0
  1181. 223.83 s > --number-of-factorized-loop-subtopologies 1 1
  1182. 223.83 s > --number-of-anticommutating-loops 1 1
  1183. 223.83 s > [...]
  1184. 223.83 s > [2026-09-18 22:26:40.431] @feyngen::diagram_... INFO : 0s | Δ=0s | Starting Feynman graph generation with Symbolica...
  1185. 223.83 s > [2026-09-18 22:26:40.431] @feyngen::diagram_... INFO : 0s | Δ=0s | Number of graphs resulting from Symbolica generation: 3
  1186. 223.83 s > [2026-09-18 22:26:40.431] @feyngen::diagram_... INFO : 0s | Δ=0s | Number of graphs retained after removal of vetoed topologies: 2
  1187. 223.83 s > [2026-09-18 22:26:40.431] @feyngen::diagram_... INFO : 0s | Δ=0s | Number of graphs after vertex info assignment: 2
  1188. 223.83 s > [2026-09-18 22:26:40.431] @feyngen::diagram_... INFO : 0s | Δ=0s | Number of graphs after all complete graphs filters are applied: 2
  1189. 223.83 s > [2026-09-18 22:26:40.431] @feyngen::diagram_... INFO : 0s | Δ=0s | Number of graphs after closed anticommutating chains analysis: 1
  1190. 223.83 s > [2026-09-18 22:26:40.431] @feyngen::diagram_... INFO : 0s | Δ=0s | Number of graphs after symmetrization of external states: 1
  1191. 223.83 s > [2026-09-18 22:26:40.431] @feyngen::diagram_... INFO : 0s | Δ=0s | Number of graphs after canonization of vertices, edges and flows (graph labels assigned here): 1
  1192. 223.83 s > [2026-09-18 22:26:40.444] @feyngen::diagram_... INFO : 0s | Δ=0s | Number of graphs after numerator-aware grouping with strategy 'up to a scalar rescaling': 1 (1 isomorphically unique graph, 0 color zero, 0 lorentz zero, 0 grouped and 0 cancellation)
  1193. 223.83 s > [2026-09-18 22:26:40.444] @feyngen::diagram_... INFO : ( Sum of the symmetry factors from each graph generated = -1/2 )
  1194. 223.83 s > [2026-09-18 22:26:40.444] @commands::generate INFO : Generated amplitude 1 graphs.
  1195. 223.83 s > [2026-09-18 22:26:40.444] @commands::generate INFO : Only diagram generation was requested, skipping integrand generation. You can generate integrands later using the 'generate existing <options>' command.
  1196. 223.83 s > [2026-09-18 22:26:40.444] @gammaloop_api::se... INFO : Running command generate
  1197. 223.83 s > The application panicked (crashed).
  1198. 223.83 s > Message: label _func_power_ not found
  1199. 223.83 s > Location: /nix/store/n9w914kh1cm59xx3spcs831cdyb56m32-vendor-cargo-deps/c19b7c6f923b580ac259164a89f2577984ad5ab09ee9d583b888f934adbbe8d0/symjit-2.25.6/src/symjit/assembler.rs:77
  1200. 223.83 s >
  1201. 223.83 s > ━━━━━━━━━━━━━━━━━━━━━━━━━━━━━━━━━━ BACKTRACE ━━━━━━━━━━━━━━━━━━━━━━━━━━━━━━━━━━━
  1202. 223.83 s > 1: <color_eyre[51793ea62743adbd]::config::PanicHook>::panic_report<unknown>
  1203. 223.83 s > at <unknown source file>:<unknown line>
  1204. 223.83 s > 2: <color_eyre[51793ea62743adbd]::config::PanicHook>::into_panic_hook::{closure#0}<unknown>
  1205. 223.83 s > at <unknown source file>:<unknown line>
  1206. 223.83 s > 3: std[bcb96dfbba0ab899]::panicking::panic_with_hook<unknown>
  1207. 223.83 s > at <unknown source file>:<unknown line>
  1208. 223.83 s > 4: std[bcb96dfbba0ab899]::panicking::panic_handler::{closure#0}<unknown>
  1209. 223.83 s > at <unknown source file>:<unknown line>
  1210. 223.83 s > 5: std[bcb96dfbba0ab899]::sys::backtrace::__rust_end_short_backtrace::<std[bcb96dfbba0ab899]::panicking::panic_handler::{closure#0}, !><unknown>
  1211. 223.83 s > at <unknown source file>:<unknown line>
  1212. 223.83 s > 6: __rustc[6c289b9f9c454d21]::rust_begin_unwind<unknown>
  1213. 223.83 s > at <unknown source file>:<unknown line>
  1214. 223.83 s > 7: core[940e698046960fd5]::panicking::panic_fmt<unknown>
  1215. 223.83 s > at <unknown source file>:<unknown line>
  1216. 223.83 s > 8: <symjit[e408de789c333cd]::symjit::assembler::Assembler>::apply_jumps<unknown>
  1217. 223.83 s > at <unknown source file>:<unknown line>
  1218. 223.83 s > 9: <symjit[e408de789c333cd]::symjit::builder::Builder>::compile_from_mir::<symjit[e408de789c333cd]::symjit::amd::complex::AmdComplexGenerator><unknown>
  1219. 223.83 s > at <unknown source file>:<unknown line>
  1220. 223.83 s > 10: <symjit[e408de789c333cd]::symjit::runnable::Application>::compile_ty<unknown>
  1221. 223.83 s > at <unknown source file>:<unknown line>
  1222. 223.83 s > 11: <symjit[e408de789c333cd]::symjit::runnable::Application>::with_mir<unknown>
  1223. 223.83 s > at <unknown source file>:<unknown line>
  1224. 223.83 s > 12: <symjit[e408de789c333cd]::symjit::composer::DirectTranslator as symjit[e408de789c333cd]::symjit::composer::Composer>::compile<unknown>
  1225. 223.83 s > at <unknown source file>:<unknown line>
  1226. 223.83 s > 13: <symjit[e408de789c333cd]::symjit::compiler::Translator as symjit[e408de789c333cd]::symjit::composer::Composer>::compile<unknown>
  1227. 223.83 s > at <unknown source file>:<unknown line>
  1228. 223.83 s > 14: <numerica[124dab8567f4861e]::domains::float::complex::Complex<f64> as symbolica[10e259bab675d243]::evaluate::backend::JITCompiledNumber>::jit_compile<unknown>
  1229. 223.83 s > at <unknown source file>:<unknown line>
  1230. 223.83 s > 15: <gammalooprs[917cbd3df9e68f8f]::integrands::process::evaluators::GenericEvaluator>::activate_symjit<unknown>
  1231. 223.83 s > at <unknown source file>:<unknown line>
  1232. 223.83 s > 16: <gammalooprs[917cbd3df9e68f8f]::integrands::process::amplitude::AmplitudeIntegrand>::prepare_runtime_backends_after_generation_with_compile_times<unknown>
  1233. 223.83 s > at <unknown source file>:<unknown line>
  1234. 223.83 s > 17: <gammalooprs[917cbd3df9e68f8f]::processes::amplitude::Amplitude>::build_integrand<unknown>
  1235. 223.83 s > at <unknown source file>:<unknown line>
  1236. 223.83 s > 18: <gammalooprs[917cbd3df9e68f8f]::processes::process::Process>::generate_integrands<unknown>
  1237. 223.83 s > at <unknown source file>:<unknown line>
  1238. 223.83 s > 19: <gammalooprs[917cbd3df9e68f8f]::processes::ProcessList>::generate_integrands<unknown>
  1239. 223.83 s > at <unknown source file>:<unknown line>
  1240. 223.83 s > 20: <gammaloop_api[9ebf6628f97aeb57]::state::State>::generate_integrands<unknown>
  1241. 223.83 s > at <unknown source file>:<unknown line>
  1242. 223.83 s > 21: <gammaloop_api[9ebf6628f97aeb57]::commands::generate::Generate>::run::<&std[bcb96dfbba0ab899]::path::PathBuf><unknown>
  1243. 223.83 s > at <unknown source file>:<unknown line>
  1244. 223.83 s > 22: <gammaloop_api[9ebf6628f97aeb57]::commands::Commands>::run<unknown>
  1245. 223.83 s > at <unknown source file>:<unknown line>
  1246. 223.83 s > 23: <gammaloop_api[9ebf6628f97aeb57]::session::CliSession>::execute_prepared<unknown>
  1247. 223.83 s > at <unknown source file>:<unknown line>
  1248. 223.83 s > 24: <gammaloop_api[9ebf6628f97aeb57]::session::CliSession>::execute_prepared_commands<unknown>
  1249. 223.83 s > at <unknown source file>:<unknown line>
  1250. 223.83 s > 25: <gammaloop_api[9ebf6628f97aeb57]::session::CliSession>::execute_prepared<unknown>
  1251. 223.83 s > at <unknown source file>:<unknown line>
  1252. 223.83 s > 26: <gammaloop_api[9ebf6628f97aeb57]::session::CliSession>::execute_command<unknown>
  1253. 223.83 s > at <unknown source file>:<unknown line>
  1254. 223.83 s > 27: <gammaloop_integration_tests[191607b70c61cd5a]::CLIState>::run_command<unknown>
  1255. 223.83 s > at <unknown source file>:<unknown line>
  1256. 223.83 s > 28: uv[3c7454ef256d6487]::run_single_integrated_uv_case<unknown>
  1257. 223.83 s > at <unknown source file>:<unknown line>
  1258. 223.83 s > 29: <uv[3c7454ef256d6487]::thermal_sunrise_uv::{closure#0} as core[940e698046960fd5]::ops::function::FnOnce<()>>::call_once<unknown>
  1259. 223.83 s > at <unknown source file>:<unknown line>
  1260. 223.83 s > 30: test[75d6903177b1d7e9]::__rust_begin_short_backtrace::<core[940e698046960fd5]::result::Result<(), alloc[2ea6bcb46fca0c42]::string::String>, fn() -> core[940e698046960fd5]::result::Result<(), alloc[2ea6bcb46fca0c42]::string::String>><unknown>
  1261. 223.83 s > at <unknown source file>:<unknown line>
  1262. 223.83 s > 31: test[75d6903177b1d7e9]::run_test::{closure#0}<unknown>
  1263. 223.83 s > at <unknown source file>:<unknown line>
  1264. 223.83 s > 32: std[bcb96dfbba0ab899]::sys::backtrace::__rust_begin_short_backtrace::<test[75d6903177b1d7e9]::run_test::{closure#1}, ()><unknown>
  1265. 223.83 s > at <unknown source file>:<unknown line>
  1266. 223.83 s > 33: <std[bcb96dfbba0ab899]::thread::lifecycle::spawn_unchecked<test[75d6903177b1d7e9]::run_test::{closure#1}, ()>::{closure#1} as core[940e698046960fd5]::ops::function::FnOnce<()>>::call_once::{shim:vtable#0}<unknown>
  1267. 223.83 s > at <unknown source file>:<unknown line>
  1268. 223.83 s > 34: <std[bcb96dfbba0ab899]::sys::thread::unix::Thread>::new::thread_start<unknown>
  1269. 223.83 s > at <unknown source file>:<unknown line>
  1270. 223.83 s > 35: start_thread<unknown>
  1271. 223.83 s > at <unknown source file>:<unknown line>
  1272. 223.83 s > 36: __clone3<unknown>
  1273. 223.83 s > at <unknown source file>:<unknown line>
  1274. 223.83 s >
  1275. 223.83 s > Run with COLORBT_SHOW_HIDDEN=1 environment variable to disable frame filtering.
  1276. 223.83 s > Run with RUST_BACKTRACE=full to include source snippets.
  1277. 223.83 s > Warning: SpanTrace capture is Unsupported.
  1278. 223.83 s > Ensure that you've setup a tracing-error ErrorLayer and the semver versions are compatible
  1279. 223.83 s >
  1280. 223.83 s > error: test run failed
  1281. 223.83 s >
  1282. 223.83 s > ========== nextest test summary ==========
  1283. 223.83 s > report: target/nextest/ci_gammaloop/junit.xml
  1284. 223.83 s > tests: 170, failures: 2, errors: 0
  1285. 223.83 s >
  1286. 223.83 s > 1. gammaloop-integration-tests::test_runs::aa_aa::important::aa_aa_local_inspect_backend_consistency
  1287. 223.83 s > failure: test failure with exit code 101
  1288. 223.83 s > system-out
  1289. 223.83 s > running 1 test
  1290. 223.83 s > test aa_aa::important::aa_aa_local_inspect_backend_consistency ... FAILED
  1291. 223.83 s >
  1292. 223.83 s > failures:
  1293. 223.83 s >
  1294. 223.83 s > failures:
  1295. 223.83 s > aa_aa::important::aa_aa_local_inspect_backend_consistency
  1296. 223.83 s >
  1297. 223.83 s > test result: FAILED. 0 passed; 1 failed; 0 ignored; 0 measured; 274 filtered out; finished in 2.78s
  1298. 223.83 s > system-err
  1299. 223.83 s > [2026-09-18 22:25:58.332] @gammaloop_api::se... INFO : Running command import model sm-default.json
  1300. 223.83 s > [2026-09-18 22:25:58.332] @import::model INFO : Loading built-in JSON model sm-default
  1301. 223.83 s > [2026-09-18 22:25:58.354] @gammalooprs::model INFO : The following 15 external parameters were forced to zero by the restriction card:
  1302. 223.83 s > lamWS, AWS, rhoWS, etaWS, ymc, yme, ymm, MC, Me, MM, WTau, muQ, muLe, muLmu, muLtau
  1303. 223.83 s > [2026-09-18 22:25:58.354] @gammalooprs::model INFO : The following 34 vertex rules were removed by the restriction card:
  1304. 223.83 s > V_82 -> (c~, d, G+) | V_83 -> (t~, d, G+) | V_84 -> (c~, s, G+) | V_85 -> (t~, s, G+) | V_86 -> (u~, b, G+) | V_87 -> (c~, b, G+) | V_90 -> (c~, d, W+) | V_91 -> (t~, d, W+) | V_92 -> (u~, s, W+) | V_94 -> (t~, s, W+) | V_95 -> (u~, b, W+) | V_96 -> (c~, b, W+) | V_101 -> (e+, e-, G0) | V_102 -> (mu+, mu-, G0) | V_104 -> (e+, e-, H) | V_105 -> (mu+, mu-, H) | V_110 -> (ve~, e-, G+) | V_111 -> (vm~, mu-, G+) | V_116 -> (b~, u, G-) | V_117 -> (d~, c, G-) | V_118 -> (s~, c, G-) | V_119 -> (b~, c, G-) | V_120 -> (d~, t, G-) | V_121 -> (s~, t, G-) | V_124 -> (s~, u, W-) | V_125 -> (b~, u, W-) | V_126 -> (d~, c, W-) | V_128 -> (b~, c, W-) | V_129 -> (d~, t, W-) | V_130 -> (s~, t, W-) | V_138 -> (c~, c, G0) | V_140 -> (c~, c, H) | V_145 -> (e+, ve, G-) | V_146 -> (mu+, vm, G-)
  1305. 223.83 s > [2026-09-18 22:25:58.354] @gammalooprs::model INFO : The following 36 couplings were removed by the restriction card:
  1306. 223.83 s > GC_13, GC_14, GC_16, GC_17, GC_18, GC_19, GC_20, GC_22, GC_23, GC_24, GC_25, GC_26, GC_28, GC_29, GC_42, GC_43, GC_44, GC_46, GC_47, GC_48, GC_84, GC_85, GC_86, GC_87, GC_88, GC_89, GC_90, GC_91, GC_92, GC_93, GC_101, GC_102, GC_103, GC_105, GC_106, GC_107
  1307. 223.83 s > [2026-09-18 22:25:58.354] @gammaloop_api::se... INFO : Running command run set_model_parameters
  1308. 223.83 s > [2026-09-18 22:25:58.354] @gammaloop_api::se... INFO : Starting command block set_model_parameters
  1309. 223.83 s > [2026-09-18 22:25:58.354] @gammaloop_api::se... INFO : Running command set model MT=173.0
  1310. 223.83 s > [2026-09-18 22:25:58.359] @gammaloop_api::se... INFO : Running command set model WT=0.0
  1311. 223.83 s > [2026-09-18 22:25:58.363] @gammaloop_api::se... INFO : Running command set model ymt=173.0
  1312. 223.83 s > [2026-09-18 22:25:58.368] @gammaloop_api::se... INFO : Running command set model aS=0.118
  1313. 223.83 s > [2026-09-18 22:25:58.372] @gammaloop_api::se... INFO : Running command set model aEWM1=137.036
  1314. 223.83 s > [2026-09-18 22:25:58.376] @gammaloop_api::se... INFO : Running command set model Gf=1.166390e-05
  1315. 223.83 s > [2026-09-18 22:25:58.381] @gammaloop_api::se... INFO : Running command set model MZ=91.188
  1316. 223.83 s > [2026-09-18 22:25:58.386] @gammaloop_api::se... INFO : Running command set global string '
  1317. 223.83 s > [global.generation.compile]
  1318. 223.83 s > compilation_mode = "symjit"
  1319. 223.83 s > optimization_level = "O0"
  1320. 223.83 s > fast_math = false
  1321. 223.83 s > [...]
  1322. 223.83 s > [2026-09-18 22:25:58.386] @gammaloop_api::se... INFO : Running command import graphs ./examples/cli/aa_aa/1L/aa_aa_1L.dot -p aa_aa_all_helicities -i 1L_ppmm -o
  1323. 223.83 s > [2026-09-18 22:25:58.386] @commands::import INFO : Loading graphs from '/build/source/examples/cli/aa_aa/1L/aa_aa_1L.dot'
  1324. 223.83 s > [2026-09-18 22:25:58.396] @gammaloop_api::se... INFO : Running command generate existing -p aa_aa_all_helicities
  1325. 223.83 s > The application panicked (crashed).
  1326. 223.83 s > Message: label _func_power_ not found
  1327. 223.83 s > Location: /nix/store/n9w914kh1cm59xx3spcs831cdyb56m32-vendor-cargo-deps/c19b7c6f923b580ac259164a89f2577984ad5ab09ee9d583b888f934adbbe8d0/symjit-2.25.6/src/symjit/assembler.rs:77
  1328. 223.83 s >
  1329. 223.83 s > ━━━━━━━━━━━━━━━━━━━━━━━━━━━━━━━━━━ BACKTRACE ━━━━━━━━━━━━━━━━━━━━━━━━━━━━━━━━━━━
  1330. 223.83 s > 1: <color_eyre[51793ea62743adbd]::config::PanicHook>::panic_report<unknown>
  1331. 223.83 s > at <unknown source file>:<unknown line>
  1332. 223.83 s > 2: <color_eyre[51793ea62743adbd]::config::PanicHook>::into_panic_hook::{closure#0}<unknown>
  1333. 223.83 s > at <unknown source file>:<unknown line>
  1334. 223.83 s > 3: std[bcb96dfbba0ab899]::panicking::panic_with_hook<unknown>
  1335. 223.83 s > at <unknown source file>:<unknown line>
  1336. 223.83 s > 4: std[bcb96dfbba0ab899]::panicking::panic_handler::{closure#0}<unknown>
  1337. 223.83 s > at <unknown source file>:<unknown line>
  1338. 223.83 s > 5: std[bcb96dfbba0ab899]::sys::backtrace::__rust_end_short_backtrace::<std[bcb96dfbba0ab899]::panicking::panic_handler::{closure#0}, !><unknown>
  1339. 223.83 s > at <unknown source file>:<unknown line>
  1340. 223.83 s > 6: __rustc[6c289b9f9c454d21]::rust_begin_unwind<unknown>
  1341. 223.83 s > at <unknown source file>:<unknown line>
  1342. 223.83 s > 7: core[940e698046960fd5]::panicking::panic_fmt<unknown>
  1343. 223.83 s > at <unknown source file>:<unknown line>
  1344. 223.83 s > 8: <symjit[e408de789c333cd]::symjit::assembler::Assembler>::apply_jumps<unknown>
  1345. 223.83 s > at <unknown source file>:<unknown line>
  1346. 223.83 s > 9: <symjit[e408de789c333cd]::symjit::builder::Builder>::compile_from_mir::<symjit[e408de789c333cd]::symjit::amd::complex::AmdComplexGenerator><unknown>
  1347. 223.83 s > at <unknown source file>:<unknown line>
  1348. 223.83 s > 10: <symjit[e408de789c333cd]::symjit::runnable::Application>::compile_ty<unknown>
  1349. 223.83 s > at <unknown source file>:<unknown line>
  1350. 223.83 s > 11: <symjit[e408de789c333cd]::symjit::runnable::Application>::with_mir<unknown>
  1351. 223.83 s > at <unknown source file>:<unknown line>
  1352. 223.83 s > 12: <symjit[e408de789c333cd]::symjit::composer::DirectTranslator as symjit[e408de789c333cd]::symjit::composer::Composer>::compile<unknown>
  1353. 223.83 s > at <unknown source file>:<unknown line>
  1354. 223.83 s > 13: <symjit[e408de789c333cd]::symjit::compiler::Translator as symjit[e408de789c333cd]::symjit::composer::Composer>::compile<unknown>
  1355. 223.83 s > at <unknown source file>:<unknown line>
  1356. 223.83 s > 14: <numerica[124dab8567f4861e]::domains::float::complex::Complex<f64> as symbolica[10e259bab675d243]::evaluate::backend::JITCompiledNumber>::jit_compile<unknown>
  1357. 223.83 s > at <unknown source file>:<unknown line>
  1358. 223.83 s > 15: <gammalooprs[917cbd3df9e68f8f]::integrands::process::evaluators::GenericEvaluator>::activate_symjit<unknown>
  1359. 223.83 s > at <unknown source file>:<unknown line>
  1360. 223.83 s > 16: <gammalooprs[917cbd3df9e68f8f]::integrands::process::amplitude::AmplitudeIntegrand>::prepare_runtime_backends_after_generation_with_compile_times<unknown>
  1361. 223.83 s > at <unknown source file>:<unknown line>
  1362. 223.83 s > 17: <gammalooprs[917cbd3df9e68f8f]::processes::amplitude::Amplitude>::build_integrand<unknown>
  1363. 223.83 s > at <unknown source file>:<unknown line>
  1364. 223.83 s > 18: <gammalooprs[917cbd3df9e68f8f]::processes::process::Process>::generate_integrands<unknown>
  1365. 223.83 s > at <unknown source file>:<unknown line>
  1366. 223.83 s > 19: <gammaloop_api[9ebf6628f97aeb57]::state::State>::generate_integrand<unknown>
  1367. 223.83 s > at <unknown source file>:<unknown line>
  1368. 223.83 s > 20: <gammaloop_api[9ebf6628f97aeb57]::commands::generate::Generate>::run::<&std[bcb96dfbba0ab899]::path::PathBuf><unknown>
  1369. 223.83 s > at <unknown source file>:<unknown line>
  1370. 223.83 s > 21: <gammaloop_api[9ebf6628f97aeb57]::commands::Commands>::run<unknown>
  1371. 223.83 s > at <unknown source file>:<unknown line>
  1372. 223.83 s > 22: <gammaloop_api[9ebf6628f97aeb57]::session::CliSession>::execute_prepared<unknown>
  1373. 223.83 s > at <unknown source file>:<unknown line>
  1374. 223.83 s > 23: <gammaloop_api[9ebf6628f97aeb57]::session::CliSession>::execute_command<unknown>
  1375. 223.83 s > at <unknown source file>:<unknown line>
  1376. 223.83 s > 24: <gammaloop_integration_tests[191607b70c61cd5a]::CLIState>::run_command<unknown>
  1377. 223.83 s > at <unknown source file>:<unknown line>
  1378. 223.83 s > 25: test_runs[9b7e2dc2dc4f29b0]::aa_aa::generate_aa_aa_helicity_family<unknown>
  1379. 223.83 s > at <unknown source file>:<unknown line>
  1380. 223.83 s > 26: <test_runs[9b7e2dc2dc4f29b0]::aa_aa::important::aa_aa_local_inspect_backend_consistency::{closure#0} as core[940e698046960fd5]::ops::function::FnOnce<()>>::call_once<unknown>
  1381. 223.83 s > at <unknown source file>:<unknown line>
  1382. 223.83 s > 27: serial_test[cd99724524a2f1c0]::serial_code_lock::local_serial_core_with_return::<(), eyre[cb2fd339c0c40fca]::Report><unknown>
  1383. 223.83 s > at <unknown source file>:<unknown line>
  1384. 223.83 s > 28: <test_runs[9b7e2dc2dc4f29b0]::aa_aa::important::aa_aa_local_inspect_backend_consistency::{closure#0} as core[940e698046960fd5]::ops::function::FnOnce<()>>::call_once<unknown>
  1385. 223.83 s > at <unknown source file>:<unknown line>
  1386. 223.83 s > 29: test[75d6903177b1d7e9]::__rust_begin_short_backtrace::<core[940e698046960fd5]::result::Result<(), alloc[2ea6bcb46fca0c42]::string::String>, fn() -> core[940e698046960fd5]::result::Result<(), alloc[2ea6bcb46fca0c42]::string::String>><unknown>
  1387. 223.83 s > at <unknown source file>:<unknown line>
  1388. 223.83 s > 30: test[75d6903177b1d7e9]::run_test::{closure#0}<unknown>
  1389. 223.83 s > at <unknown source file>:<unknown line>
  1390. 223.83 s > 31: std[bcb96dfbba0ab899]::sys::backtrace::__rust_begin_short_backtrace::<test[75d6903177b1d7e9]::run_test::{closure#1}, ()><unknown>
  1391. 223.83 s > at <unknown source file>:<unknown line>
  1392. 223.83 s > 32: <std[bcb96dfbba0ab899]::thread::lifecycle::spawn_unchecked<test[75d6903177b1d7e9]::run_test::{closure#1}, ()>::{closure#1} as core[940e698046960fd5]::ops::function::FnOnce<()>>::call_once::{shim:vtable#0}<unknown>
  1393. 223.83 s > at <unknown source file>:<unknown line>
  1394. 223.83 s > 33: <std[bcb96dfbba0ab899]::sys::thread::unix::Thread>::new::thread_start<unknown>
  1395. 223.83 s > at <unknown source file>:<unknown line>
  1396. 223.83 s > 34: start_thread<unknown>
  1397. 223.83 s > at <unknown source file>:<unknown line>
  1398. 223.83 s > 35: __clone3<unknown>
  1399. 223.83 s > at <unknown source file>:<unknown line>
  1400. 223.83 s >
  1401. 223.83 s > Run with COLORBT_SHOW_HIDDEN=1 environment variable to disable frame filtering.
  1402. 223.83 s > Run with RUST_BACKTRACE=full to include source snippets.
  1403. 223.83 s > Warning: SpanTrace capture is Unsupported.
  1404. 223.83 s > Ensure that you've setup a tracing-error ErrorLayer and the semver versions are compatible
  1405. 223.83 s >
  1406. 223.83 s > 2. gammaloop-integration-tests::uv::thermal_sunrise_uv
  1407. 223.83 s > failure: test failure with exit code 101
  1408. 223.83 s > system-out
  1409. 223.83 s > running 1 test
  1410. 223.83 s > test thermal_sunrise_uv ... FAILED
  1411. 223.83 s >
  1412. 223.83 s > failures:
  1413. 223.83 s >
  1414. 223.83 s > failures:
  1415. 223.83 s > thermal_sunrise_uv
  1416. 223.83 s >
  1417. 223.83 s > test result: FAILED. 0 passed; 1 failed; 0 ignored; 0 measured; 31 filtered out; finished in 2.95s
  1418. 223.83 s > system-err
  1419. 223.83 s > [2026-09-18 22:26:40.402] @gammaloop_api::se... INFO : Running command run generate
  1420. 223.83 s > [2026-09-18 22:26:40.402] @gammaloop_api::se... INFO : Starting command block generate
  1421. 223.83 s > [2026-09-18 22:26:40.402] @gammaloop_api::se... INFO : Running command import model sm-default.json
  1422. 223.83 s > [2026-09-18 22:26:40.402] @import::model INFO : Loading built-in JSON model sm-default
  1423. 223.83 s > [2026-09-18 22:26:40.429] @gammalooprs::model INFO : The following 15 external parameters were forced to zero by the restriction card:
  1424. 223.83 s > lamWS, AWS, rhoWS, etaWS, ymc, yme, ymm, MC, Me, MM, WTau, muQ, muLe, muLmu, muLtau
  1425. 223.83 s > [2026-09-18 22:26:40.429] @gammalooprs::model INFO : The following 34 vertex rules were removed by the restriction card:
  1426. 223.83 s > V_82 -> (c~, d, G+) | V_83 -> (t~, d, G+) | V_84 -> (c~, s, G+) | V_85 -> (t~, s, G+) | V_86 -> (u~, b, G+) | V_87 -> (c~, b, G+) | V_90 -> (c~, d, W+) | V_91 -> (t~, d, W+) | V_92 -> (u~, s, W+) | V_94 -> (t~, s, W+) | V_95 -> (u~, b, W+) | V_96 -> (c~, b, W+) | V_101 -> (e+, e-, G0) | V_102 -> (mu+, mu-, G0) | V_104 -> (e+, e-, H) | V_105 -> (mu+, mu-, H) | V_110 -> (ve~, e-, G+) | V_111 -> (vm~, mu-, G+) | V_116 -> (b~, u, G-) | V_117 -> (d~, c, G-) | V_118 -> (s~, c, G-) | V_119 -> (b~, c, G-) | V_120 -> (d~, t, G-) | V_121 -> (s~, t, G-) | V_124 -> (s~, u, W-) | V_125 -> (b~, u, W-) | V_126 -> (d~, c, W-) | V_128 -> (b~, c, W-) | V_129 -> (d~, t, W-) | V_130 -> (s~, t, W-) | V_138 -> (c~, c, G0) | V_140 -> (c~, c, H) | V_145 -> (e+, ve, G-) | V_146 -> (mu+, vm, G-)
  1427. 223.83 s > [2026-09-18 22:26:40.429] @gammalooprs::model INFO : The following 36 couplings were removed by the restriction card:
  1428. 223.83 s > GC_13, GC_14, GC_16, GC_17, GC_18, GC_19, GC_20, GC_22, GC_23, GC_24, GC_25, GC_26, GC_28, GC_29, GC_42, GC_43, GC_44, GC_46, GC_47, GC_48, GC_84, GC_85, GC_86, GC_87, GC_88, GC_89, GC_90, GC_91, GC_92, GC_93, GC_101, GC_102, GC_103, GC_105, GC_106, GC_107
  1429. 223.83 s > [2026-09-18 22:26:40.429] @gammaloop_api::se... INFO : Running command remove processes
  1430. 223.83 s > [2026-09-18 22:26:40.429] @gammaloop_api::se... INFO : Running command generate amp {} > {} [{2}] | g u
  1431. 223.83 s > --numerator-grouping group_identical_graphs_up_to_scalar_rescaling
  1432. 223.83 s > --max-n-bridges 0
  1433. 223.83 s > --number-of-factorized-loop-subtopologies 1 1
  1434. 223.83 s > --number-of-anticommutating-loops 1 1
  1435. 223.83 s > [...]
  1436. 223.83 s > [2026-09-18 22:26:40.431] @feyngen::diagram_... INFO : 0s | Δ=0s | Starting Feynman graph generation with Symbolica...
  1437. 223.83 s > [2026-09-18 22:26:40.431] @feyngen::diagram_... INFO : 0s | Δ=0s | Number of graphs resulting from Symbolica generation: 3
  1438. 223.83 s > [2026-09-18 22:26:40.431] @feyngen::diagram_... INFO : 0s | Δ=0s | Number of graphs retained after removal of vetoed topologies: 2
  1439. 223.83 s > [2026-09-18 22:26:40.431] @feyngen::diagram_... INFO : 0s | Δ=0s | Number of graphs after vertex info assignment: 2
  1440. 223.83 s > [2026-09-18 22:26:40.431] @feyngen::diagram_... INFO : 0s | Δ=0s | Number of graphs after all complete graphs filters are applied: 2
  1441. 223.83 s > [2026-09-18 22:26:40.431] @feyngen::diagram_... INFO : 0s | Δ=0s | Number of graphs after closed anticommutating chains analysis: 1
  1442. 223.83 s > [2026-09-18 22:26:40.431] @feyngen::diagram_... INFO : 0s | Δ=0s | Number of graphs after symmetrization of external states: 1
  1443. 223.83 s > [2026-09-18 22:26:40.431] @feyngen::diagram_... INFO : 0s | Δ=0s | Number of graphs after canonization of vertices, edges and flows (graph labels assigned here): 1
  1444. 223.83 s > [2026-09-18 22:26:40.444] @feyngen::diagram_... INFO : 0s | Δ=0s | Number of graphs after numerator-aware grouping with strategy 'up to a scalar rescaling': 1 (1 isomorphically unique graph, 0 color zero, 0 lorentz zero, 0 grouped and 0 cancellation)
  1445. 223.83 s > [2026-09-18 22:26:40.444] @feyngen::diagram_... INFO : ( Sum of the symmetry factors from each graph generated = -1/2 )
  1446. 223.83 s > [2026-09-18 22:26:40.444] @commands::generate INFO : Generated amplitude 1 graphs.
  1447. 223.83 s > [2026-09-18 22:26:40.444] @commands::generate INFO : Only diagram generation was requested, skipping integrand generation. You can generate integrands later using the 'generate existing <options>' command.
  1448. 223.83 s > [2026-09-18 22:26:40.444] @gammaloop_api::se... INFO : Running command generate
  1449. 223.83 s > The application panicked (crashed).
  1450. 223.83 s > Message: label _func_power_ not found
  1451. 223.83 s > Location: /nix/store/n9w914kh1cm59xx3spcs831cdyb56m32-vendor-cargo-deps/c19b7c6f923b580ac259164a89f2577984ad5ab09ee9d583b888f934adbbe8d0/symjit-2.25.6/src/symjit/assembler.rs:77
  1452. 223.83 s >
  1453. 223.83 s > ━━━━━━━━━━━━━━━━━━━━━━━━━━━━━━━━━━ BACKTRACE ━━━━━━━━━━━━━━━━━━━━━━━━━━━━━━━━━━━
  1454. 223.83 s > 1: <color_eyre[51793ea62743adbd]::config::PanicHook>::panic_report<unknown>
  1455. 223.83 s > at <unknown source file>:<unknown line>
  1456. 223.83 s > 2: <color_eyre[51793ea62743adbd]::config::PanicHook>::into_panic_hook::{closure#0}<unknown>
  1457. 223.83 s > at <unknown source file>:<unknown line>
  1458. 223.83 s > 3: std[bcb96dfbba0ab899]::panicking::panic_with_hook<unknown>
  1459. 223.83 s > at <unknown source file>:<unknown line>
  1460. 223.83 s > 4: std[bcb96dfbba0ab899]::panicking::panic_handler::{closure#0}<unknown>
  1461. 223.83 s > at <unknown source file>:<unknown line>
  1462. 223.83 s > 5: std[bcb96dfbba0ab899]::sys::backtrace::__rust_end_short_backtrace::<std[bcb96dfbba0ab899]::panicking::panic_handler::{closure#0}, !><unknown>
  1463. 223.83 s > at <unknown source file>:<unknown line>
  1464. 223.83 s > 6: __rustc[6c289b9f9c454d21]::rust_begin_unwind<unknown>
  1465. 223.83 s > at <unknown source file>:<unknown line>
  1466. 223.83 s > 7: core[940e698046960fd5]::panicking::panic_fmt<unknown>
  1467. 223.83 s > at <unknown source file>:<unknown line>
  1468. 223.83 s > 8: <symjit[e408de789c333cd]::symjit::assembler::Assembler>::apply_jumps<unknown>
  1469. 223.83 s > at <unknown source file>:<unknown line>
  1470. 223.83 s > 9: <symjit[e408de789c333cd]::symjit::builder::Builder>::compile_from_mir::<symjit[e408de789c333cd]::symjit::amd::complex::AmdComplexGenerator><unknown>
  1471. 223.83 s > at <unknown source file>:<unknown line>
  1472. 223.83 s > 10: <symjit[e408de789c333cd]::symjit::runnable::Application>::compile_ty<unknown>
  1473. 223.83 s > at <unknown source file>:<unknown line>
  1474. 223.83 s > 11: <symjit[e408de789c333cd]::symjit::runnable::Application>::with_mir<unknown>
  1475. 223.83 s > at <unknown source file>:<unknown line>
  1476. 223.83 s > 12: <symjit[e408de789c333cd]::symjit::composer::DirectTranslator as symjit[e408de789c333cd]::symjit::composer::Composer>::compile<unknown>
  1477. 223.83 s > at <unknown source file>:<unknown line>
  1478. 223.83 s > 13: <symjit[e408de789c333cd]::symjit::compiler::Translator as symjit[e408de789c333cd]::symjit::composer::Composer>::compile<unknown>
  1479. 223.83 s > at <unknown source file>:<unknown line>
  1480. 223.83 s > 14: <numerica[124dab8567f4861e]::domains::float::complex::Complex<f64> as symbolica[10e259bab675d243]::evaluate::backend::JITCompiledNumber>::jit_compile<unknown>
  1481. 223.83 s > at <unknown source file>:<unknown line>
  1482. 223.83 s > 15: <gammalooprs[917cbd3df9e68f8f]::integrands::process::evaluators::GenericEvaluator>::activate_symjit<unknown>
  1483. 223.83 s > at <unknown source file>:<unknown line>
  1484. 223.83 s > 16: <gammalooprs[917cbd3df9e68f8f]::integrands::process::amplitude::AmplitudeIntegrand>::prepare_runtime_backends_after_generation_with_compile_times<unknown>
  1485. 223.83 s > at <unknown source file>:<unknown line>
  1486. 223.83 s > 17: <gammalooprs[917cbd3df9e68f8f]::processes::amplitude::Amplitude>::build_integrand<unknown>
  1487. 223.83 s > at <unknown source file>:<unknown line>
  1488. 223.83 s > 18: <gammalooprs[917cbd3df9e68f8f]::processes::process::Process>::generate_integrands<unknown>
  1489. 223.83 s > at <unknown source file>:<unknown line>
  1490. 223.83 s > 19: <gammalooprs[917cbd3df9e68f8f]::processes::ProcessList>::generate_integrands<unknown>
  1491. 223.83 s > at <unknown source file>:<unknown line>
  1492. 223.83 s > 20: <gammaloop_api[9ebf6628f97aeb57]::state::State>::generate_integrands<unknown>
  1493. 223.83 s > at <unknown source file>:<unknown line>
  1494. 223.83 s > 21: <gammaloop_api[9ebf6628f97aeb57]::commands::generate::Generate>::run::<&std[bcb96dfbba0ab899]::path::PathBuf><unknown>
  1495. 223.83 s > at <unknown source file>:<unknown line>
  1496. 223.83 s > 22: <gammaloop_api[9ebf6628f97aeb57]::commands::Commands>::run<unknown>
  1497. 223.83 s > at <unknown source file>:<unknown line>
  1498. 223.83 s > 23: <gammaloop_api[9ebf6628f97aeb57]::session::CliSession>::execute_prepared<unknown>
  1499. 223.83 s > at <unknown source file>:<unknown line>
  1500. 223.83 s > 24: <gammaloop_api[9ebf6628f97aeb57]::session::CliSession>::execute_prepared_commands<unknown>
  1501. 223.83 s > at <unknown source file>:<unknown line>
  1502. 223.83 s > 25: <gammaloop_api[9ebf6628f97aeb57]::session::CliSession>::execute_prepared<unknown>
  1503. 223.83 s > at <unknown source file>:<unknown line>
  1504. 223.83 s > 26: <gammaloop_api[9ebf6628f97aeb57]::session::CliSession>::execute_command<unknown>
  1505. 223.83 s > at <unknown source file>:<unknown line>
  1506. 223.83 s > 27: <gammaloop_integration_tests[191607b70c61cd5a]::CLIState>::run_command<unknown>
  1507. 223.83 s > at <unknown source file>:<unknown line>
  1508. 223.83 s > 28: uv[3c7454ef256d6487]::run_single_integrated_uv_case<unknown>
  1509. 223.83 s > at <unknown source file>:<unknown line>
  1510. 223.83 s > 29: <uv[3c7454ef256d6487]::thermal_sunrise_uv::{closure#0} as core[940e698046960fd5]::ops::function::FnOnce<()>>::call_once<unknown>
  1511. 223.83 s > at <unknown source file>:<unknown line>
  1512. 223.83 s > 30: test[75d6903177b1d7e9]::__rust_begin_short_backtrace::<core[940e698046960fd5]::result::Result<(), alloc[2ea6bcb46fca0c42]::string::String>, fn() -> core[940e698046960fd5]::result::Result<(), alloc[2ea6bcb46fca0c42]::string::String>><unknown>
  1513. 223.83 s > at <unknown source file>:<unknown line>
  1514. 223.83 s > 31: test[75d6903177b1d7e9]::run_test::{closure#0}<unknown>
  1515. 223.83 s > at <unknown source file>:<unknown line>
  1516. 223.83 s > 32: std[bcb96dfbba0ab899]::sys::backtrace::__rust_begin_short_backtrace::<test[75d6903177b1d7e9]::run_test::{closure#1}, ()><unknown>
  1517. 223.83 s > at <unknown source file>:<unknown line>
  1518. 223.83 s > 33: <std[bcb96dfbba0ab899]::thread::lifecycle::spawn_unchecked<test[75d6903177b1d7e9]::run_test::{closure#1}, ()>::{closure#1} as core[940e698046960fd5]::ops::function::FnOnce<()>>::call_once::{shim:vtable#0}<unknown>
  1519. 223.83 s > at <unknown source file>:<unknown line>
  1520. 223.83 s > 34: <std[bcb96dfbba0ab899]::sys::thread::unix::Thread>::new::thread_start<unknown>
  1521. 223.83 s > at <unknown source file>:<unknown line>
  1522. 223.83 s > 35: start_thread<unknown>
  1523. 223.83 s > at <unknown source file>:<unknown line>
  1524. 223.83 s > 36: __clone3<unknown>
  1525. 223.83 s > at <unknown source file>:<unknown line>
  1526. 223.83 s >
  1527. 223.83 s > Run with COLORBT_SHOW_HIDDEN=1 environment variable to disable frame filtering.
  1528. 223.83 s > Run with RUST_BACKTRACE=full to include source snippets.
  1529. 223.83 s > Warning: SpanTrace capture is Unsupported.
  1530. 223.83 s > Ensure that you've setup a tracing-error ErrorLayer and the semver versions are compatible
  1531. 223.83 s > =========================================
  1532. 223.83 s For full logs, run:
  1533. 223.83 s nix log /nix/store/kwk339q5xvfx62zai4ay5j3qq0nfsqgw-gammaloop-nextest-integration.drv
  1534. 223.97 s [0 built (1 failed), 0.0Run failed.