0.09 s
$ /nix/store/9ypz3flqsrl5xl495mm8h645gadjsxi1-coreutils-9.11/bin/timeout --kill-after=15s 7200s /nix/store/23zk8sgzamrbmj1fday15szf7f2279s8-nix-2.34.7/bin/nix --extra-experimental-features nix-command --extra-experimental-features flakes flake clone git+https://github.com/alphal00p/gammaloop --dest /tmp/nix-ci-worker/stable-pwd/repo/
0.10 s
Cloning into '/tmp/nix-ci-worker/stable-pwd/repo'...
1.08 s
remote: Enumerating objects: 65450, done.
1.20 s
remote: Counting objects: 0% (1/8101)
remote: Counting objects: 1% (82/8101)
remote: Counting objects: 2% (163/8101)
remote: Counting objects: 3% (244/8101)
remote: Counting objects: 4% (325/8101)
remote: Counting objects: 5% (406/8101)
remote: Counting objects: 6% (487/8101)
remote: Counting objects: 7% (568/8101)
remote: Counting objects: 8% (649/8101)
remote: Counting objects: 9% (730/8101)
remote: Counting objects: 10% (811/8101)
remote: Counting objects: 11% (892/8101)
remote: Counting objects: 12% (973/8101)
remote: Counting objects: 13% (1054/8101)
remote: Counting objects: 14% (1135/8101)
remote: Counting objects: 15% (1216/8101)
remote: Counting objects: 16% (1297/8101)
remote: Counting objects: 17% (1378/8101)
remote: Counting objects: 18% (1459/8101)
remote: Counting objects: 19% (1540/8101)
remote: Counting objects: 20% (1621/8101)
remote: Counting objects: 21% (1702/8101)
remote: Counting objects: 22% (1783/8101)
remote: Counting objects: 23% (1864/8101)
remote: Counting objects: 24% (1945/8101)
remote: Counting objects: 25% (2026/8101)
remote: Counting objects: 26% (2107/8101)
remote: Counting objects: 27% (2188/8101)
remote: Counting objects: 28% (2269/8101)
remote: Counting objects: 29% (2350/8101)
remote: Counting objects: 30% (2431/8101)
remote: Counting objects: 31% (2512/8101)
remote: Counting objects: 32% (2593/8101)
remote: Counting objects: 33% (2674/8101)
remote: Counting objects: 34% (2755/8101)
remote: Counting objects: 35% (2836/8101)
remote: Counting objects: 36% (2917/8101)
remote: Counting objects: 37% (2998/8101)
remote: Counting objects: 38% (3079/8101)
remote: Counting objects: 39% (3160/8101)
remote: Counting objects: 40% (3241/8101)
remote: Counting objects: 41% (3322/8101)
remote: Counting objects: 42% (3403/8101)
remote: Counting objects: 43% (3484/8101)
remote: Counting objects: 44% (3565/8101)
remote: Counting objects: 45% (3646/8101)
remote: Counting objects: 46% (3727/8101)
remote: Counting objects: 47% (3808/8101)
remote: Counting objects: 48% (3889/8101)
remote: Counting objects: 49% (3970/8101)
remote: Counting objects: 50% (4051/8101)
remote: Counting objects: 51% (4132/8101)
remote: Counting objects: 52% (4213/8101)
remote: Counting objects: 53% (4294/8101)
remote: Counting objects: 54% (4375/8101)
remote: Counting objects: 55% (4456/8101)
remote: Counting objects: 56% (4537/8101)
remote: Counting objects: 57% (4618/8101)
remote: Counting objects: 58% (4699/8101)
remote: Counting objects: 59% (4780/8101)
remote: Counting objects: 60% (4861/8101)
remote: Counting objects: 61% (4942/8101)
remote: Counting objects: 62% (5023/8101)
remote: Counting objects: 63% (5104/8101)
remote: Counting objects: 64% (5185/8101)
remote: Counting objects: 65% (5266/8101)
remote: Counting objects: 66% (5347/8101)
remote: Counting objects: 67% (5428/8101)
remote: Counting objects: 68% (5509/8101)
remote: Counting objects: 69% (5590/8101)
remote: Counting objects: 70% (5671/8101)
remote: Counting objects: 71% (5752/8101)
remote: Counting objects: 72% (5833/8101)
remote: Counting objects: 73% (5914/8101)
remote: Counting objects: 74% (5995/8101)
remote: Counting objects: 75% (6076/8101)
remote: Counting objects: 76% (6157/8101)
remote: Counting objects: 77% (6238/8101)
remote: Counting objects: 78% (6319/8101)
remote: Counting objects: 79% (6400/8101)
remote: Counting objects: 80% (6481/8101)
remote: Counting objects: 81% (6562/8101)
remote: Counting objects: 82% (6643/8101)
remote: Counting objects: 83% (6724/8101)
remote: Counting objects: 84% (6805/8101)
remote: Counting objects: 85% (6886/8101)
remote: Counting objects: 86% (6967/8101)
remote: Counting objects: 87% (7048/8101)
remote: Counting objects: 88% (7129/8101)
remote: Counting objects: 89% (7210/8101)
remote: Counting objects: 90% (7291/8101)
remote: Counting objects: 91% (7372/8101)
remote: Counting objects: 92% (7453/8101)
remote: Counting objects: 93% (7534/8101)
remote: Counting objects: 94% (7615/8101)
remote: Counting objects: 95% (7696/8101)
remote: Counting objects: 96% (7777/8101)
remote: Counting objects: 97% (7858/8101)
remote: Counting objects: 98% (7939/8101)
remote: Counting objects: 99% (8020/8101)
remote: Counting objects: 100% (8101/8101)
remote: Counting objects: 100% (8101/8101), done.
2.85 s
remote: Compressing objects: 0% (1/1732)
remote: Compressing objects: 1% (18/1732)
remote: Compressing objects: 2% (35/1732)
remote: Compressing objects: 3% (52/1732)
remote: Compressing objects: 4% (70/1732)
remote: Compressing objects: 5% (87/1732)
remote: Compressing objects: 6% (104/1732)
remote: Compressing objects: 7% (122/1732)
remote: Compressing objects: 8% (139/1732)
remote: Compressing objects: 9% (156/1732)
remote: Compressing objects: 10% (174/1732)
remote: Compressing objects: 11% (191/1732)
remote: Compressing objects: 12% (208/1732)
remote: Compressing objects: 13% (226/1732)
remote: Compressing objects: 14% (243/1732)
remote: Compressing objects: 15% (260/1732)
remote: Compressing objects: 16% (278/1732)
remote: Compressing objects: 17% (295/1732)
remote: Compressing objects: 17% (310/1732)
remote: Compressing objects: 18% (312/1732)
remote: Compressing objects: 19% (330/1732)
remote: Compressing objects: 20% (347/1732)
remote: Compressing objects: 21% (364/1732)
remote: Compressing objects: 22% (382/1732)
remote: Compressing objects: 23% (399/1732)
remote: Compressing objects: 24% (416/1732)
remote: Compressing objects: 25% (433/1732)
remote: Compressing objects: 26% (451/1732)
remote: Compressing objects: 27% (468/1732)
remote: Compressing objects: 28% (485/1732)
remote: Compressing objects: 29% (503/1732)
remote: Compressing objects: 30% (520/1732)
remote: Compressing objects: 31% (537/1732)
remote: Compressing objects: 32% (555/1732)
remote: Compressing objects: 33% (572/1732)
remote: Compressing objects: 34% (589/1732)
remote: Compressing objects: 35% (607/1732)
remote: Compressing objects: 36% (624/1732)
remote: Compressing objects: 37% (641/1732)
remote: Compressing objects: 38% (659/1732)
remote: Compressing objects: 39% (676/1732)
remote: Compressing objects: 40% (693/1732)
remote: Compressing objects: 41% (711/1732)
remote: Compressing objects: 42% (728/1732)
remote: Compressing objects: 43% (745/1732)
remote: Compressing objects: 44% (763/1732)
remote: Compressing objects: 45% (780/1732)
remote: Compressing objects: 46% (797/1732)
remote: Compressing objects: 47% (815/1732)
remote: Compressing objects: 48% (832/1732)
remote: Compressing objects: 49% (849/1732)
remote: Compressing objects: 50% (866/1732)
remote: Compressing objects: 51% (884/1732)
remote: Compressing objects: 52% (901/1732)
remote: Compressing objects: 53% (918/1732)
remote: Compressing objects: 54% (936/1732)
remote: Compressing objects: 55% (953/1732)
remote: Compressing objects: 56% (970/1732)
remote: Compressing objects: 57% (988/1732)
remote: Compressing objects: 58% (1005/1732)
remote: Compressing objects: 59% (1022/1732)
remote: Compressing objects: 60% (1040/1732)
remote: Compressing objects: 61% (1057/1732)
remote: Compressing objects: 62% (1074/1732)
remote: Compressing objects: 63% (1092/1732)
remote: Compressing objects: 64% (1109/1732)
remote: Compressing objects: 65% (1126/1732)
remote: Compressing objects: 66% (1144/1732)
remote: Compressing objects: 67% (1161/1732)
remote: Compressing objects: 68% (1178/1732)
remote: Compressing objects: 69% (1196/1732)
remote: Compressing objects: 70% (1213/1732)
remote: Compressing objects: 71% (1230/1732)
remote: Compressing objects: 72% (1248/1732)
remote: Compressing objects: 73% (1265/1732)
remote: Compressing objects: 74% (1282/1732)
remote: Compressing objects: 75% (1299/1732)
remote: Compressing objects: 76% (1317/1732)
remote: Compressing objects: 77% (1334/1732)
remote: Compressing objects: 78% (1351/1732)
remote: Compressing objects: 79% (1369/1732)
remote: Compressing objects: 80% (1386/1732)
remote: Compressing objects: 81% (1403/1732)
remote: Compressing objects: 82% (1421/1732)
remote: Compressing objects: 83% (1438/1732)
remote: Compressing objects: 84% (1455/1732)
remote: Compressing objects: 85% (1473/1732)
remote: Compressing objects: 86% (1490/1732)
remote: Compressing objects: 87% (1507/1732)
remote: Compressing objects: 88% (1525/1732)
remote: Compressing objects: 89% (1542/1732)
remote: Compressing objects: 90% (1559/1732)
remote: Compressing objects: 91% (1577/1732)
remote: Compressing objects: 92% (1594/1732)
remote: Compressing objects: 93% (1611/1732)
remote: Compressing objects: 94% (1629/1732)
remote: Compressing objects: 95% (1646/1732)
remote: Compressing objects: 96% (1663/1732)
remote: Compressing objects: 97% (1681/1732)
remote: Compressing objects: 98% (1698/1732)
remote: Compressing objects: 99% (1715/1732)
remote: Compressing objects: 100% (1732/1732)
remote: Compressing objects: 100% (1732/1732), done.
5.75 s
Receiving objects: 0% (1/65450)
Receiving objects: 1% (655/65450)
Receiving objects: 2% (1309/65450)
Receiving objects: 3% (1964/65450)
Receiving objects: 4% (2618/65450)
Receiving objects: 5% (3273/65450)
Receiving objects: 6% (3927/65450)
Receiving objects: 7% (4582/65450)
Receiving objects: 8% (5236/65450)
Receiving objects: 9% (5891/65450)
Receiving objects: 10% (6545/65450)
Receiving objects: 11% (7200/65450)
Receiving objects: 12% (7854/65450), 12.35 MiB | 24.68 MiB/s
Receiving objects: 13% (8509/65450), 12.35 MiB | 24.68 MiB/s
Receiving objects: 14% (9163/65450), 12.35 MiB | 24.68 MiB/s
Receiving objects: 15% (9818/65450), 12.35 MiB | 24.68 MiB/s
Receiving objects: 16% (10472/65450), 12.35 MiB | 24.68 MiB/s
Receiving objects: 17% (11127/65450), 12.35 MiB | 24.68 MiB/s
Receiving objects: 18% (11781/65450), 12.35 MiB | 24.68 MiB/s
Receiving objects: 19% (12436/65450), 12.35 MiB | 24.68 MiB/s
Receiving objects: 20% (13090/65450), 12.35 MiB | 24.68 MiB/s
Receiving objects: 21% (13745/65450), 12.35 MiB | 24.68 MiB/s
Receiving objects: 22% (14399/65450), 12.35 MiB | 24.68 MiB/s
Receiving objects: 23% (15054/65450), 12.35 MiB | 24.68 MiB/s
Receiving objects: 24% (15708/65450), 12.35 MiB | 24.68 MiB/s
Receiving objects: 25% (16363/65450), 12.35 MiB | 24.68 MiB/s
Receiving objects: 26% (17017/65450), 12.35 MiB | 24.68 MiB/s
Receiving objects: 27% (17672/65450), 12.35 MiB | 24.68 MiB/s
Receiving objects: 28% (18326/65450), 12.35 MiB | 24.68 MiB/s
Receiving objects: 29% (18981/65450), 12.35 MiB | 24.68 MiB/s
Receiving objects: 30% (19635/65450), 12.35 MiB | 24.68 MiB/s
Receiving objects: 31% (20290/65450), 12.35 MiB | 24.68 MiB/s
Receiving objects: 32% (20944/65450), 12.35 MiB | 24.68 MiB/s
Receiving objects: 33% (21599/65450), 12.35 MiB | 24.68 MiB/s
Receiving objects: 34% (22253/65450), 12.35 MiB | 24.68 MiB/s
Receiving objects: 35% (22908/65450), 12.35 MiB | 24.68 MiB/s
Receiving objects: 36% (23562/65450), 12.35 MiB | 24.68 MiB/s
Receiving objects: 37% (24217/65450), 12.35 MiB | 24.68 MiB/s
Receiving objects: 38% (24871/65450), 12.35 MiB | 24.68 MiB/s
Receiving objects: 39% (25526/65450), 12.35 MiB | 24.68 MiB/s
Receiving objects: 40% (26180/65450), 12.35 MiB | 24.68 MiB/s
Receiving objects: 41% (26835/65450), 12.35 MiB | 24.68 MiB/s
Receiving objects: 42% (27489/65450), 12.35 MiB | 24.68 MiB/s
Receiving objects: 43% (28144/65450), 12.35 MiB | 24.68 MiB/s
Receiving objects: 44% (28798/65450), 12.35 MiB | 24.68 MiB/s
Receiving objects: 45% (29453/65450), 12.35 MiB | 24.68 MiB/s
Receiving objects: 46% (30107/65450), 12.35 MiB | 24.68 MiB/s
Receiving objects: 47% (30762/65450), 12.35 MiB | 24.68 MiB/s
Receiving objects: 48% (31416/65450), 12.35 MiB | 24.68 MiB/s
Receiving objects: 49% (32071/65450), 12.35 MiB | 24.68 MiB/s
Receiving objects: 50% (32725/65450), 12.35 MiB | 24.68 MiB/s
Receiving objects: 50% (32753/65450), 30.14 MiB | 30.13 MiB/s
Receiving objects: 51% (33380/65450), 30.14 MiB | 30.13 MiB/s
Receiving objects: 52% (34034/65450), 30.14 MiB | 30.13 MiB/s
Receiving objects: 53% (34689/65450), 30.14 MiB | 30.13 MiB/s
Receiving objects: 54% (35343/65450), 30.14 MiB | 30.13 MiB/s
Receiving objects: 55% (35998/65450), 30.14 MiB | 30.13 MiB/s
Receiving objects: 56% (36652/65450), 30.14 MiB | 30.13 MiB/s
Receiving objects: 57% (37307/65450), 30.14 MiB | 30.13 MiB/s
Receiving objects: 58% (37961/65450), 30.14 MiB | 30.13 MiB/s
Receiving objects: 59% (38616/65450), 30.14 MiB | 30.13 MiB/s
Receiving objects: 60% (39270/65450), 44.22 MiB | 28.86 MiB/s
Receiving objects: 61% (39925/65450), 44.22 MiB | 28.86 MiB/s
Receiving objects: 62% (40579/65450), 44.22 MiB | 28.86 MiB/s
Receiving objects: 63% (41234/65450), 44.22 MiB | 28.86 MiB/s
Receiving objects: 64% (41888/65450), 44.22 MiB | 28.86 MiB/s
Receiving objects: 65% (42543/65450), 44.22 MiB | 28.86 MiB/s
Receiving objects: 66% (43197/65450), 44.22 MiB | 28.86 MiB/s
Receiving objects: 67% (43852/65450), 44.22 MiB | 28.86 MiB/s
Receiving objects: 68% (44506/65450), 44.22 MiB | 28.86 MiB/s
Receiving objects: 69% (45161/65450), 44.22 MiB | 28.86 MiB/s
Receiving objects: 70% (45815/65450), 44.22 MiB | 28.86 MiB/s
Receiving objects: 71% (46470/65450), 44.22 MiB | 28.86 MiB/s
Receiving objects: 72% (47124/65450), 44.22 MiB | 28.86 MiB/s
Receiving objects: 72% (47293/65450), 44.22 MiB | 28.86 MiB/s
Receiving objects: 73% (47779/65450), 44.22 MiB | 28.86 MiB/s
Receiving objects: 74% (48433/65450), 60.71 MiB | 29.87 MiB/s
Receiving objects: 75% (49088/65450), 60.71 MiB | 29.87 MiB/s
Receiving objects: 76% (49742/65450), 60.71 MiB | 29.87 MiB/s
Receiving objects: 77% (50397/65450), 60.71 MiB | 29.87 MiB/s
Receiving objects: 78% (51051/65450), 60.71 MiB | 29.87 MiB/s
Receiving objects: 79% (51706/65450), 60.71 MiB | 29.87 MiB/s
Receiving objects: 80% (52360/65450), 60.71 MiB | 29.87 MiB/s
Receiving objects: 81% (53015/65450), 60.71 MiB | 29.87 MiB/s
Receiving objects: 82% (53669/65450), 60.71 MiB | 29.87 MiB/s
Receiving objects: 83% (54324/65450), 78.45 MiB | 30.94 MiB/s
Receiving objects: 84% (54978/65450), 78.45 MiB | 30.94 MiB/s
Receiving objects: 85% (55633/65450), 78.45 MiB | 30.94 MiB/s
Receiving objects: 86% (56287/65450), 78.45 MiB | 30.94 MiB/s
Receiving objects: 87% (56942/65450), 78.45 MiB | 30.94 MiB/s
Receiving objects: 88% (57596/65450), 78.45 MiB | 30.94 MiB/s
Receiving objects: 89% (58251/65450), 78.45 MiB | 30.94 MiB/s
Receiving objects: 90% (58905/65450), 78.45 MiB | 30.94 MiB/s
Receiving objects: 91% (59560/65450), 78.45 MiB | 30.94 MiB/s
Receiving objects: 92% (60214/65450), 78.45 MiB | 30.94 MiB/s
Receiving objects: 93% (60869/65450), 78.45 MiB | 30.94 MiB/s
Receiving objects: 94% (61523/65450), 78.45 MiB | 30.94 MiB/s
Receiving objects: 95% (62178/65450), 78.45 MiB | 30.94 MiB/s
Receiving objects: 96% (62832/65450), 78.45 MiB | 30.94 MiB/s
Receiving objects: 97% (63487/65450), 78.45 MiB | 30.94 MiB/s
Receiving objects: 98% (64141/65450), 78.45 MiB | 30.94 MiB/s
Receiving objects: 99% (64796/65450), 78.45 MiB | 30.94 MiB/s
remote: Total 65450 (delta 6924), reused 6528 (delta 6350), pack-reused 57349 (from 1)
5.76 s
Receiving objects: 100% (65450/65450), 78.45 MiB | 30.94 MiB/s
Receiving objects: 100% (65450/65450), 88.68 MiB | 30.64 MiB/s, done.
7.42 s
Resolving deltas: 0% (0/46042)
Resolving deltas: 1% (461/46042)
Resolving deltas: 2% (924/46042)
Resolving deltas: 3% (1382/46042)
Resolving deltas: 4% (1843/46042)
Resolving deltas: 5% (2303/46042)
Resolving deltas: 6% (2763/46042)
Resolving deltas: 7% (3223/46042)
Resolving deltas: 8% (3684/46042)
Resolving deltas: 9% (4144/46042)
Resolving deltas: 10% (4605/46042)
Resolving deltas: 11% (5067/46042)
Resolving deltas: 12% (5526/46042)
Resolving deltas: 13% (5986/46042)
Resolving deltas: 14% (6446/46042)
Resolving deltas: 15% (6907/46042)
Resolving deltas: 16% (7367/46042)
Resolving deltas: 17% (7828/46042)
Resolving deltas: 18% (8288/46042)
Resolving deltas: 19% (8748/46042)
Resolving deltas: 20% (9209/46042)
Resolving deltas: 21% (9669/46042)
Resolving deltas: 22% (10130/46042)
Resolving deltas: 23% (10591/46042)
Resolving deltas: 24% (11051/46042)
Resolving deltas: 25% (11511/46042)
Resolving deltas: 26% (11971/46042)
Resolving deltas: 27% (12432/46042)
Resolving deltas: 28% (12892/46042)
Resolving deltas: 29% (13353/46042)
Resolving deltas: 30% (13813/46042)
Resolving deltas: 31% (14274/46042)
Resolving deltas: 32% (14734/46042)
Resolving deltas: 33% (15194/46042)
Resolving deltas: 34% (15655/46042)
Resolving deltas: 35% (16115/46042)
Resolving deltas: 36% (16576/46042)
Resolving deltas: 37% (17036/46042)
Resolving deltas: 38% (17496/46042)
Resolving deltas: 39% (17957/46042)
Resolving deltas: 40% (18417/46042)
Resolving deltas: 41% (18878/46042)
Resolving deltas: 42% (19338/46042)
Resolving deltas: 43% (19799/46042)
Resolving deltas: 44% (20259/46042)
Resolving deltas: 45% (20719/46042)
Resolving deltas: 46% (21180/46042)
Resolving deltas: 47% (21640/46042)
Resolving deltas: 48% (22101/46042)
Resolving deltas: 49% (22561/46042)
Resolving deltas: 50% (23021/46042)
Resolving deltas: 51% (23482/46042)
Resolving deltas: 52% (23942/46042)
Resolving deltas: 53% (24403/46042)
Resolving deltas: 54% (24863/46042)
Resolving deltas: 55% (25324/46042)
Resolving deltas: 56% (25784/46042)
Resolving deltas: 57% (26244/46042)
Resolving deltas: 58% (26705/46042)
Resolving deltas: 59% (27166/46042)
Resolving deltas: 60% (27626/46042)
Resolving deltas: 61% (28086/46042)
Resolving deltas: 62% (28547/46042)
Resolving deltas: 63% (29007/46042)
Resolving deltas: 64% (29467/46042)
Resolving deltas: 65% (29928/46042)
Resolving deltas: 66% (30388/46042)
Resolving deltas: 67% (30849/46042)
Resolving deltas: 68% (31309/46042)
Resolving deltas: 69% (31769/46042)
Resolving deltas: 70% (32230/46042)
Resolving deltas: 71% (32690/46042)
Resolving deltas: 71% (32748/46042)
Resolving deltas: 72% (33152/46042)
Resolving deltas: 73% (33611/46042)
Resolving deltas: 74% (34072/46042)
Resolving deltas: 75% (34532/46042)
Resolving deltas: 76% (34992/46042)
Resolving deltas: 77% (35453/46042)
Resolving deltas: 78% (35913/46042)
Resolving deltas: 79% (36374/46042)
Resolving deltas: 80% (36834/46042)
Resolving deltas: 81% (37295/46042)
Resolving deltas: 82% (37755/46042)
Resolving deltas: 83% (38215/46042)
Resolving deltas: 84% (38676/46042)
Resolving deltas: 85% (39136/46042)
Resolving deltas: 86% (39597/46042)
Resolving deltas: 87% (40057/46042)
Resolving deltas: 88% (40517/46042)
Resolving deltas: 89% (40978/46042)
Resolving deltas: 90% (41438/46042)
Resolving deltas: 91% (41899/46042)
Resolving deltas: 92% (42359/46042)
Resolving deltas: 93% (42820/46042)
Resolving deltas: 94% (43280/46042)
Resolving deltas: 95% (43740/46042)
Resolving deltas: 96% (44201/46042)
Resolving deltas: 97% (44661/46042)
Resolving deltas: 98% (45122/46042)
Resolving deltas: 99% (45582/46042)
Resolving deltas: 100% (46042/46042)
Resolving deltas: 100% (46042/46042), done.
8.02 s
Fetching commit de1fcd35ce25218ec941344369f9e542139a673d for finite_T_and_mu ...
8.02 s
$ /nix/store/bcnisk3ydfgv26v2gw3zlky24g00yww2-git-2.54.0/bin/git fetch origin de1fcd35ce25218ec941344369f9e542139a673d
8.60 s
From https://github.com/alphal00p/gammaloop
8.60 s
* branch de1fcd35ce25218ec941344369f9e542139a673d -> FETCH_HEAD
8.67 s
$ /nix/store/9ypz3flqsrl5xl495mm8h645gadjsxi1-coreutils-9.11/bin/timeout --kill-after=15s 7200s /nix/store/bcnisk3ydfgv26v2gw3zlky24g00yww2-git-2.54.0/bin/git -c advice.detachedHead=false checkout de1fcd35ce25218ec941344369f9e542139a673d
8.95 s
HEAD is now at de1fcd35 fix integrated counterterm orientation localization
8.96 s
$ /nix/store/9ypz3flqsrl5xl495mm8h645gadjsxi1-coreutils-9.11/bin/timeout --kill-after=15s 7200s /nix/store/23zk8sgzamrbmj1fday15szf7f2279s8-nix-2.34.7/bin/nix --extra-experimental-features nix-command --extra-experimental-features flakes --log-format internal-json run .#packages.x86_64-linux.nix-ci-check-gammaloop-nextest-python-api --print-build-logs
9.64 s
error (ignored): SQLite database '/var/cache/nix-ci-worker/eval-cache-v6/236836d192e3189eaf5ff1d2159b989a5433dded7d996aca53c52fa23761689f.sqlite ' is busy
17.57 s
27.70 s
evaluating derivation 'g
copying '/nix/store/jlx6
evaluating derivation 'g
copying '/nix/store/jlx6
evaluating derivation 'g
copying '/nix/store/jlx6
evaluating derivation 'g
copying '/nix/store/jlx6
evaluating derivation 'g
copying '/nix/store/jlx6
evaluating derivation 'g
copying '/nix/store/jlx6
evaluating derivation 'g
copying '/nix/store/jlx6
evaluating derivation 'g
copying '/nix/store/jlx6
evaluating derivation 'g
copying '/nix/store/jlx6
evaluating derivation 'g
copying '/nix/store/jlx6
evaluating derivation 'g
copying '/nix/store/jlx6
evaluating derivation 'g
copying '/nix/store/jlx6
evaluating derivation 'g
[0 /1 built]
[1 /0 /1 built] building g gammaloop-nextest-python-api> Extracting 1 binary, 1 build script output directory, and 3 linked paths to /build/nextest-archive-FhUZtG
27.78 s
gammaloop-nextest-python-api> Extracted 18 files to /build/nextest-archive-FhUZtG in 0.08s
27.81 s
gammaloop-nextest-python-api> ------------
27.81 s
gammaloop-nextest-python-api> Nextest run ID 7c853691-c126-4dcb-a0ad-e99c4eb0e33f with nextest profile: ci_gammaloop
27.81 s
gammaloop-nextest-python-api> Starting 5 tests across 1 binary
28.05 s
gammaloop-nextest-python-api> FAIL [ 0.234s] (1/5) gammaloop-integration-tests::test_python_api python_session_getters_return_live_toml_and_command_blocks
28.05 s
gammaloop-nextest-python-api> stdout ---
28.05 s
gammaloop-nextest-python-api>
28.05 s
gammaloop-nextest-python-api> running 1 test
28.05 s
gammaloop-nextest-python-api> test python_session_getters_return_live_toml_and_command_blocks ... FAILED
28.05 s
gammaloop-nextest-python-api>
28.05 s
gammaloop-nextest-python-api> failures:
28.05 s
gammaloop-nextest-python-api>
28.05 s
gammaloop-nextest-python-api> failures:
28.05 s
gammaloop-nextest-python-api> python_session_getters_return_live_toml_and_command_blocks
28.05 s
gammaloop-nextest-python-api>
28.05 s
gammaloop-nextest-python-api> test result: FAILED. 0 passed; 1 failed; 0 ignored; 0 measured; 4 filtered out; finished in 0.22s
28.05 s
gammaloop-nextest-python-api>
28.05 s
gammaloop-nextest-python-api> stderr ---
28.05 s
gammaloop-nextest-python-api> Error: Python API test subprocess failed.
28.05 s
gammaloop-nextest-python-api> stdout:
28.05 s
gammaloop-nextest-python-api> ┌────────────────────────────────────────────────────────┐
28.05 s
gammaloop-nextest-python-api> │ You are running a restricted Symbolica instance. │
28.05 s
gammaloop-nextest-python-api> │ │
28.05 s
gammaloop-nextest-python-api> │ This mode is only permitted for non-commercial use and │
28.05 s
gammaloop-nextest-python-api> │ is limited to one instance and core per machine. │
28.05 s
gammaloop-nextest-python-api> │ │
28.05 s
gammaloop-nextest-python-api> │ Hobbyists can easily acquire a free license key │
28.05 s
gammaloop-nextest-python-api> │ that unlocks all cores and removes this banner: │
28.05 s
gammaloop-nextest-python-api> │ │
28.05 s
gammaloop-nextest-python-api> │ from symbolica import * │
28.05 s
gammaloop-nextest-python-api> │ request_hobbyist_license('YOUR_NAME', 'YOUR_EMAIL') │
28.05 s
gammaloop-nextest-python-api> │ │
28.05 s
gammaloop-nextest-python-api> │ All other users can obtain a free 30-day trial key: │
28.05 s
gammaloop-nextest-python-api> │ │
28.05 s
gammaloop-nextest-python-api> │ from symbolica import * │
28.05 s
gammaloop-nextest-python-api> │ request_trial_license('NAME', 'EMAIL', 'EMPLOYER') │
28.05 s
gammaloop-nextest-python-api> │ │
28.05 s
gammaloop-nextest-python-api> │ See https://symbolica.io/docs/get_started.html#license │
28.05 s
gammaloop-nextest-python-api> └────────────────────────────────────────────────────────┘
28.05 s
gammaloop-nextest-python-api> ┌───────────────────────────────────────────────────────────────────────────────────────────────────────────┐
28.05 s
gammaloop-nextest-python-api> │ Cannot start new unlicensed Symbolica instance since there is already another one running on the machine. │
28.05 s
gammaloop-nextest-python-api> └───────────────────────────────────────────────────────────────────────────────────────────────────────────┘
28.05 s
gammaloop-nextest-python-api>
28.05 s
gammaloop-nextest-python-api> stderr:
28.05 s
gammaloop-nextest-python-api> ┌───────────────────────────────────┐
28.05 s
gammaloop-nextest-python-api> │ The Symbolica license has expired │
28.05 s
gammaloop-nextest-python-api> └───────────────────────────────────┘
28.05 s
gammaloop-nextest-python-api>
28.05 s
gammaloop-nextest-python-api>
28.05 s
gammaloop-nextest-python-api> Location:
28.05 s
gammaloop-nextest-python-api> tests/tests/test_python_api.rs:156:20
28.05 s
gammaloop-nextest-python-api>
28.07 s
gammaloop-nextest-python-api> FAIL [ 0.257s] (2/5) gammaloop-integration-tests::test_python_api python_evaluate_samples_batch_and_momentum_space_have_expected_shape
28.07 s
gammaloop-nextest-python-api> stdout ---
28.07 s
gammaloop-nextest-python-api>
28.07 s
gammaloop-nextest-python-api> running 1 test
28.07 s
gammaloop-nextest-python-api> test python_evaluate_samples_batch_and_momentum_space_have_expected_shape ... FAILED
28.07 s
gammaloop-nextest-python-api>
28.07 s
gammaloop-nextest-python-api> failures:
28.07 s
gammaloop-nextest-python-api>
28.07 s
gammaloop-nextest-python-api> failures:
28.07 s
gammaloop-nextest-python-api> python_evaluate_samples_batch_and_momentum_space_have_expected_shape
28.07 s
gammaloop-nextest-python-api>
28.07 s
gammaloop-nextest-python-api> test result: FAILED. 0 passed; 1 failed; 0 ignored; 0 measured; 4 filtered out; finished in 0.25s
28.07 s
gammaloop-nextest-python-api>
28.07 s
gammaloop-nextest-python-api> stderr ---
28.07 s
gammaloop-nextest-python-api> Error: Python API test subprocess failed.
28.07 s
gammaloop-nextest-python-api> stdout:
28.07 s
gammaloop-nextest-python-api> ┌────────────────────────────────────────────────────────┐
28.07 s
gammaloop-nextest-python-api> │ You are running a restricted Symbolica instance. │
28.07 s
gammaloop-nextest-python-api> │ │
28.07 s
gammaloop-nextest-python-api> │ This mode is only permitted for non-commercial use and │
28.07 s
gammaloop-nextest-python-api> │ is limited to one instance and core per machine. │
28.07 s
gammaloop-nextest-python-api> │ │
28.07 s
gammaloop-nextest-python-api> │ Hobbyists can easily acquire a free license key │
28.07 s
gammaloop-nextest-python-api> │ that unlocks all cores and removes this banner: │
28.07 s
gammaloop-nextest-python-api> │ │
28.07 s
gammaloop-nextest-python-api> │ from symbolica import * │
28.07 s
gammaloop-nextest-python-api> │ request_hobbyist_license('YOUR_NAME', 'YOUR_EMAIL') │
28.07 s
gammaloop-nextest-python-api> │ │
28.07 s
gammaloop-nextest-python-api> │ All other users can obtain a free 30-day trial key: │
28.07 s
gammaloop-nextest-python-api> │ │
28.07 s
gammaloop-nextest-python-api> │ from symbolica import * │
28.07 s
gammaloop-nextest-python-api> │ request_trial_license('NAME', 'EMAIL', 'EMPLOYER') │
28.07 s
gammaloop-nextest-python-api> │ │
28.07 s
gammaloop-nextest-python-api> │ See https://symbolica.io/docs/get_started.html#license │
28.07 s
gammaloop-nextest-python-api> └────────────────────────────────────────────────────────┘
28.07 s
gammaloop-nextest-python-api> ┌───────────────────────────────────────────────────────────────────────────────────────────────────────────┐
28.07 s
gammaloop-nextest-python-api> │ Cannot start new unlicensed Symbolica instance since there is already another one running on the machine. │
28.07 s
gammaloop-nextest-python-api> └───────────────────────────────────────────────────────────────────────────────────────────────────────────┘
28.07 s
gammaloop-nextest-python-api>
28.07 s
gammaloop-nextest-python-api> stderr:
28.07 s
gammaloop-nextest-python-api> ┌───────────────────────────────────┐
28.07 s
gammaloop-nextest-python-api> │ The Symbolica license has expired │
28.07 s
gammaloop-nextest-python-api> └───────────────────────────────────┘
28.07 s
gammaloop-nextest-python-api>
28.07 s
gammaloop-nextest-python-api>
28.07 s
gammaloop-nextest-python-api> Location:
28.07 s
gammaloop-nextest-python-api> tests/tests/test_python_api.rs:156:20
28.07 s
gammaloop-nextest-python-api>
28.11 s
gammaloop-nextest-python-api> FAIL [ 0.296s] (3/5) gammaloop-integration-tests::test_python_api python_evaluate_sample_honors_generate_events_and_observable_snapshots
28.11 s
gammaloop-nextest-python-api> stdout ---
28.11 s
gammaloop-nextest-python-api>
28.11 s
gammaloop-nextest-python-api> running 1 test
28.11 s
gammaloop-nextest-python-api> test python_evaluate_sample_honors_generate_events_and_observable_snapshots ... FAILED
28.11 s
gammaloop-nextest-python-api>
28.11 s
gammaloop-nextest-python-api> failures:
28.11 s
gammaloop-nextest-python-api>
28.11 s
gammaloop-nextest-python-api> failures:
28.11 s
gammaloop-nextest-python-api> python_evaluate_sample_honors_generate_events_and_observable_snapshots
28.11 s
gammaloop-nextest-python-api>
28.11 s
gammaloop-nextest-python-api> test result: FAILED. 0 passed; 1 failed; 0 ignored; 0 measured; 4 filtered out; finished in 0.29s
28.11 s
gammaloop-nextest-python-api>
28.11 s
gammaloop-nextest-python-api> stderr ---
28.11 s
gammaloop-nextest-python-api> Error: Python API test subprocess failed.
28.11 s
gammaloop-nextest-python-api> stdout:
28.11 s
gammaloop-nextest-python-api> ┌────────────────────────────────────────────────────────┐
28.11 s
gammaloop-nextest-python-api> │ You are running a restricted Symbolica instance. │
28.11 s
gammaloop-nextest-python-api> │ │
28.11 s
gammaloop-nextest-python-api> │ This mode is only permitted for non-commercial use and │
28.11 s
gammaloop-nextest-python-api> │ is limited to one instance and core per machine. │
28.11 s
gammaloop-nextest-python-api> │ │
28.11 s
gammaloop-nextest-python-api> │ Hobbyists can easily acquire a free license key │
28.11 s
gammaloop-nextest-python-api> │ that unlocks all cores and removes this banner: │
28.11 s
gammaloop-nextest-python-api> │ │
28.11 s
gammaloop-nextest-python-api> │ from symbolica import * │
28.11 s
gammaloop-nextest-python-api> │ request_hobbyist_license('YOUR_NAME', 'YOUR_EMAIL') │
28.11 s
gammaloop-nextest-python-api> │ │
28.11 s
gammaloop-nextest-python-api> │ All other users can obtain a free 30-day trial key: │
28.11 s
gammaloop-nextest-python-api> │ │
28.11 s
gammaloop-nextest-python-api> │ from symbolica import * │
28.11 s
gammaloop-nextest-python-api> │ request_trial_license('NAME', 'EMAIL', 'EMPLOYER') │
28.11 s
gammaloop-nextest-python-api> │ │
28.11 s
gammaloop-nextest-python-api> │ See https://symbolica.io/docs/get_started.html#license │
28.11 s
gammaloop-nextest-python-api> └────────────────────────────────────────────────────────┘
28.11 s
gammaloop-nextest-python-api> ┌───────────────────────────────────────────────────────────────────────────────────────────────────────────┐
28.11 s
gammaloop-nextest-python-api> │ Cannot start new unlicensed Symbolica instance since there is already another one running on the machine. │
28.11 s
gammaloop-nextest-python-api> └───────────────────────────────────────────────────────────────────────────────────────────────────────────┘
28.11 s
gammaloop-nextest-python-api>
28.11 s
gammaloop-nextest-python-api> stderr:
28.11 s
gammaloop-nextest-python-api> ┌───────────────────────────────────┐
28.11 s
gammaloop-nextest-python-api> │ The Symbolica license has expired │
28.11 s
gammaloop-nextest-python-api> └───────────────────────────────────┘
28.11 s
gammaloop-nextest-python-api>
28.11 s
gammaloop-nextest-python-api>
28.11 s
gammaloop-nextest-python-api> Location:
28.11 s
gammaloop-nextest-python-api> tests/tests/test_python_api.rs:156:20
28.11 s
gammaloop-nextest-python-api>
28.16 s
gammaloop-nextest-python-api> FAIL [ 0.346s] (4/5) gammaloop-integration-tests::test_python_api python_evaluate_sample_preserves_graph_grouping_and_incoming_pdgs
28.16 s
gammaloop-nextest-python-api> stdout ---
28.16 s
gammaloop-nextest-python-api>
28.16 s
gammaloop-nextest-python-api> running 1 test
28.16 s
gammaloop-nextest-python-api> test python_evaluate_sample_preserves_graph_grouping_and_incoming_pdgs ... FAILED
28.16 s
gammaloop-nextest-python-api>
28.16 s
gammaloop-nextest-python-api> failures:
28.16 s
gammaloop-nextest-python-api>
28.16 s
gammaloop-nextest-python-api> failures:
28.16 s
gammaloop-nextest-python-api> python_evaluate_sample_preserves_graph_grouping_and_incoming_pdgs
28.16 s
gammaloop-nextest-python-api>
28.16 s
gammaloop-nextest-python-api> test result: FAILED. 0 passed; 1 failed; 0 ignored; 0 measured; 4 filtered out; finished in 0.34s
28.16 s
gammaloop-nextest-python-api>
28.16 s
gammaloop-nextest-python-api> stderr ---
28.16 s
gammaloop-nextest-python-api> Error: Python API test subprocess failed.
28.16 s
gammaloop-nextest-python-api> stdout:
28.16 s
gammaloop-nextest-python-api> ┌────────────────────────────────────────────────────────┐
28.16 s
gammaloop-nextest-python-api> │ You are running a restricted Symbolica instance. │
28.16 s
gammaloop-nextest-python-api> │ │
28.16 s
gammaloop-nextest-python-api> │ This mode is only permitted for non-commercial use and │
28.16 s
gammaloop-nextest-python-api> │ is limited to one instance and core per machine. │
28.16 s
gammaloop-nextest-python-api> │ │
28.16 s
gammaloop-nextest-python-api> │ Hobbyists can easily acquire a free license key │
28.16 s
gammaloop-nextest-python-api> │ that unlocks all cores and removes this banner: │
28.16 s
gammaloop-nextest-python-api> │ │
28.16 s
gammaloop-nextest-python-api> │ from symbolica import * │
28.16 s
gammaloop-nextest-python-api> │ request_hobbyist_license('YOUR_NAME', 'YOUR_EMAIL') │
28.16 s
gammaloop-nextest-python-api> │ │
28.16 s
gammaloop-nextest-python-api> │ All other users can obtain a free 30-day trial key: │
28.16 s
gammaloop-nextest-python-api> │ │
28.16 s
gammaloop-nextest-python-api> │ from symbolica import * │
28.16 s
gammaloop-nextest-python-api> │ request_trial_license('NAME', 'EMAIL', 'EMPLOYER') │
28.16 s
gammaloop-nextest-python-api> │ │
28.16 s
gammaloop-nextest-python-api> │ See https://symbolica.io/docs/get_started.html#license │
28.16 s
gammaloop-nextest-python-api> └────────────────────────────────────────────────────────┘
28.16 s
gammaloop-nextest-python-api> ┌───────────────────────────────────────────────────────────────────────────────────────────────────────────┐
28.16 s
gammaloop-nextest-python-api> │ Cannot start new unlicensed Symbolica instance since there is already another one running on the machine. │
28.16 s
gammaloop-nextest-python-api> └───────────────────────────────────────────────────────────────────────────────────────────────────────────┘
28.16 s
gammaloop-nextest-python-api>
28.16 s
gammaloop-nextest-python-api> stderr:
28.16 s
gammaloop-nextest-python-api> ┌───────────────────────────────────┐
28.16 s
gammaloop-nextest-python-api> │ The Symbolica license has expired │
28.16 s
gammaloop-nextest-python-api> └───────────────────────────────────┘
28.16 s
gammaloop-nextest-python-api> [2026-09-01 10:05:46.432] @gammaloop_api::se... INFO : Running command import model sm-default
28.16 s
gammaloop-nextest-python-api> [2026-09-01 10:05:46.432] @import::model INFO : Loading built-in JSON model sm-default
28.16 s
gammaloop-nextest-python-api> [2026-09-01 10:05:46.471] @gammalooprs::model INFO : The following 15 external parameters were forced to zero by the restriction card:
28.16 s
gammaloop-nextest-python-api> lamWS, AWS, rhoWS, etaWS, ymc, yme, ymm, MC, Me, MM, WTau, muQ, muLe, muLmu, muLtau
28.16 s
gammaloop-nextest-python-api> [2026-09-01 10:05:46.472] @gammalooprs::model INFO : The following 34 vertex rules were removed by the restriction card:
28.16 s
gammaloop-nextest-python-api> V_82 -> (c~, d, G+) | V_83 -> (t~, d, G+) | V_84 -> (c~, s, G+) | V_85 -> (t~, s, G+) | V_86 -> (u~, b, G+) | V_87 -> (c~, b, G+) | V_90 -> (c~, d, W+) | V_91 -> (t~, d, W+) | V_92 -> (u~, s, W+) | V_94 -> (t~, s, W+) | V_95 -> (u~, b, W+) | V_96 -> (c~, b, W+) | V_101 -> (e+, e-, G0) | V_102 -> (mu+, mu-, G0) | V_104 -> (e+, e-, H) | V_105 -> (mu+, mu-, H) | V_110 -> (ve~, e-, G+) | V_111 -> (vm~, mu-, G+) | V_116 -> (b~, u, G-) | V_117 -> (d~, c, G-) | V_118 -> (s~, c, G-) | V_119 -> (b~, c, G-) | V_120 -> (d~, t, G-) | V_121 -> (s~, t, G-) | V_124 -> (s~, u, W-) | V_125 -> (b~, u, W-) | V_126 -> (d~, c, W-) | V_128 -> (b~, c, W-) | V_129 -> (d~, t, W-) | V_130 -> (s~, t, W-) | V_138 -> (c~, c, G0) | V_140 -> (c~, c, H) | V_145 -> (e+, ve, G-) | V_146 -> (mu+, vm, G-)
28.16 s
gammaloop-nextest-python-api> [2026-09-01 10:05:46.472] @gammalooprs::model INFO : The following 36 couplings were removed by the restriction card:
28.16 s
gammaloop-nextest-python-api> GC_13, GC_14, GC_16, GC_17, GC_18, GC_19, GC_20, GC_22, GC_23, GC_24, GC_25, GC_26, GC_28, GC_29, GC_42, GC_43, GC_44, GC_46, GC_47, GC_48, GC_84, GC_85, GC_86, GC_87, GC_88, GC_89, GC_90, GC_91, GC_92, GC_93, GC_101, GC_102, GC_103, GC_105, GC_106, GC_107
28.16 s
gammaloop-nextest-python-api> [2026-09-01 10:05:46.472] @gammaloop_api::se... INFO : Running command set default-runtime kv kinematics.externals='{"type":"constant","data":{"momenta":[[32.0,0.0,0.0,32.0],[32.0,0.0,0.0,-32.0]],"helicities":[1,1]}}'
28.16 s
gammaloop-nextest-python-api> [2026-09-01 10:05:46.473] @gammaloop_api::se... INFO : Running command set default-runtime kv subtraction.disable_threshold_subtraction=true
28.16 s
gammaloop-nextest-python-api> [2026-09-01 10:05:46.474] @gammaloop_api::se... INFO : Running command generate xs e+ e- > d d~ g | e- a d g QED^2==4 [{{2}} QCD=0] --numerator-grouping group_identical_graphs_up_to_sign --clear-existing-processes --only-diagrams
28.16 s
gammaloop-nextest-python-api> [2026-09-01 10:05:46.476] @feyngen::diagram_... INFO : 0s | Δ=0s | Starting Feynman graph generation with Symbolica...
28.16 s
gammaloop-nextest-python-api> [2026-09-01 10:05:46.479] @feyngen::diagram_... INFO : 0s | Δ=0s | Number of graphs resulting from Symbolica generation: 246
28.16 s
gammaloop-nextest-python-api> [2026-09-01 10:05:46.481] @feyngen::diagram_... INFO : 0s | Δ=0s | Number of graphs retained after enforcing supergraph particle content: 8
28.16 s
gammaloop-nextest-python-api> [2026-09-01 10:05:46.484] @feyngen::diagram_... INFO : 0s | Δ=0s | Number of graphs retained after removal of vetoed topologies: 8
28.16 s
gammaloop-nextest-python-api> [2026-09-01 10:05:46.484] @feyngen::diagram_... INFO : 0s | Δ=0s | Number of graphs after vertex info assignment: 8
28.16 s
gammaloop-nextest-python-api> [2026-09-01 10:05:46.484] @feyngen::diagram_... INFO : 0s | Δ=0s | Number of graphs after all complete graphs filters are applied: 8
28.16 s
gammaloop-nextest-python-api>
28.16 s
gammaloop-nextest-python-api>
28.16 s
gammaloop-nextest-python-api> Location:
28.16 s
gammaloop-nextest-python-api> tests/tests/test_python_api.rs:156:20
28.16 s
gammaloop-nextest-python-api>
28.39 s
gammaloop-nextest-python-api> FAIL [ 0.573s] (5/5) gammaloop-integration-tests::test_python_api python_settings_wrappers_expose_nested_runtime_and_global_settings
28.39 s
gammaloop-nextest-python-api> stdout ---
28.39 s
gammaloop-nextest-python-api>
28.39 s
gammaloop-nextest-python-api> running 1 test
28.39 s
gammaloop-nextest-python-api> test python_settings_wrappers_expose_nested_runtime_and_global_settings ... FAILED
28.39 s
gammaloop-nextest-python-api>
28.39 s
gammaloop-nextest-python-api> failures:
28.39 s
gammaloop-nextest-python-api>
28.39 s
gammaloop-nextest-python-api> failures:
28.39 s
gammaloop-nextest-python-api> python_settings_wrappers_expose_nested_runtime_and_global_settings
28.39 s
gammaloop-nextest-python-api>
28.39 s
gammaloop-nextest-python-api> test result: FAILED. 0 passed; 1 failed; 0 ignored; 0 measured; 4 filtered out; finished in 0.57s
28.39 s
gammaloop-nextest-python-api>
28.39 s
gammaloop-nextest-python-api> stderr ---
28.39 s
gammaloop-nextest-python-api> Error: Python API test subprocess failed.
28.39 s
gammaloop-nextest-python-api> stdout:
28.39 s
gammaloop-nextest-python-api> ┌────────────────────────────────────────────────────────┐
28.39 s
gammaloop-nextest-python-api> │ You are running a restricted Symbolica instance. │
28.39 s
gammaloop-nextest-python-api> │ │
28.39 s
gammaloop-nextest-python-api> │ This mode is only permitted for non-commercial use and │
28.39 s
gammaloop-nextest-python-api> │ is limited to one instance and core per machine. │
28.39 s
gammaloop-nextest-python-api> │ │
28.39 s
gammaloop-nextest-python-api> │ Hobbyists can easily acquire a free license key │
28.39 s
gammaloop-nextest-python-api> │ that unlocks all cores and removes this banner: │
28.39 s
gammaloop-nextest-python-api> │ │
28.39 s
gammaloop-nextest-python-api> │ from symbolica import * │
28.39 s
gammaloop-nextest-python-api> │ request_hobbyist_license('YOUR_NAME', 'YOUR_EMAIL') │
28.39 s
gammaloop-nextest-python-api> │ │
28.39 s
gammaloop-nextest-python-api> │ All other users can obtain a free 30-day trial key: │
28.39 s
gammaloop-nextest-python-api> │ │
28.39 s
gammaloop-nextest-python-api> │ from symbolica import * │
28.39 s
gammaloop-nextest-python-api> │ request_trial_license('NAME', 'EMAIL', 'EMPLOYER') │
28.39 s
gammaloop-nextest-python-api> │ │
28.39 s
gammaloop-nextest-python-api> │ See https://symbolica.io/docs/get_started.html#license │
28.39 s
gammaloop-nextest-python-api> └────────────────────────────────────────────────────────┘
28.39 s
gammaloop-nextest-python-api> ┌───────────────────────────────────────────────────────────────────────────────────────────────────────────┐
28.39 s
gammaloop-nextest-python-api> │ Cannot start new unlicensed Symbolica instance since there is already another one running on the machine. │
28.39 s
gammaloop-nextest-python-api> └───────────────────────────────────────────────────────────────────────────────────────────────────────────┘
28.39 s
gammaloop-nextest-python-api>
28.39 s
gammaloop-nextest-python-api> stderr:
28.39 s
gammaloop-nextest-python-api> ┌───────────────────────────────────┐
28.39 s
gammaloop-nextest-python-api> │ The Symbolica license has expired │
28.39 s
gammaloop-nextest-python-api> └───────────────────────────────────┘
28.39 s
gammaloop-nextest-python-api>
28.39 s
gammaloop-nextest-python-api>
28.39 s
gammaloop-nextest-python-api> Location:
28.39 s
gammaloop-nextest-python-api> tests/tests/test_python_api.rs:156:20
28.39 s
gammaloop-nextest-python-api>
28.39 s
gammaloop-nextest-python-api> ------------
28.39 s
gammaloop-nextest-python-api> Summary [ 0.576s] 5 tests run: 0 passed , 5 failed , 0 skipped
28.39 s
gammaloop-nextest-python-api> FAIL [ 0.234s] (1/5) gammaloop-integration-tests::test_python_api python_session_getters_return_live_toml_and_command_blocks
28.39 s
gammaloop-nextest-python-api> stdout ---
28.39 s
gammaloop-nextest-python-api>
28.39 s
gammaloop-nextest-python-api> running 1 test
28.39 s
gammaloop-nextest-python-api> test python_session_getters_return_live_toml_and_command_blocks ... FAILED
28.39 s
gammaloop-nextest-python-api>
28.39 s
gammaloop-nextest-python-api> failures:
28.39 s
gammaloop-nextest-python-api>
28.39 s
gammaloop-nextest-python-api> failures:
28.39 s
gammaloop-nextest-python-api> python_session_getters_return_live_toml_and_command_blocks
28.39 s
gammaloop-nextest-python-api>
28.39 s
gammaloop-nextest-python-api> test result: FAILED. 0 passed; 1 failed; 0 ignored; 0 measured; 4 filtered out; finished in 0.22s
28.39 s
gammaloop-nextest-python-api>
28.39 s
gammaloop-nextest-python-api> stderr ---
28.39 s
gammaloop-nextest-python-api> Error: Python API test subprocess failed.
28.39 s
gammaloop-nextest-python-api> stdout:
28.39 s
gammaloop-nextest-python-api> ┌────────────────────────────────────────────────────────┐
28.39 s
gammaloop-nextest-python-api> │ You are running a restricted Symbolica instance. │
28.39 s
gammaloop-nextest-python-api> │ │
28.39 s
gammaloop-nextest-python-api> │ This mode is only permitted for non-commercial use and │
28.39 s
gammaloop-nextest-python-api> │ is limited to one instance and core per machine. │
28.39 s
gammaloop-nextest-python-api> │ │
28.39 s
gammaloop-nextest-python-api> │ Hobbyists can easily acquire a free license key │
28.39 s
gammaloop-nextest-python-api> │ that unlocks all cores and removes this banner: │
28.39 s
gammaloop-nextest-python-api> │ │
28.39 s
gammaloop-nextest-python-api> │ from symbolica import * │
28.39 s
gammaloop-nextest-python-api> │ request_hobbyist_license('YOUR_NAME', 'YOUR_EMAIL') │
28.39 s
gammaloop-nextest-python-api> │ │
28.39 s
gammaloop-nextest-python-api> │ All other users can obtain a free 30-day trial key: │
28.39 s
gammaloop-nextest-python-api> │ │
28.39 s
gammaloop-nextest-python-api> │ from symbolica import * │
28.39 s
gammaloop-nextest-python-api> │ request_trial_license('NAME', 'EMAIL', 'EMPLOYER') │
28.39 s
gammaloop-nextest-python-api> │ │
28.39 s
gammaloop-nextest-python-api> │ See https://symbolica.io/docs/get_started.html#license │
28.39 s
gammaloop-nextest-python-api> └────────────────────────────────────────────────────────┘
28.39 s
gammaloop-nextest-python-api> ┌───────────────────────────────────────────────────────────────────────────────────────────────────────────┐
28.39 s
gammaloop-nextest-python-api> │ Cannot start new unlicensed Symbolica instance since there is already another one running on the machine. │
28.39 s
gammaloop-nextest-python-api> └───────────────────────────────────────────────────────────────────────────────────────────────────────────┘
28.39 s
gammaloop-nextest-python-api>
28.39 s
gammaloop-nextest-python-api> stderr:
28.39 s
gammaloop-nextest-python-api> ┌───────────────────────────────────┐
28.39 s
gammaloop-nextest-python-api> │ The Symbolica license has expired │
28.39 s
gammaloop-nextest-python-api> └───────────────────────────────────┘
28.39 s
gammaloop-nextest-python-api>
28.39 s
gammaloop-nextest-python-api>
28.39 s
gammaloop-nextest-python-api> Location:
28.39 s
gammaloop-nextest-python-api> tests/tests/test_python_api.rs:156:20
28.39 s
gammaloop-nextest-python-api>
28.39 s
gammaloop-nextest-python-api> FAIL [ 0.257s] (2/5) gammaloop-integration-tests::test_python_api python_evaluate_samples_batch_and_momentum_space_have_expected_shape
28.39 s
gammaloop-nextest-python-api> stdout ---
28.39 s
gammaloop-nextest-python-api>
28.39 s
gammaloop-nextest-python-api> running 1 test
28.39 s
gammaloop-nextest-python-api> test python_evaluate_samples_batch_and_momentum_space_have_expected_shape ... FAILED
28.39 s
gammaloop-nextest-python-api>
28.39 s
gammaloop-nextest-python-api> failures:
28.39 s
gammaloop-nextest-python-api>
28.39 s
gammaloop-nextest-python-api> failures:
28.39 s
gammaloop-nextest-python-api> python_evaluate_samples_batch_and_momentum_space_have_expected_shape
28.39 s
gammaloop-nextest-python-api>
28.39 s
gammaloop-nextest-python-api> test result: FAILED. 0 passed; 1 failed; 0 ignored; 0 measured; 4 filtered out; finished in 0.25s
28.39 s
gammaloop-nextest-python-api>
28.39 s
gammaloop-nextest-python-api> stderr ---
28.39 s
gammaloop-nextest-python-api> Error: Python API test subprocess failed.
28.39 s
gammaloop-nextest-python-api> stdout:
28.39 s
gammaloop-nextest-python-api> ┌────────────────────────────────────────────────────────┐
28.39 s
gammaloop-nextest-python-api> │ You are running a restricted Symbolica instance. │
28.39 s
gammaloop-nextest-python-api> │ │
28.39 s
gammaloop-nextest-python-api> │ This mode is only permitted for non-commercial use and │
28.39 s
gammaloop-nextest-python-api> │ is limited to one instance and core per machine. │
28.39 s
gammaloop-nextest-python-api> │ │
28.39 s
gammaloop-nextest-python-api> │ Hobbyists can easily acquire a free license key │
28.39 s
gammaloop-nextest-python-api> │ that unlocks all cores and removes this banner: │
28.39 s
gammaloop-nextest-python-api> │ │
28.39 s
gammaloop-nextest-python-api> │ from symbolica import * │
28.39 s
gammaloop-nextest-python-api> │ request_hobbyist_license('YOUR_NAME', 'YOUR_EMAIL') │
28.39 s
gammaloop-nextest-python-api> │ │
28.39 s
gammaloop-nextest-python-api> │ All other users can obtain a free 30-day trial key: │
28.39 s
gammaloop-nextest-python-api> │ │
28.39 s
gammaloop-nextest-python-api> │ from symbolica import * │
28.39 s
gammaloop-nextest-python-api> │ request_trial_license('NAME', 'EMAIL', 'EMPLOYER') │
28.39 s
gammaloop-nextest-python-api> │ │
28.39 s
gammaloop-nextest-python-api> │ See https://symbolica.io/docs/get_started.html#license │
28.39 s
gammaloop-nextest-python-api> └────────────────────────────────────────────────────────┘
28.39 s
gammaloop-nextest-python-api> ┌───────────────────────────────────────────────────────────────────────────────────────────────────────────┐
28.39 s
gammaloop-nextest-python-api> │ Cannot start new unlicensed Symbolica instance since there is already another one running on the machine. │
28.39 s
gammaloop-nextest-python-api> └───────────────────────────────────────────────────────────────────────────────────────────────────────────┘
28.39 s
gammaloop-nextest-python-api>
28.39 s
gammaloop-nextest-python-api> stderr:
28.39 s
gammaloop-nextest-python-api> ┌───────────────────────────────────┐
28.39 s
gammaloop-nextest-python-api> │ The Symbolica license has expired │
28.39 s
gammaloop-nextest-python-api> └───────────────────────────────────┘
28.39 s
gammaloop-nextest-python-api>
28.39 s
gammaloop-nextest-python-api>
28.39 s
gammaloop-nextest-python-api> Location:
28.39 s
gammaloop-nextest-python-api> tests/tests/test_python_api.rs:156:20
28.39 s
gammaloop-nextest-python-api>
28.39 s
gammaloop-nextest-python-api> FAIL [ 0.296s] (3/5) gammaloop-integration-tests::test_python_api python_evaluate_sample_honors_generate_events_and_observable_snapshots
28.39 s
gammaloop-nextest-python-api> stdout ---
28.39 s
gammaloop-nextest-python-api>
28.39 s
gammaloop-nextest-python-api> running 1 test
28.39 s
gammaloop-nextest-python-api> test python_evaluate_sample_honors_generate_events_and_observable_snapshots ... FAILED
28.39 s
gammaloop-nextest-python-api>
28.39 s
gammaloop-nextest-python-api> failures:
28.39 s
gammaloop-nextest-python-api>
28.39 s
gammaloop-nextest-python-api> failures:
28.39 s
gammaloop-nextest-python-api> python_evaluate_sample_honors_generate_events_and_observable_snapshots
28.39 s
gammaloop-nextest-python-api>
28.39 s
gammaloop-nextest-python-api> test result: FAILED. 0 passed; 1 failed; 0 ignored; 0 measured; 4 filtered out; finished in 0.29s
28.39 s
gammaloop-nextest-python-api>
28.39 s
gammaloop-nextest-python-api> stderr ---
28.39 s
gammaloop-nextest-python-api> Error: Python API test subprocess failed.
28.39 s
gammaloop-nextest-python-api> stdout:
28.39 s
gammaloop-nextest-python-api> ┌────────────────────────────────────────────────────────┐
28.39 s
gammaloop-nextest-python-api> │ You are running a restricted Symbolica instance. │
28.39 s
gammaloop-nextest-python-api> │ │
28.39 s
gammaloop-nextest-python-api> │ This mode is only permitted for non-commercial use and │
28.39 s
gammaloop-nextest-python-api> │ is limited to one instance and core per machine. │
28.39 s
gammaloop-nextest-python-api> │ │
28.39 s
gammaloop-nextest-python-api> │ Hobbyists can easily acquire a free license key │
28.39 s
gammaloop-nextest-python-api> │ that unlocks all cores and removes this banner: │
28.39 s
gammaloop-nextest-python-api> │ │
28.39 s
gammaloop-nextest-python-api> │ from symbolica import * │
28.39 s
gammaloop-nextest-python-api> │ request_hobbyist_license('YOUR_NAME', 'YOUR_EMAIL') │
28.39 s
gammaloop-nextest-python-api> │ │
28.39 s
gammaloop-nextest-python-api> │ All other users can obtain a free 30-day trial key: │
28.39 s
gammaloop-nextest-python-api> │ │
28.39 s
gammaloop-nextest-python-api> │ from symbolica import * │
28.39 s
gammaloop-nextest-python-api> │ request_trial_license('NAME', 'EMAIL', 'EMPLOYER') │
28.39 s
gammaloop-nextest-python-api> │ │
28.39 s
gammaloop-nextest-python-api> │ See https://symbolica.io/docs/get_started.html#license │
28.39 s
gammaloop-nextest-python-api> └────────────────────────────────────────────────────────┘
28.39 s
gammaloop-nextest-python-api> ┌───────────────────────────────────────────────────────────────────────────────────────────────────────────┐
28.39 s
gammaloop-nextest-python-api> │ Cannot start new unlicensed Symbolica instance since there is already another one running on the machine. │
28.39 s
gammaloop-nextest-python-api> └───────────────────────────────────────────────────────────────────────────────────────────────────────────┘
28.39 s
gammaloop-nextest-python-api>
28.39 s
gammaloop-nextest-python-api> stderr:
28.39 s
gammaloop-nextest-python-api> ┌───────────────────────────────────┐
28.39 s
gammaloop-nextest-python-api> │ The Symbolica license has expired │
28.39 s
gammaloop-nextest-python-api> └───────────────────────────────────┘
28.39 s
gammaloop-nextest-python-api>
28.39 s
gammaloop-nextest-python-api>
28.39 s
gammaloop-nextest-python-api> Location:
28.39 s
gammaloop-nextest-python-api> tests/tests/test_python_api.rs:156:20
28.39 s
gammaloop-nextest-python-api>
28.39 s
gammaloop-nextest-python-api> FAIL [ 0.346s] (4/5) gammaloop-integration-tests::test_python_api python_evaluate_sample_preserves_graph_grouping_and_incoming_pdgs
28.39 s
gammaloop-nextest-python-api> stdout ---
28.39 s
gammaloop-nextest-python-api>
28.39 s
gammaloop-nextest-python-api> running 1 test
28.39 s
gammaloop-nextest-python-api> test python_evaluate_sample_preserves_graph_grouping_and_incoming_pdgs ... FAILED
28.39 s
gammaloop-nextest-python-api>
28.39 s
gammaloop-nextest-python-api> failures:
28.39 s
gammaloop-nextest-python-api>
28.39 s
gammaloop-nextest-python-api> failures:
28.39 s
gammaloop-nextest-python-api> python_evaluate_sample_preserves_graph_grouping_and_incoming_pdgs
28.39 s
gammaloop-nextest-python-api>
28.39 s
gammaloop-nextest-python-api> test result: FAILED. 0 passed; 1 failed; 0 ignored; 0 measured; 4 filtered out; finished in 0.34s
28.39 s
gammaloop-nextest-python-api>
28.39 s
gammaloop-nextest-python-api> stderr ---
28.39 s
gammaloop-nextest-python-api> Error: Python API test subprocess failed.
28.39 s
gammaloop-nextest-python-api> stdout:
28.39 s
gammaloop-nextest-python-api> ┌────────────────────────────────────────────────────────┐
28.39 s
gammaloop-nextest-python-api> │ You are running a restricted Symbolica instance. │
28.39 s
gammaloop-nextest-python-api> │ │
28.39 s
gammaloop-nextest-python-api> │ This mode is only permitted for non-commercial use and │
28.39 s
gammaloop-nextest-python-api> │ is limited to one instance and core per machine. │
28.39 s
gammaloop-nextest-python-api> │ │
28.39 s
gammaloop-nextest-python-api> │ Hobbyists can easily acquire a free license key │
28.39 s
gammaloop-nextest-python-api> │ that unlocks all cores and removes this banner: │
28.39 s
gammaloop-nextest-python-api> │ │
28.39 s
gammaloop-nextest-python-api> │ from symbolica import * │
28.39 s
gammaloop-nextest-python-api> │ request_hobbyist_license('YOUR_NAME', 'YOUR_EMAIL') │
28.39 s
gammaloop-nextest-python-api> │ │
28.39 s
gammaloop-nextest-python-api> │ All other users can obtain a free 30-day trial key: │
28.39 s
gammaloop-nextest-python-api> │ │
28.39 s
gammaloop-nextest-python-api> │ from symbolica import * │
28.39 s
gammaloop-nextest-python-api> │ request_trial_license('NAME', 'EMAIL', 'EMPLOYER') │
28.39 s
gammaloop-nextest-python-api> │ │
28.39 s
gammaloop-nextest-python-api> │ See https://symbolica.io/docs/get_started.html#license │
28.39 s
gammaloop-nextest-python-api> └────────────────────────────────────────────────────────┘
28.39 s
gammaloop-nextest-python-api> ┌───────────────────────────────────────────────────────────────────────────────────────────────────────────┐
28.39 s
gammaloop-nextest-python-api> │ Cannot start new unlicensed Symbolica instance since there is already another one running on the machine. │
28.39 s
gammaloop-nextest-python-api> └───────────────────────────────────────────────────────────────────────────────────────────────────────────┘
28.39 s
gammaloop-nextest-python-api>
28.39 s
gammaloop-nextest-python-api> stderr:
28.39 s
gammaloop-nextest-python-api> ┌───────────────────────────────────┐
28.39 s
gammaloop-nextest-python-api> │ The Symbolica license has expired │
28.39 s
gammaloop-nextest-python-api> └───────────────────────────────────┘
28.39 s
gammaloop-nextest-python-api> [2026-09-01 10:05:46.432] @gammaloop_api::se... INFO : Running command import model sm-default
28.39 s
gammaloop-nextest-python-api> [2026-09-01 10:05:46.432] @import::model INFO : Loading built-in JSON model sm-default
28.39 s
gammaloop-nextest-python-api> [2026-09-01 10:05:46.471] @gammalooprs::model INFO : The following 15 external parameters were forced to zero by the restriction card:
28.39 s
gammaloop-nextest-python-api> lamWS, AWS, rhoWS, etaWS, ymc, yme, ymm, MC, Me, MM, WTau, muQ, muLe, muLmu, muLtau
28.39 s
gammaloop-nextest-python-api> [2026-09-01 10:05:46.472] @gammalooprs::model INFO : The following 34 vertex rules were removed by the restriction card:
28.39 s
gammaloop-nextest-python-api> V_82 -> (c~, d, G+) | V_83 -> (t~, d, G+) | V_84 -> (c~, s, G+) | V_85 -> (t~, s, G+) | V_86 -> (u~, b, G+) | V_87 -> (c~, b, G+) | V_90 -> (c~, d, W+) | V_91 -> (t~, d, W+) | V_92 -> (u~, s, W+) | V_94 -> (t~, s, W+) | V_95 -> (u~, b, W+) | V_96 -> (c~, b, W+) | V_101 -> (e+, e-, G0) | V_102 -> (mu+, mu-, G0) | V_104 -> (e+, e-, H) | V_105 -> (mu+, mu-, H) | V_110 -> (ve~, e-, G+) | V_111 -> (vm~, mu-, G+) | V_116 -> (b~, u, G-) | V_117 -> (d~, c, G-) | V_118 -> (s~, c, G-) | V_119 -> (b~, c, G-) | V_120 -> (d~, t, G-) | V_121 -> (s~, t, G-) | V_124 -> (s~, u, W-) | V_125 -> (b~, u, W-) | V_126 -> (d~, c, W-) | V_128 -> (b~, c, W-) | V_129 -> (d~, t, W-) | V_130 -> (s~, t, W-) | V_138 -> (c~, c, G0) | V_140 -> (c~, c, H) | V_145 -> (e+, ve, G-) | V_146 -> (mu+, vm, G-)
28.39 s
gammaloop-nextest-python-api> [2026-09-01 10:05:46.472] @gammalooprs::model INFO : The following 36 couplings were removed by the restriction card:
28.39 s
gammaloop-nextest-python-api> GC_13, GC_14, GC_16, GC_17, GC_18, GC_19, GC_20, GC_22, GC_23, GC_24, GC_25, GC_26, GC_28, GC_29, GC_42, GC_43, GC_44, GC_46, GC_47, GC_48, GC_84, GC_85, GC_86, GC_87, GC_88, GC_89, GC_90, GC_91, GC_92, GC_93, GC_101, GC_102, GC_103, GC_105, GC_106, GC_107
28.39 s
gammaloop-nextest-python-api> [2026-09-01 10:05:46.472] @gammaloop_api::se... INFO : Running command set default-runtime kv kinematics.externals='{"type":"constant","data":{"momenta":[[32.0,0.0,0.0,32.0],[32.0,0.0,0.0,-32.0]],"helicities":[1,1]}}'
28.39 s
gammaloop-nextest-python-api> [2026-09-01 10:05:46.473] @gammaloop_api::se... INFO : Running command set default-runtime kv subtraction.disable_threshold_subtraction=true
28.39 s
gammaloop-nextest-python-api> [2026-09-01 10:05:46.474] @gammaloop_api::se... INFO : Running command generate xs e+ e- > d d~ g | e- a d g QED^2==4 [{{2}} QCD=0] --numerator-grouping group_identical_graphs_up_to_sign --clear-existing-processes --only-diagrams
28.39 s
gammaloop-nextest-python-api> [2026-09-01 10:05:46.476] @feyngen::diagram_... INFO : 0s | Δ=0s | Starting Feynman graph generation with Symbolica...
28.39 s
gammaloop-nextest-python-api> [2026-09-01 10:05:46.479] @feyngen::diagram_... INFO : 0s | Δ=0s | Number of graphs resulting from Symbolica generation: 246
28.39 s
gammaloop-nextest-python-api> [2026-09-01 10:05:46.481] @feyngen::diagram_... INFO : 0s | Δ=0s | Number of graphs retained after enforcing supergraph particle content: 8
28.39 s
gammaloop-nextest-python-api> [2026-09-01 10:05:46.484] @feyngen::diagram_... INFO : 0s | Δ=0s | Number of graphs retained after removal of vetoed topologies: 8
28.39 s
gammaloop-nextest-python-api> [2026-09-01 10:05:46.484] @feyngen::diagram_... INFO : 0s | Δ=0s | Number of graphs after vertex info assignment: 8
28.39 s
gammaloop-nextest-python-api> [2026-09-01 10:05:46.484] @feyngen::diagram_... INFO : 0s | Δ=0s | Number of graphs after all complete graphs filters are applied: 8
28.39 s
gammaloop-nextest-python-api>
28.39 s
gammaloop-nextest-python-api>
28.39 s
gammaloop-nextest-python-api> Location:
28.39 s
gammaloop-nextest-python-api> tests/tests/test_python_api.rs:156:20
28.39 s
gammaloop-nextest-python-api>
28.39 s
gammaloop-nextest-python-api> FAIL [ 0.573s] (5/5) gammaloop-integration-tests::test_python_api python_settings_wrappers_expose_nested_runtime_and_global_settings
28.39 s
gammaloop-nextest-python-api> stdout ---
28.39 s
gammaloop-nextest-python-api>
28.39 s
gammaloop-nextest-python-api> running 1 test
28.39 s
gammaloop-nextest-python-api> test python_settings_wrappers_expose_nested_runtime_and_global_settings ... FAILED
28.39 s
gammaloop-nextest-python-api>
28.39 s
gammaloop-nextest-python-api> failures:
28.39 s
gammaloop-nextest-python-api>
28.39 s
gammaloop-nextest-python-api> failures:
28.39 s
gammaloop-nextest-python-api> python_settings_wrappers_expose_nested_runtime_and_global_settings
28.39 s
gammaloop-nextest-python-api>
28.39 s
gammaloop-nextest-python-api> test result: FAILED. 0 passed; 1 failed; 0 ignored; 0 measured; 4 filtered out; finished in 0.57s
28.39 s
gammaloop-nextest-python-api>
28.39 s
gammaloop-nextest-python-api> stderr ---
28.39 s
gammaloop-nextest-python-api> Error: Python API test subprocess failed.
28.39 s
gammaloop-nextest-python-api> stdout:
28.39 s
gammaloop-nextest-python-api> ┌────────────────────────────────────────────────────────┐
28.39 s
gammaloop-nextest-python-api> │ You are running a restricted Symbolica instance. │
28.39 s
gammaloop-nextest-python-api> │ │
28.39 s
gammaloop-nextest-python-api> │ This mode is only permitted for non-commercial use and │
28.39 s
gammaloop-nextest-python-api> │ is limited to one instance and core per machine. │
28.39 s
gammaloop-nextest-python-api> │ │
28.39 s
gammaloop-nextest-python-api> │ Hobbyists can easily acquire a free license key │
28.39 s
gammaloop-nextest-python-api> │ that unlocks all cores and removes this banner: │
28.39 s
gammaloop-nextest-python-api> │ │
28.39 s
gammaloop-nextest-python-api> │ from symbolica import * │
28.39 s
gammaloop-nextest-python-api> │ request_hobbyist_license('YOUR_NAME', 'YOUR_EMAIL') │
28.39 s
gammaloop-nextest-python-api> │ │
28.39 s
gammaloop-nextest-python-api> │ All other users can obtain a free 30-day trial key: │
28.39 s
gammaloop-nextest-python-api> │ │
28.39 s
gammaloop-nextest-python-api> │ from symbolica import * │
28.39 s
gammaloop-nextest-python-api> │ request_trial_license('NAME', 'EMAIL', 'EMPLOYER') │
28.39 s
gammaloop-nextest-python-api> │ │
28.39 s
gammaloop-nextest-python-api> │ See https://symbolica.io/docs/get_started.html#license │
28.39 s
gammaloop-nextest-python-api> └────────────────────────────────────────────────────────┘
28.39 s
gammaloop-nextest-python-api> ┌───────────────────────────────────────────────────────────────────────────────────────────────────────────┐
28.39 s
gammaloop-nextest-python-api> │ Cannot start new unlicensed Symbolica instance since there is already another one running on the machine. │
28.39 s
gammaloop-nextest-python-api> └───────────────────────────────────────────────────────────────────────────────────────────────────────────┘
28.39 s
gammaloop-nextest-python-api>
28.39 s
gammaloop-nextest-python-api> stderr:
28.39 s
gammaloop-nextest-python-api> ┌───────────────────────────────────┐
28.39 s
gammaloop-nextest-python-api> │ The Symbolica license has expired │
28.39 s
gammaloop-nextest-python-api> └───────────────────────────────────┘
28.39 s
gammaloop-nextest-python-api>
28.39 s
gammaloop-nextest-python-api>
28.39 s
gammaloop-nextest-python-api> Location:
28.39 s
gammaloop-nextest-python-api> tests/tests/test_python_api.rs:156:20
28.39 s
gammaloop-nextest-python-api>
28.41 s
gammaloop-nextest-python-api> error : test run failed
28.44 s
gammaloop-nextest-python-api>
28.44 s
gammaloop-nextest-python-api> ========== nextest test summary ==========
28.44 s
gammaloop-nextest-python-api> report: target/nextest/ci_gammaloop/junit.xml
28.44 s
gammaloop-nextest-python-api> tests: 5, failures: 5, errors: 0
28.44 s
gammaloop-nextest-python-api>
28.44 s
gammaloop-nextest-python-api> 1. gammaloop-integration-tests::test_python_api::python_session_getters_return_live_toml_and_command_blocks
28.44 s
gammaloop-nextest-python-api> failure: test failure with exit code 101
28.44 s
gammaloop-nextest-python-api> Error: Python API test subprocess failed.
28.44 s
gammaloop-nextest-python-api> stdout:
28.44 s
gammaloop-nextest-python-api> ┌────────────────────────────────────────────────────────┐
28.44 s
gammaloop-nextest-python-api> │ You are running a restricted Symbolica instance. │
28.44 s
gammaloop-nextest-python-api> │ │
28.44 s
gammaloop-nextest-python-api> │ This mode is only permitted for non-commercial use and │
28.44 s
gammaloop-nextest-python-api> │ is limited to one instance and core per machine. │
28.44 s
gammaloop-nextest-python-api> │ │
28.44 s
gammaloop-nextest-python-api> │ Hobbyists can easily acquire a free license key │
28.44 s
gammaloop-nextest-python-api> │ that unlocks all cores and removes this banner: │
28.44 s
gammaloop-nextest-python-api> │ │
28.44 s
gammaloop-nextest-python-api> │ from symbolica import * │
28.44 s
gammaloop-nextest-python-api> │ request_hobbyist_license('YOUR_NAME', 'YOUR_EMAIL') │
28.44 s
gammaloop-nextest-python-api> │ │
28.44 s
gammaloop-nextest-python-api> │ All other users can obtain a free 30-day trial key: │
28.44 s
gammaloop-nextest-python-api> │ │
28.44 s
gammaloop-nextest-python-api> │ from symbolica import * │
28.44 s
gammaloop-nextest-python-api> │ request_trial_license('NAME', 'EMAIL', 'EMPLOYER') │
28.44 s
gammaloop-nextest-python-api> │ │
28.44 s
gammaloop-nextest-python-api> │ See https://symbolica.io/docs/get_started.html#license │
28.44 s
gammaloop-nextest-python-api> └────────────────────────────────────────────────────────┘
28.44 s
gammaloop-nextest-python-api> ┌───────────────────────────────────────────────────────────────────────────────────────────────────────────┐
28.44 s
gammaloop-nextest-python-api> │ Cannot start new unlicensed Symbolica instance since there is already another one running on the machine. │
28.44 s
gammaloop-nextest-python-api> └───────────────────────────────────────────────────────────────────────────────────────────────────────────┘
28.44 s
gammaloop-nextest-python-api>
28.44 s
gammaloop-nextest-python-api> stderr:
28.44 s
gammaloop-nextest-python-api> ┌───────────────────────────────────┐
28.44 s
gammaloop-nextest-python-api> │ The Symbolica license has expired │
28.44 s
gammaloop-nextest-python-api> └───────────────────────────────────┘
28.44 s
gammaloop-nextest-python-api>
28.44 s
gammaloop-nextest-python-api>
28.44 s
gammaloop-nextest-python-api> Location:
28.44 s
gammaloop-nextest-python-api> tests/tests/test_python_api.rs:156:20
28.44 s
gammaloop-nextest-python-api> system-out
28.44 s
gammaloop-nextest-python-api> running 1 test
28.44 s
gammaloop-nextest-python-api> test python_session_getters_return_live_toml_and_command_blocks ... FAILED
28.44 s
gammaloop-nextest-python-api>
28.44 s
gammaloop-nextest-python-api> failures:
28.44 s
gammaloop-nextest-python-api>
28.44 s
gammaloop-nextest-python-api> failures:
28.44 s
gammaloop-nextest-python-api> python_session_getters_return_live_toml_and_command_blocks
28.44 s
gammaloop-nextest-python-api>
28.44 s
gammaloop-nextest-python-api> test result: FAILED. 0 passed; 1 failed; 0 ignored; 0 measured; 4 filtered out; finished in 0.22s
28.44 s
gammaloop-nextest-python-api> system-err
28.44 s
gammaloop-nextest-python-api> Error: Python API test subprocess failed.
28.44 s
gammaloop-nextest-python-api> stdout:
28.44 s
gammaloop-nextest-python-api> ┌────────────────────────────────────────────────────────┐
28.44 s
gammaloop-nextest-python-api> │ You are running a restricted Symbolica instance. │
28.44 s
gammaloop-nextest-python-api> │ │
28.44 s
gammaloop-nextest-python-api> │ This mode is only permitted for non-commercial use and │
28.44 s
gammaloop-nextest-python-api> │ is limited to one instance and core per machine. │
28.44 s
gammaloop-nextest-python-api> │ │
28.44 s
gammaloop-nextest-python-api> │ Hobbyists can easily acquire a free license key │
28.44 s
gammaloop-nextest-python-api> │ that unlocks all cores and removes this banner: │
28.44 s
gammaloop-nextest-python-api> │ │
28.44 s
gammaloop-nextest-python-api> │ from symbolica import * │
28.44 s
gammaloop-nextest-python-api> │ request_hobbyist_license('YOUR_NAME', 'YOUR_EMAIL') │
28.44 s
gammaloop-nextest-python-api> │ │
28.44 s
gammaloop-nextest-python-api> │ All other users can obtain a free 30-day trial key: │
28.44 s
gammaloop-nextest-python-api> │ │
28.44 s
gammaloop-nextest-python-api> │ from symbolica import * │
28.44 s
gammaloop-nextest-python-api> │ request_trial_license('NAME', 'EMAIL', 'EMPLOYER') │
28.44 s
gammaloop-nextest-python-api> │ │
28.44 s
gammaloop-nextest-python-api> │ See https://symbolica.io/docs/get_started.html#license │
28.44 s
gammaloop-nextest-python-api> └────────────────────────────────────────────────────────┘
28.44 s
gammaloop-nextest-python-api> ┌───────────────────────────────────────────────────────────────────────────────────────────────────────────┐
28.44 s
gammaloop-nextest-python-api> │ Cannot start new unlicensed Symbolica instance since there is already another one running on the machine. │
28.44 s
gammaloop-nextest-python-api> └───────────────────────────────────────────────────────────────────────────────────────────────────────────┘
28.44 s
gammaloop-nextest-python-api>
28.44 s
gammaloop-nextest-python-api> stderr:
28.44 s
gammaloop-nextest-python-api> ┌───────────────────────────────────┐
28.44 s
gammaloop-nextest-python-api> │ The Symbolica license has expired │
28.44 s
gammaloop-nextest-python-api> └───────────────────────────────────┘
28.44 s
gammaloop-nextest-python-api>
28.44 s
gammaloop-nextest-python-api>
28.44 s
gammaloop-nextest-python-api> Location:
28.44 s
gammaloop-nextest-python-api> tests/tests/test_python_api.rs:156:20
28.44 s
gammaloop-nextest-python-api>
28.44 s
gammaloop-nextest-python-api> 2. gammaloop-integration-tests::test_python_api::python_evaluate_samples_batch_and_momentum_space_have_expected_shape
28.44 s
gammaloop-nextest-python-api> failure: test failure with exit code 101
28.44 s
gammaloop-nextest-python-api> Error: Python API test subprocess failed.
28.44 s
gammaloop-nextest-python-api> stdout:
28.44 s
gammaloop-nextest-python-api> ┌────────────────────────────────────────────────────────┐
28.44 s
gammaloop-nextest-python-api> │ You are running a restricted Symbolica instance. │
28.44 s
gammaloop-nextest-python-api> │ │
28.44 s
gammaloop-nextest-python-api> │ This mode is only permitted for non-commercial use and │
28.44 s
gammaloop-nextest-python-api> │ is limited to one instance and core per machine. │
28.44 s
gammaloop-nextest-python-api> │ │
28.44 s
gammaloop-nextest-python-api> │ Hobbyists can easily acquire a free license key │
28.44 s
gammaloop-nextest-python-api> │ that unlocks all cores and removes this banner: │
28.44 s
gammaloop-nextest-python-api> │ │
28.44 s
gammaloop-nextest-python-api> │ from symbolica import * │
28.44 s
gammaloop-nextest-python-api> │ request_hobbyist_license('YOUR_NAME', 'YOUR_EMAIL') │
28.44 s
gammaloop-nextest-python-api> │ │
28.44 s
gammaloop-nextest-python-api> │ All other users can obtain a free 30-day trial key: │
28.44 s
gammaloop-nextest-python-api> │ │
28.44 s
gammaloop-nextest-python-api> │ from symbolica import * │
28.44 s
gammaloop-nextest-python-api> │ request_trial_license('NAME', 'EMAIL', 'EMPLOYER') │
28.44 s
gammaloop-nextest-python-api> │ │
28.44 s
gammaloop-nextest-python-api> │ See https://symbolica.io/docs/get_started.html#license │
28.44 s
gammaloop-nextest-python-api> └────────────────────────────────────────────────────────┘
28.44 s
gammaloop-nextest-python-api> ┌───────────────────────────────────────────────────────────────────────────────────────────────────────────┐
28.44 s
gammaloop-nextest-python-api> │ Cannot start new unlicensed Symbolica instance since there is already another one running on the machine. │
28.44 s
gammaloop-nextest-python-api> └───────────────────────────────────────────────────────────────────────────────────────────────────────────┘
28.44 s
gammaloop-nextest-python-api>
28.44 s
gammaloop-nextest-python-api> stderr:
28.44 s
gammaloop-nextest-python-api> ┌───────────────────────────────────┐
28.44 s
gammaloop-nextest-python-api> │ The Symbolica license has expired │
28.44 s
gammaloop-nextest-python-api> └───────────────────────────────────┘
28.44 s
gammaloop-nextest-python-api>
28.44 s
gammaloop-nextest-python-api>
28.44 s
gammaloop-nextest-python-api> Location:
28.44 s
gammaloop-nextest-python-api> tests/tests/test_python_api.rs:156:20
28.44 s
gammaloop-nextest-python-api> system-out
28.44 s
gammaloop-nextest-python-api> running 1 test
28.44 s
gammaloop-nextest-python-api> test python_evaluate_samples_batch_and_momentum_space_have_expected_shape ... FAILED
28.44 s
gammaloop-nextest-python-api>
28.44 s
gammaloop-nextest-python-api> failures:
28.44 s
gammaloop-nextest-python-api>
28.44 s
gammaloop-nextest-python-api> failures:
28.44 s
gammaloop-nextest-python-api> python_evaluate_samples_batch_and_momentum_space_have_expected_shape
28.44 s
gammaloop-nextest-python-api>
28.44 s
gammaloop-nextest-python-api> test result: FAILED. 0 passed; 1 failed; 0 ignored; 0 measured; 4 filtered out; finished in 0.25s
28.44 s
gammaloop-nextest-python-api> system-err
28.44 s
gammaloop-nextest-python-api> Error: Python API test subprocess failed.
28.44 s
gammaloop-nextest-python-api> stdout:
28.44 s
gammaloop-nextest-python-api> ┌────────────────────────────────────────────────────────┐
28.44 s
gammaloop-nextest-python-api> │ You are running a restricted Symbolica instance. │
28.44 s
gammaloop-nextest-python-api> │ │
28.44 s
gammaloop-nextest-python-api> │ This mode is only permitted for non-commercial use and │
28.44 s
gammaloop-nextest-python-api> │ is limited to one instance and core per machine. │
28.44 s
gammaloop-nextest-python-api> │ │
28.44 s
gammaloop-nextest-python-api> │ Hobbyists can easily acquire a free license key │
28.44 s
gammaloop-nextest-python-api> │ that unlocks all cores and removes this banner: │
28.44 s
gammaloop-nextest-python-api> │ │
28.44 s
gammaloop-nextest-python-api> │ from symbolica import * │
28.44 s
gammaloop-nextest-python-api> │ request_hobbyist_license('YOUR_NAME', 'YOUR_EMAIL') │
28.44 s
gammaloop-nextest-python-api> │ │
28.44 s
gammaloop-nextest-python-api> │ All other users can obtain a free 30-day trial key: │
28.44 s
gammaloop-nextest-python-api> │ │
28.44 s
gammaloop-nextest-python-api> │ from symbolica import * │
28.44 s
gammaloop-nextest-python-api> │ request_trial_license('NAME', 'EMAIL', 'EMPLOYER') │
28.44 s
gammaloop-nextest-python-api> │ │
28.44 s
gammaloop-nextest-python-api> │ See https://symbolica.io/docs/get_started.html#license │
28.44 s
gammaloop-nextest-python-api> └────────────────────────────────────────────────────────┘
28.44 s
gammaloop-nextest-python-api> ┌───────────────────────────────────────────────────────────────────────────────────────────────────────────┐
28.44 s
gammaloop-nextest-python-api> │ Cannot start new unlicensed Symbolica instance since there is already another one running on the machine. │
28.44 s
gammaloop-nextest-python-api> └───────────────────────────────────────────────────────────────────────────────────────────────────────────┘
28.44 s
gammaloop-nextest-python-api>
28.44 s
gammaloop-nextest-python-api> stderr:
28.44 s
gammaloop-nextest-python-api> ┌───────────────────────────────────┐
28.44 s
gammaloop-nextest-python-api> │ The Symbolica license has expired │
28.44 s
gammaloop-nextest-python-api> └───────────────────────────────────┘
28.44 s
gammaloop-nextest-python-api>
28.44 s
gammaloop-nextest-python-api>
28.44 s
gammaloop-nextest-python-api> Location:
28.44 s
gammaloop-nextest-python-api> tests/tests/test_python_api.rs:156:20
28.44 s
gammaloop-nextest-python-api>
28.44 s
gammaloop-nextest-python-api> 3. gammaloop-integration-tests::test_python_api::python_evaluate_sample_honors_generate_events_and_observable_snapshots
28.44 s
gammaloop-nextest-python-api> failure: test failure with exit code 101
28.44 s
gammaloop-nextest-python-api> Error: Python API test subprocess failed.
28.44 s
gammaloop-nextest-python-api> stdout:
28.44 s
gammaloop-nextest-python-api> ┌────────────────────────────────────────────────────────┐
28.44 s
gammaloop-nextest-python-api> │ You are running a restricted Symbolica instance. │
28.44 s
gammaloop-nextest-python-api> │ │
28.44 s
gammaloop-nextest-python-api> │ This mode is only permitted for non-commercial use and │
28.44 s
gammaloop-nextest-python-api> │ is limited to one instance and core per machine. │
28.44 s
gammaloop-nextest-python-api> │ │
28.44 s
gammaloop-nextest-python-api> │ Hobbyists can easily acquire a free license key │
28.44 s
gammaloop-nextest-python-api> │ that unlocks all cores and removes this banner: │
28.44 s
gammaloop-nextest-python-api> │ │
28.44 s
gammaloop-nextest-python-api> │ from symbolica import * │
28.44 s
gammaloop-nextest-python-api> │ request_hobbyist_license('YOUR_NAME', 'YOUR_EMAIL') │
28.44 s
gammaloop-nextest-python-api> │ │
28.44 s
gammaloop-nextest-python-api> │ All other users can obtain a free 30-day trial key: │
28.44 s
gammaloop-nextest-python-api> │ │
28.44 s
gammaloop-nextest-python-api> │ from symbolica import * │
28.44 s
gammaloop-nextest-python-api> │ request_trial_license('NAME', 'EMAIL', 'EMPLOYER') │
28.44 s
gammaloop-nextest-python-api> │ │
28.44 s
gammaloop-nextest-python-api> │ See https://symbolica.io/docs/get_started.html#license │
28.44 s
gammaloop-nextest-python-api> └────────────────────────────────────────────────────────┘
28.44 s
gammaloop-nextest-python-api> ┌───────────────────────────────────────────────────────────────────────────────────────────────────────────┐
28.44 s
gammaloop-nextest-python-api> │ Cannot start new unlicensed Symbolica instance since there is already another one running on the machine. │
28.44 s
gammaloop-nextest-python-api> └───────────────────────────────────────────────────────────────────────────────────────────────────────────┘
28.44 s
gammaloop-nextest-python-api>
28.44 s
gammaloop-nextest-python-api> stderr:
28.44 s
gammaloop-nextest-python-api> ┌───────────────────────────────────┐
28.44 s
gammaloop-nextest-python-api> │ The Symbolica license has expired │
28.44 s
gammaloop-nextest-python-api> └───────────────────────────────────┘
28.44 s
gammaloop-nextest-python-api>
28.44 s
gammaloop-nextest-python-api>
28.44 s
gammaloop-nextest-python-api> Location:
28.44 s
gammaloop-nextest-python-api> tests/tests/test_python_api.rs:156:20
28.44 s
gammaloop-nextest-python-api> system-out
28.44 s
gammaloop-nextest-python-api> running 1 test
28.44 s
gammaloop-nextest-python-api> test python_evaluate_sample_honors_generate_events_and_observable_snapshots ... FAILED
28.44 s
gammaloop-nextest-python-api>
28.44 s
gammaloop-nextest-python-api> failures:
28.44 s
gammaloop-nextest-python-api>
28.44 s
gammaloop-nextest-python-api> failures:
28.44 s
gammaloop-nextest-python-api> python_evaluate_sample_honors_generate_events_and_observable_snapshots
28.44 s
gammaloop-nextest-python-api>
28.44 s
gammaloop-nextest-python-api> test result: FAILED. 0 passed; 1 failed; 0 ignored; 0 measured; 4 filtered out; finished in 0.29s
28.44 s
gammaloop-nextest-python-api> system-err
28.44 s
gammaloop-nextest-python-api> Error: Python API test subprocess failed.
28.44 s
gammaloop-nextest-python-api> stdout:
28.44 s
gammaloop-nextest-python-api> ┌────────────────────────────────────────────────────────┐
28.44 s
gammaloop-nextest-python-api> │ You are running a restricted Symbolica instance. │
28.44 s
gammaloop-nextest-python-api> │ │
28.44 s
gammaloop-nextest-python-api> │ This mode is only permitted for non-commercial use and │
28.44 s
gammaloop-nextest-python-api> │ is limited to one instance and core per machine. │
28.44 s
gammaloop-nextest-python-api> │ │
28.44 s
gammaloop-nextest-python-api> │ Hobbyists can easily acquire a free license key │
28.44 s
gammaloop-nextest-python-api> │ that unlocks all cores and removes this banner: │
28.44 s
gammaloop-nextest-python-api> │ │
28.44 s
gammaloop-nextest-python-api> │ from symbolica import * │
28.44 s
gammaloop-nextest-python-api> │ request_hobbyist_license('YOUR_NAME', 'YOUR_EMAIL') │
28.44 s
gammaloop-nextest-python-api> │ │
28.44 s
gammaloop-nextest-python-api> │ All other users can obtain a free 30-day trial key: │
28.44 s
gammaloop-nextest-python-api> │ │
28.44 s
gammaloop-nextest-python-api> │ from symbolica import * │
28.44 s
gammaloop-nextest-python-api> │ request_trial_license('NAME', 'EMAIL', 'EMPLOYER') │
28.44 s
gammaloop-nextest-python-api> │ │
28.44 s
gammaloop-nextest-python-api> │ See https://symbolica.io/docs/get_started.html#license │
28.44 s
gammaloop-nextest-python-api> └────────────────────────────────────────────────────────┘
28.44 s
gammaloop-nextest-python-api> ┌───────────────────────────────────────────────────────────────────────────────────────────────────────────┐
28.44 s
gammaloop-nextest-python-api> │ Cannot start new unlicensed Symbolica instance since there is already another one running on the machine. │
28.44 s
gammaloop-nextest-python-api> └───────────────────────────────────────────────────────────────────────────────────────────────────────────┘
28.44 s
gammaloop-nextest-python-api>
28.44 s
gammaloop-nextest-python-api> stderr:
28.44 s
gammaloop-nextest-python-api> ┌───────────────────────────────────┐
28.44 s
gammaloop-nextest-python-api> │ The Symbolica license has expired │
28.44 s
gammaloop-nextest-python-api> └───────────────────────────────────┘
28.44 s
gammaloop-nextest-python-api>
28.44 s
gammaloop-nextest-python-api>
28.44 s
gammaloop-nextest-python-api> Location:
28.44 s
gammaloop-nextest-python-api> tests/tests/test_python_api.rs:156:20
28.44 s
gammaloop-nextest-python-api>
28.44 s
gammaloop-nextest-python-api> 4. gammaloop-integration-tests::test_python_api::python_evaluate_sample_preserves_graph_grouping_and_incoming_pdgs
28.44 s
gammaloop-nextest-python-api> failure: test failure with exit code 101
28.44 s
gammaloop-nextest-python-api> Error: Python API test subprocess failed.
28.44 s
gammaloop-nextest-python-api> stdout:
28.44 s
gammaloop-nextest-python-api> ┌────────────────────────────────────────────────────────┐
28.44 s
gammaloop-nextest-python-api> │ You are running a restricted Symbolica instance. │
28.44 s
gammaloop-nextest-python-api> │ │
28.44 s
gammaloop-nextest-python-api> │ This mode is only permitted for non-commercial use and │
28.44 s
gammaloop-nextest-python-api> │ is limited to one instance and core per machine. │
28.44 s
gammaloop-nextest-python-api> │ │
28.44 s
gammaloop-nextest-python-api> │ Hobbyists can easily acquire a free license key │
28.44 s
gammaloop-nextest-python-api> │ that unlocks all cores and removes this banner: │
28.44 s
gammaloop-nextest-python-api> │ │
28.44 s
gammaloop-nextest-python-api> │ from symbolica import * │
28.44 s
gammaloop-nextest-python-api> │ request_hobbyist_license('YOUR_NAME', 'YOUR_EMAIL') │
28.44 s
gammaloop-nextest-python-api> │ │
28.44 s
gammaloop-nextest-python-api> │ All other users can obtain a free 30-day trial key: │
28.44 s
gammaloop-nextest-python-api> │ │
28.44 s
gammaloop-nextest-python-api> │ from symbolica import * │
28.44 s
gammaloop-nextest-python-api> │ request_trial_license('NAME', 'EMAIL', 'EMPLOYER') │
28.44 s
gammaloop-nextest-python-api> │ │
28.44 s
gammaloop-nextest-python-api> │ See https://symbolica.io/docs/get_started.html#license │
28.44 s
gammaloop-nextest-python-api> └────────────────────────────────────────────────────────┘
28.44 s
gammaloop-nextest-python-api> ┌───────────────────────────────────────────────────────────────────────────────────────────────────────────┐
28.44 s
gammaloop-nextest-python-api> │ Cannot start new unlicensed Symbolica instance since there is already another one running on the machine. │
28.44 s
gammaloop-nextest-python-api> └───────────────────────────────────────────────────────────────────────────────────────────────────────────┘
28.44 s
gammaloop-nextest-python-api>
28.44 s
gammaloop-nextest-python-api> stderr:
28.44 s
gammaloop-nextest-python-api> ┌───────────────────────────────────┐
28.44 s
gammaloop-nextest-python-api> │ The Symbolica license has expired │
28.44 s
gammaloop-nextest-python-api> └───────────────────────────────────┘
28.44 s
gammaloop-nextest-python-api> [2026-09-01 10:05:46.432] @gammaloop_api::se... INFO : Running command import model sm-default
28.44 s
gammaloop-nextest-python-api> [2026-09-01 10:05:46.432] @import::model INFO : Loading built-in JSON model sm-default
28.44 s
gammaloop-nextest-python-api> [2026-09-01 10:05:46.471] @gammalooprs::model INFO : The following 15 external parameters were forced to zero by the restriction card:
28.44 s
gammaloop-nextest-python-api> lamWS, AWS, rhoWS, etaWS, ymc, yme, ymm, MC, Me, MM, WTau, muQ, muLe, muLmu, muLtau
28.44 s
gammaloop-nextest-python-api> [2026-09-01 10:05:46.472] @gammalooprs::model INFO : The following 34 vertex rules were removed by the restriction card:
28.44 s
gammaloop-nextest-python-api> V_82 -> (c~, d, G+) | V_83 -> (t~, d, G+) | V_84 -> (c~, s, G+) | V_85 -> (t~, s, G+) | V_86 -> (u~, b, G+) | V_87 -> (c~, b, G+) | V_90 -> (c~, d, W+) | V_91 -> (t~, d, W+) | V_92 -> (u~, s, W+) | V_94 -> (t~, s, W+) | V_95 -> (u~, b, W+) | V_96 -> (c~, b, W+) | V_101 -> (e+, e-, G0) | V_102 -> (mu+, mu-, G0) | V_104 -> (e+, e-, H) | V_105 -> (mu+, mu-, H) | V_110 -> (ve~, e-, G+) | V_111 -> (vm~, mu-, G+) | V_116 -> (b~, u, G-) | V_117 -> (d~, c, G-) | V_118 -> (s~, c, G-) | V_119 -> (b~, c, G-) | V_120 -> (d~, t, G-) | V_121 -> (s~, t, G-) | V_124 -> (s~, u, W-) | V_125 -> (b~, u, W-) | V_126 -> (d~, c, W-) | V_128 -> (b~, c, W-) | V_129 -> (d~, t, W-) | V_130 -> (s~, t, W-) | V_138 -> (c~, c, G0) | V_140 -> (c~, c, H) | V_145 -> (e+, ve, G-) | V_146 -> (mu+, vm, G-)
28.44 s
gammaloop-nextest-python-api> [2026-09-01 10:05:46.472] @gammalooprs::model INFO : The following 36 couplings were removed by the restriction card:
28.44 s
gammaloop-nextest-python-api> GC_13, GC_14, GC_16, GC_17, GC_18, GC_19, GC_20, GC_22, GC_23, GC_24, GC_25, GC_26, GC_28, GC_29, GC_42, GC_43, GC_44, GC_46, GC_47, GC_48, GC_84, GC_85, GC_86, GC_87, GC_88, GC_89, GC_90, GC_91, GC_92, GC_93, GC_101, GC_102, GC_103, GC_105, GC_106, GC_107
28.44 s
gammaloop-nextest-python-api> [2026-09-01 10:05:46.472] @gammaloop_api::se... INFO : Running command set default-runtime kv kinematics.externals='{"type":"constant","data":{"momenta":[[32.0,0.0,0.0,32.0],[32.0,0.0,0.0,-32.0]],"helicities":[1,1]}}'
28.44 s
gammaloop-nextest-python-api> [2026-09-01 10:05:46.473] @gammaloop_api::se... INFO : Running command set default-runtime kv subtraction.disable_threshold_subtraction=true
28.44 s
gammaloop-nextest-python-api> [2026-09-01 10:05:46.474] @gammaloop_api::se... INFO : Running command generate xs e+ e- > d d~ g | e- a d g QED^2==4 [{{2}} QCD=0] --numerator-grouping group_identical_graphs_up_to_sign --clear-existing-processes --only-diagrams
28.44 s
gammaloop-nextest-python-api> [2026-09-01 10:05:46.476] @feyngen::diagram_... INFO : 0s | Δ=0s | Starting Feynman graph generation with Symbolica...
28.44 s
gammaloop-nextest-python-api> [2026-09-01 10:05:46.479] @feyngen::diagram_... INFO : 0s | Δ=0s | Number of graphs resulting from Symbolica generation: 246
28.44 s
gammaloop-nextest-python-api> [2026-09-01 10:05:46.481] @feyngen::diagram_... INFO : 0s | Δ=0s | Number of graphs retained after enforcing supergraph particle content: 8
28.44 s
gammaloop-nextest-python-api> [2026-09-01 10:05:46.484] @feyngen::diagram_... INFO : 0s | Δ=0s | Number of graphs retained after removal of vetoed topologies: 8
28.44 s
gammaloop-nextest-python-api> [2026-09-01 10:05:46.484] @feyngen::diagram_... INFO : 0s | Δ=0s | Number of graphs after vertex info assignment: 8
28.44 s
gammaloop-nextest-python-api> [2026-09-01 10:05:46.484] @feyngen::diagram_... INFO : 0s | Δ=0s | Number of graphs after all complete graphs filters are applied: 8
28.44 s
gammaloop-nextest-python-api>
28.44 s
gammaloop-nextest-python-api>
28.44 s
gammaloop-nextest-python-api> Location:
28.44 s
gammaloop-nextest-python-api> tests/tests/test_python_api.rs:156:20
28.44 s
gammaloop-nextest-python-api> system-out
28.44 s
gammaloop-nextest-python-api> running 1 test
28.44 s
gammaloop-nextest-python-api> test python_evaluate_sample_preserves_graph_grouping_and_incoming_pdgs ... FAILED
28.44 s
gammaloop-nextest-python-api>
28.44 s
gammaloop-nextest-python-api> failures:
28.44 s
gammaloop-nextest-python-api>
28.44 s
gammaloop-nextest-python-api> failures:
28.44 s
gammaloop-nextest-python-api> python_evaluate_sample_preserves_graph_grouping_and_incoming_pdgs
28.44 s
gammaloop-nextest-python-api>
28.44 s
gammaloop-nextest-python-api> test result: FAILED. 0 passed; 1 failed; 0 ignored; 0 measured; 4 filtered out; finished in 0.34s
28.44 s
gammaloop-nextest-python-api> system-err
28.44 s
gammaloop-nextest-python-api> Error: Python API test subprocess failed.
28.44 s
gammaloop-nextest-python-api> stdout:
28.44 s
gammaloop-nextest-python-api> ┌────────────────────────────────────────────────────────┐
28.44 s
gammaloop-nextest-python-api> │ You are running a restricted Symbolica instance. │
28.44 s
gammaloop-nextest-python-api> │ │
28.44 s
gammaloop-nextest-python-api> │ This mode is only permitted for non-commercial use and │
28.44 s
gammaloop-nextest-python-api> │ is limited to one instance and core per machine. │
28.44 s
gammaloop-nextest-python-api> │ │
28.44 s
gammaloop-nextest-python-api> │ Hobbyists can easily acquire a free license key │
28.44 s
gammaloop-nextest-python-api> │ that unlocks all cores and removes this banner: │
28.44 s
gammaloop-nextest-python-api> │ │
28.44 s
gammaloop-nextest-python-api> │ from symbolica import * │
28.44 s
gammaloop-nextest-python-api> │ request_hobbyist_license('YOUR_NAME', 'YOUR_EMAIL') │
28.44 s
gammaloop-nextest-python-api> │ │
28.44 s
gammaloop-nextest-python-api> │ All other users can obtain a free 30-day trial key: │
28.44 s
gammaloop-nextest-python-api> │ │
28.44 s
gammaloop-nextest-python-api> │ from symbolica import * │
28.44 s
gammaloop-nextest-python-api> │ request_trial_license('NAME', 'EMAIL', 'EMPLOYER') │
28.44 s
gammaloop-nextest-python-api> │ │
28.44 s
gammaloop-nextest-python-api> │ See https://symbolica.io/docs/get_started.html#license │
28.44 s
gammaloop-nextest-python-api> └────────────────────────────────────────────────────────┘
28.44 s
gammaloop-nextest-python-api> ┌───────────────────────────────────────────────────────────────────────────────────────────────────────────┐
28.44 s
gammaloop-nextest-python-api> │ Cannot start new unlicensed Symbolica instance since there is already another one running on the machine. │
28.44 s
gammaloop-nextest-python-api> └───────────────────────────────────────────────────────────────────────────────────────────────────────────┘
28.44 s
gammaloop-nextest-python-api>
28.44 s
gammaloop-nextest-python-api> stderr:
28.44 s
gammaloop-nextest-python-api> ┌───────────────────────────────────┐
28.44 s
gammaloop-nextest-python-api> │ The Symbolica license has expired │
28.44 s
gammaloop-nextest-python-api> └───────────────────────────────────┘
28.44 s
gammaloop-nextest-python-api> [2026-09-01 10:05:46.432] @gammaloop_api::se... INFO : Running command import model sm-default
28.44 s
gammaloop-nextest-python-api> [2026-09-01 10:05:46.432] @import::model INFO : Loading built-in JSON model sm-default
28.44 s
gammaloop-nextest-python-api> [2026-09-01 10:05:46.471] @gammalooprs::model INFO : The following 15 external parameters were forced to zero by the restriction card:
28.44 s
gammaloop-nextest-python-api> lamWS, AWS, rhoWS, etaWS, ymc, yme, ymm, MC, Me, MM, WTau, muQ, muLe, muLmu, muLtau
28.44 s
gammaloop-nextest-python-api> [2026-09-01 10:05:46.472] @gammalooprs::model INFO : The following 34 vertex rules were removed by the restriction card:
28.44 s
gammaloop-nextest-python-api> V_82 -> (c~, d, G+) | V_83 -> (t~, d, G+) | V_84 -> (c~, s, G+) | V_85 -> (t~, s, G+) | V_86 -> (u~, b, G+) | V_87 -> (c~, b, G+) | V_90 -> (c~, d, W+) | V_91 -> (t~, d, W+) | V_92 -> (u~, s, W+) | V_94 -> (t~, s, W+) | V_95 -> (u~, b, W+) | V_96 -> (c~, b, W+) | V_101 -> (e+, e-, G0) | V_102 -> (mu+, mu-, G0) | V_104 -> (e+, e-, H) | V_105 -> (mu+, mu-, H) | V_110 -> (ve~, e-, G+) | V_111 -> (vm~, mu-, G+) | V_116 -> (b~, u, G-) | V_117 -> (d~, c, G-) | V_118 -> (s~, c, G-) | V_119 -> (b~, c, G-) | V_120 -> (d~, t, G-) | V_121 -> (s~, t, G-) | V_124 -> (s~, u, W-) | V_125 -> (b~, u, W-) | V_126 -> (d~, c, W-) | V_128 -> (b~, c, W-) | V_129 -> (d~, t, W-) | V_130 -> (s~, t, W-) | V_138 -> (c~, c, G0) | V_140 -> (c~, c, H) | V_145 -> (e+, ve, G-) | V_146 -> (mu+, vm, G-)
28.44 s
gammaloop-nextest-python-api> [2026-09-01 10:05:46.472] @gammalooprs::model INFO : The following 36 couplings were removed by the restriction card:
28.44 s
gammaloop-nextest-python-api> GC_13, GC_14, GC_16, GC_17, GC_18, GC_19, GC_20, GC_22, GC_23, GC_24, GC_25, GC_26, GC_28, GC_29, GC_42, GC_43, GC_44, GC_46, GC_47, GC_48, GC_84, GC_85, GC_86, GC_87, GC_88, GC_89, GC_90, GC_91, GC_92, GC_93, GC_101, GC_102, GC_103, GC_105, GC_106, GC_107
28.44 s
gammaloop-nextest-python-api> [2026-09-01 10:05:46.472] @gammaloop_api::se... INFO : Running command set default-runtime kv kinematics.externals='{"type":"constant","data":{"momenta":[[32.0,0.0,0.0,32.0],[32.0,0.0,0.0,-32.0]],"helicities":[1,1]}}'
28.44 s
gammaloop-nextest-python-api> [2026-09-01 10:05:46.473] @gammaloop_api::se... INFO : Running command set default-runtime kv subtraction.disable_threshold_subtraction=true
28.44 s
gammaloop-nextest-python-api> [2026-09-01 10:05:46.474] @gammaloop_api::se... INFO : Running command generate xs e+ e- > d d~ g | e- a d g QED^2==4 [{{2}} QCD=0] --numerator-grouping group_identical_graphs_up_to_sign --clear-existing-processes --only-diagrams
28.44 s
gammaloop-nextest-python-api> [2026-09-01 10:05:46.476] @feyngen::diagram_... INFO : 0s | Δ=0s | Starting Feynman graph generation with Symbolica...
28.44 s
gammaloop-nextest-python-api> [2026-09-01 10:05:46.479] @feyngen::diagram_... INFO : 0s | Δ=0s | Number of graphs resulting from Symbolica generation: 246
28.44 s
gammaloop-nextest-python-api> [2026-09-01 10:05:46.481] @feyngen::diagram_... INFO : 0s | Δ=0s | Number of graphs retained after enforcing supergraph particle content: 8
28.44 s
gammaloop-nextest-python-api> [2026-09-01 10:05:46.484] @feyngen::diagram_... INFO : 0s | Δ=0s | Number of graphs retained after removal of vetoed topologies: 8
28.44 s
gammaloop-nextest-python-api> [2026-09-01 10:05:46.484] @feyngen::diagram_... INFO : 0s | Δ=0s | Number of graphs after vertex info assignment: 8
28.44 s
gammaloop-nextest-python-api> [2026-09-01 10:05:46.484] @feyngen::diagram_... INFO : 0s | Δ=0s | Number of graphs after all complete graphs filters are applied: 8
28.44 s
gammaloop-nextest-python-api>
28.44 s
gammaloop-nextest-python-api>
28.44 s
gammaloop-nextest-python-api> Location:
28.44 s
gammaloop-nextest-python-api> tests/tests/test_python_api.rs:156:20
28.44 s
gammaloop-nextest-python-api>
28.44 s
gammaloop-nextest-python-api> 5. gammaloop-integration-tests::test_python_api::python_settings_wrappers_expose_nested_runtime_and_global_settings
28.44 s
gammaloop-nextest-python-api> failure: test failure with exit code 101
28.44 s
gammaloop-nextest-python-api> Error: Python API test subprocess failed.
28.44 s
gammaloop-nextest-python-api> stdout:
28.44 s
gammaloop-nextest-python-api> ┌────────────────────────────────────────────────────────┐
28.44 s
gammaloop-nextest-python-api> │ You are running a restricted Symbolica instance. │
28.44 s
gammaloop-nextest-python-api> │ │
28.44 s
gammaloop-nextest-python-api> │ This mode is only permitted for non-commercial use and │
28.44 s
gammaloop-nextest-python-api> │ is limited to one instance and core per machine. │
28.44 s
gammaloop-nextest-python-api> │ │
28.44 s
gammaloop-nextest-python-api> │ Hobbyists can easily acquire a free license key │
28.44 s
gammaloop-nextest-python-api> │ that unlocks all cores and removes this banner: │
28.44 s
gammaloop-nextest-python-api> │ │
28.44 s
gammaloop-nextest-python-api> │ from symbolica import * │
28.44 s
gammaloop-nextest-python-api> │ request_hobbyist_license('YOUR_NAME', 'YOUR_EMAIL') │
28.44 s
gammaloop-nextest-python-api> │ │
28.44 s
gammaloop-nextest-python-api> │ All other users can obtain a free 30-day trial key: │
28.44 s
gammaloop-nextest-python-api> │ │
28.44 s
gammaloop-nextest-python-api> │ from symbolica import * │
28.44 s
gammaloop-nextest-python-api> │ request_trial_license('NAME', 'EMAIL', 'EMPLOYER') │
28.44 s
gammaloop-nextest-python-api> │ │
28.44 s
gammaloop-nextest-python-api> │ See https://symbolica.io/docs/get_started.html#license │
28.44 s
gammaloop-nextest-python-api> └────────────────────────────────────────────────────────┘
28.44 s
gammaloop-nextest-python-api> ┌───────────────────────────────────────────────────────────────────────────────────────────────────────────┐
28.44 s
gammaloop-nextest-python-api> │ Cannot start new unlicensed Symbolica instance since there is already another one running on the machine. │
28.44 s
gammaloop-nextest-python-api> └───────────────────────────────────────────────────────────────────────────────────────────────────────────┘
28.44 s
gammaloop-nextest-python-api>
28.44 s
gammaloop-nextest-python-api> stderr:
28.44 s
gammaloop-nextest-python-api> ┌───────────────────────────────────┐
28.44 s
gammaloop-nextest-python-api> │ The Symbolica license has expired │
28.44 s
gammaloop-nextest-python-api> └───────────────────────────────────┘
28.44 s
gammaloop-nextest-python-api>
28.44 s
gammaloop-nextest-python-api>
28.44 s
gammaloop-nextest-python-api> Location:
28.44 s
gammaloop-nextest-python-api> tests/tests/test_python_api.rs:156:20
28.44 s
gammaloop-nextest-python-api> system-out
28.44 s
gammaloop-nextest-python-api> running 1 test
28.44 s
gammaloop-nextest-python-api> test python_settings_wrappers_expose_nested_runtime_and_global_settings ... FAILED
28.44 s
gammaloop-nextest-python-api>
28.44 s
gammaloop-nextest-python-api> failures:
28.44 s
gammaloop-nextest-python-api>
28.44 s
gammaloop-nextest-python-api> failures:
28.44 s
gammaloop-nextest-python-api> python_settings_wrappers_expose_nested_runtime_and_global_settings
28.44 s
gammaloop-nextest-python-api>
28.44 s
gammaloop-nextest-python-api> test result: FAILED. 0 passed; 1 failed; 0 ignored; 0 measured; 4 filtered out; finished in 0.57s
28.44 s
gammaloop-nextest-python-api> system-err
28.44 s
gammaloop-nextest-python-api> Error: Python API test subprocess failed.
28.44 s
gammaloop-nextest-python-api> stdout:
28.44 s
gammaloop-nextest-python-api> ┌────────────────────────────────────────────────────────┐
28.44 s
gammaloop-nextest-python-api> │ You are running a restricted Symbolica instance. │
28.44 s
gammaloop-nextest-python-api> │ │
28.44 s
gammaloop-nextest-python-api> │ This mode is only permitted for non-commercial use and │
28.44 s
gammaloop-nextest-python-api> │ is limited to one instance and core per machine. │
28.44 s
gammaloop-nextest-python-api> │ │
28.44 s
gammaloop-nextest-python-api> │ Hobbyists can easily acquire a free license key │
28.44 s
gammaloop-nextest-python-api> │ that unlocks all cores and removes this banner: │
28.44 s
gammaloop-nextest-python-api> │ │
28.44 s
gammaloop-nextest-python-api> │ from symbolica import * │
28.44 s
gammaloop-nextest-python-api> │ request_hobbyist_license('YOUR_NAME', 'YOUR_EMAIL') │
28.44 s
gammaloop-nextest-python-api> │ │
28.44 s
gammaloop-nextest-python-api> │ All other users can obtain a free 30-day trial key: │
28.44 s
gammaloop-nextest-python-api> │ │
28.44 s
gammaloop-nextest-python-api> │ from symbolica import * │
28.44 s
gammaloop-nextest-python-api> │ request_trial_license('NAME', 'EMAIL', 'EMPLOYER') │
28.44 s
gammaloop-nextest-python-api> │ │
28.44 s
gammaloop-nextest-python-api> │ See https://symbolica.io/docs/get_started.html#license │
28.44 s
gammaloop-nextest-python-api> └────────────────────────────────────────────────────────┘
28.44 s
gammaloop-nextest-python-api> ┌───────────────────────────────────────────────────────────────────────────────────────────────────────────┐
28.44 s
gammaloop-nextest-python-api> │ Cannot start new unlicensed Symbolica instance since there is already another one running on the machine. │
28.44 s
gammaloop-nextest-python-api> └───────────────────────────────────────────────────────────────────────────────────────────────────────────┘
28.44 s
gammaloop-nextest-python-api>
28.44 s
gammaloop-nextest-python-api> stderr:
28.44 s
gammaloop-nextest-python-api> ┌───────────────────────────────────┐
28.44 s
gammaloop-nextest-python-api> │ The Symbolica license has expired │
28.44 s
gammaloop-nextest-python-api> └───────────────────────────────────┘
28.44 s
gammaloop-nextest-python-api>
28.44 s
gammaloop-nextest-python-api>
28.44 s
gammaloop-nextest-python-api> Location:
28.44 s
gammaloop-nextest-python-api> tests/tests/test_python_api.rs:156:20
28.44 s
gammaloop-nextest-python-api> =========================================
28.50 s
[0 built (1 failed )]error: Cannot build '/nix/store/90vl6933shlgrvsg0q1k9hbam6pqxvdh-gammaloop-nextest-python-api.drv '.
28.50 s
Reason: builder failed with exit code 100 .
28.50 s
Output paths:
28.50 s
/nix/store/ghyr21i59xgm2lhlwag6cmm3fgmdax99-gammaloop-nextest-python-api
28.50 s
Last 961 log lines:
28.50 s
> Extracting 1 binary, 1 build script output directory, and 3 linked paths to /build/nextest-archive-FhUZtG
28.50 s
> Extracted 18 files to /build/nextest-archive-FhUZtG in 0.08s
28.50 s
> ------------
28.50 s
> Nextest run ID 7c853691-c126-4dcb-a0ad-e99c4eb0e33f with nextest profile: ci_gammaloop
28.50 s
> Starting 5 tests across 1 binary
28.50 s
> FAIL [ 0.234s] (1/5) gammaloop-integration-tests::test_python_api python_session_getters_return_live_toml_and_command_blocks
28.50 s
> stdout ---
28.50 s
>
28.50 s
> running 1 test
28.50 s
> test python_session_getters_return_live_toml_and_command_blocks ... FAILED
28.50 s
>
28.50 s
> failures:
28.50 s
>
28.50 s
> failures:
28.50 s
> python_session_getters_return_live_toml_and_command_blocks
28.50 s
>
28.50 s
> test result: FAILED. 0 passed; 1 failed; 0 ignored; 0 measured; 4 filtered out; finished in 0.22s
28.50 s
>
28.50 s
> stderr ---
28.50 s
> Error: Python API test subprocess failed.
28.50 s
> stdout:
28.50 s
> ┌────────────────────────────────────────────────────────┐
28.50 s
> │ You are running a restricted Symbolica instance. │
28.50 s
> │ │
28.50 s
> │ This mode is only permitted for non-commercial use and │
28.50 s
> │ is limited to one instance and core per machine. │
28.50 s
> │ │
28.50 s
> │ Hobbyists can easily acquire a free license key │
28.50 s
> │ that unlocks all cores and removes this banner: │
28.50 s
> │ │
28.50 s
> │ from symbolica import * │
28.50 s
> │ request_hobbyist_license('YOUR_NAME', 'YOUR_EMAIL') │
28.50 s
> │ │
28.50 s
> │ All other users can obtain a free 30-day trial key: │
28.50 s
> │ │
28.50 s
> │ from symbolica import * │
28.50 s
> │ request_trial_license('NAME', 'EMAIL', 'EMPLOYER') │
28.50 s
> │ │
28.50 s
> │ See https://symbolica.io/docs/get_started.html#license │
28.50 s
> └────────────────────────────────────────────────────────┘
28.50 s
> ┌───────────────────────────────────────────────────────────────────────────────────────────────────────────┐
28.50 s
> │ Cannot start new unlicensed Symbolica instance since there is already another one running on the machine. │
28.51 s
> └───────────────────────────────────────────────────────────────────────────────────────────────────────────┘
28.51 s
>
28.51 s
> stderr:
28.51 s
> ┌───────────────────────────────────┐
28.51 s
> │ The Symbolica license has expired │
28.51 s
> └───────────────────────────────────┘
28.51 s
>
28.51 s
>
28.51 s
> Location:
28.51 s
> tests/tests/test_python_api.rs:156:20
28.51 s
>
28.51 s
> FAIL [ 0.257s] (2/5) gammaloop-integration-tests::test_python_api python_evaluate_samples_batch_and_momentum_space_have_expected_shape
28.51 s
> stdout ---
28.51 s
>
28.51 s
> running 1 test
28.51 s
> test python_evaluate_samples_batch_and_momentum_space_have_expected_shape ... FAILED
28.51 s
>
28.51 s
> failures:
28.51 s
>
28.51 s
> failures:
28.51 s
> python_evaluate_samples_batch_and_momentum_space_have_expected_shape
28.51 s
>
28.51 s
> test result: FAILED. 0 passed; 1 failed; 0 ignored; 0 measured; 4 filtered out; finished in 0.25s
28.51 s
>
28.51 s
> stderr ---
28.51 s
> Error: Python API test subprocess failed.
28.51 s
> stdout:
28.51 s
> ┌────────────────────────────────────────────────────────┐
28.51 s
> │ You are running a restricted Symbolica instance. │
28.51 s
> │ │
28.51 s
> │ This mode is only permitted for non-commercial use and │
28.51 s
> │ is limited to one instance and core per machine. │
28.51 s
> │ │
28.51 s
> │ Hobbyists can easily acquire a free license key │
28.51 s
> │ that unlocks all cores and removes this banner: │
28.51 s
> │ │
28.51 s
> │ from symbolica import * │
28.51 s
> │ request_hobbyist_license('YOUR_NAME', 'YOUR_EMAIL') │
28.51 s
> │ │
28.51 s
> │ All other users can obtain a free 30-day trial key: │
28.51 s
> │ │
28.51 s
> │ from symbolica import * │
28.51 s
> │ request_trial_license('NAME', 'EMAIL', 'EMPLOYER') │
28.51 s
> │ │
28.51 s
> │ See https://symbolica.io/docs/get_started.html#license │
28.51 s
> └────────────────────────────────────────────────────────┘
28.51 s
> ┌───────────────────────────────────────────────────────────────────────────────────────────────────────────┐
28.51 s
> │ Cannot start new unlicensed Symbolica instance since there is already another one running on the machine. │
28.51 s
> └───────────────────────────────────────────────────────────────────────────────────────────────────────────┘
28.51 s
>
28.51 s
> stderr:
28.51 s
> ┌───────────────────────────────────┐
28.51 s
> │ The Symbolica license has expired │
28.51 s
> └───────────────────────────────────┘
28.51 s
>
28.51 s
>
28.51 s
> Location:
28.51 s
> tests/tests/test_python_api.rs:156:20
28.51 s
>
28.51 s
> FAIL [ 0.296s] (3/5) gammaloop-integration-tests::test_python_api python_evaluate_sample_honors_generate_events_and_observable_snapshots
28.51 s
> stdout ---
28.51 s
>
28.51 s
> running 1 test
28.51 s
> test python_evaluate_sample_honors_generate_events_and_observable_snapshots ... FAILED
28.51 s
>
28.51 s
> failures:
28.51 s
>
28.51 s
> failures:
28.51 s
> python_evaluate_sample_honors_generate_events_and_observable_snapshots
28.51 s
>
28.51 s
> test result: FAILED. 0 passed; 1 failed; 0 ignored; 0 measured; 4 filtered out; finished in 0.29s
28.51 s
>
28.51 s
> stderr ---
28.51 s
> Error: Python API test subprocess failed.
28.51 s
> stdout:
28.51 s
> ┌────────────────────────────────────────────────────────┐
28.51 s
> │ You are running a restricted Symbolica instance. │
28.51 s
> │ │
28.51 s
> │ This mode is only permitted for non-commercial use and │
28.51 s
> │ is limited to one instance and core per machine. │
28.51 s
> │ │
28.51 s
> │ Hobbyists can easily acquire a free license key │
28.51 s
> │ that unlocks all cores and removes this banner: │
28.51 s
> │ │
28.51 s
> │ from symbolica import * │
28.51 s
> │ request_hobbyist_license('YOUR_NAME', 'YOUR_EMAIL') │
28.51 s
> │ │
28.51 s
> │ All other users can obtain a free 30-day trial key: │
28.51 s
> │ │
28.51 s
> │ from symbolica import * │
28.51 s
> │ request_trial_license('NAME', 'EMAIL', 'EMPLOYER') │
28.51 s
> │ │
28.51 s
> │ See https://symbolica.io/docs/get_started.html#license │
28.51 s
> └────────────────────────────────────────────────────────┘
28.51 s
> ┌───────────────────────────────────────────────────────────────────────────────────────────────────────────┐
28.51 s
> │ Cannot start new unlicensed Symbolica instance since there is already another one running on the machine. │
28.51 s
> └───────────────────────────────────────────────────────────────────────────────────────────────────────────┘
28.51 s
>
28.51 s
> stderr:
28.51 s
> ┌───────────────────────────────────┐
28.51 s
> │ The Symbolica license has expired │
28.51 s
> └───────────────────────────────────┘
28.51 s
>
28.51 s
>
28.51 s
> Location:
28.51 s
> tests/tests/test_python_api.rs:156:20
28.51 s
>
28.51 s
> FAIL [ 0.346s] (4/5) gammaloop-integration-tests::test_python_api python_evaluate_sample_preserves_graph_grouping_and_incoming_pdgs
28.51 s
> stdout ---
28.51 s
>
28.51 s
> running 1 test
28.51 s
> test python_evaluate_sample_preserves_graph_grouping_and_incoming_pdgs ... FAILED
28.51 s
>
28.51 s
> failures:
28.51 s
>
28.51 s
> failures:
28.51 s
> python_evaluate_sample_preserves_graph_grouping_and_incoming_pdgs
28.51 s
>
28.51 s
> test result: FAILED. 0 passed; 1 failed; 0 ignored; 0 measured; 4 filtered out; finished in 0.34s
28.51 s
>
28.51 s
> stderr ---
28.51 s
> Error: Python API test subprocess failed.
28.51 s
> stdout:
28.51 s
> ┌────────────────────────────────────────────────────────┐
28.51 s
> │ You are running a restricted Symbolica instance. │
28.51 s
> │ │
28.51 s
> │ This mode is only permitted for non-commercial use and │
28.51 s
> │ is limited to one instance and core per machine. │
28.51 s
> │ │
28.51 s
> │ Hobbyists can easily acquire a free license key │
28.51 s
> │ that unlocks all cores and removes this banner: │
28.51 s
> │ │
28.51 s
> │ from symbolica import * │
28.51 s
> │ request_hobbyist_license('YOUR_NAME', 'YOUR_EMAIL') │
28.51 s
> │ │
28.51 s
> │ All other users can obtain a free 30-day trial key: │
28.51 s
> │ │
28.51 s
> │ from symbolica import * │
28.51 s
> │ request_trial_license('NAME', 'EMAIL', 'EMPLOYER') │
28.51 s
> │ │
28.51 s
> │ See https://symbolica.io/docs/get_started.html#license │
28.51 s
> └────────────────────────────────────────────────────────┘
28.51 s
> ┌───────────────────────────────────────────────────────────────────────────────────────────────────────────┐
28.51 s
> │ Cannot start new unlicensed Symbolica instance since there is already another one running on the machine. │
28.51 s
> └───────────────────────────────────────────────────────────────────────────────────────────────────────────┘
28.51 s
>
28.51 s
> stderr:
28.51 s
> ┌───────────────────────────────────┐
28.51 s
> │ The Symbolica license has expired │
28.51 s
> └───────────────────────────────────┘
28.51 s
> [2026-09-01 10:05:46.432] @gammaloop_api::se... INFO : Running command import model sm-default
28.51 s
> [2026-09-01 10:05:46.432] @import::model INFO : Loading built-in JSON model sm-default
28.51 s
> [2026-09-01 10:05:46.471] @gammalooprs::model INFO : The following 15 external parameters were forced to zero by the restriction card:
28.51 s
> lamWS, AWS, rhoWS, etaWS, ymc, yme, ymm, MC, Me, MM, WTau, muQ, muLe, muLmu, muLtau
28.51 s
> [2026-09-01 10:05:46.472] @gammalooprs::model INFO : The following 34 vertex rules were removed by the restriction card:
28.51 s
> V_82 -> (c~, d, G+) | V_83 -> (t~, d, G+) | V_84 -> (c~, s, G+) | V_85 -> (t~, s, G+) | V_86 -> (u~, b, G+) | V_87 -> (c~, b, G+) | V_90 -> (c~, d, W+) | V_91 -> (t~, d, W+) | V_92 -> (u~, s, W+) | V_94 -> (t~, s, W+) | V_95 -> (u~, b, W+) | V_96 -> (c~, b, W+) | V_101 -> (e+, e-, G0) | V_102 -> (mu+, mu-, G0) | V_104 -> (e+, e-, H) | V_105 -> (mu+, mu-, H) | V_110 -> (ve~, e-, G+) | V_111 -> (vm~, mu-, G+) | V_116 -> (b~, u, G-) | V_117 -> (d~, c, G-) | V_118 -> (s~, c, G-) | V_119 -> (b~, c, G-) | V_120 -> (d~, t, G-) | V_121 -> (s~, t, G-) | V_124 -> (s~, u, W-) | V_125 -> (b~, u, W-) | V_126 -> (d~, c, W-) | V_128 -> (b~, c, W-) | V_129 -> (d~, t, W-) | V_130 -> (s~, t, W-) | V_138 -> (c~, c, G0) | V_140 -> (c~, c, H) | V_145 -> (e+, ve, G-) | V_146 -> (mu+, vm, G-)
28.51 s
> [2026-09-01 10:05:46.472] @gammalooprs::model INFO : The following 36 couplings were removed by the restriction card:
28.51 s
> GC_13, GC_14, GC_16, GC_17, GC_18, GC_19, GC_20, GC_22, GC_23, GC_24, GC_25, GC_26, GC_28, GC_29, GC_42, GC_43, GC_44, GC_46, GC_47, GC_48, GC_84, GC_85, GC_86, GC_87, GC_88, GC_89, GC_90, GC_91, GC_92, GC_93, GC_101, GC_102, GC_103, GC_105, GC_106, GC_107
28.51 s
> [2026-09-01 10:05:46.472] @gammaloop_api::se... INFO : Running command set default-runtime kv kinematics.externals='{"type":"constant","data":{"momenta":[[32.0,0.0,0.0,32.0],[32.0,0.0,0.0,-32.0]],"helicities":[1,1]}}'
28.51 s
> [2026-09-01 10:05:46.473] @gammaloop_api::se... INFO : Running command set default-runtime kv subtraction.disable_threshold_subtraction=true
28.51 s
> [2026-09-01 10:05:46.474] @gammaloop_api::se... INFO : Running command generate xs e+ e- > d d~ g | e- a d g QED^2==4 [{{2}} QCD=0] --numerator-grouping group_identical_graphs_up_to_sign --clear-existing-processes --only-diagrams
28.51 s
> [2026-09-01 10:05:46.476] @feyngen::diagram_... INFO : 0s | Δ=0s | Starting Feynman graph generation with Symbolica...
28.51 s
> [2026-09-01 10:05:46.479] @feyngen::diagram_... INFO : 0s | Δ=0s | Number of graphs resulting from Symbolica generation: 246
28.51 s
> [2026-09-01 10:05:46.481] @feyngen::diagram_... INFO : 0s | Δ=0s | Number of graphs retained after enforcing supergraph particle content: 8
28.51 s
> [2026-09-01 10:05:46.484] @feyngen::diagram_... INFO : 0s | Δ=0s | Number of graphs retained after removal of vetoed topologies: 8
28.51 s
> [2026-09-01 10:05:46.484] @feyngen::diagram_... INFO : 0s | Δ=0s | Number of graphs after vertex info assignment: 8
28.51 s
> [2026-09-01 10:05:46.484] @feyngen::diagram_... INFO : 0s | Δ=0s | Number of graphs after all complete graphs filters are applied: 8
28.51 s
>
28.51 s
>
28.51 s
> Location:
28.51 s
> tests/tests/test_python_api.rs:156:20
28.51 s
>
28.51 s
> FAIL [ 0.573s] (5/5) gammaloop-integration-tests::test_python_api python_settings_wrappers_expose_nested_runtime_and_global_settings
28.51 s
> stdout ---
28.51 s
>
28.51 s
> running 1 test
28.51 s
> test python_settings_wrappers_expose_nested_runtime_and_global_settings ... FAILED
28.51 s
>
28.51 s
> failures:
28.51 s
>
28.51 s
> failures:
28.51 s
> python_settings_wrappers_expose_nested_runtime_and_global_settings
28.51 s
>
28.51 s
> test result: FAILED. 0 passed; 1 failed; 0 ignored; 0 measured; 4 filtered out; finished in 0.57s
28.51 s
>
28.51 s
> stderr ---
28.51 s
> Error: Python API test subprocess failed.
28.51 s
> stdout:
28.51 s
> ┌────────────────────────────────────────────────────────┐
28.51 s
> │ You are running a restricted Symbolica instance. │
28.51 s
> │ │
28.51 s
> │ This mode is only permitted for non-commercial use and │
28.51 s
> │ is limited to one instance and core per machine. │
28.51 s
> │ │
28.51 s
> │ Hobbyists can easily acquire a free license key │
28.51 s
> │ that unlocks all cores and removes this banner: │
28.51 s
> │ │
28.51 s
> │ from symbolica import * │
28.51 s
> │ request_hobbyist_license('YOUR_NAME', 'YOUR_EMAIL') │
28.51 s
> │ │
28.51 s
> │ All other users can obtain a free 30-day trial key: │
28.51 s
> │ │
28.51 s
> │ from symbolica import * │
28.51 s
> │ request_trial_license('NAME', 'EMAIL', 'EMPLOYER') │
28.51 s
> │ │
28.51 s
> │ See https://symbolica.io/docs/get_started.html#license │
28.51 s
> └────────────────────────────────────────────────────────┘
28.51 s
> ┌───────────────────────────────────────────────────────────────────────────────────────────────────────────┐
28.51 s
> │ Cannot start new unlicensed Symbolica instance since there is already another one running on the machine. │
28.51 s
> └───────────────────────────────────────────────────────────────────────────────────────────────────────────┘
28.51 s
>
28.51 s
> stderr:
28.51 s
> ┌───────────────────────────────────┐
28.51 s
> │ The Symbolica license has expired │
28.51 s
> └───────────────────────────────────┘
28.51 s
>
28.51 s
>
28.51 s
> Location:
28.51 s
> tests/tests/test_python_api.rs:156:20
28.51 s
>
28.51 s
> ------------
28.51 s
> Summary [ 0.576s] 5 tests run: 0 passed , 5 failed , 0 skipped
28.51 s
> FAIL [ 0.234s] (1/5) gammaloop-integration-tests::test_python_api python_session_getters_return_live_toml_and_command_blocks
28.51 s
> stdout ---
28.51 s
>
28.51 s
> running 1 test
28.51 s
> test python_session_getters_return_live_toml_and_command_blocks ... FAILED
28.51 s
>
28.51 s
> failures:
28.51 s
>
28.51 s
> failures:
28.51 s
> python_session_getters_return_live_toml_and_command_blocks
28.51 s
>
28.51 s
> test result: FAILED. 0 passed; 1 failed; 0 ignored; 0 measured; 4 filtered out; finished in 0.22s
28.51 s
>
28.51 s
> stderr ---
28.51 s
> Error: Python API test subprocess failed.
28.51 s
> stdout:
28.51 s
> ┌────────────────────────────────────────────────────────┐
28.51 s
> │ You are running a restricted Symbolica instance. │
28.51 s
> │ │
28.51 s
> │ This mode is only permitted for non-commercial use and │
28.51 s
> │ is limited to one instance and core per machine. │
28.51 s
> │ │
28.51 s
> │ Hobbyists can easily acquire a free license key │
28.51 s
> │ that unlocks all cores and removes this banner: │
28.51 s
> │ │
28.51 s
> │ from symbolica import * │
28.51 s
> │ request_hobbyist_license('YOUR_NAME', 'YOUR_EMAIL') │
28.51 s
> │ │
28.51 s
> │ All other users can obtain a free 30-day trial key: │
28.51 s
> │ │
28.51 s
> │ from symbolica import * │
28.51 s
> │ request_trial_license('NAME', 'EMAIL', 'EMPLOYER') │
28.51 s
> │ │
28.51 s
> │ See https://symbolica.io/docs/get_started.html#license │
28.51 s
> └────────────────────────────────────────────────────────┘
28.51 s
> ┌───────────────────────────────────────────────────────────────────────────────────────────────────────────┐
28.51 s
> │ Cannot start new unlicensed Symbolica instance since there is already another one running on the machine. │
28.51 s
> └───────────────────────────────────────────────────────────────────────────────────────────────────────────┘
28.51 s
>
28.51 s
> stderr:
28.51 s
> ┌───────────────────────────────────┐
28.51 s
> │ The Symbolica license has expired │
28.51 s
> └───────────────────────────────────┘
28.51 s
>
28.51 s
>
28.51 s
> Location:
28.51 s
> tests/tests/test_python_api.rs:156:20
28.51 s
>
28.51 s
> FAIL [ 0.257s] (2/5) gammaloop-integration-tests::test_python_api python_evaluate_samples_batch_and_momentum_space_have_expected_shape
28.51 s
> stdout ---
28.51 s
>
28.51 s
> running 1 test
28.51 s
> test python_evaluate_samples_batch_and_momentum_space_have_expected_shape ... FAILED
28.51 s
>
28.51 s
> failures:
28.51 s
>
28.51 s
> failures:
28.51 s
> python_evaluate_samples_batch_and_momentum_space_have_expected_shape
28.51 s
>
28.51 s
> test result: FAILED. 0 passed; 1 failed; 0 ignored; 0 measured; 4 filtered out; finished in 0.25s
28.51 s
>
28.51 s
> stderr ---
28.51 s
> Error: Python API test subprocess failed.
28.51 s
> stdout:
28.51 s
> ┌────────────────────────────────────────────────────────┐
28.51 s
> │ You are running a restricted Symbolica instance. │
28.51 s
> │ │
28.51 s
> │ This mode is only permitted for non-commercial use and │
28.51 s
> │ is limited to one instance and core per machine. │
28.51 s
> │ │
28.51 s
> │ Hobbyists can easily acquire a free license key │
28.51 s
> │ that unlocks all cores and removes this banner: │
28.51 s
> │ │
28.51 s
> │ from symbolica import * │
28.51 s
> │ request_hobbyist_license('YOUR_NAME', 'YOUR_EMAIL') │
28.51 s
> │ │
28.51 s
> │ All other users can obtain a free 30-day trial key: │
28.51 s
> │ │
28.51 s
> │ from symbolica import * │
28.51 s
> │ request_trial_license('NAME', 'EMAIL', 'EMPLOYER') │
28.51 s
> │ │
28.51 s
> │ See https://symbolica.io/docs/get_started.html#license │
28.51 s
> └────────────────────────────────────────────────────────┘
28.51 s
> ┌───────────────────────────────────────────────────────────────────────────────────────────────────────────┐
28.51 s
> │ Cannot start new unlicensed Symbolica instance since there is already another one running on the machine. │
28.51 s
> └───────────────────────────────────────────────────────────────────────────────────────────────────────────┘
28.51 s
>
28.51 s
> stderr:
28.51 s
> ┌───────────────────────────────────┐
28.51 s
> │ The Symbolica license has expired │
28.51 s
> └───────────────────────────────────┘
28.51 s
>
28.51 s
>
28.51 s
> Location:
28.51 s
> tests/tests/test_python_api.rs:156:20
28.51 s
>
28.51 s
> FAIL [ 0.296s] (3/5) gammaloop-integration-tests::test_python_api python_evaluate_sample_honors_generate_events_and_observable_snapshots
28.51 s
> stdout ---
28.51 s
>
28.51 s
> running 1 test
28.51 s
> test python_evaluate_sample_honors_generate_events_and_observable_snapshots ... FAILED
28.51 s
>
28.51 s
> failures:
28.51 s
>
28.51 s
> failures:
28.51 s
> python_evaluate_sample_honors_generate_events_and_observable_snapshots
28.51 s
>
28.51 s
> test result: FAILED. 0 passed; 1 failed; 0 ignored; 0 measured; 4 filtered out; finished in 0.29s
28.51 s
>
28.51 s
> stderr ---
28.51 s
> Error: Python API test subprocess failed.
28.51 s
> stdout:
28.51 s
> ┌────────────────────────────────────────────────────────┐
28.51 s
> │ You are running a restricted Symbolica instance. │
28.51 s
> │ │
28.51 s
> │ This mode is only permitted for non-commercial use and │
28.51 s
> │ is limited to one instance and core per machine. │
28.51 s
> │ │
28.51 s
> │ Hobbyists can easily acquire a free license key │
28.51 s
> │ that unlocks all cores and removes this banner: │
28.51 s
> │ │
28.51 s
> │ from symbolica import * │
28.51 s
> │ request_hobbyist_license('YOUR_NAME', 'YOUR_EMAIL') │
28.51 s
> │ │
28.51 s
> │ All other users can obtain a free 30-day trial key: │
28.51 s
> │ │
28.51 s
> │ from symbolica import * │
28.51 s
> │ request_trial_license('NAME', 'EMAIL', 'EMPLOYER') │
28.51 s
> │ │
28.51 s
> │ See https://symbolica.io/docs/get_started.html#license │
28.51 s
> └────────────────────────────────────────────────────────┘
28.51 s
> ┌───────────────────────────────────────────────────────────────────────────────────────────────────────────┐
28.51 s
> │ Cannot start new unlicensed Symbolica instance since there is already another one running on the machine. │
28.51 s
> └───────────────────────────────────────────────────────────────────────────────────────────────────────────┘
28.51 s
>
28.51 s
> stderr:
28.51 s
> ┌───────────────────────────────────┐
28.51 s
> │ The Symbolica license has expired │
28.51 s
> └───────────────────────────────────┘
28.51 s
>
28.51 s
>
28.51 s
> Location:
28.51 s
> tests/tests/test_python_api.rs:156:20
28.51 s
>
28.51 s
> FAIL [ 0.346s] (4/5) gammaloop-integration-tests::test_python_api python_evaluate_sample_preserves_graph_grouping_and_incoming_pdgs
28.51 s
> stdout ---
28.51 s
>
28.51 s
> running 1 test
28.51 s
> test python_evaluate_sample_preserves_graph_grouping_and_incoming_pdgs ... FAILED
28.51 s
>
28.51 s
> failures:
28.51 s
>
28.51 s
> failures:
28.51 s
> python_evaluate_sample_preserves_graph_grouping_and_incoming_pdgs
28.51 s
>
28.51 s
> test result: FAILED. 0 passed; 1 failed; 0 ignored; 0 measured; 4 filtered out; finished in 0.34s
28.51 s
>
28.51 s
> stderr ---
28.51 s
> Error: Python API test subprocess failed.
28.51 s
> stdout:
28.51 s
> ┌────────────────────────────────────────────────────────┐
28.51 s
> │ You are running a restricted Symbolica instance. │
28.51 s
> │ │
28.51 s
> │ This mode is only permitted for non-commercial use and │
28.51 s
> │ is limited to one instance and core per machine. │
28.51 s
> │ │
28.51 s
> │ Hobbyists can easily acquire a free license key │
28.51 s
> │ that unlocks all cores and removes this banner: │
28.51 s
> │ │
28.51 s
> │ from symbolica import * │
28.51 s
> │ request_hobbyist_license('YOUR_NAME', 'YOUR_EMAIL') │
28.51 s
> │ │
28.51 s
> │ All other users can obtain a free 30-day trial key: │
28.51 s
> │ │
28.51 s
> │ from symbolica import * │
28.51 s
> │ request_trial_license('NAME', 'EMAIL', 'EMPLOYER') │
28.51 s
> │ │
28.51 s
> │ See https://symbolica.io/docs/get_started.html#license │
28.51 s
> └────────────────────────────────────────────────────────┘
28.51 s
> ┌───────────────────────────────────────────────────────────────────────────────────────────────────────────┐
28.51 s
> │ Cannot start new unlicensed Symbolica instance since there is already another one running on the machine. │
28.51 s
> └───────────────────────────────────────────────────────────────────────────────────────────────────────────┘
28.51 s
>
28.51 s
> stderr:
28.51 s
> ┌───────────────────────────────────┐
28.51 s
> │ The Symbolica license has expired │
28.51 s
> └───────────────────────────────────┘
28.51 s
> [2026-09-01 10:05:46.432] @gammaloop_api::se... INFO : Running command import model sm-default
28.51 s
> [2026-09-01 10:05:46.432] @import::model INFO : Loading built-in JSON model sm-default
28.51 s
> [2026-09-01 10:05:46.471] @gammalooprs::model INFO : The following 15 external parameters were forced to zero by the restriction card:
28.51 s
> lamWS, AWS, rhoWS, etaWS, ymc, yme, ymm, MC, Me, MM, WTau, muQ, muLe, muLmu, muLtau
28.51 s
> [2026-09-01 10:05:46.472] @gammalooprs::model INFO : The following 34 vertex rules were removed by the restriction card:
28.51 s
> V_82 -> (c~, d, G+) | V_83 -> (t~, d, G+) | V_84 -> (c~, s, G+) | V_85 -> (t~, s, G+) | V_86 -> (u~, b, G+) | V_87 -> (c~, b, G+) | V_90 -> (c~, d, W+) | V_91 -> (t~, d, W+) | V_92 -> (u~, s, W+) | V_94 -> (t~, s, W+) | V_95 -> (u~, b, W+) | V_96 -> (c~, b, W+) | V_101 -> (e+, e-, G0) | V_102 -> (mu+, mu-, G0) | V_104 -> (e+, e-, H) | V_105 -> (mu+, mu-, H) | V_110 -> (ve~, e-, G+) | V_111 -> (vm~, mu-, G+) | V_116 -> (b~, u, G-) | V_117 -> (d~, c, G-) | V_118 -> (s~, c, G-) | V_119 -> (b~, c, G-) | V_120 -> (d~, t, G-) | V_121 -> (s~, t, G-) | V_124 -> (s~, u, W-) | V_125 -> (b~, u, W-) | V_126 -> (d~, c, W-) | V_128 -> (b~, c, W-) | V_129 -> (d~, t, W-) | V_130 -> (s~, t, W-) | V_138 -> (c~, c, G0) | V_140 -> (c~, c, H) | V_145 -> (e+, ve, G-) | V_146 -> (mu+, vm, G-)
28.51 s
> [2026-09-01 10:05:46.472] @gammalooprs::model INFO : The following 36 couplings were removed by the restriction card:
28.51 s
> GC_13, GC_14, GC_16, GC_17, GC_18, GC_19, GC_20, GC_22, GC_23, GC_24, GC_25, GC_26, GC_28, GC_29, GC_42, GC_43, GC_44, GC_46, GC_47, GC_48, GC_84, GC_85, GC_86, GC_87, GC_88, GC_89, GC_90, GC_91, GC_92, GC_93, GC_101, GC_102, GC_103, GC_105, GC_106, GC_107
28.51 s
> [2026-09-01 10:05:46.472] @gammaloop_api::se... INFO : Running command set default-runtime kv kinematics.externals='{"type":"constant","data":{"momenta":[[32.0,0.0,0.0,32.0],[32.0,0.0,0.0,-32.0]],"helicities":[1,1]}}'
28.51 s
> [2026-09-01 10:05:46.473] @gammaloop_api::se... INFO : Running command set default-runtime kv subtraction.disable_threshold_subtraction=true
28.52 s
> [2026-09-01 10:05:46.474] @gammaloop_api::se... INFO : Running command generate xs e+ e- > d d~ g | e- a d g QED^2==4 [{{2}} QCD=0] --numerator-grouping group_identical_graphs_up_to_sign --clear-existing-processes --only-diagrams
28.52 s
> [2026-09-01 10:05:46.476] @feyngen::diagram_... INFO : 0s | Δ=0s | Starting Feynman graph generation with Symbolica...
28.52 s
> [2026-09-01 10:05:46.479] @feyngen::diagram_... INFO : 0s | Δ=0s | Number of graphs resulting from Symbolica generation: 246
28.52 s
> [2026-09-01 10:05:46.481] @feyngen::diagram_... INFO : 0s | Δ=0s | Number of graphs retained after enforcing supergraph particle content: 8
28.52 s
> [2026-09-01 10:05:46.484] @feyngen::diagram_... INFO : 0s | Δ=0s | Number of graphs retained after removal of vetoed topologies: 8
28.52 s
> [2026-09-01 10:05:46.484] @feyngen::diagram_... INFO : 0s | Δ=0s | Number of graphs after vertex info assignment: 8
28.52 s
> [2026-09-01 10:05:46.484] @feyngen::diagram_... INFO : 0s | Δ=0s | Number of graphs after all complete graphs filters are applied: 8
28.52 s
>
28.52 s
>
28.52 s
> Location:
28.52 s
> tests/tests/test_python_api.rs:156:20
28.52 s
>
28.52 s
> FAIL [ 0.573s] (5/5) gammaloop-integration-tests::test_python_api python_settings_wrappers_expose_nested_runtime_and_global_settings
28.52 s
> stdout ---
28.52 s
>
28.52 s
> running 1 test
28.52 s
> test python_settings_wrappers_expose_nested_runtime_and_global_settings ... FAILED
28.52 s
>
28.52 s
> failures:
28.52 s
>
28.52 s
> failures:
28.52 s
> python_settings_wrappers_expose_nested_runtime_and_global_settings
28.52 s
>
28.52 s
> test result: FAILED. 0 passed; 1 failed; 0 ignored; 0 measured; 4 filtered out; finished in 0.57s
28.52 s
>
28.52 s
> stderr ---
28.52 s
> Error: Python API test subprocess failed.
28.52 s
> stdout:
28.52 s
> ┌────────────────────────────────────────────────────────┐
28.52 s
> │ You are running a restricted Symbolica instance. │
28.52 s
> │ │
28.52 s
> │ This mode is only permitted for non-commercial use and │
28.52 s
> │ is limited to one instance and core per machine. │
28.52 s
> │ │
28.52 s
> │ Hobbyists can easily acquire a free license key │
28.52 s
> │ that unlocks all cores and removes this banner: │
28.52 s
> │ │
28.52 s
> │ from symbolica import * │
28.52 s
> │ request_hobbyist_license('YOUR_NAME', 'YOUR_EMAIL') │
28.52 s
> │ │
28.52 s
> │ All other users can obtain a free 30-day trial key: │
28.52 s
> │ │
28.52 s
> │ from symbolica import * │
28.52 s
> │ request_trial_license('NAME', 'EMAIL', 'EMPLOYER') │
28.52 s
> │ │
28.52 s
> │ See https://symbolica.io/docs/get_started.html#license │
28.52 s
> └────────────────────────────────────────────────────────┘
28.52 s
> ┌───────────────────────────────────────────────────────────────────────────────────────────────────────────┐
28.52 s
> │ Cannot start new unlicensed Symbolica instance since there is already another one running on the machine. │
28.52 s
> └───────────────────────────────────────────────────────────────────────────────────────────────────────────┘
28.52 s
>
28.52 s
> stderr:
28.52 s
> ┌───────────────────────────────────┐
28.52 s
> │ The Symbolica license has expired │
28.52 s
> └───────────────────────────────────┘
28.52 s
>
28.52 s
>
28.52 s
> Location:
28.52 s
> tests/tests/test_python_api.rs:156:20
28.52 s
>
28.52 s
> error : test run failed
28.52 s
>
28.52 s
> ========== nextest test summary ==========
28.52 s
> report: target/nextest/ci_gammaloop/junit.xml
28.52 s
> tests: 5, failures: 5, errors: 0
28.52 s
>
28.52 s
> 1. gammaloop-integration-tests::test_python_api::python_session_getters_return_live_toml_and_command_blocks
28.52 s
> failure: test failure with exit code 101
28.52 s
> Error: Python API test subprocess failed.
28.52 s
> stdout:
28.52 s
> ┌────────────────────────────────────────────────────────┐
28.52 s
> │ You are running a restricted Symbolica instance. │
28.52 s
> │ │
28.52 s
> │ This mode is only permitted for non-commercial use and │
28.52 s
> │ is limited to one instance and core per machine. │
28.52 s
> │ │
28.52 s
> │ Hobbyists can easily acquire a free license key │
28.52 s
> │ that unlocks all cores and removes this banner: │
28.52 s
> │ │
28.52 s
> │ from symbolica import * │
28.52 s
> │ request_hobbyist_license('YOUR_NAME', 'YOUR_EMAIL') │
28.52 s
> │ │
28.52 s
> │ All other users can obtain a free 30-day trial key: │
28.52 s
> │ │
28.52 s
> │ from symbolica import * │
28.52 s
> │ request_trial_license('NAME', 'EMAIL', 'EMPLOYER') │
28.52 s
> │ │
28.52 s
> │ See https://symbolica.io/docs/get_started.html#license │
28.52 s
> └────────────────────────────────────────────────────────┘
28.52 s
> ┌───────────────────────────────────────────────────────────────────────────────────────────────────────────┐
28.52 s
> │ Cannot start new unlicensed Symbolica instance since there is already another one running on the machine. │
28.52 s
> └───────────────────────────────────────────────────────────────────────────────────────────────────────────┘
28.52 s
>
28.52 s
> stderr:
28.52 s
> ┌───────────────────────────────────┐
28.52 s
> │ The Symbolica license has expired │
28.52 s
> └───────────────────────────────────┘
28.52 s
>
28.52 s
>
28.52 s
> Location:
28.52 s
> tests/tests/test_python_api.rs:156:20
28.52 s
> system-out
28.52 s
> running 1 test
28.52 s
> test python_session_getters_return_live_toml_and_command_blocks ... FAILED
28.52 s
>
28.52 s
> failures:
28.52 s
>
28.52 s
> failures:
28.52 s
> python_session_getters_return_live_toml_and_command_blocks
28.52 s
>
28.52 s
> test result: FAILED. 0 passed; 1 failed; 0 ignored; 0 measured; 4 filtered out; finished in 0.22s
28.52 s
> system-err
28.52 s
> Error: Python API test subprocess failed.
28.52 s
> stdout:
28.52 s
> ┌────────────────────────────────────────────────────────┐
28.52 s
> │ You are running a restricted Symbolica instance. │
28.52 s
> │ │
28.52 s
> │ This mode is only permitted for non-commercial use and │
28.52 s
> │ is limited to one instance and core per machine. │
28.52 s
> │ │
28.52 s
> │ Hobbyists can easily acquire a free license key │
28.52 s
> │ that unlocks all cores and removes this banner: │
28.52 s
> │ │
28.52 s
> │ from symbolica import * │
28.52 s
> │ request_hobbyist_license('YOUR_NAME', 'YOUR_EMAIL') │
28.52 s
> │ │
28.52 s
> │ All other users can obtain a free 30-day trial key: │
28.52 s
> │ │
28.52 s
> │ from symbolica import * │
28.52 s
> │ request_trial_license('NAME', 'EMAIL', 'EMPLOYER') │
28.52 s
> │ │
28.52 s
> │ See https://symbolica.io/docs/get_started.html#license │
28.52 s
> └────────────────────────────────────────────────────────┘
28.52 s
> ┌───────────────────────────────────────────────────────────────────────────────────────────────────────────┐
28.52 s
> │ Cannot start new unlicensed Symbolica instance since there is already another one running on the machine. │
28.52 s
> └───────────────────────────────────────────────────────────────────────────────────────────────────────────┘
28.52 s
>
28.52 s
> stderr:
28.52 s
> ┌───────────────────────────────────┐
28.52 s
> │ The Symbolica license has expired │
28.52 s
> └───────────────────────────────────┘
28.52 s
>
28.52 s
>
28.52 s
> Location:
28.52 s
> tests/tests/test_python_api.rs:156:20
28.52 s
>
28.52 s
> 2. gammaloop-integration-tests::test_python_api::python_evaluate_samples_batch_and_momentum_space_have_expected_shape
28.52 s
> failure: test failure with exit code 101
28.52 s
> Error: Python API test subprocess failed.
28.52 s
> stdout:
28.52 s
> ┌────────────────────────────────────────────────────────┐
28.52 s
> │ You are running a restricted Symbolica instance. │
28.52 s
> │ │
28.52 s
> │ This mode is only permitted for non-commercial use and │
28.52 s
> │ is limited to one instance and core per machine. │
28.52 s
> │ │
28.52 s
> │ Hobbyists can easily acquire a free license key │
28.52 s
> │ that unlocks all cores and removes this banner: │
28.52 s
> │ │
28.52 s
> │ from symbolica import * │
28.52 s
> │ request_hobbyist_license('YOUR_NAME', 'YOUR_EMAIL') │
28.52 s
> │ │
28.52 s
> │ All other users can obtain a free 30-day trial key: │
28.52 s
> │ │
28.52 s
> │ from symbolica import * │
28.52 s
> │ request_trial_license('NAME', 'EMAIL', 'EMPLOYER') │
28.52 s
> │ │
28.52 s
> │ See https://symbolica.io/docs/get_started.html#license │
28.52 s
> └────────────────────────────────────────────────────────┘
28.52 s
> ┌───────────────────────────────────────────────────────────────────────────────────────────────────────────┐
28.52 s
> │ Cannot start new unlicensed Symbolica instance since there is already another one running on the machine. │
28.52 s
> └───────────────────────────────────────────────────────────────────────────────────────────────────────────┘
28.52 s
>
28.52 s
> stderr:
28.52 s
> ┌───────────────────────────────────┐
28.52 s
> │ The Symbolica license has expired │
28.52 s
> └───────────────────────────────────┘
28.52 s
>
28.52 s
>
28.52 s
> Location:
28.52 s
> tests/tests/test_python_api.rs:156:20
28.52 s
> system-out
28.52 s
> running 1 test
28.52 s
> test python_evaluate_samples_batch_and_momentum_space_have_expected_shape ... FAILED
28.52 s
>
28.52 s
> failures:
28.52 s
>
28.52 s
> failures:
28.52 s
> python_evaluate_samples_batch_and_momentum_space_have_expected_shape
28.52 s
>
28.52 s
> test result: FAILED. 0 passed; 1 failed; 0 ignored; 0 measured; 4 filtered out; finished in 0.25s
28.52 s
> system-err
28.52 s
> Error: Python API test subprocess failed.
28.52 s
> stdout:
28.52 s
> ┌────────────────────────────────────────────────────────┐
28.52 s
> │ You are running a restricted Symbolica instance. │
28.52 s
> │ │
28.52 s
> │ This mode is only permitted for non-commercial use and │
28.52 s
> │ is limited to one instance and core per machine. │
28.52 s
> │ │
28.52 s
> │ Hobbyists can easily acquire a free license key │
28.52 s
> │ that unlocks all cores and removes this banner: │
28.52 s
> │ │
28.52 s
> │ from symbolica import * │
28.52 s
> │ request_hobbyist_license('YOUR_NAME', 'YOUR_EMAIL') │
28.52 s
> │ │
28.52 s
> │ All other users can obtain a free 30-day trial key: │
28.52 s
> │ │
28.52 s
> │ from symbolica import * │
28.52 s
> │ request_trial_license('NAME', 'EMAIL', 'EMPLOYER') │
28.52 s
> │ │
28.52 s
> │ See https://symbolica.io/docs/get_started.html#license │
28.52 s
> └────────────────────────────────────────────────────────┘
28.52 s
> ┌───────────────────────────────────────────────────────────────────────────────────────────────────────────┐
28.52 s
> │ Cannot start new unlicensed Symbolica instance since there is already another one running on the machine. │
28.52 s
> └───────────────────────────────────────────────────────────────────────────────────────────────────────────┘
28.52 s
>
28.52 s
> stderr:
28.52 s
> ┌───────────────────────────────────┐
28.52 s
> │ The Symbolica license has expired │
28.52 s
> └───────────────────────────────────┘
28.52 s
>
28.52 s
>
28.52 s
> Location:
28.52 s
> tests/tests/test_python_api.rs:156:20
28.52 s
>
28.52 s
> 3. gammaloop-integration-tests::test_python_api::python_evaluate_sample_honors_generate_events_and_observable_snapshots
28.52 s
> failure: test failure with exit code 101
28.52 s
> Error: Python API test subprocess failed.
28.52 s
> stdout:
28.52 s
> ┌────────────────────────────────────────────────────────┐
28.52 s
> │ You are running a restricted Symbolica instance. │
28.52 s
> │ │
28.52 s
> │ This mode is only permitted for non-commercial use and │
28.52 s
> │ is limited to one instance and core per machine. │
28.52 s
> │ │
28.52 s
> │ Hobbyists can easily acquire a free license key │
28.52 s
> │ that unlocks all cores and removes this banner: │
28.52 s
> │ │
28.52 s
> │ from symbolica import * │
28.52 s
> │ request_hobbyist_license('YOUR_NAME', 'YOUR_EMAIL') │
28.52 s
> │ │
28.52 s
> │ All other users can obtain a free 30-day trial key: │
28.52 s
> │ │
28.52 s
> │ from symbolica import * │
28.52 s
> │ request_trial_license('NAME', 'EMAIL', 'EMPLOYER') │
28.52 s
> │ │
28.52 s
> │ See https://symbolica.io/docs/get_started.html#license │
28.52 s
> └────────────────────────────────────────────────────────┘
28.52 s
> ┌───────────────────────────────────────────────────────────────────────────────────────────────────────────┐
28.52 s
> │ Cannot start new unlicensed Symbolica instance since there is already another one running on the machine. │
28.52 s
> └───────────────────────────────────────────────────────────────────────────────────────────────────────────┘
28.52 s
>
28.52 s
> stderr:
28.52 s
> ┌───────────────────────────────────┐
28.52 s
> │ The Symbolica license has expired │
28.52 s
> └───────────────────────────────────┘
28.52 s
>
28.52 s
>
28.52 s
> Location:
28.52 s
> tests/tests/test_python_api.rs:156:20
28.52 s
> system-out
28.52 s
> running 1 test
28.52 s
> test python_evaluate_sample_honors_generate_events_and_observable_snapshots ... FAILED
28.52 s
>
28.52 s
> failures:
28.52 s
>
28.52 s
> failures:
28.52 s
> python_evaluate_sample_honors_generate_events_and_observable_snapshots
28.52 s
>
28.52 s
> test result: FAILED. 0 passed; 1 failed; 0 ignored; 0 measured; 4 filtered out; finished in 0.29s
28.52 s
> system-err
28.52 s
> Error: Python API test subprocess failed.
28.52 s
> stdout:
28.52 s
> ┌────────────────────────────────────────────────────────┐
28.52 s
> │ You are running a restricted Symbolica instance. │
28.52 s
> │ │
28.52 s
> │ This mode is only permitted for non-commercial use and │
28.52 s
> │ is limited to one instance and core per machine. │
28.52 s
> │ │
28.52 s
> │ Hobbyists can easily acquire a free license key │
28.52 s
> │ that unlocks all cores and removes this banner: │
28.52 s
> │ │
28.52 s
> │ from symbolica import * │
28.52 s
> │ request_hobbyist_license('YOUR_NAME', 'YOUR_EMAIL') │
28.52 s
> │ │
28.52 s
> │ All other users can obtain a free 30-day trial key: │
28.52 s
> │ │
28.52 s
> │ from symbolica import * │
28.52 s
> │ request_trial_license('NAME', 'EMAIL', 'EMPLOYER') │
28.52 s
> │ │
28.52 s
> │ See https://symbolica.io/docs/get_started.html#license │
28.52 s
> └────────────────────────────────────────────────────────┘
28.52 s
> ┌───────────────────────────────────────────────────────────────────────────────────────────────────────────┐
28.52 s
> │ Cannot start new unlicensed Symbolica instance since there is already another one running on the machine. │
28.52 s
> └───────────────────────────────────────────────────────────────────────────────────────────────────────────┘
28.52 s
>
28.52 s
> stderr:
28.52 s
> ┌───────────────────────────────────┐
28.52 s
> │ The Symbolica license has expired │
28.52 s
> └───────────────────────────────────┘
28.52 s
>
28.52 s
>
28.52 s
> Location:
28.52 s
> tests/tests/test_python_api.rs:156:20
28.52 s
>
28.52 s
> 4. gammaloop-integration-tests::test_python_api::python_evaluate_sample_preserves_graph_grouping_and_incoming_pdgs
28.52 s
> failure: test failure with exit code 101
28.52 s
> Error: Python API test subprocess failed.
28.52 s
> stdout:
28.52 s
> ┌────────────────────────────────────────────────────────┐
28.52 s
> │ You are running a restricted Symbolica instance. │
28.52 s
> │ │
28.52 s
> │ This mode is only permitted for non-commercial use and │
28.52 s
> │ is limited to one instance and core per machine. │
28.52 s
> │ │
28.52 s
> │ Hobbyists can easily acquire a free license key │
28.52 s
> │ that unlocks all cores and removes this banner: │
28.52 s
> │ │
28.52 s
> │ from symbolica import * │
28.52 s
> │ request_hobbyist_license('YOUR_NAME', 'YOUR_EMAIL') │
28.52 s
> │ │
28.52 s
> │ All other users can obtain a free 30-day trial key: │
28.52 s
> │ │
28.52 s
> │ from symbolica import * │
28.52 s
> │ request_trial_license('NAME', 'EMAIL', 'EMPLOYER') │
28.52 s
> │ │
28.52 s
> │ See https://symbolica.io/docs/get_started.html#license │
28.52 s
> └────────────────────────────────────────────────────────┘
28.52 s
> ┌───────────────────────────────────────────────────────────────────────────────────────────────────────────┐
28.52 s
> │ Cannot start new unlicensed Symbolica instance since there is already another one running on the machine. │
28.52 s
> └───────────────────────────────────────────────────────────────────────────────────────────────────────────┘
28.52 s
>
28.52 s
> stderr:
28.52 s
> ┌───────────────────────────────────┐
28.52 s
> │ The Symbolica license has expired │
28.52 s
> └───────────────────────────────────┘
28.52 s
> [2026-09-01 10:05:46.432] @gammaloop_api::se... INFO : Running command import model sm-default
28.52 s
> [2026-09-01 10:05:46.432] @import::model INFO : Loading built-in JSON model sm-default
28.52 s
> [2026-09-01 10:05:46.471] @gammalooprs::model INFO : The following 15 external parameters were forced to zero by the restriction card:
28.52 s
> lamWS, AWS, rhoWS, etaWS, ymc, yme, ymm, MC, Me, MM, WTau, muQ, muLe, muLmu, muLtau
28.52 s
> [2026-09-01 10:05:46.472] @gammalooprs::model INFO : The following 34 vertex rules were removed by the restriction card:
28.52 s
> V_82 -> (c~, d, G+) | V_83 -> (t~, d, G+) | V_84 -> (c~, s, G+) | V_85 -> (t~, s, G+) | V_86 -> (u~, b, G+) | V_87 -> (c~, b, G+) | V_90 -> (c~, d, W+) | V_91 -> (t~, d, W+) | V_92 -> (u~, s, W+) | V_94 -> (t~, s, W+) | V_95 -> (u~, b, W+) | V_96 -> (c~, b, W+) | V_101 -> (e+, e-, G0) | V_102 -> (mu+, mu-, G0) | V_104 -> (e+, e-, H) | V_105 -> (mu+, mu-, H) | V_110 -> (ve~, e-, G+) | V_111 -> (vm~, mu-, G+) | V_116 -> (b~, u, G-) | V_117 -> (d~, c, G-) | V_118 -> (s~, c, G-) | V_119 -> (b~, c, G-) | V_120 -> (d~, t, G-) | V_121 -> (s~, t, G-) | V_124 -> (s~, u, W-) | V_125 -> (b~, u, W-) | V_126 -> (d~, c, W-) | V_128 -> (b~, c, W-) | V_129 -> (d~, t, W-) | V_130 -> (s~, t, W-) | V_138 -> (c~, c, G0) | V_140 -> (c~, c, H) | V_145 -> (e+, ve, G-) | V_146 -> (mu+, vm, G-)
28.52 s
> [2026-09-01 10:05:46.472] @gammalooprs::model INFO : The following 36 couplings were removed by the restriction card:
28.52 s
> GC_13, GC_14, GC_16, GC_17, GC_18, GC_19, GC_20, GC_22, GC_23, GC_24, GC_25, GC_26, GC_28, GC_29, GC_42, GC_43, GC_44, GC_46, GC_47, GC_48, GC_84, GC_85, GC_86, GC_87, GC_88, GC_89, GC_90, GC_91, GC_92, GC_93, GC_101, GC_102, GC_103, GC_105, GC_106, GC_107
28.52 s
> [2026-09-01 10:05:46.472] @gammaloop_api::se... INFO : Running command set default-runtime kv kinematics.externals='{"type":"constant","data":{"momenta":[[32.0,0.0,0.0,32.0],[32.0,0.0,0.0,-32.0]],"helicities":[1,1]}}'
28.52 s
> [2026-09-01 10:05:46.473] @gammaloop_api::se... INFO : Running command set default-runtime kv subtraction.disable_threshold_subtraction=true
28.52 s
> [2026-09-01 10:05:46.474] @gammaloop_api::se... INFO : Running command generate xs e+ e- > d d~ g | e- a d g QED^2==4 [{{2}} QCD=0] --numerator-grouping group_identical_graphs_up_to_sign --clear-existing-processes --only-diagrams
28.52 s
> [2026-09-01 10:05:46.476] @feyngen::diagram_... INFO : 0s | Δ=0s | Starting Feynman graph generation with Symbolica...
28.52 s
> [2026-09-01 10:05:46.479] @feyngen::diagram_... INFO : 0s | Δ=0s | Number of graphs resulting from Symbolica generation: 246
28.52 s
> [2026-09-01 10:05:46.481] @feyngen::diagram_... INFO : 0s | Δ=0s | Number of graphs retained after enforcing supergraph particle content: 8
28.52 s
> [2026-09-01 10:05:46.484] @feyngen::diagram_... INFO : 0s | Δ=0s | Number of graphs retained after removal of vetoed topologies: 8
28.52 s
> [2026-09-01 10:05:46.484] @feyngen::diagram_... INFO : 0s | Δ=0s | Number of graphs after vertex info assignment: 8
28.52 s
> [2026-09-01 10:05:46.484] @feyngen::diagram_... INFO : 0s | Δ=0s | Number of graphs after all complete graphs filters are applied: 8
28.52 s
>
28.52 s
>
28.52 s
> Location:
28.52 s
> tests/tests/test_python_api.rs:156:20
28.52 s
> system-out
28.52 s
> running 1 test
28.52 s
> test python_evaluate_sample_preserves_graph_grouping_and_incoming_pdgs ... FAILED
28.52 s
>
28.52 s
> failures:
28.52 s
>
28.52 s
> failures:
28.52 s
> python_evaluate_sample_preserves_graph_grouping_and_incoming_pdgs
28.52 s
>
28.52 s
> test result: FAILED. 0 passed; 1 failed; 0 ignored; 0 measured; 4 filtered out; finished in 0.34s
28.52 s
> system-err
28.52 s
> Error: Python API test subprocess failed.
28.52 s
> stdout:
28.52 s
> ┌────────────────────────────────────────────────────────┐
28.52 s
> │ You are running a restricted Symbolica instance. │
28.52 s
> │ │
28.52 s
> │ This mode is only permitted for non-commercial use and │
28.52 s
> │ is limited to one instance and core per machine. │
28.52 s
> │ │
28.52 s
> │ Hobbyists can easily acquire a free license key │
28.52 s
> │ that unlocks all cores and removes this banner: │
28.52 s
> │ │
28.52 s
> │ from symbolica import * │
28.52 s
> │ request_hobbyist_license('YOUR_NAME', 'YOUR_EMAIL') │
28.52 s
> │ │
28.52 s
> │ All other users can obtain a free 30-day trial key: │
28.52 s
> │ │
28.52 s
> │ from symbolica import * │
28.52 s
> │ request_trial_license('NAME', 'EMAIL', 'EMPLOYER') │
28.52 s
> │ │
28.52 s
> │ See https://symbolica.io/docs/get_started.html#license │
28.52 s
> └────────────────────────────────────────────────────────┘
28.52 s
> ┌───────────────────────────────────────────────────────────────────────────────────────────────────────────┐
28.52 s
> │ Cannot start new unlicensed Symbolica instance since there is already another one running on the machine. │
28.52 s
> └───────────────────────────────────────────────────────────────────────────────────────────────────────────┘
28.52 s
>
28.52 s
> stderr:
28.52 s
> ┌───────────────────────────────────┐
28.52 s
> │ The Symbolica license has expired │
28.52 s
> └───────────────────────────────────┘
28.52 s
> [2026-09-01 10:05:46.432] @gammaloop_api::se... INFO : Running command import model sm-default
28.52 s
> [2026-09-01 10:05:46.432] @import::model INFO : Loading built-in JSON model sm-default
28.52 s
> [2026-09-01 10:05:46.471] @gammalooprs::model INFO : The following 15 external parameters were forced to zero by the restriction card:
28.52 s
> lamWS, AWS, rhoWS, etaWS, ymc, yme, ymm, MC, Me, MM, WTau, muQ, muLe, muLmu, muLtau
28.52 s
> [2026-09-01 10:05:46.472] @gammalooprs::model INFO : The following 34 vertex rules were removed by the restriction card:
28.52 s
> V_82 -> (c~, d, G+) | V_83 -> (t~, d, G+) | V_84 -> (c~, s, G+) | V_85 -> (t~, s, G+) | V_86 -> (u~, b, G+) | V_87 -> (c~, b, G+) | V_90 -> (c~, d, W+) | V_91 -> (t~, d, W+) | V_92 -> (u~, s, W+) | V_94 -> (t~, s, W+) | V_95 -> (u~, b, W+) | V_96 -> (c~, b, W+) | V_101 -> (e+, e-, G0) | V_102 -> (mu+, mu-, G0) | V_104 -> (e+, e-, H) | V_105 -> (mu+, mu-, H) | V_110 -> (ve~, e-, G+) | V_111 -> (vm~, mu-, G+) | V_116 -> (b~, u, G-) | V_117 -> (d~, c, G-) | V_118 -> (s~, c, G-) | V_119 -> (b~, c, G-) | V_120 -> (d~, t, G-) | V_121 -> (s~, t, G-) | V_124 -> (s~, u, W-) | V_125 -> (b~, u, W-) | V_126 -> (d~, c, W-) | V_128 -> (b~, c, W-) | V_129 -> (d~, t, W-) | V_130 -> (s~, t, W-) | V_138 -> (c~, c, G0) | V_140 -> (c~, c, H) | V_145 -> (e+, ve, G-) | V_146 -> (mu+, vm, G-)
28.52 s
> [2026-09-01 10:05:46.472] @gammalooprs::model INFO : The following 36 couplings were removed by the restriction card:
28.52 s
> GC_13, GC_14, GC_16, GC_17, GC_18, GC_19, GC_20, GC_22, GC_23, GC_24, GC_25, GC_26, GC_28, GC_29, GC_42, GC_43, GC_44, GC_46, GC_47, GC_48, GC_84, GC_85, GC_86, GC_87, GC_88, GC_89, GC_90, GC_91, GC_92, GC_93, GC_101, GC_102, GC_103, GC_105, GC_106, GC_107
28.52 s
> [2026-09-01 10:05:46.472] @gammaloop_api::se... INFO : Running command set default-runtime kv kinematics.externals='{"type":"constant","data":{"momenta":[[32.0,0.0,0.0,32.0],[32.0,0.0,0.0,-32.0]],"helicities":[1,1]}}'
28.52 s
> [2026-09-01 10:05:46.473] @gammaloop_api::se... INFO : Running command set default-runtime kv subtraction.disable_threshold_subtraction=true
28.52 s
> [2026-09-01 10:05:46.474] @gammaloop_api::se... INFO : Running command generate xs e+ e- > d d~ g | e- a d g QED^2==4 [{{2}} QCD=0] --numerator-grouping group_identical_graphs_up_to_sign --clear-existing-processes --only-diagrams
28.52 s
> [2026-09-01 10:05:46.476] @feyngen::diagram_... INFO : 0s | Δ=0s | Starting Feynman graph generation with Symbolica...
28.52 s
> [2026-09-01 10:05:46.479] @feyngen::diagram_... INFO : 0s | Δ=0s | Number of graphs resulting from Symbolica generation: 246
28.52 s
> [2026-09-01 10:05:46.481] @feyngen::diagram_... INFO : 0s | Δ=0s | Number of graphs retained after enforcing supergraph particle content: 8
28.52 s
> [2026-09-01 10:05:46.484] @feyngen::diagram_... INFO : 0s | Δ=0s | Number of graphs retained after removal of vetoed topologies: 8
28.52 s
> [2026-09-01 10:05:46.484] @feyngen::diagram_... INFO : 0s | Δ=0s | Number of graphs after vertex info assignment: 8
28.52 s
> [2026-09-01 10:05:46.484] @feyngen::diagram_... INFO : 0s | Δ=0s | Number of graphs after all complete graphs filters are applied: 8
28.52 s
>
28.52 s
>
28.52 s
> Location:
28.52 s
> tests/tests/test_python_api.rs:156:20
28.52 s
>
28.52 s
> 5. gammaloop-integration-tests::test_python_api::python_settings_wrappers_expose_nested_runtime_and_global_settings
28.52 s
> failure: test failure with exit code 101
28.52 s
> Error: Python API test subprocess failed.
28.52 s
> stdout:
28.52 s
> ┌────────────────────────────────────────────────────────┐
28.52 s
> │ You are running a restricted Symbolica instance. │
28.52 s
> │ │
28.52 s
> │ This mode is only permitted for non-commercial use and │
28.52 s
> │ is limited to one instance and core per machine. │
28.52 s
> │ │
28.52 s
> │ Hobbyists can easily acquire a free license key │
28.52 s
> │ that unlocks all cores and removes this banner: │
28.52 s
> │ │
28.52 s
> │ from symbolica import * │
28.52 s
> │ request_hobbyist_license('YOUR_NAME', 'YOUR_EMAIL') │
28.52 s
> │ │
28.52 s
> │ All other users can obtain a free 30-day trial key: │
28.52 s
> │ │
28.52 s
> │ from symbolica import * │
28.52 s
> │ request_trial_license('NAME', 'EMAIL', 'EMPLOYER') │
28.52 s
> │ │
28.52 s
> │ See https://symbolica.io/docs/get_started.html#license │
28.52 s
> └────────────────────────────────────────────────────────┘
28.52 s
> ┌───────────────────────────────────────────────────────────────────────────────────────────────────────────┐
28.52 s
> │ Cannot start new unlicensed Symbolica instance since there is already another one running on the machine. │
28.52 s
> └───────────────────────────────────────────────────────────────────────────────────────────────────────────┘
28.52 s
>
28.52 s
> stderr:
28.52 s
> ┌───────────────────────────────────┐
28.52 s
> │ The Symbolica license has expired │
28.52 s
> └───────────────────────────────────┘
28.52 s
>
28.52 s
>
28.52 s
> Location:
28.52 s
> tests/tests/test_python_api.rs:156:20
28.52 s
> system-out
28.52 s
> running 1 test
28.52 s
> test python_settings_wrappers_expose_nested_runtime_and_global_settings ... FAILED
28.52 s
>
28.52 s
> failures:
28.52 s
>
28.52 s
> failures:
28.52 s
> python_settings_wrappers_expose_nested_runtime_and_global_settings
28.52 s
>
28.52 s
> test result: FAILED. 0 passed; 1 failed; 0 ignored; 0 measured; 4 filtered out; finished in 0.57s
28.52 s
> system-err
28.52 s
> Error: Python API test subprocess failed.
28.52 s
> stdout:
28.52 s
> ┌────────────────────────────────────────────────────────┐
28.52 s
> │ You are running a restricted Symbolica instance. │
28.52 s
> │ │
28.52 s
> │ This mode is only permitted for non-commercial use and │
28.52 s
> │ is limited to one instance and core per machine. │
28.52 s
> │ │
28.52 s
> │ Hobbyists can easily acquire a free license key │
28.52 s
> │ that unlocks all cores and removes this banner: │
28.52 s
> │ │
28.52 s
> │ from symbolica import * │
28.52 s
> │ request_hobbyist_license('YOUR_NAME', 'YOUR_EMAIL') │
28.52 s
> │ │
28.52 s
> │ All other users can obtain a free 30-day trial key: │
28.52 s
> │ │
28.52 s
> │ from symbolica import * │
28.52 s
> │ request_trial_license('NAME', 'EMAIL', 'EMPLOYER') │
28.52 s
> │ │
28.52 s
> │ See https://symbolica.io/docs/get_started.html#license │
28.52 s
> └────────────────────────────────────────────────────────┘
28.52 s
> ┌───────────────────────────────────────────────────────────────────────────────────────────────────────────┐
28.52 s
> │ Cannot start new unlicensed Symbolica instance since there is already another one running on the machine. │
28.52 s
> └───────────────────────────────────────────────────────────────────────────────────────────────────────────┘
28.52 s
>
28.52 s
> stderr:
28.52 s
> ┌───────────────────────────────────┐
28.52 s
> │ The Symbolica license has expired │
28.52 s
> └───────────────────────────────────┘
28.52 s
>
28.52 s
>
28.52 s
> Location:
28.52 s
> tests/tests/test_python_api.rs:156:20
28.52 s
> =========================================
28.52 s
For full logs, run:
28.52 s
nix log /nix/store/90vl6933shlgrvsg0q1k9hbam6pqxvdh-gammaloop-nextest-python-api.drv
28.65 s
Run failed.