test packages.x86_64-linux.nix-ci-check-gammaloop-nextest-python-api

Reproduce this run
Original Run
  1. 0.09 s $ /nix/store/9ypz3flqsrl5xl495mm8h645gadjsxi1-coreutils-9.11/bin/timeout --kill-after=15s 7200s /nix/store/23zk8sgzamrbmj1fday15szf7f2279s8-nix-2.34.7/bin/nix --extra-experimental-features nix-command --extra-experimental-features flakes flake clone git+https://github.com/alphal00p/gammaloop --dest /tmp/nix-ci-worker/stable-pwd/repo/
  2. 0.10 s Cloning into '/tmp/nix-ci-worker/stable-pwd/repo'...
  3. 1.08 s remote: Enumerating objects: 65450, done.
  4. 1.20 s remote: Counting objects: 0% (1/8101) remote: Counting objects: 1% (82/8101) remote: Counting objects: 2% (163/8101) remote: Counting objects: 3% (244/8101) remote: Counting objects: 4% (325/8101) remote: Counting objects: 5% (406/8101) remote: Counting objects: 6% (487/8101) remote: Counting objects: 7% (568/8101) remote: Counting objects: 8% (649/8101) remote: Counting objects: 9% (730/8101) remote: Counting objects: 10% (811/8101) remote: Counting objects: 11% (892/8101) remote: Counting objects: 12% (973/8101) remote: Counting objects: 13% (1054/8101) remote: Counting objects: 14% (1135/8101) remote: Counting objects: 15% (1216/8101) remote: Counting objects: 16% (1297/8101) remote: Counting objects: 17% (1378/8101) remote: Counting objects: 18% (1459/8101) remote: Counting objects: 19% (1540/8101) remote: Counting objects: 20% (1621/8101) remote: Counting objects: 21% (1702/8101) remote: Counting objects: 22% (1783/8101) remote: Counting objects: 23% (1864/8101) remote: Counting objects: 24% (1945/8101) remote: Counting objects: 25% (2026/8101) remote: Counting objects: 26% (2107/8101) remote: Counting objects: 27% (2188/8101) remote: Counting objects: 28% (2269/8101) remote: Counting objects: 29% (2350/8101) remote: Counting objects: 30% (2431/8101) remote: Counting objects: 31% (2512/8101) remote: Counting objects: 32% (2593/8101) remote: Counting objects: 33% (2674/8101) remote: Counting objects: 34% (2755/8101) remote: Counting objects: 35% (2836/8101) remote: Counting objects: 36% (2917/8101) remote: Counting objects: 37% (2998/8101) remote: Counting objects: 38% (3079/8101) remote: Counting objects: 39% (3160/8101) remote: Counting objects: 40% (3241/8101) remote: Counting objects: 41% (3322/8101) remote: Counting objects: 42% (3403/8101) remote: Counting objects: 43% (3484/8101) remote: Counting objects: 44% (3565/8101) remote: Counting objects: 45% (3646/8101) remote: Counting objects: 46% (3727/8101) remote: Counting objects: 47% (3808/8101) remote: Counting objects: 48% (3889/8101) remote: Counting objects: 49% (3970/8101) remote: Counting objects: 50% (4051/8101) remote: Counting objects: 51% (4132/8101) remote: Counting objects: 52% (4213/8101) remote: Counting objects: 53% (4294/8101) remote: Counting objects: 54% (4375/8101) remote: Counting objects: 55% (4456/8101) remote: Counting objects: 56% (4537/8101) remote: Counting objects: 57% (4618/8101) remote: Counting objects: 58% (4699/8101) remote: Counting objects: 59% (4780/8101) remote: Counting objects: 60% (4861/8101) remote: Counting objects: 61% (4942/8101) remote: Counting objects: 62% (5023/8101) remote: Counting objects: 63% (5104/8101) remote: Counting objects: 64% (5185/8101) remote: Counting objects: 65% (5266/8101) remote: Counting objects: 66% (5347/8101) remote: Counting objects: 67% (5428/8101) remote: Counting objects: 68% (5509/8101) remote: Counting objects: 69% (5590/8101) remote: Counting objects: 70% (5671/8101) remote: Counting objects: 71% (5752/8101) remote: Counting objects: 72% (5833/8101) remote: Counting objects: 73% (5914/8101) remote: Counting objects: 74% (5995/8101) remote: Counting objects: 75% (6076/8101) remote: Counting objects: 76% (6157/8101) remote: Counting objects: 77% (6238/8101) remote: Counting objects: 78% (6319/8101) remote: Counting objects: 79% (6400/8101) remote: Counting objects: 80% (6481/8101) remote: Counting objects: 81% (6562/8101) remote: Counting objects: 82% (6643/8101) remote: Counting objects: 83% (6724/8101) remote: Counting objects: 84% (6805/8101) remote: Counting objects: 85% (6886/8101) remote: Counting objects: 86% (6967/8101) remote: Counting objects: 87% (7048/8101) remote: Counting objects: 88% (7129/8101) remote: Counting objects: 89% (7210/8101) remote: Counting objects: 90% (7291/8101) remote: Counting objects: 91% (7372/8101) remote: Counting objects: 92% (7453/8101) remote: Counting objects: 93% (7534/8101) remote: Counting objects: 94% (7615/8101) remote: Counting objects: 95% (7696/8101) remote: Counting objects: 96% (7777/8101) remote: Counting objects: 97% (7858/8101) remote: Counting objects: 98% (7939/8101) remote: Counting objects: 99% (8020/8101) remote: Counting objects: 100% (8101/8101) remote: Counting objects: 100% (8101/8101), done.
  5. 2.85 s remote: Compressing objects: 0% (1/1732) remote: Compressing objects: 1% (18/1732) remote: Compressing objects: 2% (35/1732) remote: Compressing objects: 3% (52/1732) remote: Compressing objects: 4% (70/1732) remote: Compressing objects: 5% (87/1732) remote: Compressing objects: 6% (104/1732) remote: Compressing objects: 7% (122/1732) remote: Compressing objects: 8% (139/1732) remote: Compressing objects: 9% (156/1732) remote: Compressing objects: 10% (174/1732) remote: Compressing objects: 11% (191/1732) remote: Compressing objects: 12% (208/1732) remote: Compressing objects: 13% (226/1732) remote: Compressing objects: 14% (243/1732) remote: Compressing objects: 15% (260/1732) remote: Compressing objects: 16% (278/1732) remote: Compressing objects: 17% (295/1732) remote: Compressing objects: 17% (310/1732) remote: Compressing objects: 18% (312/1732) remote: Compressing objects: 19% (330/1732) remote: Compressing objects: 20% (347/1732) remote: Compressing objects: 21% (364/1732) remote: Compressing objects: 22% (382/1732) remote: Compressing objects: 23% (399/1732) remote: Compressing objects: 24% (416/1732) remote: Compressing objects: 25% (433/1732) remote: Compressing objects: 26% (451/1732) remote: Compressing objects: 27% (468/1732) remote: Compressing objects: 28% (485/1732) remote: Compressing objects: 29% (503/1732) remote: Compressing objects: 30% (520/1732) remote: Compressing objects: 31% (537/1732) remote: Compressing objects: 32% (555/1732) remote: Compressing objects: 33% (572/1732) remote: Compressing objects: 34% (589/1732) remote: Compressing objects: 35% (607/1732) remote: Compressing objects: 36% (624/1732) remote: Compressing objects: 37% (641/1732) remote: Compressing objects: 38% (659/1732) remote: Compressing objects: 39% (676/1732) remote: Compressing objects: 40% (693/1732) remote: Compressing objects: 41% (711/1732) remote: Compressing objects: 42% (728/1732) remote: Compressing objects: 43% (745/1732) remote: Compressing objects: 44% (763/1732) remote: Compressing objects: 45% (780/1732) remote: Compressing objects: 46% (797/1732) remote: Compressing objects: 47% (815/1732) remote: Compressing objects: 48% (832/1732) remote: Compressing objects: 49% (849/1732) remote: Compressing objects: 50% (866/1732) remote: Compressing objects: 51% (884/1732) remote: Compressing objects: 52% (901/1732) remote: Compressing objects: 53% (918/1732) remote: Compressing objects: 54% (936/1732) remote: Compressing objects: 55% (953/1732) remote: Compressing objects: 56% (970/1732) remote: Compressing objects: 57% (988/1732) remote: Compressing objects: 58% (1005/1732) remote: Compressing objects: 59% (1022/1732) remote: Compressing objects: 60% (1040/1732) remote: Compressing objects: 61% (1057/1732) remote: Compressing objects: 62% (1074/1732) remote: Compressing objects: 63% (1092/1732) remote: Compressing objects: 64% (1109/1732) remote: Compressing objects: 65% (1126/1732) remote: Compressing objects: 66% (1144/1732) remote: Compressing objects: 67% (1161/1732) remote: Compressing objects: 68% (1178/1732) remote: Compressing objects: 69% (1196/1732) remote: Compressing objects: 70% (1213/1732) remote: Compressing objects: 71% (1230/1732) remote: Compressing objects: 72% (1248/1732) remote: Compressing objects: 73% (1265/1732) remote: Compressing objects: 74% (1282/1732) remote: Compressing objects: 75% (1299/1732) remote: Compressing objects: 76% (1317/1732) remote: Compressing objects: 77% (1334/1732) remote: Compressing objects: 78% (1351/1732) remote: Compressing objects: 79% (1369/1732) remote: Compressing objects: 80% (1386/1732) remote: Compressing objects: 81% (1403/1732) remote: Compressing objects: 82% (1421/1732) remote: Compressing objects: 83% (1438/1732) remote: Compressing objects: 84% (1455/1732) remote: Compressing objects: 85% (1473/1732) remote: Compressing objects: 86% (1490/1732) remote: Compressing objects: 87% (1507/1732) remote: Compressing objects: 88% (1525/1732) remote: Compressing objects: 89% (1542/1732) remote: Compressing objects: 90% (1559/1732) remote: Compressing objects: 91% (1577/1732) remote: Compressing objects: 92% (1594/1732) remote: Compressing objects: 93% (1611/1732) remote: Compressing objects: 94% (1629/1732) remote: Compressing objects: 95% (1646/1732) remote: Compressing objects: 96% (1663/1732) remote: Compressing objects: 97% (1681/1732) remote: Compressing objects: 98% (1698/1732) remote: Compressing objects: 99% (1715/1732) remote: Compressing objects: 100% (1732/1732) remote: Compressing objects: 100% (1732/1732), done.
  6. 5.75 s Receiving objects: 0% (1/65450) Receiving objects: 1% (655/65450) Receiving objects: 2% (1309/65450) Receiving objects: 3% (1964/65450) Receiving objects: 4% (2618/65450) Receiving objects: 5% (3273/65450) Receiving objects: 6% (3927/65450) Receiving objects: 7% (4582/65450) Receiving objects: 8% (5236/65450) Receiving objects: 9% (5891/65450) Receiving objects: 10% (6545/65450) Receiving objects: 11% (7200/65450) Receiving objects: 12% (7854/65450), 12.35 MiB | 24.68 MiB/s Receiving objects: 13% (8509/65450), 12.35 MiB | 24.68 MiB/s Receiving objects: 14% (9163/65450), 12.35 MiB | 24.68 MiB/s Receiving objects: 15% (9818/65450), 12.35 MiB | 24.68 MiB/s Receiving objects: 16% (10472/65450), 12.35 MiB | 24.68 MiB/s Receiving objects: 17% (11127/65450), 12.35 MiB | 24.68 MiB/s Receiving objects: 18% (11781/65450), 12.35 MiB | 24.68 MiB/s Receiving objects: 19% (12436/65450), 12.35 MiB | 24.68 MiB/s Receiving objects: 20% (13090/65450), 12.35 MiB | 24.68 MiB/s Receiving objects: 21% (13745/65450), 12.35 MiB | 24.68 MiB/s Receiving objects: 22% (14399/65450), 12.35 MiB | 24.68 MiB/s Receiving objects: 23% (15054/65450), 12.35 MiB | 24.68 MiB/s Receiving objects: 24% (15708/65450), 12.35 MiB | 24.68 MiB/s Receiving objects: 25% (16363/65450), 12.35 MiB | 24.68 MiB/s Receiving objects: 26% (17017/65450), 12.35 MiB | 24.68 MiB/s Receiving objects: 27% (17672/65450), 12.35 MiB | 24.68 MiB/s Receiving objects: 28% (18326/65450), 12.35 MiB | 24.68 MiB/s Receiving objects: 29% (18981/65450), 12.35 MiB | 24.68 MiB/s Receiving objects: 30% (19635/65450), 12.35 MiB | 24.68 MiB/s Receiving objects: 31% (20290/65450), 12.35 MiB | 24.68 MiB/s Receiving objects: 32% (20944/65450), 12.35 MiB | 24.68 MiB/s Receiving objects: 33% (21599/65450), 12.35 MiB | 24.68 MiB/s Receiving objects: 34% (22253/65450), 12.35 MiB | 24.68 MiB/s Receiving objects: 35% (22908/65450), 12.35 MiB | 24.68 MiB/s Receiving objects: 36% (23562/65450), 12.35 MiB | 24.68 MiB/s Receiving objects: 37% (24217/65450), 12.35 MiB | 24.68 MiB/s Receiving objects: 38% (24871/65450), 12.35 MiB | 24.68 MiB/s Receiving objects: 39% (25526/65450), 12.35 MiB | 24.68 MiB/s Receiving objects: 40% (26180/65450), 12.35 MiB | 24.68 MiB/s Receiving objects: 41% (26835/65450), 12.35 MiB | 24.68 MiB/s Receiving objects: 42% (27489/65450), 12.35 MiB | 24.68 MiB/s Receiving objects: 43% (28144/65450), 12.35 MiB | 24.68 MiB/s Receiving objects: 44% (28798/65450), 12.35 MiB | 24.68 MiB/s Receiving objects: 45% (29453/65450), 12.35 MiB | 24.68 MiB/s Receiving objects: 46% (30107/65450), 12.35 MiB | 24.68 MiB/s Receiving objects: 47% (30762/65450), 12.35 MiB | 24.68 MiB/s Receiving objects: 48% (31416/65450), 12.35 MiB | 24.68 MiB/s Receiving objects: 49% (32071/65450), 12.35 MiB | 24.68 MiB/s Receiving objects: 50% (32725/65450), 12.35 MiB | 24.68 MiB/s Receiving objects: 50% (32753/65450), 30.14 MiB | 30.13 MiB/s Receiving objects: 51% (33380/65450), 30.14 MiB | 30.13 MiB/s Receiving objects: 52% (34034/65450), 30.14 MiB | 30.13 MiB/s Receiving objects: 53% (34689/65450), 30.14 MiB | 30.13 MiB/s Receiving objects: 54% (35343/65450), 30.14 MiB | 30.13 MiB/s Receiving objects: 55% (35998/65450), 30.14 MiB | 30.13 MiB/s Receiving objects: 56% (36652/65450), 30.14 MiB | 30.13 MiB/s Receiving objects: 57% (37307/65450), 30.14 MiB | 30.13 MiB/s Receiving objects: 58% (37961/65450), 30.14 MiB | 30.13 MiB/s Receiving objects: 59% (38616/65450), 30.14 MiB | 30.13 MiB/s Receiving objects: 60% (39270/65450), 44.22 MiB | 28.86 MiB/s Receiving objects: 61% (39925/65450), 44.22 MiB | 28.86 MiB/s Receiving objects: 62% (40579/65450), 44.22 MiB | 28.86 MiB/s Receiving objects: 63% (41234/65450), 44.22 MiB | 28.86 MiB/s Receiving objects: 64% (41888/65450), 44.22 MiB | 28.86 MiB/s Receiving objects: 65% (42543/65450), 44.22 MiB | 28.86 MiB/s Receiving objects: 66% (43197/65450), 44.22 MiB | 28.86 MiB/s Receiving objects: 67% (43852/65450), 44.22 MiB | 28.86 MiB/s Receiving objects: 68% (44506/65450), 44.22 MiB | 28.86 MiB/s Receiving objects: 69% (45161/65450), 44.22 MiB | 28.86 MiB/s Receiving objects: 70% (45815/65450), 44.22 MiB | 28.86 MiB/s Receiving objects: 71% (46470/65450), 44.22 MiB | 28.86 MiB/s Receiving objects: 72% (47124/65450), 44.22 MiB | 28.86 MiB/s Receiving objects: 72% (47293/65450), 44.22 MiB | 28.86 MiB/s Receiving objects: 73% (47779/65450), 44.22 MiB | 28.86 MiB/s Receiving objects: 74% (48433/65450), 60.71 MiB | 29.87 MiB/s Receiving objects: 75% (49088/65450), 60.71 MiB | 29.87 MiB/s Receiving objects: 76% (49742/65450), 60.71 MiB | 29.87 MiB/s Receiving objects: 77% (50397/65450), 60.71 MiB | 29.87 MiB/s Receiving objects: 78% (51051/65450), 60.71 MiB | 29.87 MiB/s Receiving objects: 79% (51706/65450), 60.71 MiB | 29.87 MiB/s Receiving objects: 80% (52360/65450), 60.71 MiB | 29.87 MiB/s Receiving objects: 81% (53015/65450), 60.71 MiB | 29.87 MiB/s Receiving objects: 82% (53669/65450), 60.71 MiB | 29.87 MiB/s Receiving objects: 83% (54324/65450), 78.45 MiB | 30.94 MiB/s Receiving objects: 84% (54978/65450), 78.45 MiB | 30.94 MiB/s Receiving objects: 85% (55633/65450), 78.45 MiB | 30.94 MiB/s Receiving objects: 86% (56287/65450), 78.45 MiB | 30.94 MiB/s Receiving objects: 87% (56942/65450), 78.45 MiB | 30.94 MiB/s Receiving objects: 88% (57596/65450), 78.45 MiB | 30.94 MiB/s Receiving objects: 89% (58251/65450), 78.45 MiB | 30.94 MiB/s Receiving objects: 90% (58905/65450), 78.45 MiB | 30.94 MiB/s Receiving objects: 91% (59560/65450), 78.45 MiB | 30.94 MiB/s Receiving objects: 92% (60214/65450), 78.45 MiB | 30.94 MiB/s Receiving objects: 93% (60869/65450), 78.45 MiB | 30.94 MiB/s Receiving objects: 94% (61523/65450), 78.45 MiB | 30.94 MiB/s Receiving objects: 95% (62178/65450), 78.45 MiB | 30.94 MiB/s Receiving objects: 96% (62832/65450), 78.45 MiB | 30.94 MiB/s Receiving objects: 97% (63487/65450), 78.45 MiB | 30.94 MiB/s Receiving objects: 98% (64141/65450), 78.45 MiB | 30.94 MiB/s Receiving objects: 99% (64796/65450), 78.45 MiB | 30.94 MiB/s remote: Total 65450 (delta 6924), reused 6528 (delta 6350), pack-reused 57349 (from 1)
  7. 5.76 s Receiving objects: 100% (65450/65450), 78.45 MiB | 30.94 MiB/s Receiving objects: 100% (65450/65450), 88.68 MiB | 30.64 MiB/s, done.
  8. 7.42 s Resolving deltas: 0% (0/46042) Resolving deltas: 1% (461/46042) Resolving deltas: 2% (924/46042) Resolving deltas: 3% (1382/46042) Resolving deltas: 4% (1843/46042) Resolving deltas: 5% (2303/46042) Resolving deltas: 6% (2763/46042) Resolving deltas: 7% (3223/46042) Resolving deltas: 8% (3684/46042) Resolving deltas: 9% (4144/46042) Resolving deltas: 10% (4605/46042) Resolving deltas: 11% (5067/46042) Resolving deltas: 12% (5526/46042) Resolving deltas: 13% (5986/46042) Resolving deltas: 14% (6446/46042) Resolving deltas: 15% (6907/46042) Resolving deltas: 16% (7367/46042) Resolving deltas: 17% (7828/46042) Resolving deltas: 18% (8288/46042) Resolving deltas: 19% (8748/46042) Resolving deltas: 20% (9209/46042) Resolving deltas: 21% (9669/46042) Resolving deltas: 22% (10130/46042) Resolving deltas: 23% (10591/46042) Resolving deltas: 24% (11051/46042) Resolving deltas: 25% (11511/46042) Resolving deltas: 26% (11971/46042) Resolving deltas: 27% (12432/46042) Resolving deltas: 28% (12892/46042) Resolving deltas: 29% (13353/46042) Resolving deltas: 30% (13813/46042) Resolving deltas: 31% (14274/46042) Resolving deltas: 32% (14734/46042) Resolving deltas: 33% (15194/46042) Resolving deltas: 34% (15655/46042) Resolving deltas: 35% (16115/46042) Resolving deltas: 36% (16576/46042) Resolving deltas: 37% (17036/46042) Resolving deltas: 38% (17496/46042) Resolving deltas: 39% (17957/46042) Resolving deltas: 40% (18417/46042) Resolving deltas: 41% (18878/46042) Resolving deltas: 42% (19338/46042) Resolving deltas: 43% (19799/46042) Resolving deltas: 44% (20259/46042) Resolving deltas: 45% (20719/46042) Resolving deltas: 46% (21180/46042) Resolving deltas: 47% (21640/46042) Resolving deltas: 48% (22101/46042) Resolving deltas: 49% (22561/46042) Resolving deltas: 50% (23021/46042) Resolving deltas: 51% (23482/46042) Resolving deltas: 52% (23942/46042) Resolving deltas: 53% (24403/46042) Resolving deltas: 54% (24863/46042) Resolving deltas: 55% (25324/46042) Resolving deltas: 56% (25784/46042) Resolving deltas: 57% (26244/46042) Resolving deltas: 58% (26705/46042) Resolving deltas: 59% (27166/46042) Resolving deltas: 60% (27626/46042) Resolving deltas: 61% (28086/46042) Resolving deltas: 62% (28547/46042) Resolving deltas: 63% (29007/46042) Resolving deltas: 64% (29467/46042) Resolving deltas: 65% (29928/46042) Resolving deltas: 66% (30388/46042) Resolving deltas: 67% (30849/46042) Resolving deltas: 68% (31309/46042) Resolving deltas: 69% (31769/46042) Resolving deltas: 70% (32230/46042) Resolving deltas: 71% (32690/46042) Resolving deltas: 71% (32748/46042) Resolving deltas: 72% (33152/46042) Resolving deltas: 73% (33611/46042) Resolving deltas: 74% (34072/46042) Resolving deltas: 75% (34532/46042) Resolving deltas: 76% (34992/46042) Resolving deltas: 77% (35453/46042) Resolving deltas: 78% (35913/46042) Resolving deltas: 79% (36374/46042) Resolving deltas: 80% (36834/46042) Resolving deltas: 81% (37295/46042) Resolving deltas: 82% (37755/46042) Resolving deltas: 83% (38215/46042) Resolving deltas: 84% (38676/46042) Resolving deltas: 85% (39136/46042) Resolving deltas: 86% (39597/46042) Resolving deltas: 87% (40057/46042) Resolving deltas: 88% (40517/46042) Resolving deltas: 89% (40978/46042) Resolving deltas: 90% (41438/46042) Resolving deltas: 91% (41899/46042) Resolving deltas: 92% (42359/46042) Resolving deltas: 93% (42820/46042) Resolving deltas: 94% (43280/46042) Resolving deltas: 95% (43740/46042) Resolving deltas: 96% (44201/46042) Resolving deltas: 97% (44661/46042) Resolving deltas: 98% (45122/46042) Resolving deltas: 99% (45582/46042) Resolving deltas: 100% (46042/46042) Resolving deltas: 100% (46042/46042), done.
  9. 8.02 s Fetching commit de1fcd35ce25218ec941344369f9e542139a673d for finite_T_and_mu ...
  10. 8.02 s $ /nix/store/bcnisk3ydfgv26v2gw3zlky24g00yww2-git-2.54.0/bin/git fetch origin de1fcd35ce25218ec941344369f9e542139a673d
  11. 8.60 s From https://github.com/alphal00p/gammaloop
  12. 8.60 s * branch de1fcd35ce25218ec941344369f9e542139a673d -> FETCH_HEAD
  13. 8.67 s $ /nix/store/9ypz3flqsrl5xl495mm8h645gadjsxi1-coreutils-9.11/bin/timeout --kill-after=15s 7200s /nix/store/bcnisk3ydfgv26v2gw3zlky24g00yww2-git-2.54.0/bin/git -c advice.detachedHead=false checkout de1fcd35ce25218ec941344369f9e542139a673d
  14. 8.95 s HEAD is now at de1fcd35 fix integrated counterterm orientation localization
  15. 8.96 s $ /nix/store/9ypz3flqsrl5xl495mm8h645gadjsxi1-coreutils-9.11/bin/timeout --kill-after=15s 7200s /nix/store/23zk8sgzamrbmj1fday15szf7f2279s8-nix-2.34.7/bin/nix --extra-experimental-features nix-command --extra-experimental-features flakes --log-format internal-json run .#packages.x86_64-linux.nix-ci-check-gammaloop-nextest-python-api --print-build-logs
  16. 9.64 s error (ignored): SQLite database '/var/cache/nix-ci-worker/eval-cache-v6/236836d192e3189eaf5ff1d2159b989a5433dded7d996aca53c52fa23761689f.sqlite' is busy
  17. 17.57 s
  18. 27.70 s evaluating derivation 'g copying '/nix/store/jlx6 evaluating derivation 'g copying '/nix/store/jlx6 evaluating derivation 'g copying '/nix/store/jlx6 evaluating derivation 'g copying '/nix/store/jlx6 evaluating derivation 'g copying '/nix/store/jlx6 evaluating derivation 'g copying '/nix/store/jlx6 evaluating derivation 'g copying '/nix/store/jlx6 evaluating derivation 'g copying '/nix/store/jlx6 evaluating derivation 'g copying '/nix/store/jlx6 evaluating derivation 'g copying '/nix/store/jlx6 evaluating derivation 'g copying '/nix/store/jlx6 evaluating derivation 'g copying '/nix/store/jlx6 evaluating derivation 'g [0/1 built] [1/0/1 built] building ggammaloop-nextest-python-api> Extracting 1 binary, 1 build script output directory, and 3 linked paths to /build/nextest-archive-FhUZtG
  19. 27.78 s gammaloop-nextest-python-api> Extracted 18 files to /build/nextest-archive-FhUZtG in 0.08s
  20. 27.81 s gammaloop-nextest-python-api> ------------
  21. 27.81 s gammaloop-nextest-python-api> Nextest run ID 7c853691-c126-4dcb-a0ad-e99c4eb0e33f with nextest profile: ci_gammaloop
  22. 27.81 s gammaloop-nextest-python-api> Starting 5 tests across 1 binary
  23. 28.05 s gammaloop-nextest-python-api> FAIL [ 0.234s] (1/5) gammaloop-integration-tests::test_python_api python_session_getters_return_live_toml_and_command_blocks
  24. 28.05 s gammaloop-nextest-python-api> stdout ---
  25. 28.05 s gammaloop-nextest-python-api>
  26. 28.05 s gammaloop-nextest-python-api> running 1 test
  27. 28.05 s gammaloop-nextest-python-api> test python_session_getters_return_live_toml_and_command_blocks ... FAILED
  28. 28.05 s gammaloop-nextest-python-api>
  29. 28.05 s gammaloop-nextest-python-api> failures:
  30. 28.05 s gammaloop-nextest-python-api>
  31. 28.05 s gammaloop-nextest-python-api> failures:
  32. 28.05 s gammaloop-nextest-python-api> python_session_getters_return_live_toml_and_command_blocks
  33. 28.05 s gammaloop-nextest-python-api>
  34. 28.05 s gammaloop-nextest-python-api> test result: FAILED. 0 passed; 1 failed; 0 ignored; 0 measured; 4 filtered out; finished in 0.22s
  35. 28.05 s gammaloop-nextest-python-api>
  36. 28.05 s gammaloop-nextest-python-api> stderr ---
  37. 28.05 s gammaloop-nextest-python-api> Error: Python API test subprocess failed.
  38. 28.05 s gammaloop-nextest-python-api> stdout:
  39. 28.05 s gammaloop-nextest-python-api> ┌────────────────────────────────────────────────────────┐
  40. 28.05 s gammaloop-nextest-python-api> │ You are running a restricted Symbolica instance. │
  41. 28.05 s gammaloop-nextest-python-api> │ │
  42. 28.05 s gammaloop-nextest-python-api> │ This mode is only permitted for non-commercial use and │
  43. 28.05 s gammaloop-nextest-python-api> │ is limited to one instance and core per machine. │
  44. 28.05 s gammaloop-nextest-python-api> │ │
  45. 28.05 s gammaloop-nextest-python-api> │ Hobbyists can easily acquire a free license key │
  46. 28.05 s gammaloop-nextest-python-api> │ that unlocks all cores and removes this banner: │
  47. 28.05 s gammaloop-nextest-python-api> │ │
  48. 28.05 s gammaloop-nextest-python-api> │ from symbolica import * │
  49. 28.05 s gammaloop-nextest-python-api> │ request_hobbyist_license('YOUR_NAME', 'YOUR_EMAIL') │
  50. 28.05 s gammaloop-nextest-python-api> │ │
  51. 28.05 s gammaloop-nextest-python-api> │ All other users can obtain a free 30-day trial key: │
  52. 28.05 s gammaloop-nextest-python-api> │ │
  53. 28.05 s gammaloop-nextest-python-api> │ from symbolica import * │
  54. 28.05 s gammaloop-nextest-python-api> │ request_trial_license('NAME', 'EMAIL', 'EMPLOYER') │
  55. 28.05 s gammaloop-nextest-python-api> │ │
  56. 28.05 s gammaloop-nextest-python-api> │ See https://symbolica.io/docs/get_started.html#license │
  57. 28.05 s gammaloop-nextest-python-api> └────────────────────────────────────────────────────────┘
  58. 28.05 s gammaloop-nextest-python-api> ┌───────────────────────────────────────────────────────────────────────────────────────────────────────────┐
  59. 28.05 s gammaloop-nextest-python-api> │ Cannot start new unlicensed Symbolica instance since there is already another one running on the machine. │
  60. 28.05 s gammaloop-nextest-python-api> └───────────────────────────────────────────────────────────────────────────────────────────────────────────┘
  61. 28.05 s gammaloop-nextest-python-api>
  62. 28.05 s gammaloop-nextest-python-api> stderr:
  63. 28.05 s gammaloop-nextest-python-api> ┌───────────────────────────────────┐
  64. 28.05 s gammaloop-nextest-python-api> │ The Symbolica license has expired │
  65. 28.05 s gammaloop-nextest-python-api> └───────────────────────────────────┘
  66. 28.05 s gammaloop-nextest-python-api>
  67. 28.05 s gammaloop-nextest-python-api>
  68. 28.05 s gammaloop-nextest-python-api> Location:
  69. 28.05 s gammaloop-nextest-python-api> tests/tests/test_python_api.rs:156:20
  70. 28.05 s gammaloop-nextest-python-api>
  71. 28.07 s gammaloop-nextest-python-api> FAIL [ 0.257s] (2/5) gammaloop-integration-tests::test_python_api python_evaluate_samples_batch_and_momentum_space_have_expected_shape
  72. 28.07 s gammaloop-nextest-python-api> stdout ---
  73. 28.07 s gammaloop-nextest-python-api>
  74. 28.07 s gammaloop-nextest-python-api> running 1 test
  75. 28.07 s gammaloop-nextest-python-api> test python_evaluate_samples_batch_and_momentum_space_have_expected_shape ... FAILED
  76. 28.07 s gammaloop-nextest-python-api>
  77. 28.07 s gammaloop-nextest-python-api> failures:
  78. 28.07 s gammaloop-nextest-python-api>
  79. 28.07 s gammaloop-nextest-python-api> failures:
  80. 28.07 s gammaloop-nextest-python-api> python_evaluate_samples_batch_and_momentum_space_have_expected_shape
  81. 28.07 s gammaloop-nextest-python-api>
  82. 28.07 s gammaloop-nextest-python-api> test result: FAILED. 0 passed; 1 failed; 0 ignored; 0 measured; 4 filtered out; finished in 0.25s
  83. 28.07 s gammaloop-nextest-python-api>
  84. 28.07 s gammaloop-nextest-python-api> stderr ---
  85. 28.07 s gammaloop-nextest-python-api> Error: Python API test subprocess failed.
  86. 28.07 s gammaloop-nextest-python-api> stdout:
  87. 28.07 s gammaloop-nextest-python-api> ┌────────────────────────────────────────────────────────┐
  88. 28.07 s gammaloop-nextest-python-api> │ You are running a restricted Symbolica instance. │
  89. 28.07 s gammaloop-nextest-python-api> │ │
  90. 28.07 s gammaloop-nextest-python-api> │ This mode is only permitted for non-commercial use and │
  91. 28.07 s gammaloop-nextest-python-api> │ is limited to one instance and core per machine. │
  92. 28.07 s gammaloop-nextest-python-api> │ │
  93. 28.07 s gammaloop-nextest-python-api> │ Hobbyists can easily acquire a free license key │
  94. 28.07 s gammaloop-nextest-python-api> │ that unlocks all cores and removes this banner: │
  95. 28.07 s gammaloop-nextest-python-api> │ │
  96. 28.07 s gammaloop-nextest-python-api> │ from symbolica import * │
  97. 28.07 s gammaloop-nextest-python-api> │ request_hobbyist_license('YOUR_NAME', 'YOUR_EMAIL') │
  98. 28.07 s gammaloop-nextest-python-api> │ │
  99. 28.07 s gammaloop-nextest-python-api> │ All other users can obtain a free 30-day trial key: │
  100. 28.07 s gammaloop-nextest-python-api> │ │
  101. 28.07 s gammaloop-nextest-python-api> │ from symbolica import * │
  102. 28.07 s gammaloop-nextest-python-api> │ request_trial_license('NAME', 'EMAIL', 'EMPLOYER') │
  103. 28.07 s gammaloop-nextest-python-api> │ │
  104. 28.07 s gammaloop-nextest-python-api> │ See https://symbolica.io/docs/get_started.html#license │
  105. 28.07 s gammaloop-nextest-python-api> └────────────────────────────────────────────────────────┘
  106. 28.07 s gammaloop-nextest-python-api> ┌───────────────────────────────────────────────────────────────────────────────────────────────────────────┐
  107. 28.07 s gammaloop-nextest-python-api> │ Cannot start new unlicensed Symbolica instance since there is already another one running on the machine. │
  108. 28.07 s gammaloop-nextest-python-api> └───────────────────────────────────────────────────────────────────────────────────────────────────────────┘
  109. 28.07 s gammaloop-nextest-python-api>
  110. 28.07 s gammaloop-nextest-python-api> stderr:
  111. 28.07 s gammaloop-nextest-python-api> ┌───────────────────────────────────┐
  112. 28.07 s gammaloop-nextest-python-api> │ The Symbolica license has expired │
  113. 28.07 s gammaloop-nextest-python-api> └───────────────────────────────────┘
  114. 28.07 s gammaloop-nextest-python-api>
  115. 28.07 s gammaloop-nextest-python-api>
  116. 28.07 s gammaloop-nextest-python-api> Location:
  117. 28.07 s gammaloop-nextest-python-api> tests/tests/test_python_api.rs:156:20
  118. 28.07 s gammaloop-nextest-python-api>
  119. 28.11 s gammaloop-nextest-python-api> FAIL [ 0.296s] (3/5) gammaloop-integration-tests::test_python_api python_evaluate_sample_honors_generate_events_and_observable_snapshots
  120. 28.11 s gammaloop-nextest-python-api> stdout ---
  121. 28.11 s gammaloop-nextest-python-api>
  122. 28.11 s gammaloop-nextest-python-api> running 1 test
  123. 28.11 s gammaloop-nextest-python-api> test python_evaluate_sample_honors_generate_events_and_observable_snapshots ... FAILED
  124. 28.11 s gammaloop-nextest-python-api>
  125. 28.11 s gammaloop-nextest-python-api> failures:
  126. 28.11 s gammaloop-nextest-python-api>
  127. 28.11 s gammaloop-nextest-python-api> failures:
  128. 28.11 s gammaloop-nextest-python-api> python_evaluate_sample_honors_generate_events_and_observable_snapshots
  129. 28.11 s gammaloop-nextest-python-api>
  130. 28.11 s gammaloop-nextest-python-api> test result: FAILED. 0 passed; 1 failed; 0 ignored; 0 measured; 4 filtered out; finished in 0.29s
  131. 28.11 s gammaloop-nextest-python-api>
  132. 28.11 s gammaloop-nextest-python-api> stderr ---
  133. 28.11 s gammaloop-nextest-python-api> Error: Python API test subprocess failed.
  134. 28.11 s gammaloop-nextest-python-api> stdout:
  135. 28.11 s gammaloop-nextest-python-api> ┌────────────────────────────────────────────────────────┐
  136. 28.11 s gammaloop-nextest-python-api> │ You are running a restricted Symbolica instance. │
  137. 28.11 s gammaloop-nextest-python-api> │ │
  138. 28.11 s gammaloop-nextest-python-api> │ This mode is only permitted for non-commercial use and │
  139. 28.11 s gammaloop-nextest-python-api> │ is limited to one instance and core per machine. │
  140. 28.11 s gammaloop-nextest-python-api> │ │
  141. 28.11 s gammaloop-nextest-python-api> │ Hobbyists can easily acquire a free license key │
  142. 28.11 s gammaloop-nextest-python-api> │ that unlocks all cores and removes this banner: │
  143. 28.11 s gammaloop-nextest-python-api> │ │
  144. 28.11 s gammaloop-nextest-python-api> │ from symbolica import * │
  145. 28.11 s gammaloop-nextest-python-api> │ request_hobbyist_license('YOUR_NAME', 'YOUR_EMAIL') │
  146. 28.11 s gammaloop-nextest-python-api> │ │
  147. 28.11 s gammaloop-nextest-python-api> │ All other users can obtain a free 30-day trial key: │
  148. 28.11 s gammaloop-nextest-python-api> │ │
  149. 28.11 s gammaloop-nextest-python-api> │ from symbolica import * │
  150. 28.11 s gammaloop-nextest-python-api> │ request_trial_license('NAME', 'EMAIL', 'EMPLOYER') │
  151. 28.11 s gammaloop-nextest-python-api> │ │
  152. 28.11 s gammaloop-nextest-python-api> │ See https://symbolica.io/docs/get_started.html#license │
  153. 28.11 s gammaloop-nextest-python-api> └────────────────────────────────────────────────────────┘
  154. 28.11 s gammaloop-nextest-python-api> ┌───────────────────────────────────────────────────────────────────────────────────────────────────────────┐
  155. 28.11 s gammaloop-nextest-python-api> │ Cannot start new unlicensed Symbolica instance since there is already another one running on the machine. │
  156. 28.11 s gammaloop-nextest-python-api> └───────────────────────────────────────────────────────────────────────────────────────────────────────────┘
  157. 28.11 s gammaloop-nextest-python-api>
  158. 28.11 s gammaloop-nextest-python-api> stderr:
  159. 28.11 s gammaloop-nextest-python-api> ┌───────────────────────────────────┐
  160. 28.11 s gammaloop-nextest-python-api> │ The Symbolica license has expired │
  161. 28.11 s gammaloop-nextest-python-api> └───────────────────────────────────┘
  162. 28.11 s gammaloop-nextest-python-api>
  163. 28.11 s gammaloop-nextest-python-api>
  164. 28.11 s gammaloop-nextest-python-api> Location:
  165. 28.11 s gammaloop-nextest-python-api> tests/tests/test_python_api.rs:156:20
  166. 28.11 s gammaloop-nextest-python-api>
  167. 28.16 s gammaloop-nextest-python-api> FAIL [ 0.346s] (4/5) gammaloop-integration-tests::test_python_api python_evaluate_sample_preserves_graph_grouping_and_incoming_pdgs
  168. 28.16 s gammaloop-nextest-python-api> stdout ---
  169. 28.16 s gammaloop-nextest-python-api>
  170. 28.16 s gammaloop-nextest-python-api> running 1 test
  171. 28.16 s gammaloop-nextest-python-api> test python_evaluate_sample_preserves_graph_grouping_and_incoming_pdgs ... FAILED
  172. 28.16 s gammaloop-nextest-python-api>
  173. 28.16 s gammaloop-nextest-python-api> failures:
  174. 28.16 s gammaloop-nextest-python-api>
  175. 28.16 s gammaloop-nextest-python-api> failures:
  176. 28.16 s gammaloop-nextest-python-api> python_evaluate_sample_preserves_graph_grouping_and_incoming_pdgs
  177. 28.16 s gammaloop-nextest-python-api>
  178. 28.16 s gammaloop-nextest-python-api> test result: FAILED. 0 passed; 1 failed; 0 ignored; 0 measured; 4 filtered out; finished in 0.34s
  179. 28.16 s gammaloop-nextest-python-api>
  180. 28.16 s gammaloop-nextest-python-api> stderr ---
  181. 28.16 s gammaloop-nextest-python-api> Error: Python API test subprocess failed.
  182. 28.16 s gammaloop-nextest-python-api> stdout:
  183. 28.16 s gammaloop-nextest-python-api> ┌────────────────────────────────────────────────────────┐
  184. 28.16 s gammaloop-nextest-python-api> │ You are running a restricted Symbolica instance. │
  185. 28.16 s gammaloop-nextest-python-api> │ │
  186. 28.16 s gammaloop-nextest-python-api> │ This mode is only permitted for non-commercial use and │
  187. 28.16 s gammaloop-nextest-python-api> │ is limited to one instance and core per machine. │
  188. 28.16 s gammaloop-nextest-python-api> │ │
  189. 28.16 s gammaloop-nextest-python-api> │ Hobbyists can easily acquire a free license key │
  190. 28.16 s gammaloop-nextest-python-api> │ that unlocks all cores and removes this banner: │
  191. 28.16 s gammaloop-nextest-python-api> │ │
  192. 28.16 s gammaloop-nextest-python-api> │ from symbolica import * │
  193. 28.16 s gammaloop-nextest-python-api> │ request_hobbyist_license('YOUR_NAME', 'YOUR_EMAIL') │
  194. 28.16 s gammaloop-nextest-python-api> │ │
  195. 28.16 s gammaloop-nextest-python-api> │ All other users can obtain a free 30-day trial key: │
  196. 28.16 s gammaloop-nextest-python-api> │ │
  197. 28.16 s gammaloop-nextest-python-api> │ from symbolica import * │
  198. 28.16 s gammaloop-nextest-python-api> │ request_trial_license('NAME', 'EMAIL', 'EMPLOYER') │
  199. 28.16 s gammaloop-nextest-python-api> │ │
  200. 28.16 s gammaloop-nextest-python-api> │ See https://symbolica.io/docs/get_started.html#license │
  201. 28.16 s gammaloop-nextest-python-api> └────────────────────────────────────────────────────────┘
  202. 28.16 s gammaloop-nextest-python-api> ┌───────────────────────────────────────────────────────────────────────────────────────────────────────────┐
  203. 28.16 s gammaloop-nextest-python-api> │ Cannot start new unlicensed Symbolica instance since there is already another one running on the machine. │
  204. 28.16 s gammaloop-nextest-python-api> └───────────────────────────────────────────────────────────────────────────────────────────────────────────┘
  205. 28.16 s gammaloop-nextest-python-api>
  206. 28.16 s gammaloop-nextest-python-api> stderr:
  207. 28.16 s gammaloop-nextest-python-api> ┌───────────────────────────────────┐
  208. 28.16 s gammaloop-nextest-python-api> │ The Symbolica license has expired │
  209. 28.16 s gammaloop-nextest-python-api> └───────────────────────────────────┘
  210. 28.16 s gammaloop-nextest-python-api> [2026-09-01 10:05:46.432] @gammaloop_api::se... INFO : Running command import model sm-default
  211. 28.16 s gammaloop-nextest-python-api> [2026-09-01 10:05:46.432] @import::model INFO : Loading built-in JSON model sm-default
  212. 28.16 s gammaloop-nextest-python-api> [2026-09-01 10:05:46.471] @gammalooprs::model INFO : The following 15 external parameters were forced to zero by the restriction card:
  213. 28.16 s gammaloop-nextest-python-api> lamWS, AWS, rhoWS, etaWS, ymc, yme, ymm, MC, Me, MM, WTau, muQ, muLe, muLmu, muLtau
  214. 28.16 s gammaloop-nextest-python-api> [2026-09-01 10:05:46.472] @gammalooprs::model INFO : The following 34 vertex rules were removed by the restriction card:
  215. 28.16 s gammaloop-nextest-python-api> V_82 -> (c~, d, G+) | V_83 -> (t~, d, G+) | V_84 -> (c~, s, G+) | V_85 -> (t~, s, G+) | V_86 -> (u~, b, G+) | V_87 -> (c~, b, G+) | V_90 -> (c~, d, W+) | V_91 -> (t~, d, W+) | V_92 -> (u~, s, W+) | V_94 -> (t~, s, W+) | V_95 -> (u~, b, W+) | V_96 -> (c~, b, W+) | V_101 -> (e+, e-, G0) | V_102 -> (mu+, mu-, G0) | V_104 -> (e+, e-, H) | V_105 -> (mu+, mu-, H) | V_110 -> (ve~, e-, G+) | V_111 -> (vm~, mu-, G+) | V_116 -> (b~, u, G-) | V_117 -> (d~, c, G-) | V_118 -> (s~, c, G-) | V_119 -> (b~, c, G-) | V_120 -> (d~, t, G-) | V_121 -> (s~, t, G-) | V_124 -> (s~, u, W-) | V_125 -> (b~, u, W-) | V_126 -> (d~, c, W-) | V_128 -> (b~, c, W-) | V_129 -> (d~, t, W-) | V_130 -> (s~, t, W-) | V_138 -> (c~, c, G0) | V_140 -> (c~, c, H) | V_145 -> (e+, ve, G-) | V_146 -> (mu+, vm, G-)
  216. 28.16 s gammaloop-nextest-python-api> [2026-09-01 10:05:46.472] @gammalooprs::model INFO : The following 36 couplings were removed by the restriction card:
  217. 28.16 s gammaloop-nextest-python-api> GC_13, GC_14, GC_16, GC_17, GC_18, GC_19, GC_20, GC_22, GC_23, GC_24, GC_25, GC_26, GC_28, GC_29, GC_42, GC_43, GC_44, GC_46, GC_47, GC_48, GC_84, GC_85, GC_86, GC_87, GC_88, GC_89, GC_90, GC_91, GC_92, GC_93, GC_101, GC_102, GC_103, GC_105, GC_106, GC_107
  218. 28.16 s gammaloop-nextest-python-api> [2026-09-01 10:05:46.472] @gammaloop_api::se... INFO : Running command set default-runtime kv kinematics.externals='{"type":"constant","data":{"momenta":[[32.0,0.0,0.0,32.0],[32.0,0.0,0.0,-32.0]],"helicities":[1,1]}}'
  219. 28.16 s gammaloop-nextest-python-api> [2026-09-01 10:05:46.473] @gammaloop_api::se... INFO : Running command set default-runtime kv subtraction.disable_threshold_subtraction=true
  220. 28.16 s gammaloop-nextest-python-api> [2026-09-01 10:05:46.474] @gammaloop_api::se... INFO : Running command generate xs e+ e- > d d~ g | e- a d g QED^2==4 [{{2}} QCD=0] --numerator-grouping group_identical_graphs_up_to_sign --clear-existing-processes --only-diagrams
  221. 28.16 s gammaloop-nextest-python-api> [2026-09-01 10:05:46.476] @feyngen::diagram_... INFO : 0s | Δ=0s | Starting Feynman graph generation with Symbolica...
  222. 28.16 s gammaloop-nextest-python-api> [2026-09-01 10:05:46.479] @feyngen::diagram_... INFO : 0s | Δ=0s | Number of graphs resulting from Symbolica generation: 246
  223. 28.16 s gammaloop-nextest-python-api> [2026-09-01 10:05:46.481] @feyngen::diagram_... INFO : 0s | Δ=0s | Number of graphs retained after enforcing supergraph particle content: 8
  224. 28.16 s gammaloop-nextest-python-api> [2026-09-01 10:05:46.484] @feyngen::diagram_... INFO : 0s | Δ=0s | Number of graphs retained after removal of vetoed topologies: 8
  225. 28.16 s gammaloop-nextest-python-api> [2026-09-01 10:05:46.484] @feyngen::diagram_... INFO : 0s | Δ=0s | Number of graphs after vertex info assignment: 8
  226. 28.16 s gammaloop-nextest-python-api> [2026-09-01 10:05:46.484] @feyngen::diagram_... INFO : 0s | Δ=0s | Number of graphs after all complete graphs filters are applied: 8
  227. 28.16 s gammaloop-nextest-python-api>
  228. 28.16 s gammaloop-nextest-python-api>
  229. 28.16 s gammaloop-nextest-python-api> Location:
  230. 28.16 s gammaloop-nextest-python-api> tests/tests/test_python_api.rs:156:20
  231. 28.16 s gammaloop-nextest-python-api>
  232. 28.39 s gammaloop-nextest-python-api> FAIL [ 0.573s] (5/5) gammaloop-integration-tests::test_python_api python_settings_wrappers_expose_nested_runtime_and_global_settings
  233. 28.39 s gammaloop-nextest-python-api> stdout ---
  234. 28.39 s gammaloop-nextest-python-api>
  235. 28.39 s gammaloop-nextest-python-api> running 1 test
  236. 28.39 s gammaloop-nextest-python-api> test python_settings_wrappers_expose_nested_runtime_and_global_settings ... FAILED
  237. 28.39 s gammaloop-nextest-python-api>
  238. 28.39 s gammaloop-nextest-python-api> failures:
  239. 28.39 s gammaloop-nextest-python-api>
  240. 28.39 s gammaloop-nextest-python-api> failures:
  241. 28.39 s gammaloop-nextest-python-api> python_settings_wrappers_expose_nested_runtime_and_global_settings
  242. 28.39 s gammaloop-nextest-python-api>
  243. 28.39 s gammaloop-nextest-python-api> test result: FAILED. 0 passed; 1 failed; 0 ignored; 0 measured; 4 filtered out; finished in 0.57s
  244. 28.39 s gammaloop-nextest-python-api>
  245. 28.39 s gammaloop-nextest-python-api> stderr ---
  246. 28.39 s gammaloop-nextest-python-api> Error: Python API test subprocess failed.
  247. 28.39 s gammaloop-nextest-python-api> stdout:
  248. 28.39 s gammaloop-nextest-python-api> ┌────────────────────────────────────────────────────────┐
  249. 28.39 s gammaloop-nextest-python-api> │ You are running a restricted Symbolica instance. │
  250. 28.39 s gammaloop-nextest-python-api> │ │
  251. 28.39 s gammaloop-nextest-python-api> │ This mode is only permitted for non-commercial use and │
  252. 28.39 s gammaloop-nextest-python-api> │ is limited to one instance and core per machine. │
  253. 28.39 s gammaloop-nextest-python-api> │ │
  254. 28.39 s gammaloop-nextest-python-api> │ Hobbyists can easily acquire a free license key │
  255. 28.39 s gammaloop-nextest-python-api> │ that unlocks all cores and removes this banner: │
  256. 28.39 s gammaloop-nextest-python-api> │ │
  257. 28.39 s gammaloop-nextest-python-api> │ from symbolica import * │
  258. 28.39 s gammaloop-nextest-python-api> │ request_hobbyist_license('YOUR_NAME', 'YOUR_EMAIL') │
  259. 28.39 s gammaloop-nextest-python-api> │ │
  260. 28.39 s gammaloop-nextest-python-api> │ All other users can obtain a free 30-day trial key: │
  261. 28.39 s gammaloop-nextest-python-api> │ │
  262. 28.39 s gammaloop-nextest-python-api> │ from symbolica import * │
  263. 28.39 s gammaloop-nextest-python-api> │ request_trial_license('NAME', 'EMAIL', 'EMPLOYER') │
  264. 28.39 s gammaloop-nextest-python-api> │ │
  265. 28.39 s gammaloop-nextest-python-api> │ See https://symbolica.io/docs/get_started.html#license │
  266. 28.39 s gammaloop-nextest-python-api> └────────────────────────────────────────────────────────┘
  267. 28.39 s gammaloop-nextest-python-api> ┌───────────────────────────────────────────────────────────────────────────────────────────────────────────┐
  268. 28.39 s gammaloop-nextest-python-api> │ Cannot start new unlicensed Symbolica instance since there is already another one running on the machine. │
  269. 28.39 s gammaloop-nextest-python-api> └───────────────────────────────────────────────────────────────────────────────────────────────────────────┘
  270. 28.39 s gammaloop-nextest-python-api>
  271. 28.39 s gammaloop-nextest-python-api> stderr:
  272. 28.39 s gammaloop-nextest-python-api> ┌───────────────────────────────────┐
  273. 28.39 s gammaloop-nextest-python-api> │ The Symbolica license has expired │
  274. 28.39 s gammaloop-nextest-python-api> └───────────────────────────────────┘
  275. 28.39 s gammaloop-nextest-python-api>
  276. 28.39 s gammaloop-nextest-python-api>
  277. 28.39 s gammaloop-nextest-python-api> Location:
  278. 28.39 s gammaloop-nextest-python-api> tests/tests/test_python_api.rs:156:20
  279. 28.39 s gammaloop-nextest-python-api>
  280. 28.39 s gammaloop-nextest-python-api> ------------
  281. 28.39 s gammaloop-nextest-python-api> Summary [ 0.576s] 5 tests run: 0 passed, 5 failed, 0 skipped
  282. 28.39 s gammaloop-nextest-python-api> FAIL [ 0.234s] (1/5) gammaloop-integration-tests::test_python_api python_session_getters_return_live_toml_and_command_blocks
  283. 28.39 s gammaloop-nextest-python-api> stdout ---
  284. 28.39 s gammaloop-nextest-python-api>
  285. 28.39 s gammaloop-nextest-python-api> running 1 test
  286. 28.39 s gammaloop-nextest-python-api> test python_session_getters_return_live_toml_and_command_blocks ... FAILED
  287. 28.39 s gammaloop-nextest-python-api>
  288. 28.39 s gammaloop-nextest-python-api> failures:
  289. 28.39 s gammaloop-nextest-python-api>
  290. 28.39 s gammaloop-nextest-python-api> failures:
  291. 28.39 s gammaloop-nextest-python-api> python_session_getters_return_live_toml_and_command_blocks
  292. 28.39 s gammaloop-nextest-python-api>
  293. 28.39 s gammaloop-nextest-python-api> test result: FAILED. 0 passed; 1 failed; 0 ignored; 0 measured; 4 filtered out; finished in 0.22s
  294. 28.39 s gammaloop-nextest-python-api>
  295. 28.39 s gammaloop-nextest-python-api> stderr ---
  296. 28.39 s gammaloop-nextest-python-api> Error: Python API test subprocess failed.
  297. 28.39 s gammaloop-nextest-python-api> stdout:
  298. 28.39 s gammaloop-nextest-python-api> ┌────────────────────────────────────────────────────────┐
  299. 28.39 s gammaloop-nextest-python-api> │ You are running a restricted Symbolica instance. │
  300. 28.39 s gammaloop-nextest-python-api> │ │
  301. 28.39 s gammaloop-nextest-python-api> │ This mode is only permitted for non-commercial use and │
  302. 28.39 s gammaloop-nextest-python-api> │ is limited to one instance and core per machine. │
  303. 28.39 s gammaloop-nextest-python-api> │ │
  304. 28.39 s gammaloop-nextest-python-api> │ Hobbyists can easily acquire a free license key │
  305. 28.39 s gammaloop-nextest-python-api> │ that unlocks all cores and removes this banner: │
  306. 28.39 s gammaloop-nextest-python-api> │ │
  307. 28.39 s gammaloop-nextest-python-api> │ from symbolica import * │
  308. 28.39 s gammaloop-nextest-python-api> │ request_hobbyist_license('YOUR_NAME', 'YOUR_EMAIL') │
  309. 28.39 s gammaloop-nextest-python-api> │ │
  310. 28.39 s gammaloop-nextest-python-api> │ All other users can obtain a free 30-day trial key: │
  311. 28.39 s gammaloop-nextest-python-api> │ │
  312. 28.39 s gammaloop-nextest-python-api> │ from symbolica import * │
  313. 28.39 s gammaloop-nextest-python-api> │ request_trial_license('NAME', 'EMAIL', 'EMPLOYER') │
  314. 28.39 s gammaloop-nextest-python-api> │ │
  315. 28.39 s gammaloop-nextest-python-api> │ See https://symbolica.io/docs/get_started.html#license │
  316. 28.39 s gammaloop-nextest-python-api> └────────────────────────────────────────────────────────┘
  317. 28.39 s gammaloop-nextest-python-api> ┌───────────────────────────────────────────────────────────────────────────────────────────────────────────┐
  318. 28.39 s gammaloop-nextest-python-api> │ Cannot start new unlicensed Symbolica instance since there is already another one running on the machine. │
  319. 28.39 s gammaloop-nextest-python-api> └───────────────────────────────────────────────────────────────────────────────────────────────────────────┘
  320. 28.39 s gammaloop-nextest-python-api>
  321. 28.39 s gammaloop-nextest-python-api> stderr:
  322. 28.39 s gammaloop-nextest-python-api> ┌───────────────────────────────────┐
  323. 28.39 s gammaloop-nextest-python-api> │ The Symbolica license has expired │
  324. 28.39 s gammaloop-nextest-python-api> └───────────────────────────────────┘
  325. 28.39 s gammaloop-nextest-python-api>
  326. 28.39 s gammaloop-nextest-python-api>
  327. 28.39 s gammaloop-nextest-python-api> Location:
  328. 28.39 s gammaloop-nextest-python-api> tests/tests/test_python_api.rs:156:20
  329. 28.39 s gammaloop-nextest-python-api>
  330. 28.39 s gammaloop-nextest-python-api> FAIL [ 0.257s] (2/5) gammaloop-integration-tests::test_python_api python_evaluate_samples_batch_and_momentum_space_have_expected_shape
  331. 28.39 s gammaloop-nextest-python-api> stdout ---
  332. 28.39 s gammaloop-nextest-python-api>
  333. 28.39 s gammaloop-nextest-python-api> running 1 test
  334. 28.39 s gammaloop-nextest-python-api> test python_evaluate_samples_batch_and_momentum_space_have_expected_shape ... FAILED
  335. 28.39 s gammaloop-nextest-python-api>
  336. 28.39 s gammaloop-nextest-python-api> failures:
  337. 28.39 s gammaloop-nextest-python-api>
  338. 28.39 s gammaloop-nextest-python-api> failures:
  339. 28.39 s gammaloop-nextest-python-api> python_evaluate_samples_batch_and_momentum_space_have_expected_shape
  340. 28.39 s gammaloop-nextest-python-api>
  341. 28.39 s gammaloop-nextest-python-api> test result: FAILED. 0 passed; 1 failed; 0 ignored; 0 measured; 4 filtered out; finished in 0.25s
  342. 28.39 s gammaloop-nextest-python-api>
  343. 28.39 s gammaloop-nextest-python-api> stderr ---
  344. 28.39 s gammaloop-nextest-python-api> Error: Python API test subprocess failed.
  345. 28.39 s gammaloop-nextest-python-api> stdout:
  346. 28.39 s gammaloop-nextest-python-api> ┌────────────────────────────────────────────────────────┐
  347. 28.39 s gammaloop-nextest-python-api> │ You are running a restricted Symbolica instance. │
  348. 28.39 s gammaloop-nextest-python-api> │ │
  349. 28.39 s gammaloop-nextest-python-api> │ This mode is only permitted for non-commercial use and │
  350. 28.39 s gammaloop-nextest-python-api> │ is limited to one instance and core per machine. │
  351. 28.39 s gammaloop-nextest-python-api> │ │
  352. 28.39 s gammaloop-nextest-python-api> │ Hobbyists can easily acquire a free license key │
  353. 28.39 s gammaloop-nextest-python-api> │ that unlocks all cores and removes this banner: │
  354. 28.39 s gammaloop-nextest-python-api> │ │
  355. 28.39 s gammaloop-nextest-python-api> │ from symbolica import * │
  356. 28.39 s gammaloop-nextest-python-api> │ request_hobbyist_license('YOUR_NAME', 'YOUR_EMAIL') │
  357. 28.39 s gammaloop-nextest-python-api> │ │
  358. 28.39 s gammaloop-nextest-python-api> │ All other users can obtain a free 30-day trial key: │
  359. 28.39 s gammaloop-nextest-python-api> │ │
  360. 28.39 s gammaloop-nextest-python-api> │ from symbolica import * │
  361. 28.39 s gammaloop-nextest-python-api> │ request_trial_license('NAME', 'EMAIL', 'EMPLOYER') │
  362. 28.39 s gammaloop-nextest-python-api> │ │
  363. 28.39 s gammaloop-nextest-python-api> │ See https://symbolica.io/docs/get_started.html#license │
  364. 28.39 s gammaloop-nextest-python-api> └────────────────────────────────────────────────────────┘
  365. 28.39 s gammaloop-nextest-python-api> ┌───────────────────────────────────────────────────────────────────────────────────────────────────────────┐
  366. 28.39 s gammaloop-nextest-python-api> │ Cannot start new unlicensed Symbolica instance since there is already another one running on the machine. │
  367. 28.39 s gammaloop-nextest-python-api> └───────────────────────────────────────────────────────────────────────────────────────────────────────────┘
  368. 28.39 s gammaloop-nextest-python-api>
  369. 28.39 s gammaloop-nextest-python-api> stderr:
  370. 28.39 s gammaloop-nextest-python-api> ┌───────────────────────────────────┐
  371. 28.39 s gammaloop-nextest-python-api> │ The Symbolica license has expired │
  372. 28.39 s gammaloop-nextest-python-api> └───────────────────────────────────┘
  373. 28.39 s gammaloop-nextest-python-api>
  374. 28.39 s gammaloop-nextest-python-api>
  375. 28.39 s gammaloop-nextest-python-api> Location:
  376. 28.39 s gammaloop-nextest-python-api> tests/tests/test_python_api.rs:156:20
  377. 28.39 s gammaloop-nextest-python-api>
  378. 28.39 s gammaloop-nextest-python-api> FAIL [ 0.296s] (3/5) gammaloop-integration-tests::test_python_api python_evaluate_sample_honors_generate_events_and_observable_snapshots
  379. 28.39 s gammaloop-nextest-python-api> stdout ---
  380. 28.39 s gammaloop-nextest-python-api>
  381. 28.39 s gammaloop-nextest-python-api> running 1 test
  382. 28.39 s gammaloop-nextest-python-api> test python_evaluate_sample_honors_generate_events_and_observable_snapshots ... FAILED
  383. 28.39 s gammaloop-nextest-python-api>
  384. 28.39 s gammaloop-nextest-python-api> failures:
  385. 28.39 s gammaloop-nextest-python-api>
  386. 28.39 s gammaloop-nextest-python-api> failures:
  387. 28.39 s gammaloop-nextest-python-api> python_evaluate_sample_honors_generate_events_and_observable_snapshots
  388. 28.39 s gammaloop-nextest-python-api>
  389. 28.39 s gammaloop-nextest-python-api> test result: FAILED. 0 passed; 1 failed; 0 ignored; 0 measured; 4 filtered out; finished in 0.29s
  390. 28.39 s gammaloop-nextest-python-api>
  391. 28.39 s gammaloop-nextest-python-api> stderr ---
  392. 28.39 s gammaloop-nextest-python-api> Error: Python API test subprocess failed.
  393. 28.39 s gammaloop-nextest-python-api> stdout:
  394. 28.39 s gammaloop-nextest-python-api> ┌────────────────────────────────────────────────────────┐
  395. 28.39 s gammaloop-nextest-python-api> │ You are running a restricted Symbolica instance. │
  396. 28.39 s gammaloop-nextest-python-api> │ │
  397. 28.39 s gammaloop-nextest-python-api> │ This mode is only permitted for non-commercial use and │
  398. 28.39 s gammaloop-nextest-python-api> │ is limited to one instance and core per machine. │
  399. 28.39 s gammaloop-nextest-python-api> │ │
  400. 28.39 s gammaloop-nextest-python-api> │ Hobbyists can easily acquire a free license key │
  401. 28.39 s gammaloop-nextest-python-api> │ that unlocks all cores and removes this banner: │
  402. 28.39 s gammaloop-nextest-python-api> │ │
  403. 28.39 s gammaloop-nextest-python-api> │ from symbolica import * │
  404. 28.39 s gammaloop-nextest-python-api> │ request_hobbyist_license('YOUR_NAME', 'YOUR_EMAIL') │
  405. 28.39 s gammaloop-nextest-python-api> │ │
  406. 28.39 s gammaloop-nextest-python-api> │ All other users can obtain a free 30-day trial key: │
  407. 28.39 s gammaloop-nextest-python-api> │ │
  408. 28.39 s gammaloop-nextest-python-api> │ from symbolica import * │
  409. 28.39 s gammaloop-nextest-python-api> │ request_trial_license('NAME', 'EMAIL', 'EMPLOYER') │
  410. 28.39 s gammaloop-nextest-python-api> │ │
  411. 28.39 s gammaloop-nextest-python-api> │ See https://symbolica.io/docs/get_started.html#license │
  412. 28.39 s gammaloop-nextest-python-api> └────────────────────────────────────────────────────────┘
  413. 28.39 s gammaloop-nextest-python-api> ┌───────────────────────────────────────────────────────────────────────────────────────────────────────────┐
  414. 28.39 s gammaloop-nextest-python-api> │ Cannot start new unlicensed Symbolica instance since there is already another one running on the machine. │
  415. 28.39 s gammaloop-nextest-python-api> └───────────────────────────────────────────────────────────────────────────────────────────────────────────┘
  416. 28.39 s gammaloop-nextest-python-api>
  417. 28.39 s gammaloop-nextest-python-api> stderr:
  418. 28.39 s gammaloop-nextest-python-api> ┌───────────────────────────────────┐
  419. 28.39 s gammaloop-nextest-python-api> │ The Symbolica license has expired │
  420. 28.39 s gammaloop-nextest-python-api> └───────────────────────────────────┘
  421. 28.39 s gammaloop-nextest-python-api>
  422. 28.39 s gammaloop-nextest-python-api>
  423. 28.39 s gammaloop-nextest-python-api> Location:
  424. 28.39 s gammaloop-nextest-python-api> tests/tests/test_python_api.rs:156:20
  425. 28.39 s gammaloop-nextest-python-api>
  426. 28.39 s gammaloop-nextest-python-api> FAIL [ 0.346s] (4/5) gammaloop-integration-tests::test_python_api python_evaluate_sample_preserves_graph_grouping_and_incoming_pdgs
  427. 28.39 s gammaloop-nextest-python-api> stdout ---
  428. 28.39 s gammaloop-nextest-python-api>
  429. 28.39 s gammaloop-nextest-python-api> running 1 test
  430. 28.39 s gammaloop-nextest-python-api> test python_evaluate_sample_preserves_graph_grouping_and_incoming_pdgs ... FAILED
  431. 28.39 s gammaloop-nextest-python-api>
  432. 28.39 s gammaloop-nextest-python-api> failures:
  433. 28.39 s gammaloop-nextest-python-api>
  434. 28.39 s gammaloop-nextest-python-api> failures:
  435. 28.39 s gammaloop-nextest-python-api> python_evaluate_sample_preserves_graph_grouping_and_incoming_pdgs
  436. 28.39 s gammaloop-nextest-python-api>
  437. 28.39 s gammaloop-nextest-python-api> test result: FAILED. 0 passed; 1 failed; 0 ignored; 0 measured; 4 filtered out; finished in 0.34s
  438. 28.39 s gammaloop-nextest-python-api>
  439. 28.39 s gammaloop-nextest-python-api> stderr ---
  440. 28.39 s gammaloop-nextest-python-api> Error: Python API test subprocess failed.
  441. 28.39 s gammaloop-nextest-python-api> stdout:
  442. 28.39 s gammaloop-nextest-python-api> ┌────────────────────────────────────────────────────────┐
  443. 28.39 s gammaloop-nextest-python-api> │ You are running a restricted Symbolica instance. │
  444. 28.39 s gammaloop-nextest-python-api> │ │
  445. 28.39 s gammaloop-nextest-python-api> │ This mode is only permitted for non-commercial use and │
  446. 28.39 s gammaloop-nextest-python-api> │ is limited to one instance and core per machine. │
  447. 28.39 s gammaloop-nextest-python-api> │ │
  448. 28.39 s gammaloop-nextest-python-api> │ Hobbyists can easily acquire a free license key │
  449. 28.39 s gammaloop-nextest-python-api> │ that unlocks all cores and removes this banner: │
  450. 28.39 s gammaloop-nextest-python-api> │ │
  451. 28.39 s gammaloop-nextest-python-api> │ from symbolica import * │
  452. 28.39 s gammaloop-nextest-python-api> │ request_hobbyist_license('YOUR_NAME', 'YOUR_EMAIL') │
  453. 28.39 s gammaloop-nextest-python-api> │ │
  454. 28.39 s gammaloop-nextest-python-api> │ All other users can obtain a free 30-day trial key: │
  455. 28.39 s gammaloop-nextest-python-api> │ │
  456. 28.39 s gammaloop-nextest-python-api> │ from symbolica import * │
  457. 28.39 s gammaloop-nextest-python-api> │ request_trial_license('NAME', 'EMAIL', 'EMPLOYER') │
  458. 28.39 s gammaloop-nextest-python-api> │ │
  459. 28.39 s gammaloop-nextest-python-api> │ See https://symbolica.io/docs/get_started.html#license │
  460. 28.39 s gammaloop-nextest-python-api> └────────────────────────────────────────────────────────┘
  461. 28.39 s gammaloop-nextest-python-api> ┌───────────────────────────────────────────────────────────────────────────────────────────────────────────┐
  462. 28.39 s gammaloop-nextest-python-api> │ Cannot start new unlicensed Symbolica instance since there is already another one running on the machine. │
  463. 28.39 s gammaloop-nextest-python-api> └───────────────────────────────────────────────────────────────────────────────────────────────────────────┘
  464. 28.39 s gammaloop-nextest-python-api>
  465. 28.39 s gammaloop-nextest-python-api> stderr:
  466. 28.39 s gammaloop-nextest-python-api> ┌───────────────────────────────────┐
  467. 28.39 s gammaloop-nextest-python-api> │ The Symbolica license has expired │
  468. 28.39 s gammaloop-nextest-python-api> └───────────────────────────────────┘
  469. 28.39 s gammaloop-nextest-python-api> [2026-09-01 10:05:46.432] @gammaloop_api::se... INFO : Running command import model sm-default
  470. 28.39 s gammaloop-nextest-python-api> [2026-09-01 10:05:46.432] @import::model INFO : Loading built-in JSON model sm-default
  471. 28.39 s gammaloop-nextest-python-api> [2026-09-01 10:05:46.471] @gammalooprs::model INFO : The following 15 external parameters were forced to zero by the restriction card:
  472. 28.39 s gammaloop-nextest-python-api> lamWS, AWS, rhoWS, etaWS, ymc, yme, ymm, MC, Me, MM, WTau, muQ, muLe, muLmu, muLtau
  473. 28.39 s gammaloop-nextest-python-api> [2026-09-01 10:05:46.472] @gammalooprs::model INFO : The following 34 vertex rules were removed by the restriction card:
  474. 28.39 s gammaloop-nextest-python-api> V_82 -> (c~, d, G+) | V_83 -> (t~, d, G+) | V_84 -> (c~, s, G+) | V_85 -> (t~, s, G+) | V_86 -> (u~, b, G+) | V_87 -> (c~, b, G+) | V_90 -> (c~, d, W+) | V_91 -> (t~, d, W+) | V_92 -> (u~, s, W+) | V_94 -> (t~, s, W+) | V_95 -> (u~, b, W+) | V_96 -> (c~, b, W+) | V_101 -> (e+, e-, G0) | V_102 -> (mu+, mu-, G0) | V_104 -> (e+, e-, H) | V_105 -> (mu+, mu-, H) | V_110 -> (ve~, e-, G+) | V_111 -> (vm~, mu-, G+) | V_116 -> (b~, u, G-) | V_117 -> (d~, c, G-) | V_118 -> (s~, c, G-) | V_119 -> (b~, c, G-) | V_120 -> (d~, t, G-) | V_121 -> (s~, t, G-) | V_124 -> (s~, u, W-) | V_125 -> (b~, u, W-) | V_126 -> (d~, c, W-) | V_128 -> (b~, c, W-) | V_129 -> (d~, t, W-) | V_130 -> (s~, t, W-) | V_138 -> (c~, c, G0) | V_140 -> (c~, c, H) | V_145 -> (e+, ve, G-) | V_146 -> (mu+, vm, G-)
  475. 28.39 s gammaloop-nextest-python-api> [2026-09-01 10:05:46.472] @gammalooprs::model INFO : The following 36 couplings were removed by the restriction card:
  476. 28.39 s gammaloop-nextest-python-api> GC_13, GC_14, GC_16, GC_17, GC_18, GC_19, GC_20, GC_22, GC_23, GC_24, GC_25, GC_26, GC_28, GC_29, GC_42, GC_43, GC_44, GC_46, GC_47, GC_48, GC_84, GC_85, GC_86, GC_87, GC_88, GC_89, GC_90, GC_91, GC_92, GC_93, GC_101, GC_102, GC_103, GC_105, GC_106, GC_107
  477. 28.39 s gammaloop-nextest-python-api> [2026-09-01 10:05:46.472] @gammaloop_api::se... INFO : Running command set default-runtime kv kinematics.externals='{"type":"constant","data":{"momenta":[[32.0,0.0,0.0,32.0],[32.0,0.0,0.0,-32.0]],"helicities":[1,1]}}'
  478. 28.39 s gammaloop-nextest-python-api> [2026-09-01 10:05:46.473] @gammaloop_api::se... INFO : Running command set default-runtime kv subtraction.disable_threshold_subtraction=true
  479. 28.39 s gammaloop-nextest-python-api> [2026-09-01 10:05:46.474] @gammaloop_api::se... INFO : Running command generate xs e+ e- > d d~ g | e- a d g QED^2==4 [{{2}} QCD=0] --numerator-grouping group_identical_graphs_up_to_sign --clear-existing-processes --only-diagrams
  480. 28.39 s gammaloop-nextest-python-api> [2026-09-01 10:05:46.476] @feyngen::diagram_... INFO : 0s | Δ=0s | Starting Feynman graph generation with Symbolica...
  481. 28.39 s gammaloop-nextest-python-api> [2026-09-01 10:05:46.479] @feyngen::diagram_... INFO : 0s | Δ=0s | Number of graphs resulting from Symbolica generation: 246
  482. 28.39 s gammaloop-nextest-python-api> [2026-09-01 10:05:46.481] @feyngen::diagram_... INFO : 0s | Δ=0s | Number of graphs retained after enforcing supergraph particle content: 8
  483. 28.39 s gammaloop-nextest-python-api> [2026-09-01 10:05:46.484] @feyngen::diagram_... INFO : 0s | Δ=0s | Number of graphs retained after removal of vetoed topologies: 8
  484. 28.39 s gammaloop-nextest-python-api> [2026-09-01 10:05:46.484] @feyngen::diagram_... INFO : 0s | Δ=0s | Number of graphs after vertex info assignment: 8
  485. 28.39 s gammaloop-nextest-python-api> [2026-09-01 10:05:46.484] @feyngen::diagram_... INFO : 0s | Δ=0s | Number of graphs after all complete graphs filters are applied: 8
  486. 28.39 s gammaloop-nextest-python-api>
  487. 28.39 s gammaloop-nextest-python-api>
  488. 28.39 s gammaloop-nextest-python-api> Location:
  489. 28.39 s gammaloop-nextest-python-api> tests/tests/test_python_api.rs:156:20
  490. 28.39 s gammaloop-nextest-python-api>
  491. 28.39 s gammaloop-nextest-python-api> FAIL [ 0.573s] (5/5) gammaloop-integration-tests::test_python_api python_settings_wrappers_expose_nested_runtime_and_global_settings
  492. 28.39 s gammaloop-nextest-python-api> stdout ---
  493. 28.39 s gammaloop-nextest-python-api>
  494. 28.39 s gammaloop-nextest-python-api> running 1 test
  495. 28.39 s gammaloop-nextest-python-api> test python_settings_wrappers_expose_nested_runtime_and_global_settings ... FAILED
  496. 28.39 s gammaloop-nextest-python-api>
  497. 28.39 s gammaloop-nextest-python-api> failures:
  498. 28.39 s gammaloop-nextest-python-api>
  499. 28.39 s gammaloop-nextest-python-api> failures:
  500. 28.39 s gammaloop-nextest-python-api> python_settings_wrappers_expose_nested_runtime_and_global_settings
  501. 28.39 s gammaloop-nextest-python-api>
  502. 28.39 s gammaloop-nextest-python-api> test result: FAILED. 0 passed; 1 failed; 0 ignored; 0 measured; 4 filtered out; finished in 0.57s
  503. 28.39 s gammaloop-nextest-python-api>
  504. 28.39 s gammaloop-nextest-python-api> stderr ---
  505. 28.39 s gammaloop-nextest-python-api> Error: Python API test subprocess failed.
  506. 28.39 s gammaloop-nextest-python-api> stdout:
  507. 28.39 s gammaloop-nextest-python-api> ┌────────────────────────────────────────────────────────┐
  508. 28.39 s gammaloop-nextest-python-api> │ You are running a restricted Symbolica instance. │
  509. 28.39 s gammaloop-nextest-python-api> │ │
  510. 28.39 s gammaloop-nextest-python-api> │ This mode is only permitted for non-commercial use and │
  511. 28.39 s gammaloop-nextest-python-api> │ is limited to one instance and core per machine. │
  512. 28.39 s gammaloop-nextest-python-api> │ │
  513. 28.39 s gammaloop-nextest-python-api> │ Hobbyists can easily acquire a free license key │
  514. 28.39 s gammaloop-nextest-python-api> │ that unlocks all cores and removes this banner: │
  515. 28.39 s gammaloop-nextest-python-api> │ │
  516. 28.39 s gammaloop-nextest-python-api> │ from symbolica import * │
  517. 28.39 s gammaloop-nextest-python-api> │ request_hobbyist_license('YOUR_NAME', 'YOUR_EMAIL') │
  518. 28.39 s gammaloop-nextest-python-api> │ │
  519. 28.39 s gammaloop-nextest-python-api> │ All other users can obtain a free 30-day trial key: │
  520. 28.39 s gammaloop-nextest-python-api> │ │
  521. 28.39 s gammaloop-nextest-python-api> │ from symbolica import * │
  522. 28.39 s gammaloop-nextest-python-api> │ request_trial_license('NAME', 'EMAIL', 'EMPLOYER') │
  523. 28.39 s gammaloop-nextest-python-api> │ │
  524. 28.39 s gammaloop-nextest-python-api> │ See https://symbolica.io/docs/get_started.html#license │
  525. 28.39 s gammaloop-nextest-python-api> └────────────────────────────────────────────────────────┘
  526. 28.39 s gammaloop-nextest-python-api> ┌───────────────────────────────────────────────────────────────────────────────────────────────────────────┐
  527. 28.39 s gammaloop-nextest-python-api> │ Cannot start new unlicensed Symbolica instance since there is already another one running on the machine. │
  528. 28.39 s gammaloop-nextest-python-api> └───────────────────────────────────────────────────────────────────────────────────────────────────────────┘
  529. 28.39 s gammaloop-nextest-python-api>
  530. 28.39 s gammaloop-nextest-python-api> stderr:
  531. 28.39 s gammaloop-nextest-python-api> ┌───────────────────────────────────┐
  532. 28.39 s gammaloop-nextest-python-api> │ The Symbolica license has expired │
  533. 28.39 s gammaloop-nextest-python-api> └───────────────────────────────────┘
  534. 28.39 s gammaloop-nextest-python-api>
  535. 28.39 s gammaloop-nextest-python-api>
  536. 28.39 s gammaloop-nextest-python-api> Location:
  537. 28.39 s gammaloop-nextest-python-api> tests/tests/test_python_api.rs:156:20
  538. 28.39 s gammaloop-nextest-python-api>
  539. 28.41 s gammaloop-nextest-python-api> error: test run failed
  540. 28.44 s gammaloop-nextest-python-api>
  541. 28.44 s gammaloop-nextest-python-api> ========== nextest test summary ==========
  542. 28.44 s gammaloop-nextest-python-api> report: target/nextest/ci_gammaloop/junit.xml
  543. 28.44 s gammaloop-nextest-python-api> tests: 5, failures: 5, errors: 0
  544. 28.44 s gammaloop-nextest-python-api>
  545. 28.44 s gammaloop-nextest-python-api> 1. gammaloop-integration-tests::test_python_api::python_session_getters_return_live_toml_and_command_blocks
  546. 28.44 s gammaloop-nextest-python-api> failure: test failure with exit code 101
  547. 28.44 s gammaloop-nextest-python-api> Error: Python API test subprocess failed.
  548. 28.44 s gammaloop-nextest-python-api> stdout:
  549. 28.44 s gammaloop-nextest-python-api> ┌────────────────────────────────────────────────────────┐
  550. 28.44 s gammaloop-nextest-python-api> │ You are running a restricted Symbolica instance. │
  551. 28.44 s gammaloop-nextest-python-api> │ │
  552. 28.44 s gammaloop-nextest-python-api> │ This mode is only permitted for non-commercial use and │
  553. 28.44 s gammaloop-nextest-python-api> │ is limited to one instance and core per machine. │
  554. 28.44 s gammaloop-nextest-python-api> │ │
  555. 28.44 s gammaloop-nextest-python-api> │ Hobbyists can easily acquire a free license key │
  556. 28.44 s gammaloop-nextest-python-api> │ that unlocks all cores and removes this banner: │
  557. 28.44 s gammaloop-nextest-python-api> │ │
  558. 28.44 s gammaloop-nextest-python-api> │ from symbolica import * │
  559. 28.44 s gammaloop-nextest-python-api> │ request_hobbyist_license('YOUR_NAME', 'YOUR_EMAIL') │
  560. 28.44 s gammaloop-nextest-python-api> │ │
  561. 28.44 s gammaloop-nextest-python-api> │ All other users can obtain a free 30-day trial key: │
  562. 28.44 s gammaloop-nextest-python-api> │ │
  563. 28.44 s gammaloop-nextest-python-api> │ from symbolica import * │
  564. 28.44 s gammaloop-nextest-python-api> │ request_trial_license('NAME', 'EMAIL', 'EMPLOYER') │
  565. 28.44 s gammaloop-nextest-python-api> │ │
  566. 28.44 s gammaloop-nextest-python-api> │ See https://symbolica.io/docs/get_started.html#license │
  567. 28.44 s gammaloop-nextest-python-api> └────────────────────────────────────────────────────────┘
  568. 28.44 s gammaloop-nextest-python-api> ┌───────────────────────────────────────────────────────────────────────────────────────────────────────────┐
  569. 28.44 s gammaloop-nextest-python-api> │ Cannot start new unlicensed Symbolica instance since there is already another one running on the machine. │
  570. 28.44 s gammaloop-nextest-python-api> └───────────────────────────────────────────────────────────────────────────────────────────────────────────┘
  571. 28.44 s gammaloop-nextest-python-api>
  572. 28.44 s gammaloop-nextest-python-api> stderr:
  573. 28.44 s gammaloop-nextest-python-api> ┌───────────────────────────────────┐
  574. 28.44 s gammaloop-nextest-python-api> │ The Symbolica license has expired │
  575. 28.44 s gammaloop-nextest-python-api> └───────────────────────────────────┘
  576. 28.44 s gammaloop-nextest-python-api>
  577. 28.44 s gammaloop-nextest-python-api>
  578. 28.44 s gammaloop-nextest-python-api> Location:
  579. 28.44 s gammaloop-nextest-python-api> tests/tests/test_python_api.rs:156:20
  580. 28.44 s gammaloop-nextest-python-api> system-out
  581. 28.44 s gammaloop-nextest-python-api> running 1 test
  582. 28.44 s gammaloop-nextest-python-api> test python_session_getters_return_live_toml_and_command_blocks ... FAILED
  583. 28.44 s gammaloop-nextest-python-api>
  584. 28.44 s gammaloop-nextest-python-api> failures:
  585. 28.44 s gammaloop-nextest-python-api>
  586. 28.44 s gammaloop-nextest-python-api> failures:
  587. 28.44 s gammaloop-nextest-python-api> python_session_getters_return_live_toml_and_command_blocks
  588. 28.44 s gammaloop-nextest-python-api>
  589. 28.44 s gammaloop-nextest-python-api> test result: FAILED. 0 passed; 1 failed; 0 ignored; 0 measured; 4 filtered out; finished in 0.22s
  590. 28.44 s gammaloop-nextest-python-api> system-err
  591. 28.44 s gammaloop-nextest-python-api> Error: Python API test subprocess failed.
  592. 28.44 s gammaloop-nextest-python-api> stdout:
  593. 28.44 s gammaloop-nextest-python-api> ┌────────────────────────────────────────────────────────┐
  594. 28.44 s gammaloop-nextest-python-api> │ You are running a restricted Symbolica instance. │
  595. 28.44 s gammaloop-nextest-python-api> │ │
  596. 28.44 s gammaloop-nextest-python-api> │ This mode is only permitted for non-commercial use and │
  597. 28.44 s gammaloop-nextest-python-api> │ is limited to one instance and core per machine. │
  598. 28.44 s gammaloop-nextest-python-api> │ │
  599. 28.44 s gammaloop-nextest-python-api> │ Hobbyists can easily acquire a free license key │
  600. 28.44 s gammaloop-nextest-python-api> │ that unlocks all cores and removes this banner: │
  601. 28.44 s gammaloop-nextest-python-api> │ │
  602. 28.44 s gammaloop-nextest-python-api> │ from symbolica import * │
  603. 28.44 s gammaloop-nextest-python-api> │ request_hobbyist_license('YOUR_NAME', 'YOUR_EMAIL') │
  604. 28.44 s gammaloop-nextest-python-api> │ │
  605. 28.44 s gammaloop-nextest-python-api> │ All other users can obtain a free 30-day trial key: │
  606. 28.44 s gammaloop-nextest-python-api> │ │
  607. 28.44 s gammaloop-nextest-python-api> │ from symbolica import * │
  608. 28.44 s gammaloop-nextest-python-api> │ request_trial_license('NAME', 'EMAIL', 'EMPLOYER') │
  609. 28.44 s gammaloop-nextest-python-api> │ │
  610. 28.44 s gammaloop-nextest-python-api> │ See https://symbolica.io/docs/get_started.html#license │
  611. 28.44 s gammaloop-nextest-python-api> └────────────────────────────────────────────────────────┘
  612. 28.44 s gammaloop-nextest-python-api> ┌───────────────────────────────────────────────────────────────────────────────────────────────────────────┐
  613. 28.44 s gammaloop-nextest-python-api> │ Cannot start new unlicensed Symbolica instance since there is already another one running on the machine. │
  614. 28.44 s gammaloop-nextest-python-api> └───────────────────────────────────────────────────────────────────────────────────────────────────────────┘
  615. 28.44 s gammaloop-nextest-python-api>
  616. 28.44 s gammaloop-nextest-python-api> stderr:
  617. 28.44 s gammaloop-nextest-python-api> ┌───────────────────────────────────┐
  618. 28.44 s gammaloop-nextest-python-api> │ The Symbolica license has expired │
  619. 28.44 s gammaloop-nextest-python-api> └───────────────────────────────────┘
  620. 28.44 s gammaloop-nextest-python-api>
  621. 28.44 s gammaloop-nextest-python-api>
  622. 28.44 s gammaloop-nextest-python-api> Location:
  623. 28.44 s gammaloop-nextest-python-api> tests/tests/test_python_api.rs:156:20
  624. 28.44 s gammaloop-nextest-python-api>
  625. 28.44 s gammaloop-nextest-python-api> 2. gammaloop-integration-tests::test_python_api::python_evaluate_samples_batch_and_momentum_space_have_expected_shape
  626. 28.44 s gammaloop-nextest-python-api> failure: test failure with exit code 101
  627. 28.44 s gammaloop-nextest-python-api> Error: Python API test subprocess failed.
  628. 28.44 s gammaloop-nextest-python-api> stdout:
  629. 28.44 s gammaloop-nextest-python-api> ┌────────────────────────────────────────────────────────┐
  630. 28.44 s gammaloop-nextest-python-api> │ You are running a restricted Symbolica instance. │
  631. 28.44 s gammaloop-nextest-python-api> │ │
  632. 28.44 s gammaloop-nextest-python-api> │ This mode is only permitted for non-commercial use and │
  633. 28.44 s gammaloop-nextest-python-api> │ is limited to one instance and core per machine. │
  634. 28.44 s gammaloop-nextest-python-api> │ │
  635. 28.44 s gammaloop-nextest-python-api> │ Hobbyists can easily acquire a free license key │
  636. 28.44 s gammaloop-nextest-python-api> │ that unlocks all cores and removes this banner: │
  637. 28.44 s gammaloop-nextest-python-api> │ │
  638. 28.44 s gammaloop-nextest-python-api> │ from symbolica import * │
  639. 28.44 s gammaloop-nextest-python-api> │ request_hobbyist_license('YOUR_NAME', 'YOUR_EMAIL') │
  640. 28.44 s gammaloop-nextest-python-api> │ │
  641. 28.44 s gammaloop-nextest-python-api> │ All other users can obtain a free 30-day trial key: │
  642. 28.44 s gammaloop-nextest-python-api> │ │
  643. 28.44 s gammaloop-nextest-python-api> │ from symbolica import * │
  644. 28.44 s gammaloop-nextest-python-api> │ request_trial_license('NAME', 'EMAIL', 'EMPLOYER') │
  645. 28.44 s gammaloop-nextest-python-api> │ │
  646. 28.44 s gammaloop-nextest-python-api> │ See https://symbolica.io/docs/get_started.html#license │
  647. 28.44 s gammaloop-nextest-python-api> └────────────────────────────────────────────────────────┘
  648. 28.44 s gammaloop-nextest-python-api> ┌───────────────────────────────────────────────────────────────────────────────────────────────────────────┐
  649. 28.44 s gammaloop-nextest-python-api> │ Cannot start new unlicensed Symbolica instance since there is already another one running on the machine. │
  650. 28.44 s gammaloop-nextest-python-api> └───────────────────────────────────────────────────────────────────────────────────────────────────────────┘
  651. 28.44 s gammaloop-nextest-python-api>
  652. 28.44 s gammaloop-nextest-python-api> stderr:
  653. 28.44 s gammaloop-nextest-python-api> ┌───────────────────────────────────┐
  654. 28.44 s gammaloop-nextest-python-api> │ The Symbolica license has expired │
  655. 28.44 s gammaloop-nextest-python-api> └───────────────────────────────────┘
  656. 28.44 s gammaloop-nextest-python-api>
  657. 28.44 s gammaloop-nextest-python-api>
  658. 28.44 s gammaloop-nextest-python-api> Location:
  659. 28.44 s gammaloop-nextest-python-api> tests/tests/test_python_api.rs:156:20
  660. 28.44 s gammaloop-nextest-python-api> system-out
  661. 28.44 s gammaloop-nextest-python-api> running 1 test
  662. 28.44 s gammaloop-nextest-python-api> test python_evaluate_samples_batch_and_momentum_space_have_expected_shape ... FAILED
  663. 28.44 s gammaloop-nextest-python-api>
  664. 28.44 s gammaloop-nextest-python-api> failures:
  665. 28.44 s gammaloop-nextest-python-api>
  666. 28.44 s gammaloop-nextest-python-api> failures:
  667. 28.44 s gammaloop-nextest-python-api> python_evaluate_samples_batch_and_momentum_space_have_expected_shape
  668. 28.44 s gammaloop-nextest-python-api>
  669. 28.44 s gammaloop-nextest-python-api> test result: FAILED. 0 passed; 1 failed; 0 ignored; 0 measured; 4 filtered out; finished in 0.25s
  670. 28.44 s gammaloop-nextest-python-api> system-err
  671. 28.44 s gammaloop-nextest-python-api> Error: Python API test subprocess failed.
  672. 28.44 s gammaloop-nextest-python-api> stdout:
  673. 28.44 s gammaloop-nextest-python-api> ┌────────────────────────────────────────────────────────┐
  674. 28.44 s gammaloop-nextest-python-api> │ You are running a restricted Symbolica instance. │
  675. 28.44 s gammaloop-nextest-python-api> │ │
  676. 28.44 s gammaloop-nextest-python-api> │ This mode is only permitted for non-commercial use and │
  677. 28.44 s gammaloop-nextest-python-api> │ is limited to one instance and core per machine. │
  678. 28.44 s gammaloop-nextest-python-api> │ │
  679. 28.44 s gammaloop-nextest-python-api> │ Hobbyists can easily acquire a free license key │
  680. 28.44 s gammaloop-nextest-python-api> │ that unlocks all cores and removes this banner: │
  681. 28.44 s gammaloop-nextest-python-api> │ │
  682. 28.44 s gammaloop-nextest-python-api> │ from symbolica import * │
  683. 28.44 s gammaloop-nextest-python-api> │ request_hobbyist_license('YOUR_NAME', 'YOUR_EMAIL') │
  684. 28.44 s gammaloop-nextest-python-api> │ │
  685. 28.44 s gammaloop-nextest-python-api> │ All other users can obtain a free 30-day trial key: │
  686. 28.44 s gammaloop-nextest-python-api> │ │
  687. 28.44 s gammaloop-nextest-python-api> │ from symbolica import * │
  688. 28.44 s gammaloop-nextest-python-api> │ request_trial_license('NAME', 'EMAIL', 'EMPLOYER') │
  689. 28.44 s gammaloop-nextest-python-api> │ │
  690. 28.44 s gammaloop-nextest-python-api> │ See https://symbolica.io/docs/get_started.html#license │
  691. 28.44 s gammaloop-nextest-python-api> └────────────────────────────────────────────────────────┘
  692. 28.44 s gammaloop-nextest-python-api> ┌───────────────────────────────────────────────────────────────────────────────────────────────────────────┐
  693. 28.44 s gammaloop-nextest-python-api> │ Cannot start new unlicensed Symbolica instance since there is already another one running on the machine. │
  694. 28.44 s gammaloop-nextest-python-api> └───────────────────────────────────────────────────────────────────────────────────────────────────────────┘
  695. 28.44 s gammaloop-nextest-python-api>
  696. 28.44 s gammaloop-nextest-python-api> stderr:
  697. 28.44 s gammaloop-nextest-python-api> ┌───────────────────────────────────┐
  698. 28.44 s gammaloop-nextest-python-api> │ The Symbolica license has expired │
  699. 28.44 s gammaloop-nextest-python-api> └───────────────────────────────────┘
  700. 28.44 s gammaloop-nextest-python-api>
  701. 28.44 s gammaloop-nextest-python-api>
  702. 28.44 s gammaloop-nextest-python-api> Location:
  703. 28.44 s gammaloop-nextest-python-api> tests/tests/test_python_api.rs:156:20
  704. 28.44 s gammaloop-nextest-python-api>
  705. 28.44 s gammaloop-nextest-python-api> 3. gammaloop-integration-tests::test_python_api::python_evaluate_sample_honors_generate_events_and_observable_snapshots
  706. 28.44 s gammaloop-nextest-python-api> failure: test failure with exit code 101
  707. 28.44 s gammaloop-nextest-python-api> Error: Python API test subprocess failed.
  708. 28.44 s gammaloop-nextest-python-api> stdout:
  709. 28.44 s gammaloop-nextest-python-api> ┌────────────────────────────────────────────────────────┐
  710. 28.44 s gammaloop-nextest-python-api> │ You are running a restricted Symbolica instance. │
  711. 28.44 s gammaloop-nextest-python-api> │ │
  712. 28.44 s gammaloop-nextest-python-api> │ This mode is only permitted for non-commercial use and │
  713. 28.44 s gammaloop-nextest-python-api> │ is limited to one instance and core per machine. │
  714. 28.44 s gammaloop-nextest-python-api> │ │
  715. 28.44 s gammaloop-nextest-python-api> │ Hobbyists can easily acquire a free license key │
  716. 28.44 s gammaloop-nextest-python-api> │ that unlocks all cores and removes this banner: │
  717. 28.44 s gammaloop-nextest-python-api> │ │
  718. 28.44 s gammaloop-nextest-python-api> │ from symbolica import * │
  719. 28.44 s gammaloop-nextest-python-api> │ request_hobbyist_license('YOUR_NAME', 'YOUR_EMAIL') │
  720. 28.44 s gammaloop-nextest-python-api> │ │
  721. 28.44 s gammaloop-nextest-python-api> │ All other users can obtain a free 30-day trial key: │
  722. 28.44 s gammaloop-nextest-python-api> │ │
  723. 28.44 s gammaloop-nextest-python-api> │ from symbolica import * │
  724. 28.44 s gammaloop-nextest-python-api> │ request_trial_license('NAME', 'EMAIL', 'EMPLOYER') │
  725. 28.44 s gammaloop-nextest-python-api> │ │
  726. 28.44 s gammaloop-nextest-python-api> │ See https://symbolica.io/docs/get_started.html#license │
  727. 28.44 s gammaloop-nextest-python-api> └────────────────────────────────────────────────────────┘
  728. 28.44 s gammaloop-nextest-python-api> ┌───────────────────────────────────────────────────────────────────────────────────────────────────────────┐
  729. 28.44 s gammaloop-nextest-python-api> │ Cannot start new unlicensed Symbolica instance since there is already another one running on the machine. │
  730. 28.44 s gammaloop-nextest-python-api> └───────────────────────────────────────────────────────────────────────────────────────────────────────────┘
  731. 28.44 s gammaloop-nextest-python-api>
  732. 28.44 s gammaloop-nextest-python-api> stderr:
  733. 28.44 s gammaloop-nextest-python-api> ┌───────────────────────────────────┐
  734. 28.44 s gammaloop-nextest-python-api> │ The Symbolica license has expired │
  735. 28.44 s gammaloop-nextest-python-api> └───────────────────────────────────┘
  736. 28.44 s gammaloop-nextest-python-api>
  737. 28.44 s gammaloop-nextest-python-api>
  738. 28.44 s gammaloop-nextest-python-api> Location:
  739. 28.44 s gammaloop-nextest-python-api> tests/tests/test_python_api.rs:156:20
  740. 28.44 s gammaloop-nextest-python-api> system-out
  741. 28.44 s gammaloop-nextest-python-api> running 1 test
  742. 28.44 s gammaloop-nextest-python-api> test python_evaluate_sample_honors_generate_events_and_observable_snapshots ... FAILED
  743. 28.44 s gammaloop-nextest-python-api>
  744. 28.44 s gammaloop-nextest-python-api> failures:
  745. 28.44 s gammaloop-nextest-python-api>
  746. 28.44 s gammaloop-nextest-python-api> failures:
  747. 28.44 s gammaloop-nextest-python-api> python_evaluate_sample_honors_generate_events_and_observable_snapshots
  748. 28.44 s gammaloop-nextest-python-api>
  749. 28.44 s gammaloop-nextest-python-api> test result: FAILED. 0 passed; 1 failed; 0 ignored; 0 measured; 4 filtered out; finished in 0.29s
  750. 28.44 s gammaloop-nextest-python-api> system-err
  751. 28.44 s gammaloop-nextest-python-api> Error: Python API test subprocess failed.
  752. 28.44 s gammaloop-nextest-python-api> stdout:
  753. 28.44 s gammaloop-nextest-python-api> ┌────────────────────────────────────────────────────────┐
  754. 28.44 s gammaloop-nextest-python-api> │ You are running a restricted Symbolica instance. │
  755. 28.44 s gammaloop-nextest-python-api> │ │
  756. 28.44 s gammaloop-nextest-python-api> │ This mode is only permitted for non-commercial use and │
  757. 28.44 s gammaloop-nextest-python-api> │ is limited to one instance and core per machine. │
  758. 28.44 s gammaloop-nextest-python-api> │ │
  759. 28.44 s gammaloop-nextest-python-api> │ Hobbyists can easily acquire a free license key │
  760. 28.44 s gammaloop-nextest-python-api> │ that unlocks all cores and removes this banner: │
  761. 28.44 s gammaloop-nextest-python-api> │ │
  762. 28.44 s gammaloop-nextest-python-api> │ from symbolica import * │
  763. 28.44 s gammaloop-nextest-python-api> │ request_hobbyist_license('YOUR_NAME', 'YOUR_EMAIL') │
  764. 28.44 s gammaloop-nextest-python-api> │ │
  765. 28.44 s gammaloop-nextest-python-api> │ All other users can obtain a free 30-day trial key: │
  766. 28.44 s gammaloop-nextest-python-api> │ │
  767. 28.44 s gammaloop-nextest-python-api> │ from symbolica import * │
  768. 28.44 s gammaloop-nextest-python-api> │ request_trial_license('NAME', 'EMAIL', 'EMPLOYER') │
  769. 28.44 s gammaloop-nextest-python-api> │ │
  770. 28.44 s gammaloop-nextest-python-api> │ See https://symbolica.io/docs/get_started.html#license │
  771. 28.44 s gammaloop-nextest-python-api> └────────────────────────────────────────────────────────┘
  772. 28.44 s gammaloop-nextest-python-api> ┌───────────────────────────────────────────────────────────────────────────────────────────────────────────┐
  773. 28.44 s gammaloop-nextest-python-api> │ Cannot start new unlicensed Symbolica instance since there is already another one running on the machine. │
  774. 28.44 s gammaloop-nextest-python-api> └───────────────────────────────────────────────────────────────────────────────────────────────────────────┘
  775. 28.44 s gammaloop-nextest-python-api>
  776. 28.44 s gammaloop-nextest-python-api> stderr:
  777. 28.44 s gammaloop-nextest-python-api> ┌───────────────────────────────────┐
  778. 28.44 s gammaloop-nextest-python-api> │ The Symbolica license has expired │
  779. 28.44 s gammaloop-nextest-python-api> └───────────────────────────────────┘
  780. 28.44 s gammaloop-nextest-python-api>
  781. 28.44 s gammaloop-nextest-python-api>
  782. 28.44 s gammaloop-nextest-python-api> Location:
  783. 28.44 s gammaloop-nextest-python-api> tests/tests/test_python_api.rs:156:20
  784. 28.44 s gammaloop-nextest-python-api>
  785. 28.44 s gammaloop-nextest-python-api> 4. gammaloop-integration-tests::test_python_api::python_evaluate_sample_preserves_graph_grouping_and_incoming_pdgs
  786. 28.44 s gammaloop-nextest-python-api> failure: test failure with exit code 101
  787. 28.44 s gammaloop-nextest-python-api> Error: Python API test subprocess failed.
  788. 28.44 s gammaloop-nextest-python-api> stdout:
  789. 28.44 s gammaloop-nextest-python-api> ┌────────────────────────────────────────────────────────┐
  790. 28.44 s gammaloop-nextest-python-api> │ You are running a restricted Symbolica instance. │
  791. 28.44 s gammaloop-nextest-python-api> │ │
  792. 28.44 s gammaloop-nextest-python-api> │ This mode is only permitted for non-commercial use and │
  793. 28.44 s gammaloop-nextest-python-api> │ is limited to one instance and core per machine. │
  794. 28.44 s gammaloop-nextest-python-api> │ │
  795. 28.44 s gammaloop-nextest-python-api> │ Hobbyists can easily acquire a free license key │
  796. 28.44 s gammaloop-nextest-python-api> │ that unlocks all cores and removes this banner: │
  797. 28.44 s gammaloop-nextest-python-api> │ │
  798. 28.44 s gammaloop-nextest-python-api> │ from symbolica import * │
  799. 28.44 s gammaloop-nextest-python-api> │ request_hobbyist_license('YOUR_NAME', 'YOUR_EMAIL') │
  800. 28.44 s gammaloop-nextest-python-api> │ │
  801. 28.44 s gammaloop-nextest-python-api> │ All other users can obtain a free 30-day trial key: │
  802. 28.44 s gammaloop-nextest-python-api> │ │
  803. 28.44 s gammaloop-nextest-python-api> │ from symbolica import * │
  804. 28.44 s gammaloop-nextest-python-api> │ request_trial_license('NAME', 'EMAIL', 'EMPLOYER') │
  805. 28.44 s gammaloop-nextest-python-api> │ │
  806. 28.44 s gammaloop-nextest-python-api> │ See https://symbolica.io/docs/get_started.html#license │
  807. 28.44 s gammaloop-nextest-python-api> └────────────────────────────────────────────────────────┘
  808. 28.44 s gammaloop-nextest-python-api> ┌───────────────────────────────────────────────────────────────────────────────────────────────────────────┐
  809. 28.44 s gammaloop-nextest-python-api> │ Cannot start new unlicensed Symbolica instance since there is already another one running on the machine. │
  810. 28.44 s gammaloop-nextest-python-api> └───────────────────────────────────────────────────────────────────────────────────────────────────────────┘
  811. 28.44 s gammaloop-nextest-python-api>
  812. 28.44 s gammaloop-nextest-python-api> stderr:
  813. 28.44 s gammaloop-nextest-python-api> ┌───────────────────────────────────┐
  814. 28.44 s gammaloop-nextest-python-api> │ The Symbolica license has expired │
  815. 28.44 s gammaloop-nextest-python-api> └───────────────────────────────────┘
  816. 28.44 s gammaloop-nextest-python-api> [2026-09-01 10:05:46.432] @gammaloop_api::se... INFO : Running command import model sm-default
  817. 28.44 s gammaloop-nextest-python-api> [2026-09-01 10:05:46.432] @import::model INFO : Loading built-in JSON model sm-default
  818. 28.44 s gammaloop-nextest-python-api> [2026-09-01 10:05:46.471] @gammalooprs::model INFO : The following 15 external parameters were forced to zero by the restriction card:
  819. 28.44 s gammaloop-nextest-python-api> lamWS, AWS, rhoWS, etaWS, ymc, yme, ymm, MC, Me, MM, WTau, muQ, muLe, muLmu, muLtau
  820. 28.44 s gammaloop-nextest-python-api> [2026-09-01 10:05:46.472] @gammalooprs::model INFO : The following 34 vertex rules were removed by the restriction card:
  821. 28.44 s gammaloop-nextest-python-api> V_82 -> (c~, d, G+) | V_83 -> (t~, d, G+) | V_84 -> (c~, s, G+) | V_85 -> (t~, s, G+) | V_86 -> (u~, b, G+) | V_87 -> (c~, b, G+) | V_90 -> (c~, d, W+) | V_91 -> (t~, d, W+) | V_92 -> (u~, s, W+) | V_94 -> (t~, s, W+) | V_95 -> (u~, b, W+) | V_96 -> (c~, b, W+) | V_101 -> (e+, e-, G0) | V_102 -> (mu+, mu-, G0) | V_104 -> (e+, e-, H) | V_105 -> (mu+, mu-, H) | V_110 -> (ve~, e-, G+) | V_111 -> (vm~, mu-, G+) | V_116 -> (b~, u, G-) | V_117 -> (d~, c, G-) | V_118 -> (s~, c, G-) | V_119 -> (b~, c, G-) | V_120 -> (d~, t, G-) | V_121 -> (s~, t, G-) | V_124 -> (s~, u, W-) | V_125 -> (b~, u, W-) | V_126 -> (d~, c, W-) | V_128 -> (b~, c, W-) | V_129 -> (d~, t, W-) | V_130 -> (s~, t, W-) | V_138 -> (c~, c, G0) | V_140 -> (c~, c, H) | V_145 -> (e+, ve, G-) | V_146 -> (mu+, vm, G-)
  822. 28.44 s gammaloop-nextest-python-api> [2026-09-01 10:05:46.472] @gammalooprs::model INFO : The following 36 couplings were removed by the restriction card:
  823. 28.44 s gammaloop-nextest-python-api> GC_13, GC_14, GC_16, GC_17, GC_18, GC_19, GC_20, GC_22, GC_23, GC_24, GC_25, GC_26, GC_28, GC_29, GC_42, GC_43, GC_44, GC_46, GC_47, GC_48, GC_84, GC_85, GC_86, GC_87, GC_88, GC_89, GC_90, GC_91, GC_92, GC_93, GC_101, GC_102, GC_103, GC_105, GC_106, GC_107
  824. 28.44 s gammaloop-nextest-python-api> [2026-09-01 10:05:46.472] @gammaloop_api::se... INFO : Running command set default-runtime kv kinematics.externals='{"type":"constant","data":{"momenta":[[32.0,0.0,0.0,32.0],[32.0,0.0,0.0,-32.0]],"helicities":[1,1]}}'
  825. 28.44 s gammaloop-nextest-python-api> [2026-09-01 10:05:46.473] @gammaloop_api::se... INFO : Running command set default-runtime kv subtraction.disable_threshold_subtraction=true
  826. 28.44 s gammaloop-nextest-python-api> [2026-09-01 10:05:46.474] @gammaloop_api::se... INFO : Running command generate xs e+ e- > d d~ g | e- a d g QED^2==4 [{{2}} QCD=0] --numerator-grouping group_identical_graphs_up_to_sign --clear-existing-processes --only-diagrams
  827. 28.44 s gammaloop-nextest-python-api> [2026-09-01 10:05:46.476] @feyngen::diagram_... INFO : 0s | Δ=0s | Starting Feynman graph generation with Symbolica...
  828. 28.44 s gammaloop-nextest-python-api> [2026-09-01 10:05:46.479] @feyngen::diagram_... INFO : 0s | Δ=0s | Number of graphs resulting from Symbolica generation: 246
  829. 28.44 s gammaloop-nextest-python-api> [2026-09-01 10:05:46.481] @feyngen::diagram_... INFO : 0s | Δ=0s | Number of graphs retained after enforcing supergraph particle content: 8
  830. 28.44 s gammaloop-nextest-python-api> [2026-09-01 10:05:46.484] @feyngen::diagram_... INFO : 0s | Δ=0s | Number of graphs retained after removal of vetoed topologies: 8
  831. 28.44 s gammaloop-nextest-python-api> [2026-09-01 10:05:46.484] @feyngen::diagram_... INFO : 0s | Δ=0s | Number of graphs after vertex info assignment: 8
  832. 28.44 s gammaloop-nextest-python-api> [2026-09-01 10:05:46.484] @feyngen::diagram_... INFO : 0s | Δ=0s | Number of graphs after all complete graphs filters are applied: 8
  833. 28.44 s gammaloop-nextest-python-api>
  834. 28.44 s gammaloop-nextest-python-api>
  835. 28.44 s gammaloop-nextest-python-api> Location:
  836. 28.44 s gammaloop-nextest-python-api> tests/tests/test_python_api.rs:156:20
  837. 28.44 s gammaloop-nextest-python-api> system-out
  838. 28.44 s gammaloop-nextest-python-api> running 1 test
  839. 28.44 s gammaloop-nextest-python-api> test python_evaluate_sample_preserves_graph_grouping_and_incoming_pdgs ... FAILED
  840. 28.44 s gammaloop-nextest-python-api>
  841. 28.44 s gammaloop-nextest-python-api> failures:
  842. 28.44 s gammaloop-nextest-python-api>
  843. 28.44 s gammaloop-nextest-python-api> failures:
  844. 28.44 s gammaloop-nextest-python-api> python_evaluate_sample_preserves_graph_grouping_and_incoming_pdgs
  845. 28.44 s gammaloop-nextest-python-api>
  846. 28.44 s gammaloop-nextest-python-api> test result: FAILED. 0 passed; 1 failed; 0 ignored; 0 measured; 4 filtered out; finished in 0.34s
  847. 28.44 s gammaloop-nextest-python-api> system-err
  848. 28.44 s gammaloop-nextest-python-api> Error: Python API test subprocess failed.
  849. 28.44 s gammaloop-nextest-python-api> stdout:
  850. 28.44 s gammaloop-nextest-python-api> ┌────────────────────────────────────────────────────────┐
  851. 28.44 s gammaloop-nextest-python-api> │ You are running a restricted Symbolica instance. │
  852. 28.44 s gammaloop-nextest-python-api> │ │
  853. 28.44 s gammaloop-nextest-python-api> │ This mode is only permitted for non-commercial use and │
  854. 28.44 s gammaloop-nextest-python-api> │ is limited to one instance and core per machine. │
  855. 28.44 s gammaloop-nextest-python-api> │ │
  856. 28.44 s gammaloop-nextest-python-api> │ Hobbyists can easily acquire a free license key │
  857. 28.44 s gammaloop-nextest-python-api> │ that unlocks all cores and removes this banner: │
  858. 28.44 s gammaloop-nextest-python-api> │ │
  859. 28.44 s gammaloop-nextest-python-api> │ from symbolica import * │
  860. 28.44 s gammaloop-nextest-python-api> │ request_hobbyist_license('YOUR_NAME', 'YOUR_EMAIL') │
  861. 28.44 s gammaloop-nextest-python-api> │ │
  862. 28.44 s gammaloop-nextest-python-api> │ All other users can obtain a free 30-day trial key: │
  863. 28.44 s gammaloop-nextest-python-api> │ │
  864. 28.44 s gammaloop-nextest-python-api> │ from symbolica import * │
  865. 28.44 s gammaloop-nextest-python-api> │ request_trial_license('NAME', 'EMAIL', 'EMPLOYER') │
  866. 28.44 s gammaloop-nextest-python-api> │ │
  867. 28.44 s gammaloop-nextest-python-api> │ See https://symbolica.io/docs/get_started.html#license │
  868. 28.44 s gammaloop-nextest-python-api> └────────────────────────────────────────────────────────┘
  869. 28.44 s gammaloop-nextest-python-api> ┌───────────────────────────────────────────────────────────────────────────────────────────────────────────┐
  870. 28.44 s gammaloop-nextest-python-api> │ Cannot start new unlicensed Symbolica instance since there is already another one running on the machine. │
  871. 28.44 s gammaloop-nextest-python-api> └───────────────────────────────────────────────────────────────────────────────────────────────────────────┘
  872. 28.44 s gammaloop-nextest-python-api>
  873. 28.44 s gammaloop-nextest-python-api> stderr:
  874. 28.44 s gammaloop-nextest-python-api> ┌───────────────────────────────────┐
  875. 28.44 s gammaloop-nextest-python-api> │ The Symbolica license has expired │
  876. 28.44 s gammaloop-nextest-python-api> └───────────────────────────────────┘
  877. 28.44 s gammaloop-nextest-python-api> [2026-09-01 10:05:46.432] @gammaloop_api::se... INFO : Running command import model sm-default
  878. 28.44 s gammaloop-nextest-python-api> [2026-09-01 10:05:46.432] @import::model INFO : Loading built-in JSON model sm-default
  879. 28.44 s gammaloop-nextest-python-api> [2026-09-01 10:05:46.471] @gammalooprs::model INFO : The following 15 external parameters were forced to zero by the restriction card:
  880. 28.44 s gammaloop-nextest-python-api> lamWS, AWS, rhoWS, etaWS, ymc, yme, ymm, MC, Me, MM, WTau, muQ, muLe, muLmu, muLtau
  881. 28.44 s gammaloop-nextest-python-api> [2026-09-01 10:05:46.472] @gammalooprs::model INFO : The following 34 vertex rules were removed by the restriction card:
  882. 28.44 s gammaloop-nextest-python-api> V_82 -> (c~, d, G+) | V_83 -> (t~, d, G+) | V_84 -> (c~, s, G+) | V_85 -> (t~, s, G+) | V_86 -> (u~, b, G+) | V_87 -> (c~, b, G+) | V_90 -> (c~, d, W+) | V_91 -> (t~, d, W+) | V_92 -> (u~, s, W+) | V_94 -> (t~, s, W+) | V_95 -> (u~, b, W+) | V_96 -> (c~, b, W+) | V_101 -> (e+, e-, G0) | V_102 -> (mu+, mu-, G0) | V_104 -> (e+, e-, H) | V_105 -> (mu+, mu-, H) | V_110 -> (ve~, e-, G+) | V_111 -> (vm~, mu-, G+) | V_116 -> (b~, u, G-) | V_117 -> (d~, c, G-) | V_118 -> (s~, c, G-) | V_119 -> (b~, c, G-) | V_120 -> (d~, t, G-) | V_121 -> (s~, t, G-) | V_124 -> (s~, u, W-) | V_125 -> (b~, u, W-) | V_126 -> (d~, c, W-) | V_128 -> (b~, c, W-) | V_129 -> (d~, t, W-) | V_130 -> (s~, t, W-) | V_138 -> (c~, c, G0) | V_140 -> (c~, c, H) | V_145 -> (e+, ve, G-) | V_146 -> (mu+, vm, G-)
  883. 28.44 s gammaloop-nextest-python-api> [2026-09-01 10:05:46.472] @gammalooprs::model INFO : The following 36 couplings were removed by the restriction card:
  884. 28.44 s gammaloop-nextest-python-api> GC_13, GC_14, GC_16, GC_17, GC_18, GC_19, GC_20, GC_22, GC_23, GC_24, GC_25, GC_26, GC_28, GC_29, GC_42, GC_43, GC_44, GC_46, GC_47, GC_48, GC_84, GC_85, GC_86, GC_87, GC_88, GC_89, GC_90, GC_91, GC_92, GC_93, GC_101, GC_102, GC_103, GC_105, GC_106, GC_107
  885. 28.44 s gammaloop-nextest-python-api> [2026-09-01 10:05:46.472] @gammaloop_api::se... INFO : Running command set default-runtime kv kinematics.externals='{"type":"constant","data":{"momenta":[[32.0,0.0,0.0,32.0],[32.0,0.0,0.0,-32.0]],"helicities":[1,1]}}'
  886. 28.44 s gammaloop-nextest-python-api> [2026-09-01 10:05:46.473] @gammaloop_api::se... INFO : Running command set default-runtime kv subtraction.disable_threshold_subtraction=true
  887. 28.44 s gammaloop-nextest-python-api> [2026-09-01 10:05:46.474] @gammaloop_api::se... INFO : Running command generate xs e+ e- > d d~ g | e- a d g QED^2==4 [{{2}} QCD=0] --numerator-grouping group_identical_graphs_up_to_sign --clear-existing-processes --only-diagrams
  888. 28.44 s gammaloop-nextest-python-api> [2026-09-01 10:05:46.476] @feyngen::diagram_... INFO : 0s | Δ=0s | Starting Feynman graph generation with Symbolica...
  889. 28.44 s gammaloop-nextest-python-api> [2026-09-01 10:05:46.479] @feyngen::diagram_... INFO : 0s | Δ=0s | Number of graphs resulting from Symbolica generation: 246
  890. 28.44 s gammaloop-nextest-python-api> [2026-09-01 10:05:46.481] @feyngen::diagram_... INFO : 0s | Δ=0s | Number of graphs retained after enforcing supergraph particle content: 8
  891. 28.44 s gammaloop-nextest-python-api> [2026-09-01 10:05:46.484] @feyngen::diagram_... INFO : 0s | Δ=0s | Number of graphs retained after removal of vetoed topologies: 8
  892. 28.44 s gammaloop-nextest-python-api> [2026-09-01 10:05:46.484] @feyngen::diagram_... INFO : 0s | Δ=0s | Number of graphs after vertex info assignment: 8
  893. 28.44 s gammaloop-nextest-python-api> [2026-09-01 10:05:46.484] @feyngen::diagram_... INFO : 0s | Δ=0s | Number of graphs after all complete graphs filters are applied: 8
  894. 28.44 s gammaloop-nextest-python-api>
  895. 28.44 s gammaloop-nextest-python-api>
  896. 28.44 s gammaloop-nextest-python-api> Location:
  897. 28.44 s gammaloop-nextest-python-api> tests/tests/test_python_api.rs:156:20
  898. 28.44 s gammaloop-nextest-python-api>
  899. 28.44 s gammaloop-nextest-python-api> 5. gammaloop-integration-tests::test_python_api::python_settings_wrappers_expose_nested_runtime_and_global_settings
  900. 28.44 s gammaloop-nextest-python-api> failure: test failure with exit code 101
  901. 28.44 s gammaloop-nextest-python-api> Error: Python API test subprocess failed.
  902. 28.44 s gammaloop-nextest-python-api> stdout:
  903. 28.44 s gammaloop-nextest-python-api> ┌────────────────────────────────────────────────────────┐
  904. 28.44 s gammaloop-nextest-python-api> │ You are running a restricted Symbolica instance. │
  905. 28.44 s gammaloop-nextest-python-api> │ │
  906. 28.44 s gammaloop-nextest-python-api> │ This mode is only permitted for non-commercial use and │
  907. 28.44 s gammaloop-nextest-python-api> │ is limited to one instance and core per machine. │
  908. 28.44 s gammaloop-nextest-python-api> │ │
  909. 28.44 s gammaloop-nextest-python-api> │ Hobbyists can easily acquire a free license key │
  910. 28.44 s gammaloop-nextest-python-api> │ that unlocks all cores and removes this banner: │
  911. 28.44 s gammaloop-nextest-python-api> │ │
  912. 28.44 s gammaloop-nextest-python-api> │ from symbolica import * │
  913. 28.44 s gammaloop-nextest-python-api> │ request_hobbyist_license('YOUR_NAME', 'YOUR_EMAIL') │
  914. 28.44 s gammaloop-nextest-python-api> │ │
  915. 28.44 s gammaloop-nextest-python-api> │ All other users can obtain a free 30-day trial key: │
  916. 28.44 s gammaloop-nextest-python-api> │ │
  917. 28.44 s gammaloop-nextest-python-api> │ from symbolica import * │
  918. 28.44 s gammaloop-nextest-python-api> │ request_trial_license('NAME', 'EMAIL', 'EMPLOYER') │
  919. 28.44 s gammaloop-nextest-python-api> │ │
  920. 28.44 s gammaloop-nextest-python-api> │ See https://symbolica.io/docs/get_started.html#license │
  921. 28.44 s gammaloop-nextest-python-api> └────────────────────────────────────────────────────────┘
  922. 28.44 s gammaloop-nextest-python-api> ┌───────────────────────────────────────────────────────────────────────────────────────────────────────────┐
  923. 28.44 s gammaloop-nextest-python-api> │ Cannot start new unlicensed Symbolica instance since there is already another one running on the machine. │
  924. 28.44 s gammaloop-nextest-python-api> └───────────────────────────────────────────────────────────────────────────────────────────────────────────┘
  925. 28.44 s gammaloop-nextest-python-api>
  926. 28.44 s gammaloop-nextest-python-api> stderr:
  927. 28.44 s gammaloop-nextest-python-api> ┌───────────────────────────────────┐
  928. 28.44 s gammaloop-nextest-python-api> │ The Symbolica license has expired │
  929. 28.44 s gammaloop-nextest-python-api> └───────────────────────────────────┘
  930. 28.44 s gammaloop-nextest-python-api>
  931. 28.44 s gammaloop-nextest-python-api>
  932. 28.44 s gammaloop-nextest-python-api> Location:
  933. 28.44 s gammaloop-nextest-python-api> tests/tests/test_python_api.rs:156:20
  934. 28.44 s gammaloop-nextest-python-api> system-out
  935. 28.44 s gammaloop-nextest-python-api> running 1 test
  936. 28.44 s gammaloop-nextest-python-api> test python_settings_wrappers_expose_nested_runtime_and_global_settings ... FAILED
  937. 28.44 s gammaloop-nextest-python-api>
  938. 28.44 s gammaloop-nextest-python-api> failures:
  939. 28.44 s gammaloop-nextest-python-api>
  940. 28.44 s gammaloop-nextest-python-api> failures:
  941. 28.44 s gammaloop-nextest-python-api> python_settings_wrappers_expose_nested_runtime_and_global_settings
  942. 28.44 s gammaloop-nextest-python-api>
  943. 28.44 s gammaloop-nextest-python-api> test result: FAILED. 0 passed; 1 failed; 0 ignored; 0 measured; 4 filtered out; finished in 0.57s
  944. 28.44 s gammaloop-nextest-python-api> system-err
  945. 28.44 s gammaloop-nextest-python-api> Error: Python API test subprocess failed.
  946. 28.44 s gammaloop-nextest-python-api> stdout:
  947. 28.44 s gammaloop-nextest-python-api> ┌────────────────────────────────────────────────────────┐
  948. 28.44 s gammaloop-nextest-python-api> │ You are running a restricted Symbolica instance. │
  949. 28.44 s gammaloop-nextest-python-api> │ │
  950. 28.44 s gammaloop-nextest-python-api> │ This mode is only permitted for non-commercial use and │
  951. 28.44 s gammaloop-nextest-python-api> │ is limited to one instance and core per machine. │
  952. 28.44 s gammaloop-nextest-python-api> │ │
  953. 28.44 s gammaloop-nextest-python-api> │ Hobbyists can easily acquire a free license key │
  954. 28.44 s gammaloop-nextest-python-api> │ that unlocks all cores and removes this banner: │
  955. 28.44 s gammaloop-nextest-python-api> │ │
  956. 28.44 s gammaloop-nextest-python-api> │ from symbolica import * │
  957. 28.44 s gammaloop-nextest-python-api> │ request_hobbyist_license('YOUR_NAME', 'YOUR_EMAIL') │
  958. 28.44 s gammaloop-nextest-python-api> │ │
  959. 28.44 s gammaloop-nextest-python-api> │ All other users can obtain a free 30-day trial key: │
  960. 28.44 s gammaloop-nextest-python-api> │ │
  961. 28.44 s gammaloop-nextest-python-api> │ from symbolica import * │
  962. 28.44 s gammaloop-nextest-python-api> │ request_trial_license('NAME', 'EMAIL', 'EMPLOYER') │
  963. 28.44 s gammaloop-nextest-python-api> │ │
  964. 28.44 s gammaloop-nextest-python-api> │ See https://symbolica.io/docs/get_started.html#license │
  965. 28.44 s gammaloop-nextest-python-api> └────────────────────────────────────────────────────────┘
  966. 28.44 s gammaloop-nextest-python-api> ┌───────────────────────────────────────────────────────────────────────────────────────────────────────────┐
  967. 28.44 s gammaloop-nextest-python-api> │ Cannot start new unlicensed Symbolica instance since there is already another one running on the machine. │
  968. 28.44 s gammaloop-nextest-python-api> └───────────────────────────────────────────────────────────────────────────────────────────────────────────┘
  969. 28.44 s gammaloop-nextest-python-api>
  970. 28.44 s gammaloop-nextest-python-api> stderr:
  971. 28.44 s gammaloop-nextest-python-api> ┌───────────────────────────────────┐
  972. 28.44 s gammaloop-nextest-python-api> │ The Symbolica license has expired │
  973. 28.44 s gammaloop-nextest-python-api> └───────────────────────────────────┘
  974. 28.44 s gammaloop-nextest-python-api>
  975. 28.44 s gammaloop-nextest-python-api>
  976. 28.44 s gammaloop-nextest-python-api> Location:
  977. 28.44 s gammaloop-nextest-python-api> tests/tests/test_python_api.rs:156:20
  978. 28.44 s gammaloop-nextest-python-api> =========================================
  979. 28.50 s [0 built (1 failed)]error: Cannot build '/nix/store/90vl6933shlgrvsg0q1k9hbam6pqxvdh-gammaloop-nextest-python-api.drv'.
  980. 28.50 s Reason: builder failed with exit code 100.
  981. 28.50 s Output paths:
  982. 28.50 s /nix/store/ghyr21i59xgm2lhlwag6cmm3fgmdax99-gammaloop-nextest-python-api
  983. 28.50 s Last 961 log lines:
  984. 28.50 s > Extracting 1 binary, 1 build script output directory, and 3 linked paths to /build/nextest-archive-FhUZtG
  985. 28.50 s > Extracted 18 files to /build/nextest-archive-FhUZtG in 0.08s
  986. 28.50 s > ------------
  987. 28.50 s > Nextest run ID 7c853691-c126-4dcb-a0ad-e99c4eb0e33f with nextest profile: ci_gammaloop
  988. 28.50 s > Starting 5 tests across 1 binary
  989. 28.50 s > FAIL [ 0.234s] (1/5) gammaloop-integration-tests::test_python_api python_session_getters_return_live_toml_and_command_blocks
  990. 28.50 s > stdout ---
  991. 28.50 s >
  992. 28.50 s > running 1 test
  993. 28.50 s > test python_session_getters_return_live_toml_and_command_blocks ... FAILED
  994. 28.50 s >
  995. 28.50 s > failures:
  996. 28.50 s >
  997. 28.50 s > failures:
  998. 28.50 s > python_session_getters_return_live_toml_and_command_blocks
  999. 28.50 s >
  1000. 28.50 s > test result: FAILED. 0 passed; 1 failed; 0 ignored; 0 measured; 4 filtered out; finished in 0.22s
  1001. 28.50 s >
  1002. 28.50 s > stderr ---
  1003. 28.50 s > Error: Python API test subprocess failed.
  1004. 28.50 s > stdout:
  1005. 28.50 s > ┌────────────────────────────────────────────────────────┐
  1006. 28.50 s > │ You are running a restricted Symbolica instance. │
  1007. 28.50 s > │ │
  1008. 28.50 s > │ This mode is only permitted for non-commercial use and │
  1009. 28.50 s > │ is limited to one instance and core per machine. │
  1010. 28.50 s > │ │
  1011. 28.50 s > │ Hobbyists can easily acquire a free license key │
  1012. 28.50 s > │ that unlocks all cores and removes this banner: │
  1013. 28.50 s > │ │
  1014. 28.50 s > │ from symbolica import * │
  1015. 28.50 s > │ request_hobbyist_license('YOUR_NAME', 'YOUR_EMAIL') │
  1016. 28.50 s > │ │
  1017. 28.50 s > │ All other users can obtain a free 30-day trial key: │
  1018. 28.50 s > │ │
  1019. 28.50 s > │ from symbolica import * │
  1020. 28.50 s > │ request_trial_license('NAME', 'EMAIL', 'EMPLOYER') │
  1021. 28.50 s > │ │
  1022. 28.50 s > │ See https://symbolica.io/docs/get_started.html#license │
  1023. 28.50 s > └────────────────────────────────────────────────────────┘
  1024. 28.50 s > ┌───────────────────────────────────────────────────────────────────────────────────────────────────────────┐
  1025. 28.50 s > │ Cannot start new unlicensed Symbolica instance since there is already another one running on the machine. │
  1026. 28.51 s > └───────────────────────────────────────────────────────────────────────────────────────────────────────────┘
  1027. 28.51 s >
  1028. 28.51 s > stderr:
  1029. 28.51 s > ┌───────────────────────────────────┐
  1030. 28.51 s > │ The Symbolica license has expired │
  1031. 28.51 s > └───────────────────────────────────┘
  1032. 28.51 s >
  1033. 28.51 s >
  1034. 28.51 s > Location:
  1035. 28.51 s > tests/tests/test_python_api.rs:156:20
  1036. 28.51 s >
  1037. 28.51 s > FAIL [ 0.257s] (2/5) gammaloop-integration-tests::test_python_api python_evaluate_samples_batch_and_momentum_space_have_expected_shape
  1038. 28.51 s > stdout ---
  1039. 28.51 s >
  1040. 28.51 s > running 1 test
  1041. 28.51 s > test python_evaluate_samples_batch_and_momentum_space_have_expected_shape ... FAILED
  1042. 28.51 s >
  1043. 28.51 s > failures:
  1044. 28.51 s >
  1045. 28.51 s > failures:
  1046. 28.51 s > python_evaluate_samples_batch_and_momentum_space_have_expected_shape
  1047. 28.51 s >
  1048. 28.51 s > test result: FAILED. 0 passed; 1 failed; 0 ignored; 0 measured; 4 filtered out; finished in 0.25s
  1049. 28.51 s >
  1050. 28.51 s > stderr ---
  1051. 28.51 s > Error: Python API test subprocess failed.
  1052. 28.51 s > stdout:
  1053. 28.51 s > ┌────────────────────────────────────────────────────────┐
  1054. 28.51 s > │ You are running a restricted Symbolica instance. │
  1055. 28.51 s > │ │
  1056. 28.51 s > │ This mode is only permitted for non-commercial use and │
  1057. 28.51 s > │ is limited to one instance and core per machine. │
  1058. 28.51 s > │ │
  1059. 28.51 s > │ Hobbyists can easily acquire a free license key │
  1060. 28.51 s > │ that unlocks all cores and removes this banner: │
  1061. 28.51 s > │ │
  1062. 28.51 s > │ from symbolica import * │
  1063. 28.51 s > │ request_hobbyist_license('YOUR_NAME', 'YOUR_EMAIL') │
  1064. 28.51 s > │ │
  1065. 28.51 s > │ All other users can obtain a free 30-day trial key: │
  1066. 28.51 s > │ │
  1067. 28.51 s > │ from symbolica import * │
  1068. 28.51 s > │ request_trial_license('NAME', 'EMAIL', 'EMPLOYER') │
  1069. 28.51 s > │ │
  1070. 28.51 s > │ See https://symbolica.io/docs/get_started.html#license │
  1071. 28.51 s > └────────────────────────────────────────────────────────┘
  1072. 28.51 s > ┌───────────────────────────────────────────────────────────────────────────────────────────────────────────┐
  1073. 28.51 s > │ Cannot start new unlicensed Symbolica instance since there is already another one running on the machine. │
  1074. 28.51 s > └───────────────────────────────────────────────────────────────────────────────────────────────────────────┘
  1075. 28.51 s >
  1076. 28.51 s > stderr:
  1077. 28.51 s > ┌───────────────────────────────────┐
  1078. 28.51 s > │ The Symbolica license has expired │
  1079. 28.51 s > └───────────────────────────────────┘
  1080. 28.51 s >
  1081. 28.51 s >
  1082. 28.51 s > Location:
  1083. 28.51 s > tests/tests/test_python_api.rs:156:20
  1084. 28.51 s >
  1085. 28.51 s > FAIL [ 0.296s] (3/5) gammaloop-integration-tests::test_python_api python_evaluate_sample_honors_generate_events_and_observable_snapshots
  1086. 28.51 s > stdout ---
  1087. 28.51 s >
  1088. 28.51 s > running 1 test
  1089. 28.51 s > test python_evaluate_sample_honors_generate_events_and_observable_snapshots ... FAILED
  1090. 28.51 s >
  1091. 28.51 s > failures:
  1092. 28.51 s >
  1093. 28.51 s > failures:
  1094. 28.51 s > python_evaluate_sample_honors_generate_events_and_observable_snapshots
  1095. 28.51 s >
  1096. 28.51 s > test result: FAILED. 0 passed; 1 failed; 0 ignored; 0 measured; 4 filtered out; finished in 0.29s
  1097. 28.51 s >
  1098. 28.51 s > stderr ---
  1099. 28.51 s > Error: Python API test subprocess failed.
  1100. 28.51 s > stdout:
  1101. 28.51 s > ┌────────────────────────────────────────────────────────┐
  1102. 28.51 s > │ You are running a restricted Symbolica instance. │
  1103. 28.51 s > │ │
  1104. 28.51 s > │ This mode is only permitted for non-commercial use and │
  1105. 28.51 s > │ is limited to one instance and core per machine. │
  1106. 28.51 s > │ │
  1107. 28.51 s > │ Hobbyists can easily acquire a free license key │
  1108. 28.51 s > │ that unlocks all cores and removes this banner: │
  1109. 28.51 s > │ │
  1110. 28.51 s > │ from symbolica import * │
  1111. 28.51 s > │ request_hobbyist_license('YOUR_NAME', 'YOUR_EMAIL') │
  1112. 28.51 s > │ │
  1113. 28.51 s > │ All other users can obtain a free 30-day trial key: │
  1114. 28.51 s > │ │
  1115. 28.51 s > │ from symbolica import * │
  1116. 28.51 s > │ request_trial_license('NAME', 'EMAIL', 'EMPLOYER') │
  1117. 28.51 s > │ │
  1118. 28.51 s > │ See https://symbolica.io/docs/get_started.html#license │
  1119. 28.51 s > └────────────────────────────────────────────────────────┘
  1120. 28.51 s > ┌───────────────────────────────────────────────────────────────────────────────────────────────────────────┐
  1121. 28.51 s > │ Cannot start new unlicensed Symbolica instance since there is already another one running on the machine. │
  1122. 28.51 s > └───────────────────────────────────────────────────────────────────────────────────────────────────────────┘
  1123. 28.51 s >
  1124. 28.51 s > stderr:
  1125. 28.51 s > ┌───────────────────────────────────┐
  1126. 28.51 s > │ The Symbolica license has expired │
  1127. 28.51 s > └───────────────────────────────────┘
  1128. 28.51 s >
  1129. 28.51 s >
  1130. 28.51 s > Location:
  1131. 28.51 s > tests/tests/test_python_api.rs:156:20
  1132. 28.51 s >
  1133. 28.51 s > FAIL [ 0.346s] (4/5) gammaloop-integration-tests::test_python_api python_evaluate_sample_preserves_graph_grouping_and_incoming_pdgs
  1134. 28.51 s > stdout ---
  1135. 28.51 s >
  1136. 28.51 s > running 1 test
  1137. 28.51 s > test python_evaluate_sample_preserves_graph_grouping_and_incoming_pdgs ... FAILED
  1138. 28.51 s >
  1139. 28.51 s > failures:
  1140. 28.51 s >
  1141. 28.51 s > failures:
  1142. 28.51 s > python_evaluate_sample_preserves_graph_grouping_and_incoming_pdgs
  1143. 28.51 s >
  1144. 28.51 s > test result: FAILED. 0 passed; 1 failed; 0 ignored; 0 measured; 4 filtered out; finished in 0.34s
  1145. 28.51 s >
  1146. 28.51 s > stderr ---
  1147. 28.51 s > Error: Python API test subprocess failed.
  1148. 28.51 s > stdout:
  1149. 28.51 s > ┌────────────────────────────────────────────────────────┐
  1150. 28.51 s > │ You are running a restricted Symbolica instance. │
  1151. 28.51 s > │ │
  1152. 28.51 s > │ This mode is only permitted for non-commercial use and │
  1153. 28.51 s > │ is limited to one instance and core per machine. │
  1154. 28.51 s > │ │
  1155. 28.51 s > │ Hobbyists can easily acquire a free license key │
  1156. 28.51 s > │ that unlocks all cores and removes this banner: │
  1157. 28.51 s > │ │
  1158. 28.51 s > │ from symbolica import * │
  1159. 28.51 s > │ request_hobbyist_license('YOUR_NAME', 'YOUR_EMAIL') │
  1160. 28.51 s > │ │
  1161. 28.51 s > │ All other users can obtain a free 30-day trial key: │
  1162. 28.51 s > │ │
  1163. 28.51 s > │ from symbolica import * │
  1164. 28.51 s > │ request_trial_license('NAME', 'EMAIL', 'EMPLOYER') │
  1165. 28.51 s > │ │
  1166. 28.51 s > │ See https://symbolica.io/docs/get_started.html#license │
  1167. 28.51 s > └────────────────────────────────────────────────────────┘
  1168. 28.51 s > ┌───────────────────────────────────────────────────────────────────────────────────────────────────────────┐
  1169. 28.51 s > │ Cannot start new unlicensed Symbolica instance since there is already another one running on the machine. │
  1170. 28.51 s > └───────────────────────────────────────────────────────────────────────────────────────────────────────────┘
  1171. 28.51 s >
  1172. 28.51 s > stderr:
  1173. 28.51 s > ┌───────────────────────────────────┐
  1174. 28.51 s > │ The Symbolica license has expired │
  1175. 28.51 s > └───────────────────────────────────┘
  1176. 28.51 s > [2026-09-01 10:05:46.432] @gammaloop_api::se... INFO : Running command import model sm-default
  1177. 28.51 s > [2026-09-01 10:05:46.432] @import::model INFO : Loading built-in JSON model sm-default
  1178. 28.51 s > [2026-09-01 10:05:46.471] @gammalooprs::model INFO : The following 15 external parameters were forced to zero by the restriction card:
  1179. 28.51 s > lamWS, AWS, rhoWS, etaWS, ymc, yme, ymm, MC, Me, MM, WTau, muQ, muLe, muLmu, muLtau
  1180. 28.51 s > [2026-09-01 10:05:46.472] @gammalooprs::model INFO : The following 34 vertex rules were removed by the restriction card:
  1181. 28.51 s > V_82 -> (c~, d, G+) | V_83 -> (t~, d, G+) | V_84 -> (c~, s, G+) | V_85 -> (t~, s, G+) | V_86 -> (u~, b, G+) | V_87 -> (c~, b, G+) | V_90 -> (c~, d, W+) | V_91 -> (t~, d, W+) | V_92 -> (u~, s, W+) | V_94 -> (t~, s, W+) | V_95 -> (u~, b, W+) | V_96 -> (c~, b, W+) | V_101 -> (e+, e-, G0) | V_102 -> (mu+, mu-, G0) | V_104 -> (e+, e-, H) | V_105 -> (mu+, mu-, H) | V_110 -> (ve~, e-, G+) | V_111 -> (vm~, mu-, G+) | V_116 -> (b~, u, G-) | V_117 -> (d~, c, G-) | V_118 -> (s~, c, G-) | V_119 -> (b~, c, G-) | V_120 -> (d~, t, G-) | V_121 -> (s~, t, G-) | V_124 -> (s~, u, W-) | V_125 -> (b~, u, W-) | V_126 -> (d~, c, W-) | V_128 -> (b~, c, W-) | V_129 -> (d~, t, W-) | V_130 -> (s~, t, W-) | V_138 -> (c~, c, G0) | V_140 -> (c~, c, H) | V_145 -> (e+, ve, G-) | V_146 -> (mu+, vm, G-)
  1182. 28.51 s > [2026-09-01 10:05:46.472] @gammalooprs::model INFO : The following 36 couplings were removed by the restriction card:
  1183. 28.51 s > GC_13, GC_14, GC_16, GC_17, GC_18, GC_19, GC_20, GC_22, GC_23, GC_24, GC_25, GC_26, GC_28, GC_29, GC_42, GC_43, GC_44, GC_46, GC_47, GC_48, GC_84, GC_85, GC_86, GC_87, GC_88, GC_89, GC_90, GC_91, GC_92, GC_93, GC_101, GC_102, GC_103, GC_105, GC_106, GC_107
  1184. 28.51 s > [2026-09-01 10:05:46.472] @gammaloop_api::se... INFO : Running command set default-runtime kv kinematics.externals='{"type":"constant","data":{"momenta":[[32.0,0.0,0.0,32.0],[32.0,0.0,0.0,-32.0]],"helicities":[1,1]}}'
  1185. 28.51 s > [2026-09-01 10:05:46.473] @gammaloop_api::se... INFO : Running command set default-runtime kv subtraction.disable_threshold_subtraction=true
  1186. 28.51 s > [2026-09-01 10:05:46.474] @gammaloop_api::se... INFO : Running command generate xs e+ e- > d d~ g | e- a d g QED^2==4 [{{2}} QCD=0] --numerator-grouping group_identical_graphs_up_to_sign --clear-existing-processes --only-diagrams
  1187. 28.51 s > [2026-09-01 10:05:46.476] @feyngen::diagram_... INFO : 0s | Δ=0s | Starting Feynman graph generation with Symbolica...
  1188. 28.51 s > [2026-09-01 10:05:46.479] @feyngen::diagram_... INFO : 0s | Δ=0s | Number of graphs resulting from Symbolica generation: 246
  1189. 28.51 s > [2026-09-01 10:05:46.481] @feyngen::diagram_... INFO : 0s | Δ=0s | Number of graphs retained after enforcing supergraph particle content: 8
  1190. 28.51 s > [2026-09-01 10:05:46.484] @feyngen::diagram_... INFO : 0s | Δ=0s | Number of graphs retained after removal of vetoed topologies: 8
  1191. 28.51 s > [2026-09-01 10:05:46.484] @feyngen::diagram_... INFO : 0s | Δ=0s | Number of graphs after vertex info assignment: 8
  1192. 28.51 s > [2026-09-01 10:05:46.484] @feyngen::diagram_... INFO : 0s | Δ=0s | Number of graphs after all complete graphs filters are applied: 8
  1193. 28.51 s >
  1194. 28.51 s >
  1195. 28.51 s > Location:
  1196. 28.51 s > tests/tests/test_python_api.rs:156:20
  1197. 28.51 s >
  1198. 28.51 s > FAIL [ 0.573s] (5/5) gammaloop-integration-tests::test_python_api python_settings_wrappers_expose_nested_runtime_and_global_settings
  1199. 28.51 s > stdout ---
  1200. 28.51 s >
  1201. 28.51 s > running 1 test
  1202. 28.51 s > test python_settings_wrappers_expose_nested_runtime_and_global_settings ... FAILED
  1203. 28.51 s >
  1204. 28.51 s > failures:
  1205. 28.51 s >
  1206. 28.51 s > failures:
  1207. 28.51 s > python_settings_wrappers_expose_nested_runtime_and_global_settings
  1208. 28.51 s >
  1209. 28.51 s > test result: FAILED. 0 passed; 1 failed; 0 ignored; 0 measured; 4 filtered out; finished in 0.57s
  1210. 28.51 s >
  1211. 28.51 s > stderr ---
  1212. 28.51 s > Error: Python API test subprocess failed.
  1213. 28.51 s > stdout:
  1214. 28.51 s > ┌────────────────────────────────────────────────────────┐
  1215. 28.51 s > │ You are running a restricted Symbolica instance. │
  1216. 28.51 s > │ │
  1217. 28.51 s > │ This mode is only permitted for non-commercial use and │
  1218. 28.51 s > │ is limited to one instance and core per machine. │
  1219. 28.51 s > │ │
  1220. 28.51 s > │ Hobbyists can easily acquire a free license key │
  1221. 28.51 s > │ that unlocks all cores and removes this banner: │
  1222. 28.51 s > │ │
  1223. 28.51 s > │ from symbolica import * │
  1224. 28.51 s > │ request_hobbyist_license('YOUR_NAME', 'YOUR_EMAIL') │
  1225. 28.51 s > │ │
  1226. 28.51 s > │ All other users can obtain a free 30-day trial key: │
  1227. 28.51 s > │ │
  1228. 28.51 s > │ from symbolica import * │
  1229. 28.51 s > │ request_trial_license('NAME', 'EMAIL', 'EMPLOYER') │
  1230. 28.51 s > │ │
  1231. 28.51 s > │ See https://symbolica.io/docs/get_started.html#license │
  1232. 28.51 s > └────────────────────────────────────────────────────────┘
  1233. 28.51 s > ┌───────────────────────────────────────────────────────────────────────────────────────────────────────────┐
  1234. 28.51 s > │ Cannot start new unlicensed Symbolica instance since there is already another one running on the machine. │
  1235. 28.51 s > └───────────────────────────────────────────────────────────────────────────────────────────────────────────┘
  1236. 28.51 s >
  1237. 28.51 s > stderr:
  1238. 28.51 s > ┌───────────────────────────────────┐
  1239. 28.51 s > │ The Symbolica license has expired │
  1240. 28.51 s > └───────────────────────────────────┘
  1241. 28.51 s >
  1242. 28.51 s >
  1243. 28.51 s > Location:
  1244. 28.51 s > tests/tests/test_python_api.rs:156:20
  1245. 28.51 s >
  1246. 28.51 s > ------------
  1247. 28.51 s > Summary [ 0.576s] 5 tests run: 0 passed, 5 failed, 0 skipped
  1248. 28.51 s > FAIL [ 0.234s] (1/5) gammaloop-integration-tests::test_python_api python_session_getters_return_live_toml_and_command_blocks
  1249. 28.51 s > stdout ---
  1250. 28.51 s >
  1251. 28.51 s > running 1 test
  1252. 28.51 s > test python_session_getters_return_live_toml_and_command_blocks ... FAILED
  1253. 28.51 s >
  1254. 28.51 s > failures:
  1255. 28.51 s >
  1256. 28.51 s > failures:
  1257. 28.51 s > python_session_getters_return_live_toml_and_command_blocks
  1258. 28.51 s >
  1259. 28.51 s > test result: FAILED. 0 passed; 1 failed; 0 ignored; 0 measured; 4 filtered out; finished in 0.22s
  1260. 28.51 s >
  1261. 28.51 s > stderr ---
  1262. 28.51 s > Error: Python API test subprocess failed.
  1263. 28.51 s > stdout:
  1264. 28.51 s > ┌────────────────────────────────────────────────────────┐
  1265. 28.51 s > │ You are running a restricted Symbolica instance. │
  1266. 28.51 s > │ │
  1267. 28.51 s > │ This mode is only permitted for non-commercial use and │
  1268. 28.51 s > │ is limited to one instance and core per machine. │
  1269. 28.51 s > │ │
  1270. 28.51 s > │ Hobbyists can easily acquire a free license key │
  1271. 28.51 s > │ that unlocks all cores and removes this banner: │
  1272. 28.51 s > │ │
  1273. 28.51 s > │ from symbolica import * │
  1274. 28.51 s > │ request_hobbyist_license('YOUR_NAME', 'YOUR_EMAIL') │
  1275. 28.51 s > │ │
  1276. 28.51 s > │ All other users can obtain a free 30-day trial key: │
  1277. 28.51 s > │ │
  1278. 28.51 s > │ from symbolica import * │
  1279. 28.51 s > │ request_trial_license('NAME', 'EMAIL', 'EMPLOYER') │
  1280. 28.51 s > │ │
  1281. 28.51 s > │ See https://symbolica.io/docs/get_started.html#license │
  1282. 28.51 s > └────────────────────────────────────────────────────────┘
  1283. 28.51 s > ┌───────────────────────────────────────────────────────────────────────────────────────────────────────────┐
  1284. 28.51 s > │ Cannot start new unlicensed Symbolica instance since there is already another one running on the machine. │
  1285. 28.51 s > └───────────────────────────────────────────────────────────────────────────────────────────────────────────┘
  1286. 28.51 s >
  1287. 28.51 s > stderr:
  1288. 28.51 s > ┌───────────────────────────────────┐
  1289. 28.51 s > │ The Symbolica license has expired │
  1290. 28.51 s > └───────────────────────────────────┘
  1291. 28.51 s >
  1292. 28.51 s >
  1293. 28.51 s > Location:
  1294. 28.51 s > tests/tests/test_python_api.rs:156:20
  1295. 28.51 s >
  1296. 28.51 s > FAIL [ 0.257s] (2/5) gammaloop-integration-tests::test_python_api python_evaluate_samples_batch_and_momentum_space_have_expected_shape
  1297. 28.51 s > stdout ---
  1298. 28.51 s >
  1299. 28.51 s > running 1 test
  1300. 28.51 s > test python_evaluate_samples_batch_and_momentum_space_have_expected_shape ... FAILED
  1301. 28.51 s >
  1302. 28.51 s > failures:
  1303. 28.51 s >
  1304. 28.51 s > failures:
  1305. 28.51 s > python_evaluate_samples_batch_and_momentum_space_have_expected_shape
  1306. 28.51 s >
  1307. 28.51 s > test result: FAILED. 0 passed; 1 failed; 0 ignored; 0 measured; 4 filtered out; finished in 0.25s
  1308. 28.51 s >
  1309. 28.51 s > stderr ---
  1310. 28.51 s > Error: Python API test subprocess failed.
  1311. 28.51 s > stdout:
  1312. 28.51 s > ┌────────────────────────────────────────────────────────┐
  1313. 28.51 s > │ You are running a restricted Symbolica instance. │
  1314. 28.51 s > │ │
  1315. 28.51 s > │ This mode is only permitted for non-commercial use and │
  1316. 28.51 s > │ is limited to one instance and core per machine. │
  1317. 28.51 s > │ │
  1318. 28.51 s > │ Hobbyists can easily acquire a free license key │
  1319. 28.51 s > │ that unlocks all cores and removes this banner: │
  1320. 28.51 s > │ │
  1321. 28.51 s > │ from symbolica import * │
  1322. 28.51 s > │ request_hobbyist_license('YOUR_NAME', 'YOUR_EMAIL') │
  1323. 28.51 s > │ │
  1324. 28.51 s > │ All other users can obtain a free 30-day trial key: │
  1325. 28.51 s > │ │
  1326. 28.51 s > │ from symbolica import * │
  1327. 28.51 s > │ request_trial_license('NAME', 'EMAIL', 'EMPLOYER') │
  1328. 28.51 s > │ │
  1329. 28.51 s > │ See https://symbolica.io/docs/get_started.html#license │
  1330. 28.51 s > └────────────────────────────────────────────────────────┘
  1331. 28.51 s > ┌───────────────────────────────────────────────────────────────────────────────────────────────────────────┐
  1332. 28.51 s > │ Cannot start new unlicensed Symbolica instance since there is already another one running on the machine. │
  1333. 28.51 s > └───────────────────────────────────────────────────────────────────────────────────────────────────────────┘
  1334. 28.51 s >
  1335. 28.51 s > stderr:
  1336. 28.51 s > ┌───────────────────────────────────┐
  1337. 28.51 s > │ The Symbolica license has expired │
  1338. 28.51 s > └───────────────────────────────────┘
  1339. 28.51 s >
  1340. 28.51 s >
  1341. 28.51 s > Location:
  1342. 28.51 s > tests/tests/test_python_api.rs:156:20
  1343. 28.51 s >
  1344. 28.51 s > FAIL [ 0.296s] (3/5) gammaloop-integration-tests::test_python_api python_evaluate_sample_honors_generate_events_and_observable_snapshots
  1345. 28.51 s > stdout ---
  1346. 28.51 s >
  1347. 28.51 s > running 1 test
  1348. 28.51 s > test python_evaluate_sample_honors_generate_events_and_observable_snapshots ... FAILED
  1349. 28.51 s >
  1350. 28.51 s > failures:
  1351. 28.51 s >
  1352. 28.51 s > failures:
  1353. 28.51 s > python_evaluate_sample_honors_generate_events_and_observable_snapshots
  1354. 28.51 s >
  1355. 28.51 s > test result: FAILED. 0 passed; 1 failed; 0 ignored; 0 measured; 4 filtered out; finished in 0.29s
  1356. 28.51 s >
  1357. 28.51 s > stderr ---
  1358. 28.51 s > Error: Python API test subprocess failed.
  1359. 28.51 s > stdout:
  1360. 28.51 s > ┌────────────────────────────────────────────────────────┐
  1361. 28.51 s > │ You are running a restricted Symbolica instance. │
  1362. 28.51 s > │ │
  1363. 28.51 s > │ This mode is only permitted for non-commercial use and │
  1364. 28.51 s > │ is limited to one instance and core per machine. │
  1365. 28.51 s > │ │
  1366. 28.51 s > │ Hobbyists can easily acquire a free license key │
  1367. 28.51 s > │ that unlocks all cores and removes this banner: │
  1368. 28.51 s > │ │
  1369. 28.51 s > │ from symbolica import * │
  1370. 28.51 s > │ request_hobbyist_license('YOUR_NAME', 'YOUR_EMAIL') │
  1371. 28.51 s > │ │
  1372. 28.51 s > │ All other users can obtain a free 30-day trial key: │
  1373. 28.51 s > │ │
  1374. 28.51 s > │ from symbolica import * │
  1375. 28.51 s > │ request_trial_license('NAME', 'EMAIL', 'EMPLOYER') │
  1376. 28.51 s > │ │
  1377. 28.51 s > │ See https://symbolica.io/docs/get_started.html#license │
  1378. 28.51 s > └────────────────────────────────────────────────────────┘
  1379. 28.51 s > ┌───────────────────────────────────────────────────────────────────────────────────────────────────────────┐
  1380. 28.51 s > │ Cannot start new unlicensed Symbolica instance since there is already another one running on the machine. │
  1381. 28.51 s > └───────────────────────────────────────────────────────────────────────────────────────────────────────────┘
  1382. 28.51 s >
  1383. 28.51 s > stderr:
  1384. 28.51 s > ┌───────────────────────────────────┐
  1385. 28.51 s > │ The Symbolica license has expired │
  1386. 28.51 s > └───────────────────────────────────┘
  1387. 28.51 s >
  1388. 28.51 s >
  1389. 28.51 s > Location:
  1390. 28.51 s > tests/tests/test_python_api.rs:156:20
  1391. 28.51 s >
  1392. 28.51 s > FAIL [ 0.346s] (4/5) gammaloop-integration-tests::test_python_api python_evaluate_sample_preserves_graph_grouping_and_incoming_pdgs
  1393. 28.51 s > stdout ---
  1394. 28.51 s >
  1395. 28.51 s > running 1 test
  1396. 28.51 s > test python_evaluate_sample_preserves_graph_grouping_and_incoming_pdgs ... FAILED
  1397. 28.51 s >
  1398. 28.51 s > failures:
  1399. 28.51 s >
  1400. 28.51 s > failures:
  1401. 28.51 s > python_evaluate_sample_preserves_graph_grouping_and_incoming_pdgs
  1402. 28.51 s >
  1403. 28.51 s > test result: FAILED. 0 passed; 1 failed; 0 ignored; 0 measured; 4 filtered out; finished in 0.34s
  1404. 28.51 s >
  1405. 28.51 s > stderr ---
  1406. 28.51 s > Error: Python API test subprocess failed.
  1407. 28.51 s > stdout:
  1408. 28.51 s > ┌────────────────────────────────────────────────────────┐
  1409. 28.51 s > │ You are running a restricted Symbolica instance. │
  1410. 28.51 s > │ │
  1411. 28.51 s > │ This mode is only permitted for non-commercial use and │
  1412. 28.51 s > │ is limited to one instance and core per machine. │
  1413. 28.51 s > │ │
  1414. 28.51 s > │ Hobbyists can easily acquire a free license key │
  1415. 28.51 s > │ that unlocks all cores and removes this banner: │
  1416. 28.51 s > │ │
  1417. 28.51 s > │ from symbolica import * │
  1418. 28.51 s > │ request_hobbyist_license('YOUR_NAME', 'YOUR_EMAIL') │
  1419. 28.51 s > │ │
  1420. 28.51 s > │ All other users can obtain a free 30-day trial key: │
  1421. 28.51 s > │ │
  1422. 28.51 s > │ from symbolica import * │
  1423. 28.51 s > │ request_trial_license('NAME', 'EMAIL', 'EMPLOYER') │
  1424. 28.51 s > │ │
  1425. 28.51 s > │ See https://symbolica.io/docs/get_started.html#license │
  1426. 28.51 s > └────────────────────────────────────────────────────────┘
  1427. 28.51 s > ┌───────────────────────────────────────────────────────────────────────────────────────────────────────────┐
  1428. 28.51 s > │ Cannot start new unlicensed Symbolica instance since there is already another one running on the machine. │
  1429. 28.51 s > └───────────────────────────────────────────────────────────────────────────────────────────────────────────┘
  1430. 28.51 s >
  1431. 28.51 s > stderr:
  1432. 28.51 s > ┌───────────────────────────────────┐
  1433. 28.51 s > │ The Symbolica license has expired │
  1434. 28.51 s > └───────────────────────────────────┘
  1435. 28.51 s > [2026-09-01 10:05:46.432] @gammaloop_api::se... INFO : Running command import model sm-default
  1436. 28.51 s > [2026-09-01 10:05:46.432] @import::model INFO : Loading built-in JSON model sm-default
  1437. 28.51 s > [2026-09-01 10:05:46.471] @gammalooprs::model INFO : The following 15 external parameters were forced to zero by the restriction card:
  1438. 28.51 s > lamWS, AWS, rhoWS, etaWS, ymc, yme, ymm, MC, Me, MM, WTau, muQ, muLe, muLmu, muLtau
  1439. 28.51 s > [2026-09-01 10:05:46.472] @gammalooprs::model INFO : The following 34 vertex rules were removed by the restriction card:
  1440. 28.51 s > V_82 -> (c~, d, G+) | V_83 -> (t~, d, G+) | V_84 -> (c~, s, G+) | V_85 -> (t~, s, G+) | V_86 -> (u~, b, G+) | V_87 -> (c~, b, G+) | V_90 -> (c~, d, W+) | V_91 -> (t~, d, W+) | V_92 -> (u~, s, W+) | V_94 -> (t~, s, W+) | V_95 -> (u~, b, W+) | V_96 -> (c~, b, W+) | V_101 -> (e+, e-, G0) | V_102 -> (mu+, mu-, G0) | V_104 -> (e+, e-, H) | V_105 -> (mu+, mu-, H) | V_110 -> (ve~, e-, G+) | V_111 -> (vm~, mu-, G+) | V_116 -> (b~, u, G-) | V_117 -> (d~, c, G-) | V_118 -> (s~, c, G-) | V_119 -> (b~, c, G-) | V_120 -> (d~, t, G-) | V_121 -> (s~, t, G-) | V_124 -> (s~, u, W-) | V_125 -> (b~, u, W-) | V_126 -> (d~, c, W-) | V_128 -> (b~, c, W-) | V_129 -> (d~, t, W-) | V_130 -> (s~, t, W-) | V_138 -> (c~, c, G0) | V_140 -> (c~, c, H) | V_145 -> (e+, ve, G-) | V_146 -> (mu+, vm, G-)
  1441. 28.51 s > [2026-09-01 10:05:46.472] @gammalooprs::model INFO : The following 36 couplings were removed by the restriction card:
  1442. 28.51 s > GC_13, GC_14, GC_16, GC_17, GC_18, GC_19, GC_20, GC_22, GC_23, GC_24, GC_25, GC_26, GC_28, GC_29, GC_42, GC_43, GC_44, GC_46, GC_47, GC_48, GC_84, GC_85, GC_86, GC_87, GC_88, GC_89, GC_90, GC_91, GC_92, GC_93, GC_101, GC_102, GC_103, GC_105, GC_106, GC_107
  1443. 28.51 s > [2026-09-01 10:05:46.472] @gammaloop_api::se... INFO : Running command set default-runtime kv kinematics.externals='{"type":"constant","data":{"momenta":[[32.0,0.0,0.0,32.0],[32.0,0.0,0.0,-32.0]],"helicities":[1,1]}}'
  1444. 28.51 s > [2026-09-01 10:05:46.473] @gammaloop_api::se... INFO : Running command set default-runtime kv subtraction.disable_threshold_subtraction=true
  1445. 28.52 s > [2026-09-01 10:05:46.474] @gammaloop_api::se... INFO : Running command generate xs e+ e- > d d~ g | e- a d g QED^2==4 [{{2}} QCD=0] --numerator-grouping group_identical_graphs_up_to_sign --clear-existing-processes --only-diagrams
  1446. 28.52 s > [2026-09-01 10:05:46.476] @feyngen::diagram_... INFO : 0s | Δ=0s | Starting Feynman graph generation with Symbolica...
  1447. 28.52 s > [2026-09-01 10:05:46.479] @feyngen::diagram_... INFO : 0s | Δ=0s | Number of graphs resulting from Symbolica generation: 246
  1448. 28.52 s > [2026-09-01 10:05:46.481] @feyngen::diagram_... INFO : 0s | Δ=0s | Number of graphs retained after enforcing supergraph particle content: 8
  1449. 28.52 s > [2026-09-01 10:05:46.484] @feyngen::diagram_... INFO : 0s | Δ=0s | Number of graphs retained after removal of vetoed topologies: 8
  1450. 28.52 s > [2026-09-01 10:05:46.484] @feyngen::diagram_... INFO : 0s | Δ=0s | Number of graphs after vertex info assignment: 8
  1451. 28.52 s > [2026-09-01 10:05:46.484] @feyngen::diagram_... INFO : 0s | Δ=0s | Number of graphs after all complete graphs filters are applied: 8
  1452. 28.52 s >
  1453. 28.52 s >
  1454. 28.52 s > Location:
  1455. 28.52 s > tests/tests/test_python_api.rs:156:20
  1456. 28.52 s >
  1457. 28.52 s > FAIL [ 0.573s] (5/5) gammaloop-integration-tests::test_python_api python_settings_wrappers_expose_nested_runtime_and_global_settings
  1458. 28.52 s > stdout ---
  1459. 28.52 s >
  1460. 28.52 s > running 1 test
  1461. 28.52 s > test python_settings_wrappers_expose_nested_runtime_and_global_settings ... FAILED
  1462. 28.52 s >
  1463. 28.52 s > failures:
  1464. 28.52 s >
  1465. 28.52 s > failures:
  1466. 28.52 s > python_settings_wrappers_expose_nested_runtime_and_global_settings
  1467. 28.52 s >
  1468. 28.52 s > test result: FAILED. 0 passed; 1 failed; 0 ignored; 0 measured; 4 filtered out; finished in 0.57s
  1469. 28.52 s >
  1470. 28.52 s > stderr ---
  1471. 28.52 s > Error: Python API test subprocess failed.
  1472. 28.52 s > stdout:
  1473. 28.52 s > ┌────────────────────────────────────────────────────────┐
  1474. 28.52 s > │ You are running a restricted Symbolica instance. │
  1475. 28.52 s > │ │
  1476. 28.52 s > │ This mode is only permitted for non-commercial use and │
  1477. 28.52 s > │ is limited to one instance and core per machine. │
  1478. 28.52 s > │ │
  1479. 28.52 s > │ Hobbyists can easily acquire a free license key │
  1480. 28.52 s > │ that unlocks all cores and removes this banner: │
  1481. 28.52 s > │ │
  1482. 28.52 s > │ from symbolica import * │
  1483. 28.52 s > │ request_hobbyist_license('YOUR_NAME', 'YOUR_EMAIL') │
  1484. 28.52 s > │ │
  1485. 28.52 s > │ All other users can obtain a free 30-day trial key: │
  1486. 28.52 s > │ │
  1487. 28.52 s > │ from symbolica import * │
  1488. 28.52 s > │ request_trial_license('NAME', 'EMAIL', 'EMPLOYER') │
  1489. 28.52 s > │ │
  1490. 28.52 s > │ See https://symbolica.io/docs/get_started.html#license │
  1491. 28.52 s > └────────────────────────────────────────────────────────┘
  1492. 28.52 s > ┌───────────────────────────────────────────────────────────────────────────────────────────────────────────┐
  1493. 28.52 s > │ Cannot start new unlicensed Symbolica instance since there is already another one running on the machine. │
  1494. 28.52 s > └───────────────────────────────────────────────────────────────────────────────────────────────────────────┘
  1495. 28.52 s >
  1496. 28.52 s > stderr:
  1497. 28.52 s > ┌───────────────────────────────────┐
  1498. 28.52 s > │ The Symbolica license has expired │
  1499. 28.52 s > └───────────────────────────────────┘
  1500. 28.52 s >
  1501. 28.52 s >
  1502. 28.52 s > Location:
  1503. 28.52 s > tests/tests/test_python_api.rs:156:20
  1504. 28.52 s >
  1505. 28.52 s > error: test run failed
  1506. 28.52 s >
  1507. 28.52 s > ========== nextest test summary ==========
  1508. 28.52 s > report: target/nextest/ci_gammaloop/junit.xml
  1509. 28.52 s > tests: 5, failures: 5, errors: 0
  1510. 28.52 s >
  1511. 28.52 s > 1. gammaloop-integration-tests::test_python_api::python_session_getters_return_live_toml_and_command_blocks
  1512. 28.52 s > failure: test failure with exit code 101
  1513. 28.52 s > Error: Python API test subprocess failed.
  1514. 28.52 s > stdout:
  1515. 28.52 s > ┌────────────────────────────────────────────────────────┐
  1516. 28.52 s > │ You are running a restricted Symbolica instance. │
  1517. 28.52 s > │ │
  1518. 28.52 s > │ This mode is only permitted for non-commercial use and │
  1519. 28.52 s > │ is limited to one instance and core per machine. │
  1520. 28.52 s > │ │
  1521. 28.52 s > │ Hobbyists can easily acquire a free license key │
  1522. 28.52 s > │ that unlocks all cores and removes this banner: │
  1523. 28.52 s > │ │
  1524. 28.52 s > │ from symbolica import * │
  1525. 28.52 s > │ request_hobbyist_license('YOUR_NAME', 'YOUR_EMAIL') │
  1526. 28.52 s > │ │
  1527. 28.52 s > │ All other users can obtain a free 30-day trial key: │
  1528. 28.52 s > │ │
  1529. 28.52 s > │ from symbolica import * │
  1530. 28.52 s > │ request_trial_license('NAME', 'EMAIL', 'EMPLOYER') │
  1531. 28.52 s > │ │
  1532. 28.52 s > │ See https://symbolica.io/docs/get_started.html#license │
  1533. 28.52 s > └────────────────────────────────────────────────────────┘
  1534. 28.52 s > ┌───────────────────────────────────────────────────────────────────────────────────────────────────────────┐
  1535. 28.52 s > │ Cannot start new unlicensed Symbolica instance since there is already another one running on the machine. │
  1536. 28.52 s > └───────────────────────────────────────────────────────────────────────────────────────────────────────────┘
  1537. 28.52 s >
  1538. 28.52 s > stderr:
  1539. 28.52 s > ┌───────────────────────────────────┐
  1540. 28.52 s > │ The Symbolica license has expired │
  1541. 28.52 s > └───────────────────────────────────┘
  1542. 28.52 s >
  1543. 28.52 s >
  1544. 28.52 s > Location:
  1545. 28.52 s > tests/tests/test_python_api.rs:156:20
  1546. 28.52 s > system-out
  1547. 28.52 s > running 1 test
  1548. 28.52 s > test python_session_getters_return_live_toml_and_command_blocks ... FAILED
  1549. 28.52 s >
  1550. 28.52 s > failures:
  1551. 28.52 s >
  1552. 28.52 s > failures:
  1553. 28.52 s > python_session_getters_return_live_toml_and_command_blocks
  1554. 28.52 s >
  1555. 28.52 s > test result: FAILED. 0 passed; 1 failed; 0 ignored; 0 measured; 4 filtered out; finished in 0.22s
  1556. 28.52 s > system-err
  1557. 28.52 s > Error: Python API test subprocess failed.
  1558. 28.52 s > stdout:
  1559. 28.52 s > ┌────────────────────────────────────────────────────────┐
  1560. 28.52 s > │ You are running a restricted Symbolica instance. │
  1561. 28.52 s > │ │
  1562. 28.52 s > │ This mode is only permitted for non-commercial use and │
  1563. 28.52 s > │ is limited to one instance and core per machine. │
  1564. 28.52 s > │ │
  1565. 28.52 s > │ Hobbyists can easily acquire a free license key │
  1566. 28.52 s > │ that unlocks all cores and removes this banner: │
  1567. 28.52 s > │ │
  1568. 28.52 s > │ from symbolica import * │
  1569. 28.52 s > │ request_hobbyist_license('YOUR_NAME', 'YOUR_EMAIL') │
  1570. 28.52 s > │ │
  1571. 28.52 s > │ All other users can obtain a free 30-day trial key: │
  1572. 28.52 s > │ │
  1573. 28.52 s > │ from symbolica import * │
  1574. 28.52 s > │ request_trial_license('NAME', 'EMAIL', 'EMPLOYER') │
  1575. 28.52 s > │ │
  1576. 28.52 s > │ See https://symbolica.io/docs/get_started.html#license │
  1577. 28.52 s > └────────────────────────────────────────────────────────┘
  1578. 28.52 s > ┌───────────────────────────────────────────────────────────────────────────────────────────────────────────┐
  1579. 28.52 s > │ Cannot start new unlicensed Symbolica instance since there is already another one running on the machine. │
  1580. 28.52 s > └───────────────────────────────────────────────────────────────────────────────────────────────────────────┘
  1581. 28.52 s >
  1582. 28.52 s > stderr:
  1583. 28.52 s > ┌───────────────────────────────────┐
  1584. 28.52 s > │ The Symbolica license has expired │
  1585. 28.52 s > └───────────────────────────────────┘
  1586. 28.52 s >
  1587. 28.52 s >
  1588. 28.52 s > Location:
  1589. 28.52 s > tests/tests/test_python_api.rs:156:20
  1590. 28.52 s >
  1591. 28.52 s > 2. gammaloop-integration-tests::test_python_api::python_evaluate_samples_batch_and_momentum_space_have_expected_shape
  1592. 28.52 s > failure: test failure with exit code 101
  1593. 28.52 s > Error: Python API test subprocess failed.
  1594. 28.52 s > stdout:
  1595. 28.52 s > ┌────────────────────────────────────────────────────────┐
  1596. 28.52 s > │ You are running a restricted Symbolica instance. │
  1597. 28.52 s > │ │
  1598. 28.52 s > │ This mode is only permitted for non-commercial use and │
  1599. 28.52 s > │ is limited to one instance and core per machine. │
  1600. 28.52 s > │ │
  1601. 28.52 s > │ Hobbyists can easily acquire a free license key │
  1602. 28.52 s > │ that unlocks all cores and removes this banner: │
  1603. 28.52 s > │ │
  1604. 28.52 s > │ from symbolica import * │
  1605. 28.52 s > │ request_hobbyist_license('YOUR_NAME', 'YOUR_EMAIL') │
  1606. 28.52 s > │ │
  1607. 28.52 s > │ All other users can obtain a free 30-day trial key: │
  1608. 28.52 s > │ │
  1609. 28.52 s > │ from symbolica import * │
  1610. 28.52 s > │ request_trial_license('NAME', 'EMAIL', 'EMPLOYER') │
  1611. 28.52 s > │ │
  1612. 28.52 s > │ See https://symbolica.io/docs/get_started.html#license │
  1613. 28.52 s > └────────────────────────────────────────────────────────┘
  1614. 28.52 s > ┌───────────────────────────────────────────────────────────────────────────────────────────────────────────┐
  1615. 28.52 s > │ Cannot start new unlicensed Symbolica instance since there is already another one running on the machine. │
  1616. 28.52 s > └───────────────────────────────────────────────────────────────────────────────────────────────────────────┘
  1617. 28.52 s >
  1618. 28.52 s > stderr:
  1619. 28.52 s > ┌───────────────────────────────────┐
  1620. 28.52 s > │ The Symbolica license has expired │
  1621. 28.52 s > └───────────────────────────────────┘
  1622. 28.52 s >
  1623. 28.52 s >
  1624. 28.52 s > Location:
  1625. 28.52 s > tests/tests/test_python_api.rs:156:20
  1626. 28.52 s > system-out
  1627. 28.52 s > running 1 test
  1628. 28.52 s > test python_evaluate_samples_batch_and_momentum_space_have_expected_shape ... FAILED
  1629. 28.52 s >
  1630. 28.52 s > failures:
  1631. 28.52 s >
  1632. 28.52 s > failures:
  1633. 28.52 s > python_evaluate_samples_batch_and_momentum_space_have_expected_shape
  1634. 28.52 s >
  1635. 28.52 s > test result: FAILED. 0 passed; 1 failed; 0 ignored; 0 measured; 4 filtered out; finished in 0.25s
  1636. 28.52 s > system-err
  1637. 28.52 s > Error: Python API test subprocess failed.
  1638. 28.52 s > stdout:
  1639. 28.52 s > ┌────────────────────────────────────────────────────────┐
  1640. 28.52 s > │ You are running a restricted Symbolica instance. │
  1641. 28.52 s > │ │
  1642. 28.52 s > │ This mode is only permitted for non-commercial use and │
  1643. 28.52 s > │ is limited to one instance and core per machine. │
  1644. 28.52 s > │ │
  1645. 28.52 s > │ Hobbyists can easily acquire a free license key │
  1646. 28.52 s > │ that unlocks all cores and removes this banner: │
  1647. 28.52 s > │ │
  1648. 28.52 s > │ from symbolica import * │
  1649. 28.52 s > │ request_hobbyist_license('YOUR_NAME', 'YOUR_EMAIL') │
  1650. 28.52 s > │ │
  1651. 28.52 s > │ All other users can obtain a free 30-day trial key: │
  1652. 28.52 s > │ │
  1653. 28.52 s > │ from symbolica import * │
  1654. 28.52 s > │ request_trial_license('NAME', 'EMAIL', 'EMPLOYER') │
  1655. 28.52 s > │ │
  1656. 28.52 s > │ See https://symbolica.io/docs/get_started.html#license │
  1657. 28.52 s > └────────────────────────────────────────────────────────┘
  1658. 28.52 s > ┌───────────────────────────────────────────────────────────────────────────────────────────────────────────┐
  1659. 28.52 s > │ Cannot start new unlicensed Symbolica instance since there is already another one running on the machine. │
  1660. 28.52 s > └───────────────────────────────────────────────────────────────────────────────────────────────────────────┘
  1661. 28.52 s >
  1662. 28.52 s > stderr:
  1663. 28.52 s > ┌───────────────────────────────────┐
  1664. 28.52 s > │ The Symbolica license has expired │
  1665. 28.52 s > └───────────────────────────────────┘
  1666. 28.52 s >
  1667. 28.52 s >
  1668. 28.52 s > Location:
  1669. 28.52 s > tests/tests/test_python_api.rs:156:20
  1670. 28.52 s >
  1671. 28.52 s > 3. gammaloop-integration-tests::test_python_api::python_evaluate_sample_honors_generate_events_and_observable_snapshots
  1672. 28.52 s > failure: test failure with exit code 101
  1673. 28.52 s > Error: Python API test subprocess failed.
  1674. 28.52 s > stdout:
  1675. 28.52 s > ┌────────────────────────────────────────────────────────┐
  1676. 28.52 s > │ You are running a restricted Symbolica instance. │
  1677. 28.52 s > │ │
  1678. 28.52 s > │ This mode is only permitted for non-commercial use and │
  1679. 28.52 s > │ is limited to one instance and core per machine. │
  1680. 28.52 s > │ │
  1681. 28.52 s > │ Hobbyists can easily acquire a free license key │
  1682. 28.52 s > │ that unlocks all cores and removes this banner: │
  1683. 28.52 s > │ │
  1684. 28.52 s > │ from symbolica import * │
  1685. 28.52 s > │ request_hobbyist_license('YOUR_NAME', 'YOUR_EMAIL') │
  1686. 28.52 s > │ │
  1687. 28.52 s > │ All other users can obtain a free 30-day trial key: │
  1688. 28.52 s > │ │
  1689. 28.52 s > │ from symbolica import * │
  1690. 28.52 s > │ request_trial_license('NAME', 'EMAIL', 'EMPLOYER') │
  1691. 28.52 s > │ │
  1692. 28.52 s > │ See https://symbolica.io/docs/get_started.html#license │
  1693. 28.52 s > └────────────────────────────────────────────────────────┘
  1694. 28.52 s > ┌───────────────────────────────────────────────────────────────────────────────────────────────────────────┐
  1695. 28.52 s > │ Cannot start new unlicensed Symbolica instance since there is already another one running on the machine. │
  1696. 28.52 s > └───────────────────────────────────────────────────────────────────────────────────────────────────────────┘
  1697. 28.52 s >
  1698. 28.52 s > stderr:
  1699. 28.52 s > ┌───────────────────────────────────┐
  1700. 28.52 s > │ The Symbolica license has expired │
  1701. 28.52 s > └───────────────────────────────────┘
  1702. 28.52 s >
  1703. 28.52 s >
  1704. 28.52 s > Location:
  1705. 28.52 s > tests/tests/test_python_api.rs:156:20
  1706. 28.52 s > system-out
  1707. 28.52 s > running 1 test
  1708. 28.52 s > test python_evaluate_sample_honors_generate_events_and_observable_snapshots ... FAILED
  1709. 28.52 s >
  1710. 28.52 s > failures:
  1711. 28.52 s >
  1712. 28.52 s > failures:
  1713. 28.52 s > python_evaluate_sample_honors_generate_events_and_observable_snapshots
  1714. 28.52 s >
  1715. 28.52 s > test result: FAILED. 0 passed; 1 failed; 0 ignored; 0 measured; 4 filtered out; finished in 0.29s
  1716. 28.52 s > system-err
  1717. 28.52 s > Error: Python API test subprocess failed.
  1718. 28.52 s > stdout:
  1719. 28.52 s > ┌────────────────────────────────────────────────────────┐
  1720. 28.52 s > │ You are running a restricted Symbolica instance. │
  1721. 28.52 s > │ │
  1722. 28.52 s > │ This mode is only permitted for non-commercial use and │
  1723. 28.52 s > │ is limited to one instance and core per machine. │
  1724. 28.52 s > │ │
  1725. 28.52 s > │ Hobbyists can easily acquire a free license key │
  1726. 28.52 s > │ that unlocks all cores and removes this banner: │
  1727. 28.52 s > │ │
  1728. 28.52 s > │ from symbolica import * │
  1729. 28.52 s > │ request_hobbyist_license('YOUR_NAME', 'YOUR_EMAIL') │
  1730. 28.52 s > │ │
  1731. 28.52 s > │ All other users can obtain a free 30-day trial key: │
  1732. 28.52 s > │ │
  1733. 28.52 s > │ from symbolica import * │
  1734. 28.52 s > │ request_trial_license('NAME', 'EMAIL', 'EMPLOYER') │
  1735. 28.52 s > │ │
  1736. 28.52 s > │ See https://symbolica.io/docs/get_started.html#license │
  1737. 28.52 s > └────────────────────────────────────────────────────────┘
  1738. 28.52 s > ┌───────────────────────────────────────────────────────────────────────────────────────────────────────────┐
  1739. 28.52 s > │ Cannot start new unlicensed Symbolica instance since there is already another one running on the machine. │
  1740. 28.52 s > └───────────────────────────────────────────────────────────────────────────────────────────────────────────┘
  1741. 28.52 s >
  1742. 28.52 s > stderr:
  1743. 28.52 s > ┌───────────────────────────────────┐
  1744. 28.52 s > │ The Symbolica license has expired │
  1745. 28.52 s > └───────────────────────────────────┘
  1746. 28.52 s >
  1747. 28.52 s >
  1748. 28.52 s > Location:
  1749. 28.52 s > tests/tests/test_python_api.rs:156:20
  1750. 28.52 s >
  1751. 28.52 s > 4. gammaloop-integration-tests::test_python_api::python_evaluate_sample_preserves_graph_grouping_and_incoming_pdgs
  1752. 28.52 s > failure: test failure with exit code 101
  1753. 28.52 s > Error: Python API test subprocess failed.
  1754. 28.52 s > stdout:
  1755. 28.52 s > ┌────────────────────────────────────────────────────────┐
  1756. 28.52 s > │ You are running a restricted Symbolica instance. │
  1757. 28.52 s > │ │
  1758. 28.52 s > │ This mode is only permitted for non-commercial use and │
  1759. 28.52 s > │ is limited to one instance and core per machine. │
  1760. 28.52 s > │ │
  1761. 28.52 s > │ Hobbyists can easily acquire a free license key │
  1762. 28.52 s > │ that unlocks all cores and removes this banner: │
  1763. 28.52 s > │ │
  1764. 28.52 s > │ from symbolica import * │
  1765. 28.52 s > │ request_hobbyist_license('YOUR_NAME', 'YOUR_EMAIL') │
  1766. 28.52 s > │ │
  1767. 28.52 s > │ All other users can obtain a free 30-day trial key: │
  1768. 28.52 s > │ │
  1769. 28.52 s > │ from symbolica import * │
  1770. 28.52 s > │ request_trial_license('NAME', 'EMAIL', 'EMPLOYER') │
  1771. 28.52 s > │ │
  1772. 28.52 s > │ See https://symbolica.io/docs/get_started.html#license │
  1773. 28.52 s > └────────────────────────────────────────────────────────┘
  1774. 28.52 s > ┌───────────────────────────────────────────────────────────────────────────────────────────────────────────┐
  1775. 28.52 s > │ Cannot start new unlicensed Symbolica instance since there is already another one running on the machine. │
  1776. 28.52 s > └───────────────────────────────────────────────────────────────────────────────────────────────────────────┘
  1777. 28.52 s >
  1778. 28.52 s > stderr:
  1779. 28.52 s > ┌───────────────────────────────────┐
  1780. 28.52 s > │ The Symbolica license has expired │
  1781. 28.52 s > └───────────────────────────────────┘
  1782. 28.52 s > [2026-09-01 10:05:46.432] @gammaloop_api::se... INFO : Running command import model sm-default
  1783. 28.52 s > [2026-09-01 10:05:46.432] @import::model INFO : Loading built-in JSON model sm-default
  1784. 28.52 s > [2026-09-01 10:05:46.471] @gammalooprs::model INFO : The following 15 external parameters were forced to zero by the restriction card:
  1785. 28.52 s > lamWS, AWS, rhoWS, etaWS, ymc, yme, ymm, MC, Me, MM, WTau, muQ, muLe, muLmu, muLtau
  1786. 28.52 s > [2026-09-01 10:05:46.472] @gammalooprs::model INFO : The following 34 vertex rules were removed by the restriction card:
  1787. 28.52 s > V_82 -> (c~, d, G+) | V_83 -> (t~, d, G+) | V_84 -> (c~, s, G+) | V_85 -> (t~, s, G+) | V_86 -> (u~, b, G+) | V_87 -> (c~, b, G+) | V_90 -> (c~, d, W+) | V_91 -> (t~, d, W+) | V_92 -> (u~, s, W+) | V_94 -> (t~, s, W+) | V_95 -> (u~, b, W+) | V_96 -> (c~, b, W+) | V_101 -> (e+, e-, G0) | V_102 -> (mu+, mu-, G0) | V_104 -> (e+, e-, H) | V_105 -> (mu+, mu-, H) | V_110 -> (ve~, e-, G+) | V_111 -> (vm~, mu-, G+) | V_116 -> (b~, u, G-) | V_117 -> (d~, c, G-) | V_118 -> (s~, c, G-) | V_119 -> (b~, c, G-) | V_120 -> (d~, t, G-) | V_121 -> (s~, t, G-) | V_124 -> (s~, u, W-) | V_125 -> (b~, u, W-) | V_126 -> (d~, c, W-) | V_128 -> (b~, c, W-) | V_129 -> (d~, t, W-) | V_130 -> (s~, t, W-) | V_138 -> (c~, c, G0) | V_140 -> (c~, c, H) | V_145 -> (e+, ve, G-) | V_146 -> (mu+, vm, G-)
  1788. 28.52 s > [2026-09-01 10:05:46.472] @gammalooprs::model INFO : The following 36 couplings were removed by the restriction card:
  1789. 28.52 s > GC_13, GC_14, GC_16, GC_17, GC_18, GC_19, GC_20, GC_22, GC_23, GC_24, GC_25, GC_26, GC_28, GC_29, GC_42, GC_43, GC_44, GC_46, GC_47, GC_48, GC_84, GC_85, GC_86, GC_87, GC_88, GC_89, GC_90, GC_91, GC_92, GC_93, GC_101, GC_102, GC_103, GC_105, GC_106, GC_107
  1790. 28.52 s > [2026-09-01 10:05:46.472] @gammaloop_api::se... INFO : Running command set default-runtime kv kinematics.externals='{"type":"constant","data":{"momenta":[[32.0,0.0,0.0,32.0],[32.0,0.0,0.0,-32.0]],"helicities":[1,1]}}'
  1791. 28.52 s > [2026-09-01 10:05:46.473] @gammaloop_api::se... INFO : Running command set default-runtime kv subtraction.disable_threshold_subtraction=true
  1792. 28.52 s > [2026-09-01 10:05:46.474] @gammaloop_api::se... INFO : Running command generate xs e+ e- > d d~ g | e- a d g QED^2==4 [{{2}} QCD=0] --numerator-grouping group_identical_graphs_up_to_sign --clear-existing-processes --only-diagrams
  1793. 28.52 s > [2026-09-01 10:05:46.476] @feyngen::diagram_... INFO : 0s | Δ=0s | Starting Feynman graph generation with Symbolica...
  1794. 28.52 s > [2026-09-01 10:05:46.479] @feyngen::diagram_... INFO : 0s | Δ=0s | Number of graphs resulting from Symbolica generation: 246
  1795. 28.52 s > [2026-09-01 10:05:46.481] @feyngen::diagram_... INFO : 0s | Δ=0s | Number of graphs retained after enforcing supergraph particle content: 8
  1796. 28.52 s > [2026-09-01 10:05:46.484] @feyngen::diagram_... INFO : 0s | Δ=0s | Number of graphs retained after removal of vetoed topologies: 8
  1797. 28.52 s > [2026-09-01 10:05:46.484] @feyngen::diagram_... INFO : 0s | Δ=0s | Number of graphs after vertex info assignment: 8
  1798. 28.52 s > [2026-09-01 10:05:46.484] @feyngen::diagram_... INFO : 0s | Δ=0s | Number of graphs after all complete graphs filters are applied: 8
  1799. 28.52 s >
  1800. 28.52 s >
  1801. 28.52 s > Location:
  1802. 28.52 s > tests/tests/test_python_api.rs:156:20
  1803. 28.52 s > system-out
  1804. 28.52 s > running 1 test
  1805. 28.52 s > test python_evaluate_sample_preserves_graph_grouping_and_incoming_pdgs ... FAILED
  1806. 28.52 s >
  1807. 28.52 s > failures:
  1808. 28.52 s >
  1809. 28.52 s > failures:
  1810. 28.52 s > python_evaluate_sample_preserves_graph_grouping_and_incoming_pdgs
  1811. 28.52 s >
  1812. 28.52 s > test result: FAILED. 0 passed; 1 failed; 0 ignored; 0 measured; 4 filtered out; finished in 0.34s
  1813. 28.52 s > system-err
  1814. 28.52 s > Error: Python API test subprocess failed.
  1815. 28.52 s > stdout:
  1816. 28.52 s > ┌────────────────────────────────────────────────────────┐
  1817. 28.52 s > │ You are running a restricted Symbolica instance. │
  1818. 28.52 s > │ │
  1819. 28.52 s > │ This mode is only permitted for non-commercial use and │
  1820. 28.52 s > │ is limited to one instance and core per machine. │
  1821. 28.52 s > │ │
  1822. 28.52 s > │ Hobbyists can easily acquire a free license key │
  1823. 28.52 s > │ that unlocks all cores and removes this banner: │
  1824. 28.52 s > │ │
  1825. 28.52 s > │ from symbolica import * │
  1826. 28.52 s > │ request_hobbyist_license('YOUR_NAME', 'YOUR_EMAIL') │
  1827. 28.52 s > │ │
  1828. 28.52 s > │ All other users can obtain a free 30-day trial key: │
  1829. 28.52 s > │ │
  1830. 28.52 s > │ from symbolica import * │
  1831. 28.52 s > │ request_trial_license('NAME', 'EMAIL', 'EMPLOYER') │
  1832. 28.52 s > │ │
  1833. 28.52 s > │ See https://symbolica.io/docs/get_started.html#license │
  1834. 28.52 s > └────────────────────────────────────────────────────────┘
  1835. 28.52 s > ┌───────────────────────────────────────────────────────────────────────────────────────────────────────────┐
  1836. 28.52 s > │ Cannot start new unlicensed Symbolica instance since there is already another one running on the machine. │
  1837. 28.52 s > └───────────────────────────────────────────────────────────────────────────────────────────────────────────┘
  1838. 28.52 s >
  1839. 28.52 s > stderr:
  1840. 28.52 s > ┌───────────────────────────────────┐
  1841. 28.52 s > │ The Symbolica license has expired │
  1842. 28.52 s > └───────────────────────────────────┘
  1843. 28.52 s > [2026-09-01 10:05:46.432] @gammaloop_api::se... INFO : Running command import model sm-default
  1844. 28.52 s > [2026-09-01 10:05:46.432] @import::model INFO : Loading built-in JSON model sm-default
  1845. 28.52 s > [2026-09-01 10:05:46.471] @gammalooprs::model INFO : The following 15 external parameters were forced to zero by the restriction card:
  1846. 28.52 s > lamWS, AWS, rhoWS, etaWS, ymc, yme, ymm, MC, Me, MM, WTau, muQ, muLe, muLmu, muLtau
  1847. 28.52 s > [2026-09-01 10:05:46.472] @gammalooprs::model INFO : The following 34 vertex rules were removed by the restriction card:
  1848. 28.52 s > V_82 -> (c~, d, G+) | V_83 -> (t~, d, G+) | V_84 -> (c~, s, G+) | V_85 -> (t~, s, G+) | V_86 -> (u~, b, G+) | V_87 -> (c~, b, G+) | V_90 -> (c~, d, W+) | V_91 -> (t~, d, W+) | V_92 -> (u~, s, W+) | V_94 -> (t~, s, W+) | V_95 -> (u~, b, W+) | V_96 -> (c~, b, W+) | V_101 -> (e+, e-, G0) | V_102 -> (mu+, mu-, G0) | V_104 -> (e+, e-, H) | V_105 -> (mu+, mu-, H) | V_110 -> (ve~, e-, G+) | V_111 -> (vm~, mu-, G+) | V_116 -> (b~, u, G-) | V_117 -> (d~, c, G-) | V_118 -> (s~, c, G-) | V_119 -> (b~, c, G-) | V_120 -> (d~, t, G-) | V_121 -> (s~, t, G-) | V_124 -> (s~, u, W-) | V_125 -> (b~, u, W-) | V_126 -> (d~, c, W-) | V_128 -> (b~, c, W-) | V_129 -> (d~, t, W-) | V_130 -> (s~, t, W-) | V_138 -> (c~, c, G0) | V_140 -> (c~, c, H) | V_145 -> (e+, ve, G-) | V_146 -> (mu+, vm, G-)
  1849. 28.52 s > [2026-09-01 10:05:46.472] @gammalooprs::model INFO : The following 36 couplings were removed by the restriction card:
  1850. 28.52 s > GC_13, GC_14, GC_16, GC_17, GC_18, GC_19, GC_20, GC_22, GC_23, GC_24, GC_25, GC_26, GC_28, GC_29, GC_42, GC_43, GC_44, GC_46, GC_47, GC_48, GC_84, GC_85, GC_86, GC_87, GC_88, GC_89, GC_90, GC_91, GC_92, GC_93, GC_101, GC_102, GC_103, GC_105, GC_106, GC_107
  1851. 28.52 s > [2026-09-01 10:05:46.472] @gammaloop_api::se... INFO : Running command set default-runtime kv kinematics.externals='{"type":"constant","data":{"momenta":[[32.0,0.0,0.0,32.0],[32.0,0.0,0.0,-32.0]],"helicities":[1,1]}}'
  1852. 28.52 s > [2026-09-01 10:05:46.473] @gammaloop_api::se... INFO : Running command set default-runtime kv subtraction.disable_threshold_subtraction=true
  1853. 28.52 s > [2026-09-01 10:05:46.474] @gammaloop_api::se... INFO : Running command generate xs e+ e- > d d~ g | e- a d g QED^2==4 [{{2}} QCD=0] --numerator-grouping group_identical_graphs_up_to_sign --clear-existing-processes --only-diagrams
  1854. 28.52 s > [2026-09-01 10:05:46.476] @feyngen::diagram_... INFO : 0s | Δ=0s | Starting Feynman graph generation with Symbolica...
  1855. 28.52 s > [2026-09-01 10:05:46.479] @feyngen::diagram_... INFO : 0s | Δ=0s | Number of graphs resulting from Symbolica generation: 246
  1856. 28.52 s > [2026-09-01 10:05:46.481] @feyngen::diagram_... INFO : 0s | Δ=0s | Number of graphs retained after enforcing supergraph particle content: 8
  1857. 28.52 s > [2026-09-01 10:05:46.484] @feyngen::diagram_... INFO : 0s | Δ=0s | Number of graphs retained after removal of vetoed topologies: 8
  1858. 28.52 s > [2026-09-01 10:05:46.484] @feyngen::diagram_... INFO : 0s | Δ=0s | Number of graphs after vertex info assignment: 8
  1859. 28.52 s > [2026-09-01 10:05:46.484] @feyngen::diagram_... INFO : 0s | Δ=0s | Number of graphs after all complete graphs filters are applied: 8
  1860. 28.52 s >
  1861. 28.52 s >
  1862. 28.52 s > Location:
  1863. 28.52 s > tests/tests/test_python_api.rs:156:20
  1864. 28.52 s >
  1865. 28.52 s > 5. gammaloop-integration-tests::test_python_api::python_settings_wrappers_expose_nested_runtime_and_global_settings
  1866. 28.52 s > failure: test failure with exit code 101
  1867. 28.52 s > Error: Python API test subprocess failed.
  1868. 28.52 s > stdout:
  1869. 28.52 s > ┌────────────────────────────────────────────────────────┐
  1870. 28.52 s > │ You are running a restricted Symbolica instance. │
  1871. 28.52 s > │ │
  1872. 28.52 s > │ This mode is only permitted for non-commercial use and │
  1873. 28.52 s > │ is limited to one instance and core per machine. │
  1874. 28.52 s > │ │
  1875. 28.52 s > │ Hobbyists can easily acquire a free license key │
  1876. 28.52 s > │ that unlocks all cores and removes this banner: │
  1877. 28.52 s > │ │
  1878. 28.52 s > │ from symbolica import * │
  1879. 28.52 s > │ request_hobbyist_license('YOUR_NAME', 'YOUR_EMAIL') │
  1880. 28.52 s > │ │
  1881. 28.52 s > │ All other users can obtain a free 30-day trial key: │
  1882. 28.52 s > │ │
  1883. 28.52 s > │ from symbolica import * │
  1884. 28.52 s > │ request_trial_license('NAME', 'EMAIL', 'EMPLOYER') │
  1885. 28.52 s > │ │
  1886. 28.52 s > │ See https://symbolica.io/docs/get_started.html#license │
  1887. 28.52 s > └────────────────────────────────────────────────────────┘
  1888. 28.52 s > ┌───────────────────────────────────────────────────────────────────────────────────────────────────────────┐
  1889. 28.52 s > │ Cannot start new unlicensed Symbolica instance since there is already another one running on the machine. │
  1890. 28.52 s > └───────────────────────────────────────────────────────────────────────────────────────────────────────────┘
  1891. 28.52 s >
  1892. 28.52 s > stderr:
  1893. 28.52 s > ┌───────────────────────────────────┐
  1894. 28.52 s > │ The Symbolica license has expired │
  1895. 28.52 s > └───────────────────────────────────┘
  1896. 28.52 s >
  1897. 28.52 s >
  1898. 28.52 s > Location:
  1899. 28.52 s > tests/tests/test_python_api.rs:156:20
  1900. 28.52 s > system-out
  1901. 28.52 s > running 1 test
  1902. 28.52 s > test python_settings_wrappers_expose_nested_runtime_and_global_settings ... FAILED
  1903. 28.52 s >
  1904. 28.52 s > failures:
  1905. 28.52 s >
  1906. 28.52 s > failures:
  1907. 28.52 s > python_settings_wrappers_expose_nested_runtime_and_global_settings
  1908. 28.52 s >
  1909. 28.52 s > test result: FAILED. 0 passed; 1 failed; 0 ignored; 0 measured; 4 filtered out; finished in 0.57s
  1910. 28.52 s > system-err
  1911. 28.52 s > Error: Python API test subprocess failed.
  1912. 28.52 s > stdout:
  1913. 28.52 s > ┌────────────────────────────────────────────────────────┐
  1914. 28.52 s > │ You are running a restricted Symbolica instance. │
  1915. 28.52 s > │ │
  1916. 28.52 s > │ This mode is only permitted for non-commercial use and │
  1917. 28.52 s > │ is limited to one instance and core per machine. │
  1918. 28.52 s > │ │
  1919. 28.52 s > │ Hobbyists can easily acquire a free license key │
  1920. 28.52 s > │ that unlocks all cores and removes this banner: │
  1921. 28.52 s > │ │
  1922. 28.52 s > │ from symbolica import * │
  1923. 28.52 s > │ request_hobbyist_license('YOUR_NAME', 'YOUR_EMAIL') │
  1924. 28.52 s > │ │
  1925. 28.52 s > │ All other users can obtain a free 30-day trial key: │
  1926. 28.52 s > │ │
  1927. 28.52 s > │ from symbolica import * │
  1928. 28.52 s > │ request_trial_license('NAME', 'EMAIL', 'EMPLOYER') │
  1929. 28.52 s > │ │
  1930. 28.52 s > │ See https://symbolica.io/docs/get_started.html#license │
  1931. 28.52 s > └────────────────────────────────────────────────────────┘
  1932. 28.52 s > ┌───────────────────────────────────────────────────────────────────────────────────────────────────────────┐
  1933. 28.52 s > │ Cannot start new unlicensed Symbolica instance since there is already another one running on the machine. │
  1934. 28.52 s > └───────────────────────────────────────────────────────────────────────────────────────────────────────────┘
  1935. 28.52 s >
  1936. 28.52 s > stderr:
  1937. 28.52 s > ┌───────────────────────────────────┐
  1938. 28.52 s > │ The Symbolica license has expired │
  1939. 28.52 s > └───────────────────────────────────┘
  1940. 28.52 s >
  1941. 28.52 s >
  1942. 28.52 s > Location:
  1943. 28.52 s > tests/tests/test_python_api.rs:156:20
  1944. 28.52 s > =========================================
  1945. 28.52 s For full logs, run:
  1946. 28.52 s nix log /nix/store/90vl6933shlgrvsg0q1k9hbam6pqxvdh-gammaloop-nextest-python-api.drv
  1947. 28.65 s Run failed.