0.08 s
$ /nix/store/9ypz3flqsrl5xl495mm8h645gadjsxi1-coreutils-9.11/bin/timeout --kill-after=15s 7200s /nix/store/23zk8sgzamrbmj1fday15szf7f2279s8-nix-2.34.7/bin/nix --extra-experimental-features nix-command --extra-experimental-features flakes flake clone git+https://github.com/alphal00p/gammaloop --dest /tmp/nix-ci-worker/stable-pwd/repo/
0.09 s
Cloning into '/tmp/nix-ci-worker/stable-pwd/repo'...
0.78 s
remote: Enumerating objects: 65450, done.
0.89 s
remote: Counting objects: 0% (1/8122)
remote: Counting objects: 1% (82/8122)
remote: Counting objects: 2% (163/8122)
remote: Counting objects: 3% (244/8122)
remote: Counting objects: 4% (325/8122)
remote: Counting objects: 5% (407/8122)
remote: Counting objects: 6% (488/8122)
remote: Counting objects: 7% (569/8122)
remote: Counting objects: 8% (650/8122)
remote: Counting objects: 9% (731/8122)
remote: Counting objects: 10% (813/8122)
remote: Counting objects: 11% (894/8122)
remote: Counting objects: 12% (975/8122)
remote: Counting objects: 13% (1056/8122)
remote: Counting objects: 14% (1138/8122)
remote: Counting objects: 15% (1219/8122)
remote: Counting objects: 16% (1300/8122)
remote: Counting objects: 17% (1381/8122)
remote: Counting objects: 18% (1462/8122)
remote: Counting objects: 19% (1544/8122)
remote: Counting objects: 20% (1625/8122)
remote: Counting objects: 21% (1706/8122)
remote: Counting objects: 22% (1787/8122)
remote: Counting objects: 23% (1869/8122)
remote: Counting objects: 24% (1950/8122)
remote: Counting objects: 25% (2031/8122)
remote: Counting objects: 26% (2112/8122)
remote: Counting objects: 27% (2193/8122)
remote: Counting objects: 28% (2275/8122)
remote: Counting objects: 29% (2356/8122)
remote: Counting objects: 30% (2437/8122)
remote: Counting objects: 31% (2518/8122)
remote: Counting objects: 32% (2600/8122)
remote: Counting objects: 33% (2681/8122)
remote: Counting objects: 34% (2762/8122)
remote: Counting objects: 35% (2843/8122)
remote: Counting objects: 36% (2924/8122)
remote: Counting objects: 37% (3006/8122)
remote: Counting objects: 38% (3087/8122)
remote: Counting objects: 39% (3168/8122)
remote: Counting objects: 40% (3249/8122)
remote: Counting objects: 41% (3331/8122)
remote: Counting objects: 42% (3412/8122)
remote: Counting objects: 43% (3493/8122)
remote: Counting objects: 44% (3574/8122)
remote: Counting objects: 45% (3655/8122)
remote: Counting objects: 46% (3737/8122)
remote: Counting objects: 47% (3818/8122)
remote: Counting objects: 48% (3899/8122)
remote: Counting objects: 49% (3980/8122)
remote: Counting objects: 50% (4061/8122)
remote: Counting objects: 51% (4143/8122)
remote: Counting objects: 52% (4224/8122)
remote: Counting objects: 53% (4305/8122)
remote: Counting objects: 54% (4386/8122)
remote: Counting objects: 55% (4468/8122)
remote: Counting objects: 56% (4549/8122)
remote: Counting objects: 57% (4630/8122)
remote: Counting objects: 58% (4711/8122)
remote: Counting objects: 59% (4792/8122)
remote: Counting objects: 60% (4874/8122)
remote: Counting objects: 61% (4955/8122)
remote: Counting objects: 62% (5036/8122)
remote: Counting objects: 63% (5117/8122)
remote: Counting objects: 64% (5199/8122)
remote: Counting objects: 65% (5280/8122)
remote: Counting objects: 66% (5361/8122)
remote: Counting objects: 67% (5442/8122)
remote: Counting objects: 68% (5523/8122)
remote: Counting objects: 69% (5605/8122)
remote: Counting objects: 70% (5686/8122)
remote: Counting objects: 71% (5767/8122)
remote: Counting objects: 72% (5848/8122)
remote: Counting objects: 73% (5930/8122)
remote: Counting objects: 74% (6011/8122)
remote: Counting objects: 75% (6092/8122)
remote: Counting objects: 76% (6173/8122)
remote: Counting objects: 77% (6254/8122)
remote: Counting objects: 78% (6336/8122)
remote: Counting objects: 79% (6417/8122)
remote: Counting objects: 80% (6498/8122)
remote: Counting objects: 81% (6579/8122)
remote: Counting objects: 82% (6661/8122)
remote: Counting objects: 83% (6742/8122)
remote: Counting objects: 84% (6823/8122)
remote: Counting objects: 85% (6904/8122)
remote: Counting objects: 86% (6985/8122)
remote: Counting objects: 87% (7067/8122)
remote: Counting objects: 88% (7148/8122)
remote: Counting objects: 89% (7229/8122)
remote: Counting objects: 90% (7310/8122)
remote: Counting objects: 91% (7392/8122)
remote: Counting objects: 92% (7473/8122)
remote: Counting objects: 93% (7554/8122)
remote: Counting objects: 94% (7635/8122)
remote: Counting objects: 95% (7716/8122)
remote: Counting objects: 96% (7798/8122)
remote: Counting objects: 97% (7879/8122)
remote: Counting objects: 98% (7960/8122)
remote: Counting objects: 99% (8041/8122)
remote: Counting objects: 100% (8122/8122)
remote: Counting objects: 100% (8122/8122), done.
2.46 s
remote: Compressing objects: 0% (1/1734)
remote: Compressing objects: 1% (18/1734)
remote: Compressing objects: 2% (35/1734)
remote: Compressing objects: 3% (53/1734)
remote: Compressing objects: 4% (70/1734)
remote: Compressing objects: 5% (87/1734)
remote: Compressing objects: 6% (105/1734)
remote: Compressing objects: 7% (122/1734)
remote: Compressing objects: 8% (139/1734)
remote: Compressing objects: 9% (157/1734)
remote: Compressing objects: 10% (174/1734)
remote: Compressing objects: 11% (191/1734)
remote: Compressing objects: 12% (209/1734)
remote: Compressing objects: 13% (226/1734)
remote: Compressing objects: 14% (243/1734)
remote: Compressing objects: 15% (261/1734)
remote: Compressing objects: 16% (278/1734)
remote: Compressing objects: 17% (295/1734)
remote: Compressing objects: 18% (313/1734)
remote: Compressing objects: 18% (318/1734)
remote: Compressing objects: 19% (330/1734)
remote: Compressing objects: 20% (347/1734)
remote: Compressing objects: 21% (365/1734)
remote: Compressing objects: 22% (382/1734)
remote: Compressing objects: 23% (399/1734)
remote: Compressing objects: 24% (417/1734)
remote: Compressing objects: 25% (434/1734)
remote: Compressing objects: 26% (451/1734)
remote: Compressing objects: 27% (469/1734)
remote: Compressing objects: 28% (486/1734)
remote: Compressing objects: 29% (503/1734)
remote: Compressing objects: 30% (521/1734)
remote: Compressing objects: 31% (538/1734)
remote: Compressing objects: 32% (555/1734)
remote: Compressing objects: 33% (573/1734)
remote: Compressing objects: 34% (590/1734)
remote: Compressing objects: 35% (607/1734)
remote: Compressing objects: 36% (625/1734)
remote: Compressing objects: 37% (642/1734)
remote: Compressing objects: 38% (659/1734)
remote: Compressing objects: 39% (677/1734)
remote: Compressing objects: 40% (694/1734)
remote: Compressing objects: 41% (711/1734)
remote: Compressing objects: 42% (729/1734)
remote: Compressing objects: 43% (746/1734)
remote: Compressing objects: 44% (763/1734)
remote: Compressing objects: 45% (781/1734)
remote: Compressing objects: 46% (798/1734)
remote: Compressing objects: 47% (815/1734)
remote: Compressing objects: 48% (833/1734)
remote: Compressing objects: 49% (850/1734)
remote: Compressing objects: 50% (867/1734)
remote: Compressing objects: 51% (885/1734)
remote: Compressing objects: 52% (902/1734)
remote: Compressing objects: 53% (920/1734)
remote: Compressing objects: 54% (937/1734)
remote: Compressing objects: 55% (954/1734)
remote: Compressing objects: 56% (972/1734)
remote: Compressing objects: 57% (989/1734)
remote: Compressing objects: 58% (1006/1734)
remote: Compressing objects: 59% (1024/1734)
remote: Compressing objects: 60% (1041/1734)
remote: Compressing objects: 61% (1058/1734)
remote: Compressing objects: 62% (1076/1734)
remote: Compressing objects: 63% (1093/1734)
remote: Compressing objects: 64% (1110/1734)
remote: Compressing objects: 65% (1128/1734)
remote: Compressing objects: 66% (1145/1734)
remote: Compressing objects: 67% (1162/1734)
remote: Compressing objects: 68% (1180/1734)
remote: Compressing objects: 69% (1197/1734)
remote: Compressing objects: 70% (1214/1734)
remote: Compressing objects: 71% (1232/1734)
remote: Compressing objects: 72% (1249/1734)
remote: Compressing objects: 73% (1266/1734)
remote: Compressing objects: 74% (1284/1734)
remote: Compressing objects: 75% (1301/1734)
remote: Compressing objects: 76% (1318/1734)
remote: Compressing objects: 77% (1336/1734)
remote: Compressing objects: 78% (1353/1734)
remote: Compressing objects: 79% (1370/1734)
remote: Compressing objects: 80% (1388/1734)
remote: Compressing objects: 81% (1405/1734)
remote: Compressing objects: 82% (1422/1734)
remote: Compressing objects: 83% (1440/1734)
remote: Compressing objects: 84% (1457/1734)
remote: Compressing objects: 85% (1474/1734)
remote: Compressing objects: 86% (1492/1734)
remote: Compressing objects: 87% (1509/1734)
remote: Compressing objects: 88% (1526/1734)
remote: Compressing objects: 89% (1544/1734)
remote: Compressing objects: 90% (1561/1734)
remote: Compressing objects: 91% (1578/1734)
remote: Compressing objects: 92% (1596/1734)
remote: Compressing objects: 93% (1613/1734)
remote: Compressing objects: 94% (1630/1734)
remote: Compressing objects: 95% (1648/1734)
remote: Compressing objects: 96% (1665/1734)
remote: Compressing objects: 97% (1682/1734)
remote: Compressing objects: 98% (1700/1734)
remote: Compressing objects: 99% (1717/1734)
remote: Compressing objects: 100% (1734/1734)
remote: Compressing objects: 100% (1734/1734), done.
5.12 s
Receiving objects: 0% (1/65450)
Receiving objects: 1% (655/65450)
Receiving objects: 2% (1309/65450)
Receiving objects: 3% (1964/65450)
Receiving objects: 4% (2618/65450)
Receiving objects: 5% (3273/65450)
Receiving objects: 6% (3927/65450)
Receiving objects: 7% (4582/65450)
Receiving objects: 8% (5236/65450)
Receiving objects: 9% (5891/65450)
Receiving objects: 10% (6545/65450)
Receiving objects: 11% (7200/65450)
Receiving objects: 12% (7854/65450), 13.34 MiB | 26.66 MiB/s
Receiving objects: 13% (8509/65450), 13.34 MiB | 26.66 MiB/s
Receiving objects: 14% (9163/65450), 13.34 MiB | 26.66 MiB/s
Receiving objects: 15% (9818/65450), 13.34 MiB | 26.66 MiB/s
Receiving objects: 16% (10472/65450), 13.34 MiB | 26.66 MiB/s
Receiving objects: 17% (11127/65450), 13.34 MiB | 26.66 MiB/s
Receiving objects: 18% (11781/65450), 13.34 MiB | 26.66 MiB/s
Receiving objects: 19% (12436/65450), 13.34 MiB | 26.66 MiB/s
Receiving objects: 20% (13090/65450), 13.34 MiB | 26.66 MiB/s
Receiving objects: 21% (13745/65450), 13.34 MiB | 26.66 MiB/s
Receiving objects: 22% (14399/65450), 13.34 MiB | 26.66 MiB/s
Receiving objects: 23% (15054/65450), 13.34 MiB | 26.66 MiB/s
Receiving objects: 24% (15708/65450), 13.34 MiB | 26.66 MiB/s
Receiving objects: 25% (16363/65450), 13.34 MiB | 26.66 MiB/s
Receiving objects: 26% (17017/65450), 13.34 MiB | 26.66 MiB/s
Receiving objects: 27% (17672/65450), 13.34 MiB | 26.66 MiB/s
Receiving objects: 28% (18326/65450), 13.34 MiB | 26.66 MiB/s
Receiving objects: 29% (18981/65450), 13.34 MiB | 26.66 MiB/s
Receiving objects: 30% (19635/65450), 13.34 MiB | 26.66 MiB/s
Receiving objects: 31% (20290/65450), 13.34 MiB | 26.66 MiB/s
Receiving objects: 32% (20944/65450), 13.34 MiB | 26.66 MiB/s
Receiving objects: 33% (21599/65450), 13.34 MiB | 26.66 MiB/s
Receiving objects: 34% (22253/65450), 13.34 MiB | 26.66 MiB/s
Receiving objects: 35% (22908/65450), 13.34 MiB | 26.66 MiB/s
Receiving objects: 36% (23562/65450), 13.34 MiB | 26.66 MiB/s
Receiving objects: 37% (24217/65450), 13.34 MiB | 26.66 MiB/s
Receiving objects: 38% (24871/65450), 13.34 MiB | 26.66 MiB/s
Receiving objects: 39% (25526/65450), 13.34 MiB | 26.66 MiB/s
Receiving objects: 40% (26180/65450), 13.34 MiB | 26.66 MiB/s
Receiving objects: 41% (26835/65450), 13.34 MiB | 26.66 MiB/s
Receiving objects: 42% (27489/65450), 13.34 MiB | 26.66 MiB/s
Receiving objects: 43% (28144/65450), 13.34 MiB | 26.66 MiB/s
Receiving objects: 44% (28798/65450), 13.34 MiB | 26.66 MiB/s
Receiving objects: 45% (29453/65450), 13.34 MiB | 26.66 MiB/s
Receiving objects: 46% (30107/65450), 13.34 MiB | 26.66 MiB/s
Receiving objects: 47% (30762/65450), 13.34 MiB | 26.66 MiB/s
Receiving objects: 48% (31416/65450), 13.34 MiB | 26.66 MiB/s
Receiving objects: 49% (32071/65450), 13.34 MiB | 26.66 MiB/s
Receiving objects: 50% (32725/65450), 13.34 MiB | 26.66 MiB/s
Receiving objects: 51% (33380/65450), 13.34 MiB | 26.66 MiB/s
Receiving objects: 52% (34034/65450), 13.34 MiB | 26.66 MiB/s
Receiving objects: 52% (34129/65450), 13.34 MiB | 26.66 MiB/s
Receiving objects: 53% (34689/65450), 33.53 MiB | 33.52 MiB/s
Receiving objects: 54% (35343/65450), 33.53 MiB | 33.52 MiB/s
Receiving objects: 55% (35998/65450), 33.53 MiB | 33.52 MiB/s
Receiving objects: 56% (36652/65450), 33.53 MiB | 33.52 MiB/s
Receiving objects: 57% (37307/65450), 33.53 MiB | 33.52 MiB/s
Receiving objects: 58% (37961/65450), 33.53 MiB | 33.52 MiB/s
Receiving objects: 59% (38616/65450), 33.53 MiB | 33.52 MiB/s
Receiving objects: 60% (39270/65450), 33.53 MiB | 33.52 MiB/s
Receiving objects: 61% (39925/65450), 33.53 MiB | 33.52 MiB/s
Receiving objects: 62% (40579/65450), 33.53 MiB | 33.52 MiB/s
Receiving objects: 63% (41234/65450), 33.53 MiB | 33.52 MiB/s
Receiving objects: 64% (41888/65450), 50.07 MiB | 33.37 MiB/s
Receiving objects: 65% (42543/65450), 50.07 MiB | 33.37 MiB/s
Receiving objects: 66% (43197/65450), 50.07 MiB | 33.37 MiB/s
Receiving objects: 67% (43852/65450), 50.07 MiB | 33.37 MiB/s
Receiving objects: 68% (44506/65450), 50.07 MiB | 33.37 MiB/s
Receiving objects: 69% (45161/65450), 50.07 MiB | 33.37 MiB/s
Receiving objects: 70% (45815/65450), 50.07 MiB | 33.37 MiB/s
Receiving objects: 71% (46470/65450), 50.07 MiB | 33.37 MiB/s
Receiving objects: 72% (47124/65450), 50.07 MiB | 33.37 MiB/s
Receiving objects: 73% (47779/65450), 50.07 MiB | 33.37 MiB/s
Receiving objects: 74% (48433/65450), 50.07 MiB | 33.37 MiB/s
Receiving objects: 75% (49088/65450), 50.07 MiB | 33.37 MiB/s
Receiving objects: 75% (49216/65450), 67.52 MiB | 33.35 MiB/s
Receiving objects: 76% (49742/65450), 67.52 MiB | 33.35 MiB/s
Receiving objects: 77% (50397/65450), 67.52 MiB | 33.35 MiB/s
Receiving objects: 78% (51051/65450), 67.52 MiB | 33.35 MiB/s
Receiving objects: 79% (51706/65450), 67.52 MiB | 33.35 MiB/s
Receiving objects: 80% (52360/65450), 67.52 MiB | 33.35 MiB/s
Receiving objects: 81% (53015/65450), 67.52 MiB | 33.35 MiB/s
Receiving objects: 82% (53669/65450), 67.52 MiB | 33.35 MiB/s
Receiving objects: 83% (54324/65450), 67.52 MiB | 33.35 MiB/s
Receiving objects: 84% (54978/65450), 67.52 MiB | 33.35 MiB/s
Receiving objects: 85% (55633/65450), 67.52 MiB | 33.35 MiB/s
Receiving objects: 86% (56287/65450), 67.52 MiB | 33.35 MiB/s
Receiving objects: 87% (56942/65450), 67.52 MiB | 33.35 MiB/s
Receiving objects: 88% (57596/65450), 67.52 MiB | 33.35 MiB/s
Receiving objects: 89% (58251/65450), 67.52 MiB | 33.35 MiB/s
Receiving objects: 90% (58905/65450), 67.52 MiB | 33.35 MiB/s
Receiving objects: 91% (59560/65450), 67.52 MiB | 33.35 MiB/s
Receiving objects: 92% (60214/65450), 67.52 MiB | 33.35 MiB/s
Receiving objects: 93% (60869/65450), 67.52 MiB | 33.35 MiB/s
Receiving objects: 94% (61523/65450), 84.36 MiB | 33.41 MiB/s
Receiving objects: 95% (62178/65450), 84.36 MiB | 33.41 MiB/s
Receiving objects: 96% (62832/65450), 84.36 MiB | 33.41 MiB/s
Receiving objects: 97% (63487/65450), 84.36 MiB | 33.41 MiB/s
Receiving objects: 98% (64141/65450), 84.36 MiB | 33.41 MiB/s
Receiving objects: 99% (64796/65450), 84.36 MiB | 33.41 MiB/s
remote: Total 65450 (delta 6945), reused 6547 (delta 6369), pack-reused 57328 (from 1)
5.14 s
Receiving objects: 100% (65450/65450), 84.36 MiB | 33.41 MiB/s
Receiving objects: 100% (65450/65450), 88.68 MiB | 33.35 MiB/s, done.
6.67 s
Resolving deltas: 0% (0/46042)
Resolving deltas: 1% (461/46042)
Resolving deltas: 2% (921/46042)
Resolving deltas: 3% (1382/46042)
Resolving deltas: 4% (1842/46042)
Resolving deltas: 5% (2303/46042)
Resolving deltas: 6% (2763/46042)
Resolving deltas: 7% (3223/46042)
Resolving deltas: 8% (3684/46042)
Resolving deltas: 9% (4144/46042)
Resolving deltas: 10% (4605/46042)
Resolving deltas: 11% (5065/46042)
Resolving deltas: 12% (5526/46042)
Resolving deltas: 13% (5986/46042)
Resolving deltas: 14% (6446/46042)
Resolving deltas: 15% (6907/46042)
Resolving deltas: 16% (7368/46042)
Resolving deltas: 17% (7828/46042)
Resolving deltas: 18% (8288/46042)
Resolving deltas: 19% (8748/46042)
Resolving deltas: 20% (9210/46042)
Resolving deltas: 21% (9669/46042)
Resolving deltas: 22% (10130/46042)
Resolving deltas: 23% (10590/46042)
Resolving deltas: 24% (11051/46042)
Resolving deltas: 25% (11511/46042)
Resolving deltas: 26% (11971/46042)
Resolving deltas: 27% (12432/46042)
Resolving deltas: 28% (12893/46042)
Resolving deltas: 29% (13353/46042)
Resolving deltas: 30% (13813/46042)
Resolving deltas: 31% (14275/46042)
Resolving deltas: 32% (14734/46042)
Resolving deltas: 33% (15194/46042)
Resolving deltas: 34% (15655/46042)
Resolving deltas: 35% (16115/46042)
Resolving deltas: 36% (16576/46042)
Resolving deltas: 37% (17036/46042)
Resolving deltas: 38% (17496/46042)
Resolving deltas: 39% (17957/46042)
Resolving deltas: 40% (18417/46042)
Resolving deltas: 41% (18878/46042)
Resolving deltas: 42% (19339/46042)
Resolving deltas: 43% (19799/46042)
Resolving deltas: 44% (20259/46042)
Resolving deltas: 45% (20719/46042)
Resolving deltas: 46% (21180/46042)
Resolving deltas: 47% (21640/46042)
Resolving deltas: 48% (22101/46042)
Resolving deltas: 49% (22561/46042)
Resolving deltas: 50% (23021/46042)
Resolving deltas: 51% (23482/46042)
Resolving deltas: 52% (23942/46042)
Resolving deltas: 53% (24403/46042)
Resolving deltas: 54% (24863/46042)
Resolving deltas: 55% (25324/46042)
Resolving deltas: 56% (25784/46042)
Resolving deltas: 57% (26244/46042)
Resolving deltas: 58% (26705/46042)
Resolving deltas: 59% (27165/46042)
Resolving deltas: 60% (27626/46042)
Resolving deltas: 61% (28086/46042)
Resolving deltas: 62% (28547/46042)
Resolving deltas: 63% (29007/46042)
Resolving deltas: 64% (29467/46042)
Resolving deltas: 65% (29928/46042)
Resolving deltas: 66% (30388/46042)
Resolving deltas: 67% (30849/46042)
Resolving deltas: 68% (31309/46042)
Resolving deltas: 69% (31769/46042)
Resolving deltas: 70% (32230/46042)
Resolving deltas: 71% (32690/46042)
Resolving deltas: 71% (33077/46042)
Resolving deltas: 72% (33151/46042)
Resolving deltas: 73% (33611/46042)
Resolving deltas: 74% (34072/46042)
Resolving deltas: 75% (34532/46042)
Resolving deltas: 76% (34992/46042)
Resolving deltas: 77% (35453/46042)
Resolving deltas: 78% (35913/46042)
Resolving deltas: 79% (36375/46042)
Resolving deltas: 80% (36834/46042)
Resolving deltas: 81% (37295/46042)
Resolving deltas: 82% (37755/46042)
Resolving deltas: 83% (38215/46042)
Resolving deltas: 84% (38676/46042)
Resolving deltas: 85% (39136/46042)
Resolving deltas: 86% (39597/46042)
Resolving deltas: 87% (40057/46042)
Resolving deltas: 88% (40517/46042)
Resolving deltas: 89% (40978/46042)
Resolving deltas: 90% (41438/46042)
Resolving deltas: 91% (41899/46042)
Resolving deltas: 92% (42359/46042)
Resolving deltas: 93% (42820/46042)
Resolving deltas: 94% (43280/46042)
Resolving deltas: 95% (43740/46042)
Resolving deltas: 96% (44201/46042)
Resolving deltas: 97% (44661/46042)
Resolving deltas: 98% (45122/46042)
Resolving deltas: 99% (45582/46042)
Resolving deltas: 100% (46042/46042)
Resolving deltas: 100% (46042/46042), done.
7.10 s
Fetching commit de1fcd35ce25218ec941344369f9e542139a673d for finite_T_and_mu ...
7.10 s
$ /nix/store/bcnisk3ydfgv26v2gw3zlky24g00yww2-git-2.54.0/bin/git fetch origin de1fcd35ce25218ec941344369f9e542139a673d
7.63 s
From https://github.com/alphal00p/gammaloop
7.63 s
* branch de1fcd35ce25218ec941344369f9e542139a673d -> FETCH_HEAD
7.65 s
$ /nix/store/9ypz3flqsrl5xl495mm8h645gadjsxi1-coreutils-9.11/bin/timeout --kill-after=15s 7200s /nix/store/bcnisk3ydfgv26v2gw3zlky24g00yww2-git-2.54.0/bin/git -c advice.detachedHead=false checkout de1fcd35ce25218ec941344369f9e542139a673d
7.86 s
HEAD is now at de1fcd35 fix integrated counterterm orientation localization
7.87 s
$ /nix/store/9ypz3flqsrl5xl495mm8h645gadjsxi1-coreutils-9.11/bin/timeout --kill-after=15s 7200s /nix/store/23zk8sgzamrbmj1fday15szf7f2279s8-nix-2.34.7/bin/nix --extra-experimental-features nix-command --extra-experimental-features flakes --log-format internal-json run .#packages.x86_64-linux.nix-ci-check-gammaloop-nextest-python-api --print-build-logs
8.27 s
error (ignored): SQLite database '/var/cache/nix-ci-worker/eval-cache-v6/236836d192e3189eaf5ff1d2159b989a5433dded7d996aca53c52fa23761689f.sqlite ' is busy
16.15 s
25.80 s
evaluating derivation 'g
copying '/nix/store/jlx6
evaluating derivation 'g
copying '/nix/store/jlx6
evaluating derivation 'g
copying '/nix/store/jlx6
evaluating derivation 'g
copying '/nix/store/jlx6
evaluating derivation 'g
copying '/nix/store/jlx6
evaluating derivation 'g
copying '/nix/store/jlx6
evaluating derivation 'g
copying '/nix/store/jlx6
evaluating derivation 'g
copying '/nix/store/jlx6
evaluating derivation 'g
copying '/nix/store/jlx6
evaluating derivation 'g
copying '/nix/store/jlx6
evaluating derivation 'g
copying '/nix/store/jlx6
evaluating derivation 'g
copying '/nix/store/jlx6
evaluating derivation 'g
copying '/nix/store/jlx6
evaluating derivation 'g
copying '/nix/store/jlx6
evaluating derivation 'g
copying '/nix/store/jlx6
evaluating derivation 'g
copying '/nix/store/jlx6
evaluating derivation 'g
copying '/nix/store/jlx6
evaluating derivation 'g
querying gammaloop-nexte
[0 /1 built, 0.0 KiB DL]
[1 /0 /1 built, 0.0 KiB DLgammaloop-nextest-python-api> Extracting 1 binary, 1 build script output directory, and 3 linked paths to /build/nextest-archive-vvGvrM
25.89 s
gammaloop-nextest-python-api> Extracted 18 files to /build/nextest-archive-vvGvrM in 0.09s
25.90 s
gammaloop-nextest-python-api> ------------
25.90 s
gammaloop-nextest-python-api> Nextest run ID 361f0336-5d5f-4d81-89fd-6e44a3c0536f with nextest profile: ci_gammaloop
25.90 s
gammaloop-nextest-python-api> Starting 5 tests across 1 binary
26.25 s
gammaloop-nextest-python-api> FAIL [ 0.344s] (1/5) gammaloop-integration-tests::test_python_api python_evaluate_sample_honors_generate_events_and_observable_snapshots
26.25 s
gammaloop-nextest-python-api> stdout ---
26.25 s
gammaloop-nextest-python-api>
26.25 s
gammaloop-nextest-python-api> running 1 test
26.25 s
gammaloop-nextest-python-api> test python_evaluate_sample_honors_generate_events_and_observable_snapshots ... FAILED
26.25 s
gammaloop-nextest-python-api>
26.25 s
gammaloop-nextest-python-api> failures:
26.25 s
gammaloop-nextest-python-api>
26.25 s
gammaloop-nextest-python-api> failures:
26.25 s
gammaloop-nextest-python-api> python_evaluate_sample_honors_generate_events_and_observable_snapshots
26.25 s
gammaloop-nextest-python-api>
26.25 s
gammaloop-nextest-python-api> test result: FAILED. 0 passed; 1 failed; 0 ignored; 0 measured; 4 filtered out; finished in 0.33s
26.25 s
gammaloop-nextest-python-api>
26.25 s
gammaloop-nextest-python-api> stderr ---
26.25 s
gammaloop-nextest-python-api> Error: Python API test subprocess failed.
26.25 s
gammaloop-nextest-python-api> stdout:
26.25 s
gammaloop-nextest-python-api> ┌────────────────────────────────────────────────────────┐
26.25 s
gammaloop-nextest-python-api> │ You are running a restricted Symbolica instance. │
26.25 s
gammaloop-nextest-python-api> │ │
26.25 s
gammaloop-nextest-python-api> │ This mode is only permitted for non-commercial use and │
26.25 s
gammaloop-nextest-python-api> │ is limited to one instance and core per machine. │
26.25 s
gammaloop-nextest-python-api> │ │
26.25 s
gammaloop-nextest-python-api> │ Hobbyists can easily acquire a free license key │
26.25 s
gammaloop-nextest-python-api> │ that unlocks all cores and removes this banner: │
26.25 s
gammaloop-nextest-python-api> │ │
26.25 s
gammaloop-nextest-python-api> │ from symbolica import * │
26.25 s
gammaloop-nextest-python-api> │ request_hobbyist_license('YOUR_NAME', 'YOUR_EMAIL') │
26.25 s
gammaloop-nextest-python-api> │ │
26.25 s
gammaloop-nextest-python-api> │ All other users can obtain a free 30-day trial key: │
26.25 s
gammaloop-nextest-python-api> │ │
26.25 s
gammaloop-nextest-python-api> │ from symbolica import * │
26.25 s
gammaloop-nextest-python-api> │ request_trial_license('NAME', 'EMAIL', 'EMPLOYER') │
26.25 s
gammaloop-nextest-python-api> │ │
26.25 s
gammaloop-nextest-python-api> │ See https://symbolica.io/docs/get_started.html#license │
26.25 s
gammaloop-nextest-python-api> └────────────────────────────────────────────────────────┘
26.25 s
gammaloop-nextest-python-api> ┌───────────────────────────────────────────────────────────────────────────────────────────────────────────┐
26.25 s
gammaloop-nextest-python-api> │ Cannot start new unlicensed Symbolica instance since there is already another one running on the machine. │
26.25 s
gammaloop-nextest-python-api> └───────────────────────────────────────────────────────────────────────────────────────────────────────────┘
26.25 s
gammaloop-nextest-python-api>
26.25 s
gammaloop-nextest-python-api> stderr:
26.25 s
gammaloop-nextest-python-api> ┌───────────────────────────────────┐
26.25 s
gammaloop-nextest-python-api> │ The Symbolica license has expired │
26.25 s
gammaloop-nextest-python-api> └───────────────────────────────────┘
26.25 s
gammaloop-nextest-python-api>
26.25 s
gammaloop-nextest-python-api>
26.25 s
gammaloop-nextest-python-api> Location:
26.25 s
gammaloop-nextest-python-api> tests/tests/test_python_api.rs:156:20
26.25 s
gammaloop-nextest-python-api>
26.26 s
gammaloop-nextest-python-api> FAIL [ 0.357s] (2/5) gammaloop-integration-tests::test_python_api python_evaluate_sample_preserves_graph_grouping_and_incoming_pdgs
26.26 s
gammaloop-nextest-python-api> stdout ---
26.26 s
gammaloop-nextest-python-api>
26.26 s
gammaloop-nextest-python-api> running 1 test
26.26 s
gammaloop-nextest-python-api> test python_evaluate_sample_preserves_graph_grouping_and_incoming_pdgs ... FAILED
26.26 s
gammaloop-nextest-python-api>
26.26 s
gammaloop-nextest-python-api> failures:
26.26 s
gammaloop-nextest-python-api>
26.26 s
gammaloop-nextest-python-api> failures:
26.26 s
gammaloop-nextest-python-api> python_evaluate_sample_preserves_graph_grouping_and_incoming_pdgs
26.26 s
gammaloop-nextest-python-api>
26.26 s
gammaloop-nextest-python-api> test result: FAILED. 0 passed; 1 failed; 0 ignored; 0 measured; 4 filtered out; finished in 0.34s
26.26 s
gammaloop-nextest-python-api>
26.26 s
gammaloop-nextest-python-api> stderr ---
26.26 s
gammaloop-nextest-python-api> Error: Python API test subprocess failed.
26.26 s
gammaloop-nextest-python-api> stdout:
26.26 s
gammaloop-nextest-python-api> ┌────────────────────────────────────────────────────────┐
26.26 s
gammaloop-nextest-python-api> │ You are running a restricted Symbolica instance. │
26.26 s
gammaloop-nextest-python-api> │ │
26.26 s
gammaloop-nextest-python-api> │ This mode is only permitted for non-commercial use and │
26.26 s
gammaloop-nextest-python-api> │ is limited to one instance and core per machine. │
26.26 s
gammaloop-nextest-python-api> │ │
26.26 s
gammaloop-nextest-python-api> │ Hobbyists can easily acquire a free license key │
26.26 s
gammaloop-nextest-python-api> │ that unlocks all cores and removes this banner: │
26.26 s
gammaloop-nextest-python-api> │ │
26.26 s
gammaloop-nextest-python-api> │ from symbolica import * │
26.26 s
gammaloop-nextest-python-api> │ request_hobbyist_license('YOUR_NAME', 'YOUR_EMAIL') │
26.26 s
gammaloop-nextest-python-api> │ │
26.26 s
gammaloop-nextest-python-api> │ All other users can obtain a free 30-day trial key: │
26.26 s
gammaloop-nextest-python-api> │ │
26.26 s
gammaloop-nextest-python-api> │ from symbolica import * │
26.26 s
gammaloop-nextest-python-api> │ request_trial_license('NAME', 'EMAIL', 'EMPLOYER') │
26.26 s
gammaloop-nextest-python-api> │ │
26.26 s
gammaloop-nextest-python-api> │ See https://symbolica.io/docs/get_started.html#license │
26.26 s
gammaloop-nextest-python-api> └────────────────────────────────────────────────────────┘
26.26 s
gammaloop-nextest-python-api> ┌───────────────────────────────────────────────────────────────────────────────────────────────────────────┐
26.26 s
gammaloop-nextest-python-api> │ Cannot start new unlicensed Symbolica instance since there is already another one running on the machine. │
26.26 s
gammaloop-nextest-python-api> └───────────────────────────────────────────────────────────────────────────────────────────────────────────┘
26.26 s
gammaloop-nextest-python-api>
26.26 s
gammaloop-nextest-python-api> stderr:
26.26 s
gammaloop-nextest-python-api> ┌───────────────────────────────────┐
26.26 s
gammaloop-nextest-python-api> │ The Symbolica license has expired │
26.26 s
gammaloop-nextest-python-api> └───────────────────────────────────┘
26.26 s
gammaloop-nextest-python-api>
26.26 s
gammaloop-nextest-python-api>
26.26 s
gammaloop-nextest-python-api> Location:
26.26 s
gammaloop-nextest-python-api> tests/tests/test_python_api.rs:156:20
26.26 s
gammaloop-nextest-python-api>
26.27 s
gammaloop-nextest-python-api> FAIL [ 0.361s] (3/5) gammaloop-integration-tests::test_python_api python_session_getters_return_live_toml_and_command_blocks
26.27 s
gammaloop-nextest-python-api> stdout ---
26.27 s
gammaloop-nextest-python-api>
26.27 s
gammaloop-nextest-python-api> running 1 test
26.27 s
gammaloop-nextest-python-api> test python_session_getters_return_live_toml_and_command_blocks ... FAILED
26.27 s
gammaloop-nextest-python-api>
26.27 s
gammaloop-nextest-python-api> failures:
26.27 s
gammaloop-nextest-python-api>
26.27 s
gammaloop-nextest-python-api> failures:
26.27 s
gammaloop-nextest-python-api> python_session_getters_return_live_toml_and_command_blocks
26.27 s
gammaloop-nextest-python-api>
26.27 s
gammaloop-nextest-python-api> test result: FAILED. 0 passed; 1 failed; 0 ignored; 0 measured; 4 filtered out; finished in 0.35s
26.27 s
gammaloop-nextest-python-api>
26.27 s
gammaloop-nextest-python-api> stderr ---
26.27 s
gammaloop-nextest-python-api> Error: Python API test subprocess failed.
26.27 s
gammaloop-nextest-python-api> stdout:
26.27 s
gammaloop-nextest-python-api> ┌────────────────────────────────────────────────────────┐
26.27 s
gammaloop-nextest-python-api> │ You are running a restricted Symbolica instance. │
26.27 s
gammaloop-nextest-python-api> │ │
26.27 s
gammaloop-nextest-python-api> │ This mode is only permitted for non-commercial use and │
26.27 s
gammaloop-nextest-python-api> │ is limited to one instance and core per machine. │
26.27 s
gammaloop-nextest-python-api> │ │
26.27 s
gammaloop-nextest-python-api> │ Hobbyists can easily acquire a free license key │
26.27 s
gammaloop-nextest-python-api> │ that unlocks all cores and removes this banner: │
26.27 s
gammaloop-nextest-python-api> │ │
26.27 s
gammaloop-nextest-python-api> │ from symbolica import * │
26.27 s
gammaloop-nextest-python-api> │ request_hobbyist_license('YOUR_NAME', 'YOUR_EMAIL') │
26.27 s
gammaloop-nextest-python-api> │ │
26.27 s
gammaloop-nextest-python-api> │ All other users can obtain a free 30-day trial key: │
26.27 s
gammaloop-nextest-python-api> │ │
26.27 s
gammaloop-nextest-python-api> │ from symbolica import * │
26.27 s
gammaloop-nextest-python-api> │ request_trial_license('NAME', 'EMAIL', 'EMPLOYER') │
26.27 s
gammaloop-nextest-python-api> │ │
26.27 s
gammaloop-nextest-python-api> │ See https://symbolica.io/docs/get_started.html#license │
26.27 s
gammaloop-nextest-python-api> └────────────────────────────────────────────────────────┘
26.27 s
gammaloop-nextest-python-api> ┌───────────────────────────────────────────────────────────────────────────────────────────────────────────┐
26.27 s
gammaloop-nextest-python-api> │ Cannot start new unlicensed Symbolica instance since there is already another one running on the machine. │
26.27 s
gammaloop-nextest-python-api> └───────────────────────────────────────────────────────────────────────────────────────────────────────────┘
26.27 s
gammaloop-nextest-python-api>
26.27 s
gammaloop-nextest-python-api> stderr:
26.27 s
gammaloop-nextest-python-api> ┌───────────────────────────────────┐
26.27 s
gammaloop-nextest-python-api> │ The Symbolica license has expired │
26.27 s
gammaloop-nextest-python-api> └───────────────────────────────────┘
26.27 s
gammaloop-nextest-python-api>
26.27 s
gammaloop-nextest-python-api>
26.27 s
gammaloop-nextest-python-api> Location:
26.27 s
gammaloop-nextest-python-api> tests/tests/test_python_api.rs:156:20
26.27 s
gammaloop-nextest-python-api>
26.32 s
gammaloop-nextest-python-api> FAIL [ 0.417s] (4/5) gammaloop-integration-tests::test_python_api python_evaluate_samples_batch_and_momentum_space_have_expected_shape
26.32 s
gammaloop-nextest-python-api> stdout ---
26.32 s
gammaloop-nextest-python-api>
26.32 s
gammaloop-nextest-python-api> running 1 test
26.32 s
gammaloop-nextest-python-api> test python_evaluate_samples_batch_and_momentum_space_have_expected_shape ... FAILED
26.32 s
gammaloop-nextest-python-api>
26.32 s
gammaloop-nextest-python-api> failures:
26.32 s
gammaloop-nextest-python-api>
26.32 s
gammaloop-nextest-python-api> failures:
26.32 s
gammaloop-nextest-python-api> python_evaluate_samples_batch_and_momentum_space_have_expected_shape
26.32 s
gammaloop-nextest-python-api>
26.32 s
gammaloop-nextest-python-api> test result: FAILED. 0 passed; 1 failed; 0 ignored; 0 measured; 4 filtered out; finished in 0.41s
26.32 s
gammaloop-nextest-python-api>
26.32 s
gammaloop-nextest-python-api> stderr ---
26.32 s
gammaloop-nextest-python-api> Error: Python API test subprocess failed.
26.32 s
gammaloop-nextest-python-api> stdout:
26.32 s
gammaloop-nextest-python-api> ┌────────────────────────────────────────────────────────┐
26.32 s
gammaloop-nextest-python-api> │ You are running a restricted Symbolica instance. │
26.32 s
gammaloop-nextest-python-api> │ │
26.32 s
gammaloop-nextest-python-api> │ This mode is only permitted for non-commercial use and │
26.32 s
gammaloop-nextest-python-api> │ is limited to one instance and core per machine. │
26.32 s
gammaloop-nextest-python-api> │ │
26.32 s
gammaloop-nextest-python-api> │ Hobbyists can easily acquire a free license key │
26.32 s
gammaloop-nextest-python-api> │ that unlocks all cores and removes this banner: │
26.32 s
gammaloop-nextest-python-api> │ │
26.32 s
gammaloop-nextest-python-api> │ from symbolica import * │
26.32 s
gammaloop-nextest-python-api> │ request_hobbyist_license('YOUR_NAME', 'YOUR_EMAIL') │
26.32 s
gammaloop-nextest-python-api> │ │
26.32 s
gammaloop-nextest-python-api> │ All other users can obtain a free 30-day trial key: │
26.32 s
gammaloop-nextest-python-api> │ │
26.32 s
gammaloop-nextest-python-api> │ from symbolica import * │
26.32 s
gammaloop-nextest-python-api> │ request_trial_license('NAME', 'EMAIL', 'EMPLOYER') │
26.32 s
gammaloop-nextest-python-api> │ │
26.32 s
gammaloop-nextest-python-api> │ See https://symbolica.io/docs/get_started.html#license │
26.32 s
gammaloop-nextest-python-api> └────────────────────────────────────────────────────────┘
26.32 s
gammaloop-nextest-python-api> ┌───────────────────────────────────────────────────────────────────────────────────────────────────────────┐
26.32 s
gammaloop-nextest-python-api> │ Cannot start new unlicensed Symbolica instance since there is already another one running on the machine. │
26.32 s
gammaloop-nextest-python-api> └───────────────────────────────────────────────────────────────────────────────────────────────────────────┘
26.32 s
gammaloop-nextest-python-api>
26.32 s
gammaloop-nextest-python-api> stderr:
26.32 s
gammaloop-nextest-python-api> ┌───────────────────────────────────┐
26.32 s
gammaloop-nextest-python-api> │ The Symbolica license has expired │
26.32 s
gammaloop-nextest-python-api> └───────────────────────────────────┘
26.32 s
gammaloop-nextest-python-api> [2026-09-01 10:05:15.283] @gammaloop_api::se... INFO : Running command import model sm-default
26.32 s
gammaloop-nextest-python-api> [2026-09-01 10:05:15.285] @import::model INFO : Loading built-in JSON model sm-default
26.32 s
gammaloop-nextest-python-api> [2026-09-01 10:05:15.348] @gammalooprs::model INFO : The following 15 external parameters were forced to zero by the restriction card:
26.32 s
gammaloop-nextest-python-api> lamWS, AWS, rhoWS, etaWS, ymc, yme, ymm, MC, Me, MM, WTau, muQ, muLe, muLmu, muLtau
26.32 s
gammaloop-nextest-python-api> [2026-09-01 10:05:15.348] @gammalooprs::model INFO : The following 34 vertex rules were removed by the restriction card:
26.32 s
gammaloop-nextest-python-api> V_82 -> (c~, d, G+) | V_83 -> (t~, d, G+) | V_84 -> (c~, s, G+) | V_85 -> (t~, s, G+) | V_86 -> (u~, b, G+) | V_87 -> (c~, b, G+) | V_90 -> (c~, d, W+) | V_91 -> (t~, d, W+) | V_92 -> (u~, s, W+) | V_94 -> (t~, s, W+) | V_95 -> (u~, b, W+) | V_96 -> (c~, b, W+) | V_101 -> (e+, e-, G0) | V_102 -> (mu+, mu-, G0) | V_104 -> (e+, e-, H) | V_105 -> (mu+, mu-, H) | V_110 -> (ve~, e-, G+) | V_111 -> (vm~, mu-, G+) | V_116 -> (b~, u, G-) | V_117 -> (d~, c, G-) | V_118 -> (s~, c, G-) | V_119 -> (b~, c, G-) | V_120 -> (d~, t, G-) | V_121 -> (s~, t, G-) | V_124 -> (s~, u, W-) | V_125 -> (b~, u, W-) | V_126 -> (d~, c, W-) | V_128 -> (b~, c, W-) | V_129 -> (d~, t, W-) | V_130 -> (s~, t, W-) | V_138 -> (c~, c, G0) | V_140 -> (c~, c, H) | V_145 -> (e+, ve, G-) | V_146 -> (mu+, vm, G-)
26.33 s
gammaloop-nextest-python-api> [2026-09-01 10:05:15.348] @gammalooprs::model INFO : The following 36 couplings were removed by the restriction card:
26.33 s
gammaloop-nextest-python-api> GC_13, GC_14, GC_16, GC_17, GC_18, GC_19, GC_20, GC_22, GC_23, GC_24, GC_25, GC_26, GC_28, GC_29, GC_42, GC_43, GC_44, GC_46, GC_47, GC_48, GC_84, GC_85, GC_86, GC_87, GC_88, GC_89, GC_90, GC_91, GC_92, GC_93, GC_101, GC_102, GC_103, GC_105, GC_106, GC_107
26.33 s
gammaloop-nextest-python-api> [2026-09-01 10:05:15.359] @gammaloop_api::se... INFO : Running command set default-runtime kv kinematics.externals='{"type":"constant","data":{"momenta":[[32.0,0.0,0.0,32.0],[32.0,0.0,0.0,-32.0]],"helicities":[1,1]}}'
26.33 s
gammaloop-nextest-python-api> [2026-09-01 10:05:15.360] @gammaloop_api::se... INFO : Running command set default-runtime kv subtraction.disable_threshold_subtraction=true
26.33 s
gammaloop-nextest-python-api> [2026-09-01 10:05:15.361] @gammaloop_api::se... INFO : Running command generate xs e+ e- > d d~ g | e- a d g QED^2==4 [{{2}} QCD=0] --numerator-grouping group_identical_graphs_up_to_sign --clear-existing-processes --only-diagrams
26.33 s
gammaloop-nextest-python-api> [2026-09-01 10:05:15.380] @feyngen::diagram_... INFO : 0s | Δ=0s | Starting Feynman graph generation with Symbolica...
26.33 s
gammaloop-nextest-python-api> [2026-09-01 10:05:15.386] @feyngen::diagram_... INFO : 0s | Δ=0s | Number of graphs resulting from Symbolica generation: 246
26.33 s
gammaloop-nextest-python-api> [2026-09-01 10:05:15.388] @feyngen::diagram_... INFO : 0s | Δ=0s | Number of graphs retained after enforcing supergraph particle content: 8
26.33 s
gammaloop-nextest-python-api> [2026-09-01 10:05:15.388] @feyngen::diagram_... INFO : 0s | Δ=0s | Number of graphs retained after removal of vetoed topologies: 8
26.33 s
gammaloop-nextest-python-api> [2026-09-01 10:05:15.389] @feyngen::diagram_... INFO : 0s | Δ=0s | Number of graphs after vertex info assignment: 8
26.33 s
gammaloop-nextest-python-api> [2026-09-01 10:05:15.389] @feyngen::diagram_... INFO : 0s | Δ=0s | Number of graphs after all complete graphs filters are applied: 8
26.33 s
gammaloop-nextest-python-api>
26.33 s
gammaloop-nextest-python-api>
26.33 s
gammaloop-nextest-python-api> Location:
26.33 s
gammaloop-nextest-python-api> tests/tests/test_python_api.rs:156:20
26.33 s
gammaloop-nextest-python-api>
26.35 s
gammaloop-nextest-python-api> FAIL [ 0.447s] (5/5) gammaloop-integration-tests::test_python_api python_settings_wrappers_expose_nested_runtime_and_global_settings
26.35 s
gammaloop-nextest-python-api> stdout ---
26.35 s
gammaloop-nextest-python-api>
26.35 s
gammaloop-nextest-python-api> running 1 test
26.35 s
gammaloop-nextest-python-api> test python_settings_wrappers_expose_nested_runtime_and_global_settings ... FAILED
26.35 s
gammaloop-nextest-python-api>
26.35 s
gammaloop-nextest-python-api> failures:
26.35 s
gammaloop-nextest-python-api>
26.35 s
gammaloop-nextest-python-api> failures:
26.35 s
gammaloop-nextest-python-api> python_settings_wrappers_expose_nested_runtime_and_global_settings
26.35 s
gammaloop-nextest-python-api>
26.35 s
gammaloop-nextest-python-api> test result: FAILED. 0 passed; 1 failed; 0 ignored; 0 measured; 4 filtered out; finished in 0.44s
26.35 s
gammaloop-nextest-python-api>
26.35 s
gammaloop-nextest-python-api> stderr ---
26.35 s
gammaloop-nextest-python-api> Error: Python API test subprocess failed.
26.35 s
gammaloop-nextest-python-api> stdout:
26.35 s
gammaloop-nextest-python-api> ┌────────────────────────────────────────────────────────┐
26.35 s
gammaloop-nextest-python-api> │ You are running a restricted Symbolica instance. │
26.35 s
gammaloop-nextest-python-api> │ │
26.35 s
gammaloop-nextest-python-api> │ This mode is only permitted for non-commercial use and │
26.35 s
gammaloop-nextest-python-api> │ is limited to one instance and core per machine. │
26.35 s
gammaloop-nextest-python-api> │ │
26.35 s
gammaloop-nextest-python-api> │ Hobbyists can easily acquire a free license key │
26.35 s
gammaloop-nextest-python-api> │ that unlocks all cores and removes this banner: │
26.36 s
gammaloop-nextest-python-api> │ │
26.36 s
gammaloop-nextest-python-api> │ from symbolica import * │
26.36 s
gammaloop-nextest-python-api> │ request_hobbyist_license('YOUR_NAME', 'YOUR_EMAIL') │
26.36 s
gammaloop-nextest-python-api> │ │
26.36 s
gammaloop-nextest-python-api> │ All other users can obtain a free 30-day trial key: │
26.36 s
gammaloop-nextest-python-api> │ │
26.36 s
gammaloop-nextest-python-api> │ from symbolica import * │
26.36 s
gammaloop-nextest-python-api> │ request_trial_license('NAME', 'EMAIL', 'EMPLOYER') │
26.36 s
gammaloop-nextest-python-api> │ │
26.36 s
gammaloop-nextest-python-api> │ See https://symbolica.io/docs/get_started.html#license │
26.36 s
gammaloop-nextest-python-api> └────────────────────────────────────────────────────────┘
26.36 s
gammaloop-nextest-python-api> ┌───────────────────────────────────────────────────────────────────────────────────────────────────────────┐
26.36 s
gammaloop-nextest-python-api> │ Cannot start new unlicensed Symbolica instance since there is already another one running on the machine. │
26.36 s
gammaloop-nextest-python-api> └───────────────────────────────────────────────────────────────────────────────────────────────────────────┘
26.36 s
gammaloop-nextest-python-api>
26.36 s
gammaloop-nextest-python-api> stderr:
26.36 s
gammaloop-nextest-python-api> ┌───────────────────────────────────┐
26.36 s
gammaloop-nextest-python-api> │ The Symbolica license has expired │
26.36 s
gammaloop-nextest-python-api> └───────────────────────────────────┘
26.36 s
gammaloop-nextest-python-api>
26.36 s
gammaloop-nextest-python-api>
26.36 s
gammaloop-nextest-python-api> Location:
26.36 s
gammaloop-nextest-python-api> tests/tests/test_python_api.rs:156:20
26.36 s
gammaloop-nextest-python-api>
26.36 s
gammaloop-nextest-python-api> ------------
26.36 s
gammaloop-nextest-python-api> Summary [ 0.449s] 5 tests run: 0 passed , 5 failed , 0 skipped
26.36 s
gammaloop-nextest-python-api> FAIL [ 0.344s] (1/5) gammaloop-integration-tests::test_python_api python_evaluate_sample_honors_generate_events_and_observable_snapshots
26.36 s
gammaloop-nextest-python-api> stdout ---
26.36 s
gammaloop-nextest-python-api>
26.36 s
gammaloop-nextest-python-api> running 1 test
26.36 s
gammaloop-nextest-python-api> test python_evaluate_sample_honors_generate_events_and_observable_snapshots ... FAILED
26.36 s
gammaloop-nextest-python-api>
26.36 s
gammaloop-nextest-python-api> failures:
26.36 s
gammaloop-nextest-python-api>
26.36 s
gammaloop-nextest-python-api> failures:
26.36 s
gammaloop-nextest-python-api> python_evaluate_sample_honors_generate_events_and_observable_snapshots
26.36 s
gammaloop-nextest-python-api>
26.36 s
gammaloop-nextest-python-api> test result: FAILED. 0 passed; 1 failed; 0 ignored; 0 measured; 4 filtered out; finished in 0.33s
26.36 s
gammaloop-nextest-python-api>
26.36 s
gammaloop-nextest-python-api> stderr ---
26.36 s
gammaloop-nextest-python-api> Error: Python API test subprocess failed.
26.36 s
gammaloop-nextest-python-api> stdout:
26.36 s
gammaloop-nextest-python-api> ┌────────────────────────────────────────────────────────┐
26.36 s
gammaloop-nextest-python-api> │ You are running a restricted Symbolica instance. │
26.36 s
gammaloop-nextest-python-api> │ │
26.36 s
gammaloop-nextest-python-api> │ This mode is only permitted for non-commercial use and │
26.36 s
gammaloop-nextest-python-api> │ is limited to one instance and core per machine. │
26.36 s
gammaloop-nextest-python-api> │ │
26.36 s
gammaloop-nextest-python-api> │ Hobbyists can easily acquire a free license key │
26.36 s
gammaloop-nextest-python-api> │ that unlocks all cores and removes this banner: │
26.36 s
gammaloop-nextest-python-api> │ │
26.36 s
gammaloop-nextest-python-api> │ from symbolica import * │
26.36 s
gammaloop-nextest-python-api> │ request_hobbyist_license('YOUR_NAME', 'YOUR_EMAIL') │
26.36 s
gammaloop-nextest-python-api> │ │
26.36 s
gammaloop-nextest-python-api> │ All other users can obtain a free 30-day trial key: │
26.36 s
gammaloop-nextest-python-api> │ │
26.36 s
gammaloop-nextest-python-api> │ from symbolica import * │
26.36 s
gammaloop-nextest-python-api> │ request_trial_license('NAME', 'EMAIL', 'EMPLOYER') │
26.36 s
gammaloop-nextest-python-api> │ │
26.36 s
gammaloop-nextest-python-api> │ See https://symbolica.io/docs/get_started.html#license │
26.36 s
gammaloop-nextest-python-api> └────────────────────────────────────────────────────────┘
26.36 s
gammaloop-nextest-python-api> ┌───────────────────────────────────────────────────────────────────────────────────────────────────────────┐
26.36 s
gammaloop-nextest-python-api> │ Cannot start new unlicensed Symbolica instance since there is already another one running on the machine. │
26.36 s
gammaloop-nextest-python-api> └───────────────────────────────────────────────────────────────────────────────────────────────────────────┘
26.36 s
gammaloop-nextest-python-api>
26.36 s
gammaloop-nextest-python-api> stderr:
26.36 s
gammaloop-nextest-python-api> ┌───────────────────────────────────┐
26.36 s
gammaloop-nextest-python-api> │ The Symbolica license has expired │
26.36 s
gammaloop-nextest-python-api> └───────────────────────────────────┘
26.36 s
gammaloop-nextest-python-api>
26.36 s
gammaloop-nextest-python-api>
26.36 s
gammaloop-nextest-python-api> Location:
26.36 s
gammaloop-nextest-python-api> tests/tests/test_python_api.rs:156:20
26.36 s
gammaloop-nextest-python-api>
26.36 s
gammaloop-nextest-python-api> FAIL [ 0.357s] (2/5) gammaloop-integration-tests::test_python_api python_evaluate_sample_preserves_graph_grouping_and_incoming_pdgs
26.36 s
gammaloop-nextest-python-api> stdout ---
26.36 s
gammaloop-nextest-python-api>
26.36 s
gammaloop-nextest-python-api> running 1 test
26.36 s
gammaloop-nextest-python-api> test python_evaluate_sample_preserves_graph_grouping_and_incoming_pdgs ... FAILED
26.36 s
gammaloop-nextest-python-api>
26.36 s
gammaloop-nextest-python-api> failures:
26.36 s
gammaloop-nextest-python-api>
26.36 s
gammaloop-nextest-python-api> failures:
26.36 s
gammaloop-nextest-python-api> python_evaluate_sample_preserves_graph_grouping_and_incoming_pdgs
26.36 s
gammaloop-nextest-python-api>
26.36 s
gammaloop-nextest-python-api> test result: FAILED. 0 passed; 1 failed; 0 ignored; 0 measured; 4 filtered out; finished in 0.34s
26.36 s
gammaloop-nextest-python-api>
26.36 s
gammaloop-nextest-python-api> stderr ---
26.36 s
gammaloop-nextest-python-api> Error: Python API test subprocess failed.
26.36 s
gammaloop-nextest-python-api> stdout:
26.36 s
gammaloop-nextest-python-api> ┌────────────────────────────────────────────────────────┐
26.36 s
gammaloop-nextest-python-api> │ You are running a restricted Symbolica instance. │
26.36 s
gammaloop-nextest-python-api> │ │
26.36 s
gammaloop-nextest-python-api> │ This mode is only permitted for non-commercial use and │
26.36 s
gammaloop-nextest-python-api> │ is limited to one instance and core per machine. │
26.36 s
gammaloop-nextest-python-api> │ │
26.36 s
gammaloop-nextest-python-api> │ Hobbyists can easily acquire a free license key │
26.36 s
gammaloop-nextest-python-api> │ that unlocks all cores and removes this banner: │
26.36 s
gammaloop-nextest-python-api> │ │
26.36 s
gammaloop-nextest-python-api> │ from symbolica import * │
26.36 s
gammaloop-nextest-python-api> │ request_hobbyist_license('YOUR_NAME', 'YOUR_EMAIL') │
26.36 s
gammaloop-nextest-python-api> │ │
26.36 s
gammaloop-nextest-python-api> │ All other users can obtain a free 30-day trial key: │
26.36 s
gammaloop-nextest-python-api> │ │
26.36 s
gammaloop-nextest-python-api> │ from symbolica import * │
26.36 s
gammaloop-nextest-python-api> │ request_trial_license('NAME', 'EMAIL', 'EMPLOYER') │
26.36 s
gammaloop-nextest-python-api> │ │
26.36 s
gammaloop-nextest-python-api> │ See https://symbolica.io/docs/get_started.html#license │
26.36 s
gammaloop-nextest-python-api> └────────────────────────────────────────────────────────┘
26.36 s
gammaloop-nextest-python-api> ┌───────────────────────────────────────────────────────────────────────────────────────────────────────────┐
26.36 s
gammaloop-nextest-python-api> │ Cannot start new unlicensed Symbolica instance since there is already another one running on the machine. │
26.36 s
gammaloop-nextest-python-api> └───────────────────────────────────────────────────────────────────────────────────────────────────────────┘
26.36 s
gammaloop-nextest-python-api>
26.36 s
gammaloop-nextest-python-api> stderr:
26.36 s
gammaloop-nextest-python-api> ┌───────────────────────────────────┐
26.36 s
gammaloop-nextest-python-api> │ The Symbolica license has expired │
26.36 s
gammaloop-nextest-python-api> └───────────────────────────────────┘
26.36 s
gammaloop-nextest-python-api>
26.36 s
gammaloop-nextest-python-api>
26.36 s
gammaloop-nextest-python-api> Location:
26.36 s
gammaloop-nextest-python-api> tests/tests/test_python_api.rs:156:20
26.36 s
gammaloop-nextest-python-api>
26.36 s
gammaloop-nextest-python-api> FAIL [ 0.361s] (3/5) gammaloop-integration-tests::test_python_api python_session_getters_return_live_toml_and_command_blocks
26.36 s
gammaloop-nextest-python-api> stdout ---
26.36 s
gammaloop-nextest-python-api>
26.36 s
gammaloop-nextest-python-api> running 1 test
26.36 s
gammaloop-nextest-python-api> test python_session_getters_return_live_toml_and_command_blocks ... FAILED
26.36 s
gammaloop-nextest-python-api>
26.36 s
gammaloop-nextest-python-api> failures:
26.36 s
gammaloop-nextest-python-api>
26.36 s
gammaloop-nextest-python-api> failures:
26.36 s
gammaloop-nextest-python-api> python_session_getters_return_live_toml_and_command_blocks
26.36 s
gammaloop-nextest-python-api>
26.36 s
gammaloop-nextest-python-api> test result: FAILED. 0 passed; 1 failed; 0 ignored; 0 measured; 4 filtered out; finished in 0.35s
26.36 s
gammaloop-nextest-python-api>
26.36 s
gammaloop-nextest-python-api> stderr ---
26.36 s
gammaloop-nextest-python-api> Error: Python API test subprocess failed.
26.36 s
gammaloop-nextest-python-api> stdout:
26.36 s
gammaloop-nextest-python-api> ┌────────────────────────────────────────────────────────┐
26.36 s
gammaloop-nextest-python-api> │ You are running a restricted Symbolica instance. │
26.36 s
gammaloop-nextest-python-api> │ │
26.36 s
gammaloop-nextest-python-api> │ This mode is only permitted for non-commercial use and │
26.36 s
gammaloop-nextest-python-api> │ is limited to one instance and core per machine. │
26.36 s
gammaloop-nextest-python-api> │ │
26.36 s
gammaloop-nextest-python-api> │ Hobbyists can easily acquire a free license key │
26.36 s
gammaloop-nextest-python-api> │ that unlocks all cores and removes this banner: │
26.36 s
gammaloop-nextest-python-api> │ │
26.36 s
gammaloop-nextest-python-api> │ from symbolica import * │
26.36 s
gammaloop-nextest-python-api> │ request_hobbyist_license('YOUR_NAME', 'YOUR_EMAIL') │
26.36 s
gammaloop-nextest-python-api> │ │
26.36 s
gammaloop-nextest-python-api> │ All other users can obtain a free 30-day trial key: │
26.36 s
gammaloop-nextest-python-api> │ │
26.36 s
gammaloop-nextest-python-api> │ from symbolica import * │
26.36 s
gammaloop-nextest-python-api> │ request_trial_license('NAME', 'EMAIL', 'EMPLOYER') │
26.36 s
gammaloop-nextest-python-api> │ │
26.36 s
gammaloop-nextest-python-api> │ See https://symbolica.io/docs/get_started.html#license │
26.36 s
gammaloop-nextest-python-api> └────────────────────────────────────────────────────────┘
26.36 s
gammaloop-nextest-python-api> ┌───────────────────────────────────────────────────────────────────────────────────────────────────────────┐
26.36 s
gammaloop-nextest-python-api> │ Cannot start new unlicensed Symbolica instance since there is already another one running on the machine. │
26.36 s
gammaloop-nextest-python-api> └───────────────────────────────────────────────────────────────────────────────────────────────────────────┘
26.36 s
gammaloop-nextest-python-api>
26.36 s
gammaloop-nextest-python-api> stderr:
26.36 s
gammaloop-nextest-python-api> ┌───────────────────────────────────┐
26.36 s
gammaloop-nextest-python-api> │ The Symbolica license has expired │
26.36 s
gammaloop-nextest-python-api> └───────────────────────────────────┘
26.36 s
gammaloop-nextest-python-api>
26.36 s
gammaloop-nextest-python-api>
26.36 s
gammaloop-nextest-python-api> Location:
26.36 s
gammaloop-nextest-python-api> tests/tests/test_python_api.rs:156:20
26.36 s
gammaloop-nextest-python-api>
26.36 s
gammaloop-nextest-python-api> FAIL [ 0.417s] (4/5) gammaloop-integration-tests::test_python_api python_evaluate_samples_batch_and_momentum_space_have_expected_shape
26.36 s
gammaloop-nextest-python-api> stdout ---
26.36 s
gammaloop-nextest-python-api>
26.36 s
gammaloop-nextest-python-api> running 1 test
26.36 s
gammaloop-nextest-python-api> test python_evaluate_samples_batch_and_momentum_space_have_expected_shape ... FAILED
26.36 s
gammaloop-nextest-python-api>
26.36 s
gammaloop-nextest-python-api> failures:
26.36 s
gammaloop-nextest-python-api>
26.36 s
gammaloop-nextest-python-api> failures:
26.36 s
gammaloop-nextest-python-api> python_evaluate_samples_batch_and_momentum_space_have_expected_shape
26.36 s
gammaloop-nextest-python-api>
26.36 s
gammaloop-nextest-python-api> test result: FAILED. 0 passed; 1 failed; 0 ignored; 0 measured; 4 filtered out; finished in 0.41s
26.36 s
gammaloop-nextest-python-api>
26.36 s
gammaloop-nextest-python-api> stderr ---
26.36 s
gammaloop-nextest-python-api> Error: Python API test subprocess failed.
26.36 s
gammaloop-nextest-python-api> stdout:
26.36 s
gammaloop-nextest-python-api> ┌────────────────────────────────────────────────────────┐
26.36 s
gammaloop-nextest-python-api> │ You are running a restricted Symbolica instance. │
26.36 s
gammaloop-nextest-python-api> │ │
26.36 s
gammaloop-nextest-python-api> │ This mode is only permitted for non-commercial use and │
26.36 s
gammaloop-nextest-python-api> │ is limited to one instance and core per machine. │
26.36 s
gammaloop-nextest-python-api> │ │
26.36 s
gammaloop-nextest-python-api> │ Hobbyists can easily acquire a free license key │
26.36 s
gammaloop-nextest-python-api> │ that unlocks all cores and removes this banner: │
26.36 s
gammaloop-nextest-python-api> │ │
26.36 s
gammaloop-nextest-python-api> │ from symbolica import * │
26.36 s
gammaloop-nextest-python-api> │ request_hobbyist_license('YOUR_NAME', 'YOUR_EMAIL') │
26.36 s
gammaloop-nextest-python-api> │ │
26.36 s
gammaloop-nextest-python-api> │ All other users can obtain a free 30-day trial key: │
26.36 s
gammaloop-nextest-python-api> │ │
26.36 s
gammaloop-nextest-python-api> │ from symbolica import * │
26.36 s
gammaloop-nextest-python-api> │ request_trial_license('NAME', 'EMAIL', 'EMPLOYER') │
26.36 s
gammaloop-nextest-python-api> │ │
26.36 s
gammaloop-nextest-python-api> │ See https://symbolica.io/docs/get_started.html#license │
26.36 s
gammaloop-nextest-python-api> └────────────────────────────────────────────────────────┘
26.36 s
gammaloop-nextest-python-api> ┌───────────────────────────────────────────────────────────────────────────────────────────────────────────┐
26.36 s
gammaloop-nextest-python-api> │ Cannot start new unlicensed Symbolica instance since there is already another one running on the machine. │
26.37 s
gammaloop-nextest-python-api> └───────────────────────────────────────────────────────────────────────────────────────────────────────────┘
26.37 s
gammaloop-nextest-python-api>
26.37 s
gammaloop-nextest-python-api> stderr:
26.37 s
gammaloop-nextest-python-api> ┌───────────────────────────────────┐
26.37 s
gammaloop-nextest-python-api> │ The Symbolica license has expired │
26.37 s
gammaloop-nextest-python-api> └───────────────────────────────────┘
26.37 s
gammaloop-nextest-python-api> [2026-09-01 10:05:15.283] @gammaloop_api::se... INFO : Running command import model sm-default
26.37 s
gammaloop-nextest-python-api> [2026-09-01 10:05:15.285] @import::model INFO : Loading built-in JSON model sm-default
26.37 s
gammaloop-nextest-python-api> [2026-09-01 10:05:15.348] @gammalooprs::model INFO : The following 15 external parameters were forced to zero by the restriction card:
26.37 s
gammaloop-nextest-python-api> lamWS, AWS, rhoWS, etaWS, ymc, yme, ymm, MC, Me, MM, WTau, muQ, muLe, muLmu, muLtau
26.37 s
gammaloop-nextest-python-api> [2026-09-01 10:05:15.348] @gammalooprs::model INFO : The following 34 vertex rules were removed by the restriction card:
26.37 s
gammaloop-nextest-python-api> V_82 -> (c~, d, G+) | V_83 -> (t~, d, G+) | V_84 -> (c~, s, G+) | V_85 -> (t~, s, G+) | V_86 -> (u~, b, G+) | V_87 -> (c~, b, G+) | V_90 -> (c~, d, W+) | V_91 -> (t~, d, W+) | V_92 -> (u~, s, W+) | V_94 -> (t~, s, W+) | V_95 -> (u~, b, W+) | V_96 -> (c~, b, W+) | V_101 -> (e+, e-, G0) | V_102 -> (mu+, mu-, G0) | V_104 -> (e+, e-, H) | V_105 -> (mu+, mu-, H) | V_110 -> (ve~, e-, G+) | V_111 -> (vm~, mu-, G+) | V_116 -> (b~, u, G-) | V_117 -> (d~, c, G-) | V_118 -> (s~, c, G-) | V_119 -> (b~, c, G-) | V_120 -> (d~, t, G-) | V_121 -> (s~, t, G-) | V_124 -> (s~, u, W-) | V_125 -> (b~, u, W-) | V_126 -> (d~, c, W-) | V_128 -> (b~, c, W-) | V_129 -> (d~, t, W-) | V_130 -> (s~, t, W-) | V_138 -> (c~, c, G0) | V_140 -> (c~, c, H) | V_145 -> (e+, ve, G-) | V_146 -> (mu+, vm, G-)
26.37 s
gammaloop-nextest-python-api> [2026-09-01 10:05:15.348] @gammalooprs::model INFO : The following 36 couplings were removed by the restriction card:
26.37 s
gammaloop-nextest-python-api> GC_13, GC_14, GC_16, GC_17, GC_18, GC_19, GC_20, GC_22, GC_23, GC_24, GC_25, GC_26, GC_28, GC_29, GC_42, GC_43, GC_44, GC_46, GC_47, GC_48, GC_84, GC_85, GC_86, GC_87, GC_88, GC_89, GC_90, GC_91, GC_92, GC_93, GC_101, GC_102, GC_103, GC_105, GC_106, GC_107
26.37 s
gammaloop-nextest-python-api> [2026-09-01 10:05:15.359] @gammaloop_api::se... INFO : Running command set default-runtime kv kinematics.externals='{"type":"constant","data":{"momenta":[[32.0,0.0,0.0,32.0],[32.0,0.0,0.0,-32.0]],"helicities":[1,1]}}'
26.37 s
gammaloop-nextest-python-api> [2026-09-01 10:05:15.360] @gammaloop_api::se... INFO : Running command set default-runtime kv subtraction.disable_threshold_subtraction=true
26.37 s
gammaloop-nextest-python-api> [2026-09-01 10:05:15.361] @gammaloop_api::se... INFO : Running command generate xs e+ e- > d d~ g | e- a d g QED^2==4 [{{2}} QCD=0] --numerator-grouping group_identical_graphs_up_to_sign --clear-existing-processes --only-diagrams
26.37 s
gammaloop-nextest-python-api> [2026-09-01 10:05:15.380] @feyngen::diagram_... INFO : 0s | Δ=0s | Starting Feynman graph generation with Symbolica...
26.37 s
gammaloop-nextest-python-api> [2026-09-01 10:05:15.386] @feyngen::diagram_... INFO : 0s | Δ=0s | Number of graphs resulting from Symbolica generation: 246
26.37 s
gammaloop-nextest-python-api> [2026-09-01 10:05:15.388] @feyngen::diagram_... INFO : 0s | Δ=0s | Number of graphs retained after enforcing supergraph particle content: 8
26.37 s
gammaloop-nextest-python-api> [2026-09-01 10:05:15.388] @feyngen::diagram_... INFO : 0s | Δ=0s | Number of graphs retained after removal of vetoed topologies: 8
26.37 s
gammaloop-nextest-python-api> [2026-09-01 10:05:15.389] @feyngen::diagram_... INFO : 0s | Δ=0s | Number of graphs after vertex info assignment: 8
26.37 s
gammaloop-nextest-python-api> [2026-09-01 10:05:15.389] @feyngen::diagram_... INFO : 0s | Δ=0s | Number of graphs after all complete graphs filters are applied: 8
26.37 s
gammaloop-nextest-python-api>
26.37 s
gammaloop-nextest-python-api>
26.37 s
gammaloop-nextest-python-api> Location:
26.37 s
gammaloop-nextest-python-api> tests/tests/test_python_api.rs:156:20
26.37 s
gammaloop-nextest-python-api>
26.37 s
gammaloop-nextest-python-api> FAIL [ 0.447s] (5/5) gammaloop-integration-tests::test_python_api python_settings_wrappers_expose_nested_runtime_and_global_settings
26.37 s
gammaloop-nextest-python-api> stdout ---
26.37 s
gammaloop-nextest-python-api>
26.37 s
gammaloop-nextest-python-api> running 1 test
26.37 s
gammaloop-nextest-python-api> test python_settings_wrappers_expose_nested_runtime_and_global_settings ... FAILED
26.37 s
gammaloop-nextest-python-api>
26.37 s
gammaloop-nextest-python-api> failures:
26.37 s
gammaloop-nextest-python-api>
26.37 s
gammaloop-nextest-python-api> failures:
26.37 s
gammaloop-nextest-python-api> python_settings_wrappers_expose_nested_runtime_and_global_settings
26.37 s
gammaloop-nextest-python-api>
26.37 s
gammaloop-nextest-python-api> test result: FAILED. 0 passed; 1 failed; 0 ignored; 0 measured; 4 filtered out; finished in 0.44s
26.37 s
gammaloop-nextest-python-api>
26.37 s
gammaloop-nextest-python-api> stderr ---
26.37 s
gammaloop-nextest-python-api> Error: Python API test subprocess failed.
26.37 s
gammaloop-nextest-python-api> stdout:
26.37 s
gammaloop-nextest-python-api> ┌────────────────────────────────────────────────────────┐
26.37 s
gammaloop-nextest-python-api> │ You are running a restricted Symbolica instance. │
26.37 s
gammaloop-nextest-python-api> │ │
26.37 s
gammaloop-nextest-python-api> │ This mode is only permitted for non-commercial use and │
26.37 s
gammaloop-nextest-python-api> │ is limited to one instance and core per machine. │
26.37 s
gammaloop-nextest-python-api> │ │
26.37 s
gammaloop-nextest-python-api> │ Hobbyists can easily acquire a free license key │
26.37 s
gammaloop-nextest-python-api> │ that unlocks all cores and removes this banner: │
26.37 s
gammaloop-nextest-python-api> │ │
26.37 s
gammaloop-nextest-python-api> │ from symbolica import * │
26.37 s
gammaloop-nextest-python-api> │ request_hobbyist_license('YOUR_NAME', 'YOUR_EMAIL') │
26.37 s
gammaloop-nextest-python-api> │ │
26.37 s
gammaloop-nextest-python-api> │ All other users can obtain a free 30-day trial key: │
26.37 s
gammaloop-nextest-python-api> │ │
26.37 s
gammaloop-nextest-python-api> │ from symbolica import * │
26.37 s
gammaloop-nextest-python-api> │ request_trial_license('NAME', 'EMAIL', 'EMPLOYER') │
26.37 s
gammaloop-nextest-python-api> │ │
26.37 s
gammaloop-nextest-python-api> │ See https://symbolica.io/docs/get_started.html#license │
26.37 s
gammaloop-nextest-python-api> └────────────────────────────────────────────────────────┘
26.37 s
gammaloop-nextest-python-api> ┌───────────────────────────────────────────────────────────────────────────────────────────────────────────┐
26.37 s
gammaloop-nextest-python-api> │ Cannot start new unlicensed Symbolica instance since there is already another one running on the machine. │
26.37 s
gammaloop-nextest-python-api> └───────────────────────────────────────────────────────────────────────────────────────────────────────────┘
26.37 s
gammaloop-nextest-python-api>
26.37 s
gammaloop-nextest-python-api> stderr:
26.37 s
gammaloop-nextest-python-api> ┌───────────────────────────────────┐
26.37 s
gammaloop-nextest-python-api> │ The Symbolica license has expired │
26.37 s
gammaloop-nextest-python-api> └───────────────────────────────────┘
26.37 s
gammaloop-nextest-python-api>
26.37 s
gammaloop-nextest-python-api>
26.37 s
gammaloop-nextest-python-api> Location:
26.37 s
gammaloop-nextest-python-api> tests/tests/test_python_api.rs:156:20
26.37 s
gammaloop-nextest-python-api>
26.38 s
gammaloop-nextest-python-api> error : test run failed
26.41 s
gammaloop-nextest-python-api>
26.41 s
gammaloop-nextest-python-api> ========== nextest test summary ==========
26.41 s
gammaloop-nextest-python-api> report: target/nextest/ci_gammaloop/junit.xml
26.41 s
gammaloop-nextest-python-api> tests: 5, failures: 5, errors: 0
26.41 s
gammaloop-nextest-python-api>
26.41 s
gammaloop-nextest-python-api> 1. gammaloop-integration-tests::test_python_api::python_evaluate_sample_honors_generate_events_and_observable_snapshots
26.41 s
gammaloop-nextest-python-api> failure: test failure with exit code 101
26.41 s
gammaloop-nextest-python-api> Error: Python API test subprocess failed.
26.41 s
gammaloop-nextest-python-api> stdout:
26.41 s
gammaloop-nextest-python-api> ┌────────────────────────────────────────────────────────┐
26.41 s
gammaloop-nextest-python-api> │ You are running a restricted Symbolica instance. │
26.41 s
gammaloop-nextest-python-api> │ │
26.41 s
gammaloop-nextest-python-api> │ This mode is only permitted for non-commercial use and │
26.41 s
gammaloop-nextest-python-api> │ is limited to one instance and core per machine. │
26.41 s
gammaloop-nextest-python-api> │ │
26.41 s
gammaloop-nextest-python-api> │ Hobbyists can easily acquire a free license key │
26.41 s
gammaloop-nextest-python-api> │ that unlocks all cores and removes this banner: │
26.41 s
gammaloop-nextest-python-api> │ │
26.41 s
gammaloop-nextest-python-api> │ from symbolica import * │
26.41 s
gammaloop-nextest-python-api> │ request_hobbyist_license('YOUR_NAME', 'YOUR_EMAIL') │
26.41 s
gammaloop-nextest-python-api> │ │
26.41 s
gammaloop-nextest-python-api> │ All other users can obtain a free 30-day trial key: │
26.41 s
gammaloop-nextest-python-api> │ │
26.41 s
gammaloop-nextest-python-api> │ from symbolica import * │
26.41 s
gammaloop-nextest-python-api> │ request_trial_license('NAME', 'EMAIL', 'EMPLOYER') │
26.41 s
gammaloop-nextest-python-api> │ │
26.41 s
gammaloop-nextest-python-api> │ See https://symbolica.io/docs/get_started.html#license │
26.41 s
gammaloop-nextest-python-api> └────────────────────────────────────────────────────────┘
26.41 s
gammaloop-nextest-python-api> ┌───────────────────────────────────────────────────────────────────────────────────────────────────────────┐
26.41 s
gammaloop-nextest-python-api> │ Cannot start new unlicensed Symbolica instance since there is already another one running on the machine. │
26.41 s
gammaloop-nextest-python-api> └───────────────────────────────────────────────────────────────────────────────────────────────────────────┘
26.41 s
gammaloop-nextest-python-api>
26.41 s
gammaloop-nextest-python-api> stderr:
26.41 s
gammaloop-nextest-python-api> ┌───────────────────────────────────┐
26.41 s
gammaloop-nextest-python-api> │ The Symbolica license has expired │
26.41 s
gammaloop-nextest-python-api> └───────────────────────────────────┘
26.41 s
gammaloop-nextest-python-api>
26.41 s
gammaloop-nextest-python-api>
26.41 s
gammaloop-nextest-python-api> Location:
26.41 s
gammaloop-nextest-python-api> tests/tests/test_python_api.rs:156:20
26.41 s
gammaloop-nextest-python-api> system-out
26.41 s
gammaloop-nextest-python-api> running 1 test
26.41 s
gammaloop-nextest-python-api> test python_evaluate_sample_honors_generate_events_and_observable_snapshots ... FAILED
26.41 s
gammaloop-nextest-python-api>
26.41 s
gammaloop-nextest-python-api> failures:
26.41 s
gammaloop-nextest-python-api>
26.41 s
gammaloop-nextest-python-api> failures:
26.41 s
gammaloop-nextest-python-api> python_evaluate_sample_honors_generate_events_and_observable_snapshots
26.41 s
gammaloop-nextest-python-api>
26.41 s
gammaloop-nextest-python-api> test result: FAILED. 0 passed; 1 failed; 0 ignored; 0 measured; 4 filtered out; finished in 0.33s
26.41 s
gammaloop-nextest-python-api> system-err
26.41 s
gammaloop-nextest-python-api> Error: Python API test subprocess failed.
26.41 s
gammaloop-nextest-python-api> stdout:
26.41 s
gammaloop-nextest-python-api> ┌────────────────────────────────────────────────────────┐
26.41 s
gammaloop-nextest-python-api> │ You are running a restricted Symbolica instance. │
26.41 s
gammaloop-nextest-python-api> │ │
26.41 s
gammaloop-nextest-python-api> │ This mode is only permitted for non-commercial use and │
26.41 s
gammaloop-nextest-python-api> │ is limited to one instance and core per machine. │
26.41 s
gammaloop-nextest-python-api> │ │
26.41 s
gammaloop-nextest-python-api> │ Hobbyists can easily acquire a free license key │
26.41 s
gammaloop-nextest-python-api> │ that unlocks all cores and removes this banner: │
26.41 s
gammaloop-nextest-python-api> │ │
26.41 s
gammaloop-nextest-python-api> │ from symbolica import * │
26.41 s
gammaloop-nextest-python-api> │ request_hobbyist_license('YOUR_NAME', 'YOUR_EMAIL') │
26.41 s
gammaloop-nextest-python-api> │ │
26.41 s
gammaloop-nextest-python-api> │ All other users can obtain a free 30-day trial key: │
26.41 s
gammaloop-nextest-python-api> │ │
26.41 s
gammaloop-nextest-python-api> │ from symbolica import * │
26.41 s
gammaloop-nextest-python-api> │ request_trial_license('NAME', 'EMAIL', 'EMPLOYER') │
26.41 s
gammaloop-nextest-python-api> │ │
26.41 s
gammaloop-nextest-python-api> │ See https://symbolica.io/docs/get_started.html#license │
26.41 s
gammaloop-nextest-python-api> └────────────────────────────────────────────────────────┘
26.41 s
gammaloop-nextest-python-api> ┌───────────────────────────────────────────────────────────────────────────────────────────────────────────┐
26.41 s
gammaloop-nextest-python-api> │ Cannot start new unlicensed Symbolica instance since there is already another one running on the machine. │
26.41 s
gammaloop-nextest-python-api> └───────────────────────────────────────────────────────────────────────────────────────────────────────────┘
26.41 s
gammaloop-nextest-python-api>
26.41 s
gammaloop-nextest-python-api> stderr:
26.41 s
gammaloop-nextest-python-api> ┌───────────────────────────────────┐
26.41 s
gammaloop-nextest-python-api> │ The Symbolica license has expired │
26.41 s
gammaloop-nextest-python-api> └───────────────────────────────────┘
26.41 s
gammaloop-nextest-python-api>
26.41 s
gammaloop-nextest-python-api>
26.41 s
gammaloop-nextest-python-api> Location:
26.41 s
gammaloop-nextest-python-api> tests/tests/test_python_api.rs:156:20
26.41 s
gammaloop-nextest-python-api>
26.41 s
gammaloop-nextest-python-api> 2. gammaloop-integration-tests::test_python_api::python_evaluate_sample_preserves_graph_grouping_and_incoming_pdgs
26.41 s
gammaloop-nextest-python-api> failure: test failure with exit code 101
26.41 s
gammaloop-nextest-python-api> Error: Python API test subprocess failed.
26.41 s
gammaloop-nextest-python-api> stdout:
26.41 s
gammaloop-nextest-python-api> ┌────────────────────────────────────────────────────────┐
26.41 s
gammaloop-nextest-python-api> │ You are running a restricted Symbolica instance. │
26.41 s
gammaloop-nextest-python-api> │ │
26.41 s
gammaloop-nextest-python-api> │ This mode is only permitted for non-commercial use and │
26.41 s
gammaloop-nextest-python-api> │ is limited to one instance and core per machine. │
26.41 s
gammaloop-nextest-python-api> │ │
26.41 s
gammaloop-nextest-python-api> │ Hobbyists can easily acquire a free license key │
26.41 s
gammaloop-nextest-python-api> │ that unlocks all cores and removes this banner: │
26.41 s
gammaloop-nextest-python-api> │ │
26.41 s
gammaloop-nextest-python-api> │ from symbolica import * │
26.41 s
gammaloop-nextest-python-api> │ request_hobbyist_license('YOUR_NAME', 'YOUR_EMAIL') │
26.41 s
gammaloop-nextest-python-api> │ │
26.41 s
gammaloop-nextest-python-api> │ All other users can obtain a free 30-day trial key: │
26.41 s
gammaloop-nextest-python-api> │ │
26.41 s
gammaloop-nextest-python-api> │ from symbolica import * │
26.41 s
gammaloop-nextest-python-api> │ request_trial_license('NAME', 'EMAIL', 'EMPLOYER') │
26.41 s
gammaloop-nextest-python-api> │ │
26.41 s
gammaloop-nextest-python-api> │ See https://symbolica.io/docs/get_started.html#license │
26.41 s
gammaloop-nextest-python-api> └────────────────────────────────────────────────────────┘
26.41 s
gammaloop-nextest-python-api> ┌───────────────────────────────────────────────────────────────────────────────────────────────────────────┐
26.41 s
gammaloop-nextest-python-api> │ Cannot start new unlicensed Symbolica instance since there is already another one running on the machine. │
26.41 s
gammaloop-nextest-python-api> └───────────────────────────────────────────────────────────────────────────────────────────────────────────┘
26.41 s
gammaloop-nextest-python-api>
26.41 s
gammaloop-nextest-python-api> stderr:
26.41 s
gammaloop-nextest-python-api> ┌───────────────────────────────────┐
26.41 s
gammaloop-nextest-python-api> │ The Symbolica license has expired │
26.41 s
gammaloop-nextest-python-api> └───────────────────────────────────┘
26.41 s
gammaloop-nextest-python-api>
26.41 s
gammaloop-nextest-python-api>
26.41 s
gammaloop-nextest-python-api> Location:
26.41 s
gammaloop-nextest-python-api> tests/tests/test_python_api.rs:156:20
26.41 s
gammaloop-nextest-python-api> system-out
26.41 s
gammaloop-nextest-python-api> running 1 test
26.41 s
gammaloop-nextest-python-api> test python_evaluate_sample_preserves_graph_grouping_and_incoming_pdgs ... FAILED
26.41 s
gammaloop-nextest-python-api>
26.41 s
gammaloop-nextest-python-api> failures:
26.41 s
gammaloop-nextest-python-api>
26.41 s
gammaloop-nextest-python-api> failures:
26.41 s
gammaloop-nextest-python-api> python_evaluate_sample_preserves_graph_grouping_and_incoming_pdgs
26.41 s
gammaloop-nextest-python-api>
26.41 s
gammaloop-nextest-python-api> test result: FAILED. 0 passed; 1 failed; 0 ignored; 0 measured; 4 filtered out; finished in 0.34s
26.41 s
gammaloop-nextest-python-api> system-err
26.41 s
gammaloop-nextest-python-api> Error: Python API test subprocess failed.
26.41 s
gammaloop-nextest-python-api> stdout:
26.41 s
gammaloop-nextest-python-api> ┌────────────────────────────────────────────────────────┐
26.41 s
gammaloop-nextest-python-api> │ You are running a restricted Symbolica instance. │
26.41 s
gammaloop-nextest-python-api> │ │
26.41 s
gammaloop-nextest-python-api> │ This mode is only permitted for non-commercial use and │
26.41 s
gammaloop-nextest-python-api> │ is limited to one instance and core per machine. │
26.41 s
gammaloop-nextest-python-api> │ │
26.41 s
gammaloop-nextest-python-api> │ Hobbyists can easily acquire a free license key │
26.41 s
gammaloop-nextest-python-api> │ that unlocks all cores and removes this banner: │
26.41 s
gammaloop-nextest-python-api> │ │
26.41 s
gammaloop-nextest-python-api> │ from symbolica import * │
26.41 s
gammaloop-nextest-python-api> │ request_hobbyist_license('YOUR_NAME', 'YOUR_EMAIL') │
26.41 s
gammaloop-nextest-python-api> │ │
26.41 s
gammaloop-nextest-python-api> │ All other users can obtain a free 30-day trial key: │
26.41 s
gammaloop-nextest-python-api> │ │
26.41 s
gammaloop-nextest-python-api> │ from symbolica import * │
26.41 s
gammaloop-nextest-python-api> │ request_trial_license('NAME', 'EMAIL', 'EMPLOYER') │
26.41 s
gammaloop-nextest-python-api> │ │
26.41 s
gammaloop-nextest-python-api> │ See https://symbolica.io/docs/get_started.html#license │
26.41 s
gammaloop-nextest-python-api> └────────────────────────────────────────────────────────┘
26.41 s
gammaloop-nextest-python-api> ┌───────────────────────────────────────────────────────────────────────────────────────────────────────────┐
26.41 s
gammaloop-nextest-python-api> │ Cannot start new unlicensed Symbolica instance since there is already another one running on the machine. │
26.41 s
gammaloop-nextest-python-api> └───────────────────────────────────────────────────────────────────────────────────────────────────────────┘
26.41 s
gammaloop-nextest-python-api>
26.41 s
gammaloop-nextest-python-api> stderr:
26.41 s
gammaloop-nextest-python-api> ┌───────────────────────────────────┐
26.41 s
gammaloop-nextest-python-api> │ The Symbolica license has expired │
26.41 s
gammaloop-nextest-python-api> └───────────────────────────────────┘
26.41 s
gammaloop-nextest-python-api>
26.41 s
gammaloop-nextest-python-api>
26.41 s
gammaloop-nextest-python-api> Location:
26.41 s
gammaloop-nextest-python-api> tests/tests/test_python_api.rs:156:20
26.41 s
gammaloop-nextest-python-api>
26.41 s
gammaloop-nextest-python-api> 3. gammaloop-integration-tests::test_python_api::python_session_getters_return_live_toml_and_command_blocks
26.41 s
gammaloop-nextest-python-api> failure: test failure with exit code 101
26.41 s
gammaloop-nextest-python-api> Error: Python API test subprocess failed.
26.41 s
gammaloop-nextest-python-api> stdout:
26.41 s
gammaloop-nextest-python-api> ┌────────────────────────────────────────────────────────┐
26.41 s
gammaloop-nextest-python-api> │ You are running a restricted Symbolica instance. │
26.41 s
gammaloop-nextest-python-api> │ │
26.41 s
gammaloop-nextest-python-api> │ This mode is only permitted for non-commercial use and │
26.41 s
gammaloop-nextest-python-api> │ is limited to one instance and core per machine. │
26.41 s
gammaloop-nextest-python-api> │ │
26.41 s
gammaloop-nextest-python-api> │ Hobbyists can easily acquire a free license key │
26.41 s
gammaloop-nextest-python-api> │ that unlocks all cores and removes this banner: │
26.41 s
gammaloop-nextest-python-api> │ │
26.41 s
gammaloop-nextest-python-api> │ from symbolica import * │
26.41 s
gammaloop-nextest-python-api> │ request_hobbyist_license('YOUR_NAME', 'YOUR_EMAIL') │
26.41 s
gammaloop-nextest-python-api> │ │
26.41 s
gammaloop-nextest-python-api> │ All other users can obtain a free 30-day trial key: │
26.41 s
gammaloop-nextest-python-api> │ │
26.42 s
gammaloop-nextest-python-api> │ from symbolica import * │
26.42 s
gammaloop-nextest-python-api> │ request_trial_license('NAME', 'EMAIL', 'EMPLOYER') │
26.42 s
gammaloop-nextest-python-api> │ │
26.42 s
gammaloop-nextest-python-api> │ See https://symbolica.io/docs/get_started.html#license │
26.42 s
gammaloop-nextest-python-api> └────────────────────────────────────────────────────────┘
26.42 s
gammaloop-nextest-python-api> ┌───────────────────────────────────────────────────────────────────────────────────────────────────────────┐
26.42 s
gammaloop-nextest-python-api> │ Cannot start new unlicensed Symbolica instance since there is already another one running on the machine. │
26.42 s
gammaloop-nextest-python-api> └───────────────────────────────────────────────────────────────────────────────────────────────────────────┘
26.42 s
gammaloop-nextest-python-api>
26.42 s
gammaloop-nextest-python-api> stderr:
26.42 s
gammaloop-nextest-python-api> ┌───────────────────────────────────┐
26.42 s
gammaloop-nextest-python-api> │ The Symbolica license has expired │
26.42 s
gammaloop-nextest-python-api> └───────────────────────────────────┘
26.42 s
gammaloop-nextest-python-api>
26.42 s
gammaloop-nextest-python-api>
26.42 s
gammaloop-nextest-python-api> Location:
26.42 s
gammaloop-nextest-python-api> tests/tests/test_python_api.rs:156:20
26.42 s
gammaloop-nextest-python-api> system-out
26.42 s
gammaloop-nextest-python-api> running 1 test
26.42 s
gammaloop-nextest-python-api> test python_session_getters_return_live_toml_and_command_blocks ... FAILED
26.42 s
gammaloop-nextest-python-api>
26.42 s
gammaloop-nextest-python-api> failures:
26.42 s
gammaloop-nextest-python-api>
26.42 s
gammaloop-nextest-python-api> failures:
26.42 s
gammaloop-nextest-python-api> python_session_getters_return_live_toml_and_command_blocks
26.42 s
gammaloop-nextest-python-api>
26.42 s
gammaloop-nextest-python-api> test result: FAILED. 0 passed; 1 failed; 0 ignored; 0 measured; 4 filtered out; finished in 0.35s
26.42 s
gammaloop-nextest-python-api> system-err
26.42 s
gammaloop-nextest-python-api> Error: Python API test subprocess failed.
26.42 s
gammaloop-nextest-python-api> stdout:
26.42 s
gammaloop-nextest-python-api> ┌────────────────────────────────────────────────────────┐
26.42 s
gammaloop-nextest-python-api> │ You are running a restricted Symbolica instance. │
26.42 s
gammaloop-nextest-python-api> │ │
26.42 s
gammaloop-nextest-python-api> │ This mode is only permitted for non-commercial use and │
26.42 s
gammaloop-nextest-python-api> │ is limited to one instance and core per machine. │
26.42 s
gammaloop-nextest-python-api> │ │
26.42 s
gammaloop-nextest-python-api> │ Hobbyists can easily acquire a free license key │
26.42 s
gammaloop-nextest-python-api> │ that unlocks all cores and removes this banner: │
26.42 s
gammaloop-nextest-python-api> │ │
26.42 s
gammaloop-nextest-python-api> │ from symbolica import * │
26.42 s
gammaloop-nextest-python-api> │ request_hobbyist_license('YOUR_NAME', 'YOUR_EMAIL') │
26.42 s
gammaloop-nextest-python-api> │ │
26.42 s
gammaloop-nextest-python-api> │ All other users can obtain a free 30-day trial key: │
26.42 s
gammaloop-nextest-python-api> │ │
26.42 s
gammaloop-nextest-python-api> │ from symbolica import * │
26.42 s
gammaloop-nextest-python-api> │ request_trial_license('NAME', 'EMAIL', 'EMPLOYER') │
26.42 s
gammaloop-nextest-python-api> │ │
26.42 s
gammaloop-nextest-python-api> │ See https://symbolica.io/docs/get_started.html#license │
26.42 s
gammaloop-nextest-python-api> └────────────────────────────────────────────────────────┘
26.42 s
gammaloop-nextest-python-api> ┌───────────────────────────────────────────────────────────────────────────────────────────────────────────┐
26.42 s
gammaloop-nextest-python-api> │ Cannot start new unlicensed Symbolica instance since there is already another one running on the machine. │
26.42 s
gammaloop-nextest-python-api> └───────────────────────────────────────────────────────────────────────────────────────────────────────────┘
26.42 s
gammaloop-nextest-python-api>
26.42 s
gammaloop-nextest-python-api> stderr:
26.42 s
gammaloop-nextest-python-api> ┌───────────────────────────────────┐
26.42 s
gammaloop-nextest-python-api> │ The Symbolica license has expired │
26.42 s
gammaloop-nextest-python-api> └───────────────────────────────────┘
26.42 s
gammaloop-nextest-python-api>
26.42 s
gammaloop-nextest-python-api>
26.42 s
gammaloop-nextest-python-api> Location:
26.42 s
gammaloop-nextest-python-api> tests/tests/test_python_api.rs:156:20
26.42 s
gammaloop-nextest-python-api>
26.42 s
gammaloop-nextest-python-api> 4. gammaloop-integration-tests::test_python_api::python_evaluate_samples_batch_and_momentum_space_have_expected_shape
26.42 s
gammaloop-nextest-python-api> failure: test failure with exit code 101
26.42 s
gammaloop-nextest-python-api> Error: Python API test subprocess failed.
26.42 s
gammaloop-nextest-python-api> stdout:
26.42 s
gammaloop-nextest-python-api> ┌────────────────────────────────────────────────────────┐
26.42 s
gammaloop-nextest-python-api> │ You are running a restricted Symbolica instance. │
26.42 s
gammaloop-nextest-python-api> │ │
26.42 s
gammaloop-nextest-python-api> │ This mode is only permitted for non-commercial use and │
26.42 s
gammaloop-nextest-python-api> │ is limited to one instance and core per machine. │
26.42 s
gammaloop-nextest-python-api> │ │
26.42 s
gammaloop-nextest-python-api> │ Hobbyists can easily acquire a free license key │
26.42 s
gammaloop-nextest-python-api> │ that unlocks all cores and removes this banner: │
26.42 s
gammaloop-nextest-python-api> │ │
26.42 s
gammaloop-nextest-python-api> │ from symbolica import * │
26.42 s
gammaloop-nextest-python-api> │ request_hobbyist_license('YOUR_NAME', 'YOUR_EMAIL') │
26.42 s
gammaloop-nextest-python-api> │ │
26.42 s
gammaloop-nextest-python-api> │ All other users can obtain a free 30-day trial key: │
26.42 s
gammaloop-nextest-python-api> │ │
26.42 s
gammaloop-nextest-python-api> │ from symbolica import * │
26.42 s
gammaloop-nextest-python-api> │ request_trial_license('NAME', 'EMAIL', 'EMPLOYER') │
26.42 s
gammaloop-nextest-python-api> │ │
26.42 s
gammaloop-nextest-python-api> │ See https://symbolica.io/docs/get_started.html#license │
26.42 s
gammaloop-nextest-python-api> └────────────────────────────────────────────────────────┘
26.42 s
gammaloop-nextest-python-api> ┌───────────────────────────────────────────────────────────────────────────────────────────────────────────┐
26.42 s
gammaloop-nextest-python-api> │ Cannot start new unlicensed Symbolica instance since there is already another one running on the machine. │
26.42 s
gammaloop-nextest-python-api> └───────────────────────────────────────────────────────────────────────────────────────────────────────────┘
26.42 s
gammaloop-nextest-python-api>
26.42 s
gammaloop-nextest-python-api> stderr:
26.42 s
gammaloop-nextest-python-api> ┌───────────────────────────────────┐
26.42 s
gammaloop-nextest-python-api> │ The Symbolica license has expired │
26.42 s
gammaloop-nextest-python-api> └───────────────────────────────────┘
26.42 s
gammaloop-nextest-python-api> [2026-09-01 10:05:15.283] @gammaloop_api::se... INFO : Running command import model sm-default
26.42 s
gammaloop-nextest-python-api> [2026-09-01 10:05:15.285] @import::model INFO : Loading built-in JSON model sm-default
26.42 s
gammaloop-nextest-python-api> [2026-09-01 10:05:15.348] @gammalooprs::model INFO : The following 15 external parameters were forced to zero by the restriction card:
26.42 s
gammaloop-nextest-python-api> lamWS, AWS, rhoWS, etaWS, ymc, yme, ymm, MC, Me, MM, WTau, muQ, muLe, muLmu, muLtau
26.42 s
gammaloop-nextest-python-api> [2026-09-01 10:05:15.348] @gammalooprs::model INFO : The following 34 vertex rules were removed by the restriction card:
26.42 s
gammaloop-nextest-python-api> V_82 -> (c~, d, G+) | V_83 -> (t~, d, G+) | V_84 -> (c~, s, G+) | V_85 -> (t~, s, G+) | V_86 -> (u~, b, G+) | V_87 -> (c~, b, G+) | V_90 -> (c~, d, W+) | V_91 -> (t~, d, W+) | V_92 -> (u~, s, W+) | V_94 -> (t~, s, W+) | V_95 -> (u~, b, W+) | V_96 -> (c~, b, W+) | V_101 -> (e+, e-, G0) | V_102 -> (mu+, mu-, G0) | V_104 -> (e+, e-, H) | V_105 -> (mu+, mu-, H) | V_110 -> (ve~, e-, G+) | V_111 -> (vm~, mu-, G+) | V_116 -> (b~, u, G-) | V_117 -> (d~, c, G-) | V_118 -> (s~, c, G-) | V_119 -> (b~, c, G-) | V_120 -> (d~, t, G-) | V_121 -> (s~, t, G-) | V_124 -> (s~, u, W-) | V_125 -> (b~, u, W-) | V_126 -> (d~, c, W-) | V_128 -> (b~, c, W-) | V_129 -> (d~, t, W-) | V_130 -> (s~, t, W-) | V_138 -> (c~, c, G0) | V_140 -> (c~, c, H) | V_145 -> (e+, ve, G-) | V_146 -> (mu+, vm, G-)
26.42 s
gammaloop-nextest-python-api> [2026-09-01 10:05:15.348] @gammalooprs::model INFO : The following 36 couplings were removed by the restriction card:
26.42 s
gammaloop-nextest-python-api> GC_13, GC_14, GC_16, GC_17, GC_18, GC_19, GC_20, GC_22, GC_23, GC_24, GC_25, GC_26, GC_28, GC_29, GC_42, GC_43, GC_44, GC_46, GC_47, GC_48, GC_84, GC_85, GC_86, GC_87, GC_88, GC_89, GC_90, GC_91, GC_92, GC_93, GC_101, GC_102, GC_103, GC_105, GC_106, GC_107
26.42 s
gammaloop-nextest-python-api> [2026-09-01 10:05:15.359] @gammaloop_api::se... INFO : Running command set default-runtime kv kinematics.externals='{"type":"constant","data":{"momenta":[[32.0,0.0,0.0,32.0],[32.0,0.0,0.0,-32.0]],"helicities":[1,1]}}'
26.42 s
gammaloop-nextest-python-api> [2026-09-01 10:05:15.360] @gammaloop_api::se... INFO : Running command set default-runtime kv subtraction.disable_threshold_subtraction=true
26.42 s
gammaloop-nextest-python-api> [2026-09-01 10:05:15.361] @gammaloop_api::se... INFO : Running command generate xs e+ e- > d d~ g | e- a d g QED^2==4 [{{2}} QCD=0] --numerator-grouping group_identical_graphs_up_to_sign --clear-existing-processes --only-diagrams
26.42 s
gammaloop-nextest-python-api> [2026-09-01 10:05:15.380] @feyngen::diagram_... INFO : 0s | Δ=0s | Starting Feynman graph generation with Symbolica...
26.42 s
gammaloop-nextest-python-api> [2026-09-01 10:05:15.386] @feyngen::diagram_... INFO : 0s | Δ=0s | Number of graphs resulting from Symbolica generation: 246
26.42 s
gammaloop-nextest-python-api> [2026-09-01 10:05:15.388] @feyngen::diagram_... INFO : 0s | Δ=0s | Number of graphs retained after enforcing supergraph particle content: 8
26.42 s
gammaloop-nextest-python-api> [2026-09-01 10:05:15.388] @feyngen::diagram_... INFO : 0s | Δ=0s | Number of graphs retained after removal of vetoed topologies: 8
26.42 s
gammaloop-nextest-python-api> [2026-09-01 10:05:15.389] @feyngen::diagram_... INFO : 0s | Δ=0s | Number of graphs after vertex info assignment: 8
26.42 s
gammaloop-nextest-python-api> [2026-09-01 10:05:15.389] @feyngen::diagram_... INFO : 0s | Δ=0s | Number of graphs after all complete graphs filters are applied: 8
26.42 s
gammaloop-nextest-python-api>
26.42 s
gammaloop-nextest-python-api>
26.42 s
gammaloop-nextest-python-api> Location:
26.42 s
gammaloop-nextest-python-api> tests/tests/test_python_api.rs:156:20
26.42 s
gammaloop-nextest-python-api> system-out
26.42 s
gammaloop-nextest-python-api> running 1 test
26.42 s
gammaloop-nextest-python-api> test python_evaluate_samples_batch_and_momentum_space_have_expected_shape ... FAILED
26.42 s
gammaloop-nextest-python-api>
26.42 s
gammaloop-nextest-python-api> failures:
26.42 s
gammaloop-nextest-python-api>
26.42 s
gammaloop-nextest-python-api> failures:
26.42 s
gammaloop-nextest-python-api> python_evaluate_samples_batch_and_momentum_space_have_expected_shape
26.42 s
gammaloop-nextest-python-api>
26.42 s
gammaloop-nextest-python-api> test result: FAILED. 0 passed; 1 failed; 0 ignored; 0 measured; 4 filtered out; finished in 0.41s
26.42 s
gammaloop-nextest-python-api> system-err
26.42 s
gammaloop-nextest-python-api> Error: Python API test subprocess failed.
26.42 s
gammaloop-nextest-python-api> stdout:
26.42 s
gammaloop-nextest-python-api> ┌────────────────────────────────────────────────────────┐
26.42 s
gammaloop-nextest-python-api> │ You are running a restricted Symbolica instance. │
26.42 s
gammaloop-nextest-python-api> │ │
26.42 s
gammaloop-nextest-python-api> │ This mode is only permitted for non-commercial use and │
26.42 s
gammaloop-nextest-python-api> │ is limited to one instance and core per machine. │
26.42 s
gammaloop-nextest-python-api> │ │
26.42 s
gammaloop-nextest-python-api> │ Hobbyists can easily acquire a free license key │
26.42 s
gammaloop-nextest-python-api> │ that unlocks all cores and removes this banner: │
26.42 s
gammaloop-nextest-python-api> │ │
26.42 s
gammaloop-nextest-python-api> │ from symbolica import * │
26.42 s
gammaloop-nextest-python-api> │ request_hobbyist_license('YOUR_NAME', 'YOUR_EMAIL') │
26.42 s
gammaloop-nextest-python-api> │ │
26.42 s
gammaloop-nextest-python-api> │ All other users can obtain a free 30-day trial key: │
26.42 s
gammaloop-nextest-python-api> │ │
26.42 s
gammaloop-nextest-python-api> │ from symbolica import * │
26.42 s
gammaloop-nextest-python-api> │ request_trial_license('NAME', 'EMAIL', 'EMPLOYER') │
26.42 s
gammaloop-nextest-python-api> │ │
26.42 s
gammaloop-nextest-python-api> │ See https://symbolica.io/docs/get_started.html#license │
26.42 s
gammaloop-nextest-python-api> └────────────────────────────────────────────────────────┘
26.42 s
gammaloop-nextest-python-api> ┌───────────────────────────────────────────────────────────────────────────────────────────────────────────┐
26.42 s
gammaloop-nextest-python-api> │ Cannot start new unlicensed Symbolica instance since there is already another one running on the machine. │
26.42 s
gammaloop-nextest-python-api> └───────────────────────────────────────────────────────────────────────────────────────────────────────────┘
26.42 s
gammaloop-nextest-python-api>
26.42 s
gammaloop-nextest-python-api> stderr:
26.42 s
gammaloop-nextest-python-api> ┌───────────────────────────────────┐
26.42 s
gammaloop-nextest-python-api> │ The Symbolica license has expired │
26.42 s
gammaloop-nextest-python-api> └───────────────────────────────────┘
26.42 s
gammaloop-nextest-python-api> [2026-09-01 10:05:15.283] @gammaloop_api::se... INFO : Running command import model sm-default
26.42 s
gammaloop-nextest-python-api> [2026-09-01 10:05:15.285] @import::model INFO : Loading built-in JSON model sm-default
26.42 s
gammaloop-nextest-python-api> [2026-09-01 10:05:15.348] @gammalooprs::model INFO : The following 15 external parameters were forced to zero by the restriction card:
26.42 s
gammaloop-nextest-python-api> lamWS, AWS, rhoWS, etaWS, ymc, yme, ymm, MC, Me, MM, WTau, muQ, muLe, muLmu, muLtau
26.42 s
gammaloop-nextest-python-api> [2026-09-01 10:05:15.348] @gammalooprs::model INFO : The following 34 vertex rules were removed by the restriction card:
26.42 s
gammaloop-nextest-python-api> V_82 -> (c~, d, G+) | V_83 -> (t~, d, G+) | V_84 -> (c~, s, G+) | V_85 -> (t~, s, G+) | V_86 -> (u~, b, G+) | V_87 -> (c~, b, G+) | V_90 -> (c~, d, W+) | V_91 -> (t~, d, W+) | V_92 -> (u~, s, W+) | V_94 -> (t~, s, W+) | V_95 -> (u~, b, W+) | V_96 -> (c~, b, W+) | V_101 -> (e+, e-, G0) | V_102 -> (mu+, mu-, G0) | V_104 -> (e+, e-, H) | V_105 -> (mu+, mu-, H) | V_110 -> (ve~, e-, G+) | V_111 -> (vm~, mu-, G+) | V_116 -> (b~, u, G-) | V_117 -> (d~, c, G-) | V_118 -> (s~, c, G-) | V_119 -> (b~, c, G-) | V_120 -> (d~, t, G-) | V_121 -> (s~, t, G-) | V_124 -> (s~, u, W-) | V_125 -> (b~, u, W-) | V_126 -> (d~, c, W-) | V_128 -> (b~, c, W-) | V_129 -> (d~, t, W-) | V_130 -> (s~, t, W-) | V_138 -> (c~, c, G0) | V_140 -> (c~, c, H) | V_145 -> (e+, ve, G-) | V_146 -> (mu+, vm, G-)
26.42 s
gammaloop-nextest-python-api> [2026-09-01 10:05:15.348] @gammalooprs::model INFO : The following 36 couplings were removed by the restriction card:
26.42 s
gammaloop-nextest-python-api> GC_13, GC_14, GC_16, GC_17, GC_18, GC_19, GC_20, GC_22, GC_23, GC_24, GC_25, GC_26, GC_28, GC_29, GC_42, GC_43, GC_44, GC_46, GC_47, GC_48, GC_84, GC_85, GC_86, GC_87, GC_88, GC_89, GC_90, GC_91, GC_92, GC_93, GC_101, GC_102, GC_103, GC_105, GC_106, GC_107
26.42 s
gammaloop-nextest-python-api> [2026-09-01 10:05:15.359] @gammaloop_api::se... INFO : Running command set default-runtime kv kinematics.externals='{"type":"constant","data":{"momenta":[[32.0,0.0,0.0,32.0],[32.0,0.0,0.0,-32.0]],"helicities":[1,1]}}'
26.42 s
gammaloop-nextest-python-api> [2026-09-01 10:05:15.360] @gammaloop_api::se... INFO : Running command set default-runtime kv subtraction.disable_threshold_subtraction=true
26.42 s
gammaloop-nextest-python-api> [2026-09-01 10:05:15.361] @gammaloop_api::se... INFO : Running command generate xs e+ e- > d d~ g | e- a d g QED^2==4 [{{2}} QCD=0] --numerator-grouping group_identical_graphs_up_to_sign --clear-existing-processes --only-diagrams
26.42 s
gammaloop-nextest-python-api> [2026-09-01 10:05:15.380] @feyngen::diagram_... INFO : 0s | Δ=0s | Starting Feynman graph generation with Symbolica...
26.42 s
gammaloop-nextest-python-api> [2026-09-01 10:05:15.386] @feyngen::diagram_... INFO : 0s | Δ=0s | Number of graphs resulting from Symbolica generation: 246
26.42 s
gammaloop-nextest-python-api> [2026-09-01 10:05:15.388] @feyngen::diagram_... INFO : 0s | Δ=0s | Number of graphs retained after enforcing supergraph particle content: 8
26.42 s
gammaloop-nextest-python-api> [2026-09-01 10:05:15.388] @feyngen::diagram_... INFO : 0s | Δ=0s | Number of graphs retained after removal of vetoed topologies: 8
26.42 s
gammaloop-nextest-python-api> [2026-09-01 10:05:15.389] @feyngen::diagram_... INFO : 0s | Δ=0s | Number of graphs after vertex info assignment: 8
26.42 s
gammaloop-nextest-python-api> [2026-09-01 10:05:15.389] @feyngen::diagram_... INFO : 0s | Δ=0s | Number of graphs after all complete graphs filters are applied: 8
26.42 s
gammaloop-nextest-python-api>
26.42 s
gammaloop-nextest-python-api>
26.42 s
gammaloop-nextest-python-api> Location:
26.42 s
gammaloop-nextest-python-api> tests/tests/test_python_api.rs:156:20
26.42 s
gammaloop-nextest-python-api>
26.42 s
gammaloop-nextest-python-api> 5. gammaloop-integration-tests::test_python_api::python_settings_wrappers_expose_nested_runtime_and_global_settings
26.42 s
gammaloop-nextest-python-api> failure: test failure with exit code 101
26.42 s
gammaloop-nextest-python-api> Error: Python API test subprocess failed.
26.42 s
gammaloop-nextest-python-api> stdout:
26.42 s
gammaloop-nextest-python-api> ┌────────────────────────────────────────────────────────┐
26.42 s
gammaloop-nextest-python-api> │ You are running a restricted Symbolica instance. │
26.42 s
gammaloop-nextest-python-api> │ │
26.42 s
gammaloop-nextest-python-api> │ This mode is only permitted for non-commercial use and │
26.42 s
gammaloop-nextest-python-api> │ is limited to one instance and core per machine. │
26.42 s
gammaloop-nextest-python-api> │ │
26.42 s
gammaloop-nextest-python-api> │ Hobbyists can easily acquire a free license key │
26.42 s
gammaloop-nextest-python-api> │ that unlocks all cores and removes this banner: │
26.42 s
gammaloop-nextest-python-api> │ │
26.42 s
gammaloop-nextest-python-api> │ from symbolica import * │
26.42 s
gammaloop-nextest-python-api> │ request_hobbyist_license('YOUR_NAME', 'YOUR_EMAIL') │
26.42 s
gammaloop-nextest-python-api> │ │
26.42 s
gammaloop-nextest-python-api> │ All other users can obtain a free 30-day trial key: │
26.42 s
gammaloop-nextest-python-api> │ │
26.42 s
gammaloop-nextest-python-api> │ from symbolica import * │
26.42 s
gammaloop-nextest-python-api> │ request_trial_license('NAME', 'EMAIL', 'EMPLOYER') │
26.42 s
gammaloop-nextest-python-api> │ │
26.42 s
gammaloop-nextest-python-api> │ See https://symbolica.io/docs/get_started.html#license │
26.42 s
gammaloop-nextest-python-api> └────────────────────────────────────────────────────────┘
26.42 s
gammaloop-nextest-python-api> ┌───────────────────────────────────────────────────────────────────────────────────────────────────────────┐
26.42 s
gammaloop-nextest-python-api> │ Cannot start new unlicensed Symbolica instance since there is already another one running on the machine. │
26.42 s
gammaloop-nextest-python-api> └───────────────────────────────────────────────────────────────────────────────────────────────────────────┘
26.42 s
gammaloop-nextest-python-api>
26.42 s
gammaloop-nextest-python-api> stderr:
26.42 s
gammaloop-nextest-python-api> ┌───────────────────────────────────┐
26.42 s
gammaloop-nextest-python-api> │ The Symbolica license has expired │
26.42 s
gammaloop-nextest-python-api> └───────────────────────────────────┘
26.42 s
gammaloop-nextest-python-api>
26.42 s
gammaloop-nextest-python-api>
26.42 s
gammaloop-nextest-python-api> Location:
26.42 s
gammaloop-nextest-python-api> tests/tests/test_python_api.rs:156:20
26.42 s
gammaloop-nextest-python-api> system-out
26.42 s
gammaloop-nextest-python-api> running 1 test
26.42 s
gammaloop-nextest-python-api> test python_settings_wrappers_expose_nested_runtime_and_global_settings ... FAILED
26.42 s
gammaloop-nextest-python-api>
26.42 s
gammaloop-nextest-python-api> failures:
26.42 s
gammaloop-nextest-python-api>
26.42 s
gammaloop-nextest-python-api> failures:
26.42 s
gammaloop-nextest-python-api> python_settings_wrappers_expose_nested_runtime_and_global_settings
26.42 s
gammaloop-nextest-python-api>
26.42 s
gammaloop-nextest-python-api> test result: FAILED. 0 passed; 1 failed; 0 ignored; 0 measured; 4 filtered out; finished in 0.44s
26.42 s
gammaloop-nextest-python-api> system-err
26.42 s
gammaloop-nextest-python-api> Error: Python API test subprocess failed.
26.42 s
gammaloop-nextest-python-api> stdout:
26.42 s
gammaloop-nextest-python-api> ┌────────────────────────────────────────────────────────┐
26.42 s
gammaloop-nextest-python-api> │ You are running a restricted Symbolica instance. │
26.42 s
gammaloop-nextest-python-api> │ │
26.42 s
gammaloop-nextest-python-api> │ This mode is only permitted for non-commercial use and │
26.42 s
gammaloop-nextest-python-api> │ is limited to one instance and core per machine. │
26.42 s
gammaloop-nextest-python-api> │ │
26.42 s
gammaloop-nextest-python-api> │ Hobbyists can easily acquire a free license key │
26.42 s
gammaloop-nextest-python-api> │ that unlocks all cores and removes this banner: │
26.42 s
gammaloop-nextest-python-api> │ │
26.42 s
gammaloop-nextest-python-api> │ from symbolica import * │
26.42 s
gammaloop-nextest-python-api> │ request_hobbyist_license('YOUR_NAME', 'YOUR_EMAIL') │
26.42 s
gammaloop-nextest-python-api> │ │
26.42 s
gammaloop-nextest-python-api> │ All other users can obtain a free 30-day trial key: │
26.42 s
gammaloop-nextest-python-api> │ │
26.42 s
gammaloop-nextest-python-api> │ from symbolica import * │
26.42 s
gammaloop-nextest-python-api> │ request_trial_license('NAME', 'EMAIL', 'EMPLOYER') │
26.42 s
gammaloop-nextest-python-api> │ │
26.42 s
gammaloop-nextest-python-api> │ See https://symbolica.io/docs/get_started.html#license │
26.42 s
gammaloop-nextest-python-api> └────────────────────────────────────────────────────────┘
26.42 s
gammaloop-nextest-python-api> ┌───────────────────────────────────────────────────────────────────────────────────────────────────────────┐
26.42 s
gammaloop-nextest-python-api> │ Cannot start new unlicensed Symbolica instance since there is already another one running on the machine. │
26.42 s
gammaloop-nextest-python-api> └───────────────────────────────────────────────────────────────────────────────────────────────────────────┘
26.42 s
gammaloop-nextest-python-api>
26.42 s
gammaloop-nextest-python-api> stderr:
26.42 s
gammaloop-nextest-python-api> ┌───────────────────────────────────┐
26.42 s
gammaloop-nextest-python-api> │ The Symbolica license has expired │
26.42 s
gammaloop-nextest-python-api> └───────────────────────────────────┘
26.42 s
gammaloop-nextest-python-api>
26.42 s
gammaloop-nextest-python-api>
26.42 s
gammaloop-nextest-python-api> Location:
26.42 s
gammaloop-nextest-python-api> tests/tests/test_python_api.rs:156:20
26.42 s
gammaloop-nextest-python-api> =========================================
26.49 s
error: Cannot build '/nix/store/90vl6933shlgrvsg0q1k9hbam6pqxvdh-gammaloop-nextest-python-api.drv '.
26.49 s
Reason: builder failed with exit code 100 .
26.49 s
Output paths:
26.49 s
/nix/store/ghyr21i59xgm2lhlwag6cmm3fgmdax99-gammaloop-nextest-python-api
26.49 s
Last 961 log lines:
26.49 s
> Extracting 1 binary, 1 build script output directory, and 3 linked paths to /build/nextest-archive-vvGvrM
26.49 s
> Extracted 18 files to /build/nextest-archive-vvGvrM in 0.09s
26.49 s
> ------------
26.49 s
> Nextest run ID 361f0336-5d5f-4d81-89fd-6e44a3c0536f with nextest profile: ci_gammaloop
26.49 s
> Starting 5 tests across 1 binary
26.49 s
> FAIL [ 0.344s] (1/5) gammaloop-integration-tests::test_python_api python_evaluate_sample_honors_generate_events_and_observable_snapshots
26.49 s
> stdout ---
26.49 s
>
26.49 s
> running 1 test
26.49 s
> test python_evaluate_sample_honors_generate_events_and_observable_snapshots ... FAILED
26.49 s
>
26.49 s
> failures:
26.49 s
>
26.49 s
> failures:
26.49 s
> python_evaluate_sample_honors_generate_events_and_observable_snapshots
26.49 s
>
26.49 s
> test result: FAILED. 0 passed; 1 failed; 0 ignored; 0 measured; 4 filtered out; finished in 0.33s
26.49 s
>
26.49 s
> stderr ---
26.49 s
> Error: Python API test subprocess failed.
26.49 s
> stdout:
26.49 s
> ┌────────────────────────────────────────────────────────┐
26.49 s
> │ You are running a restricted Symbolica instance. │
26.49 s
> │ │
26.49 s
> │ This mode is only permitted for non-commercial use and │
26.49 s
> │ is limited to one instance and core per machine. │
26.49 s
> │ │
26.49 s
> │ Hobbyists can easily acquire a free license key │
26.49 s
> │ that unlocks all cores and removes this banner: │
26.49 s
> │ │
26.49 s
> │ from symbolica import * │
26.49 s
> │ request_hobbyist_license('YOUR_NAME', 'YOUR_EMAIL') │
26.49 s
> │ │
26.49 s
> │ All other users can obtain a free 30-day trial key: │
26.49 s
> │ │
26.49 s
> │ from symbolica import * │
26.49 s
> │ request_trial_license('NAME', 'EMAIL', 'EMPLOYER') │
26.49 s
> │ │
26.49 s
> │ See https://symbolica.io/docs/get_started.html#license │
26.49 s
> └────────────────────────────────────────────────────────┘
26.49 s
> ┌───────────────────────────────────────────────────────────────────────────────────────────────────────────┐
26.49 s
> │ Cannot start new unlicensed Symbolica instance since there is already another one running on the machine. │
26.49 s
> └───────────────────────────────────────────────────────────────────────────────────────────────────────────┘
26.49 s
>
26.49 s
> stderr:
26.49 s
> ┌───────────────────────────────────┐
26.49 s
> │ The Symbolica license has expired │
26.49 s
> └───────────────────────────────────┘
26.49 s
>
26.49 s
>
26.49 s
> Location:
26.49 s
> tests/tests/test_python_api.rs:156:20
26.49 s
>
26.49 s
> FAIL [ 0.357s] (2/5) gammaloop-integration-tests::test_python_api python_evaluate_sample_preserves_graph_grouping_and_incoming_pdgs
26.49 s
> stdout ---
26.49 s
>
26.49 s
> running 1 test
26.49 s
> test python_evaluate_sample_preserves_graph_grouping_and_incoming_pdgs ... FAILED
26.49 s
>
26.49 s
> failures:
26.49 s
>
26.49 s
> failures:
26.49 s
> python_evaluate_sample_preserves_graph_grouping_and_incoming_pdgs
26.49 s
>
26.49 s
> test result: FAILED. 0 passed; 1 failed; 0 ignored; 0 measured; 4 filtered out; finished in 0.34s
26.49 s
>
26.49 s
> stderr ---
26.49 s
> Error: Python API test subprocess failed.
26.49 s
> stdout:
26.49 s
> ┌────────────────────────────────────────────────────────┐
26.49 s
> │ You are running a restricted Symbolica instance. │
26.49 s
> │ │
26.49 s
> │ This mode is only permitted for non-commercial use and │
26.49 s
> │ is limited to one instance and core per machine. │
26.49 s
> │ │
26.49 s
> │ Hobbyists can easily acquire a free license key │
26.49 s
> │ that unlocks all cores and removes this banner: │
26.49 s
> │ │
26.49 s
> │ from symbolica import * │
26.49 s
> │ request_hobbyist_license('YOUR_NAME', 'YOUR_EMAIL') │
26.49 s
> │ │
26.49 s
> │ All other users can obtain a free 30-day trial key: │
26.49 s
> │ │
26.49 s
> │ from symbolica import * │
26.49 s
> │ request_trial_license('NAME', 'EMAIL', 'EMPLOYER') │
26.49 s
> │ │
26.49 s
> │ See https://symbolica.io/docs/get_started.html#license │
26.49 s
> └────────────────────────────────────────────────────────┘
26.49 s
> ┌───────────────────────────────────────────────────────────────────────────────────────────────────────────┐
26.49 s
> │ Cannot start new unlicensed Symbolica instance since there is already another one running on the machine. │
26.49 s
> └───────────────────────────────────────────────────────────────────────────────────────────────────────────┘
26.49 s
>
26.49 s
> stderr:
26.49 s
> ┌───────────────────────────────────┐
26.49 s
> │ The Symbolica license has expired │
26.49 s
> └───────────────────────────────────┘
26.49 s
>
26.49 s
>
26.49 s
> Location:
26.49 s
> tests/tests/test_python_api.rs:156:20
26.49 s
>
26.49 s
> FAIL [ 0.361s] (3/5) gammaloop-integration-tests::test_python_api python_session_getters_return_live_toml_and_command_blocks
26.49 s
> stdout ---
26.49 s
>
26.49 s
> running 1 test
26.49 s
> test python_session_getters_return_live_toml_and_command_blocks ... FAILED
26.49 s
>
26.49 s
> failures:
26.49 s
>
26.49 s
> failures:
26.49 s
> python_session_getters_return_live_toml_and_command_blocks
26.49 s
>
26.49 s
> test result: FAILED. 0 passed; 1 failed; 0 ignored; 0 measured; 4 filtered out; finished in 0.35s
26.49 s
>
26.49 s
> stderr ---
26.49 s
> Error: Python API test subprocess failed.
26.49 s
> stdout:
26.50 s
> ┌────────────────────────────────────────────────────────┐
26.50 s
> │ You are running a restricted Symbolica instance. │
26.50 s
> │ │
26.50 s
> │ This mode is only permitted for non-commercial use and │
26.50 s
> │ is limited to one instance and core per machine. │
26.50 s
> │ │
26.50 s
> │ Hobbyists can easily acquire a free license key │
26.50 s
> │ that unlocks all cores and removes this banner: │
26.50 s
> │ │
26.50 s
> │ from symbolica import * │
26.50 s
> │ request_hobbyist_license('YOUR_NAME', 'YOUR_EMAIL') │
26.50 s
> │ │
26.50 s
> │ All other users can obtain a free 30-day trial key: │
26.50 s
> │ │
26.50 s
> │ from symbolica import * │
26.50 s
> │ request_trial_license('NAME', 'EMAIL', 'EMPLOYER') │
26.50 s
> │ │
26.50 s
> │ See https://symbolica.io/docs/get_started.html#license │
26.50 s
> └────────────────────────────────────────────────────────┘
26.50 s
> ┌───────────────────────────────────────────────────────────────────────────────────────────────────────────┐
26.50 s
> │ Cannot start new unlicensed Symbolica instance since there is already another one running on the machine. │
26.50 s
> └───────────────────────────────────────────────────────────────────────────────────────────────────────────┘
26.50 s
>
26.50 s
> stderr:
26.50 s
> ┌───────────────────────────────────┐
26.50 s
> │ The Symbolica license has expired │
26.50 s
> └───────────────────────────────────┘
26.50 s
>
26.50 s
>
26.50 s
> Location:
26.50 s
> tests/tests/test_python_api.rs:156:20
26.50 s
>
26.50 s
> FAIL [ 0.417s] (4/5) gammaloop-integration-tests::test_python_api python_evaluate_samples_batch_and_momentum_space_have_expected_shape
26.50 s
> stdout ---
26.50 s
>
26.50 s
> running 1 test
26.50 s
> test python_evaluate_samples_batch_and_momentum_space_have_expected_shape ... FAILED
26.50 s
>
26.50 s
> failures:
26.50 s
>
26.50 s
> failures:
26.50 s
> python_evaluate_samples_batch_and_momentum_space_have_expected_shape
26.50 s
>
26.50 s
> test result: FAILED. 0 passed; 1 failed; 0 ignored; 0 measured; 4 filtered out; finished in 0.41s
26.50 s
>
26.50 s
> stderr ---
26.50 s
> Error: Python API test subprocess failed.
26.50 s
> stdout:
26.50 s
> ┌────────────────────────────────────────────────────────┐
26.50 s
> │ You are running a restricted Symbolica instance. │
26.50 s
> │ │
26.50 s
> │ This mode is only permitted for non-commercial use and │
26.50 s
> │ is limited to one instance and core per machine. │
26.50 s
> │ │
26.50 s
> │ Hobbyists can easily acquire a free license key │
26.50 s
> │ that unlocks all cores and removes this banner: │
26.50 s
> │ │
26.50 s
> │ from symbolica import * │
26.50 s
> │ request_hobbyist_license('YOUR_NAME', 'YOUR_EMAIL') │
26.50 s
> │ │
26.50 s
> │ All other users can obtain a free 30-day trial key: │
26.50 s
> │ │
26.50 s
> │ from symbolica import * │
26.50 s
> │ request_trial_license('NAME', 'EMAIL', 'EMPLOYER') │
26.50 s
> │ │
26.50 s
> │ See https://symbolica.io/docs/get_started.html#license │
26.50 s
> └────────────────────────────────────────────────────────┘
26.50 s
> ┌───────────────────────────────────────────────────────────────────────────────────────────────────────────┐
26.50 s
> │ Cannot start new unlicensed Symbolica instance since there is already another one running on the machine. │
26.50 s
> └───────────────────────────────────────────────────────────────────────────────────────────────────────────┘
26.50 s
>
26.50 s
> stderr:
26.50 s
> ┌───────────────────────────────────┐
26.50 s
> │ The Symbolica license has expired │
26.50 s
> └───────────────────────────────────┘
26.50 s
> [2026-09-01 10:05:15.283] @gammaloop_api::se... INFO : Running command import model sm-default
26.50 s
> [2026-09-01 10:05:15.285] @import::model INFO : Loading built-in JSON model sm-default
26.50 s
> [2026-09-01 10:05:15.348] @gammalooprs::model INFO : The following 15 external parameters were forced to zero by the restriction card:
26.50 s
> lamWS, AWS, rhoWS, etaWS, ymc, yme, ymm, MC, Me, MM, WTau, muQ, muLe, muLmu, muLtau
26.50 s
> [2026-09-01 10:05:15.348] @gammalooprs::model INFO : The following 34 vertex rules were removed by the restriction card:
26.50 s
> V_82 -> (c~, d, G+) | V_83 -> (t~, d, G+) | V_84 -> (c~, s, G+) | V_85 -> (t~, s, G+) | V_86 -> (u~, b, G+) | V_87 -> (c~, b, G+) | V_90 -> (c~, d, W+) | V_91 -> (t~, d, W+) | V_92 -> (u~, s, W+) | V_94 -> (t~, s, W+) | V_95 -> (u~, b, W+) | V_96 -> (c~, b, W+) | V_101 -> (e+, e-, G0) | V_102 -> (mu+, mu-, G0) | V_104 -> (e+, e-, H) | V_105 -> (mu+, mu-, H) | V_110 -> (ve~, e-, G+) | V_111 -> (vm~, mu-, G+) | V_116 -> (b~, u, G-) | V_117 -> (d~, c, G-) | V_118 -> (s~, c, G-) | V_119 -> (b~, c, G-) | V_120 -> (d~, t, G-) | V_121 -> (s~, t, G-) | V_124 -> (s~, u, W-) | V_125 -> (b~, u, W-) | V_126 -> (d~, c, W-) | V_128 -> (b~, c, W-) | V_129 -> (d~, t, W-) | V_130 -> (s~, t, W-) | V_138 -> (c~, c, G0) | V_140 -> (c~, c, H) | V_145 -> (e+, ve, G-) | V_146 -> (mu+, vm, G-)
26.50 s
> [2026-09-01 10:05:15.348] @gammalooprs::model INFO : The following 36 couplings were removed by the restriction card:
26.50 s
> GC_13, GC_14, GC_16, GC_17, GC_18, GC_19, GC_20, GC_22, GC_23, GC_24, GC_25, GC_26, GC_28, GC_29, GC_42, GC_43, GC_44, GC_46, GC_47, GC_48, GC_84, GC_85, GC_86, GC_87, GC_88, GC_89, GC_90, GC_91, GC_92, GC_93, GC_101, GC_102, GC_103, GC_105, GC_106, GC_107
26.50 s
> [2026-09-01 10:05:15.359] @gammaloop_api::se... INFO : Running command set default-runtime kv kinematics.externals='{"type":"constant","data":{"momenta":[[32.0,0.0,0.0,32.0],[32.0,0.0,0.0,-32.0]],"helicities":[1,1]}}'
26.50 s
> [2026-09-01 10:05:15.360] @gammaloop_api::se... INFO : Running command set default-runtime kv subtraction.disable_threshold_subtraction=true
26.50 s
> [2026-09-01 10:05:15.361] @gammaloop_api::se... INFO : Running command generate xs e+ e- > d d~ g | e- a d g QED^2==4 [{{2}} QCD=0] --numerator-grouping group_identical_graphs_up_to_sign --clear-existing-processes --only-diagrams
26.50 s
> [2026-09-01 10:05:15.380] @feyngen::diagram_... INFO : 0s | Δ=0s | Starting Feynman graph generation with Symbolica...
26.50 s
> [2026-09-01 10:05:15.386] @feyngen::diagram_... INFO : 0s | Δ=0s | Number of graphs resulting from Symbolica generation: 246
26.50 s
> [2026-09-01 10:05:15.388] @feyngen::diagram_... INFO : 0s | Δ=0s | Number of graphs retained after enforcing supergraph particle content: 8
26.50 s
> [2026-09-01 10:05:15.388] @feyngen::diagram_... INFO : 0s | Δ=0s | Number of graphs retained after removal of vetoed topologies: 8
26.50 s
> [2026-09-01 10:05:15.389] @feyngen::diagram_... INFO : 0s | Δ=0s | Number of graphs after vertex info assignment: 8
26.50 s
> [2026-09-01 10:05:15.389] @feyngen::diagram_... INFO : 0s | Δ=0s | Number of graphs after all complete graphs filters are applied: 8
26.50 s
>
26.50 s
>
26.50 s
> Location:
26.50 s
> tests/tests/test_python_api.rs:156:20
26.50 s
>
26.50 s
> FAIL [ 0.447s] (5/5) gammaloop-integration-tests::test_python_api python_settings_wrappers_expose_nested_runtime_and_global_settings
26.50 s
> stdout ---
26.50 s
>
26.50 s
> running 1 test
26.50 s
> test python_settings_wrappers_expose_nested_runtime_and_global_settings ... FAILED
26.50 s
>
26.50 s
> failures:
26.50 s
>
26.50 s
> failures:
26.50 s
> python_settings_wrappers_expose_nested_runtime_and_global_settings
26.50 s
>
26.50 s
> test result: FAILED. 0 passed; 1 failed; 0 ignored; 0 measured; 4 filtered out; finished in 0.44s
26.50 s
>
26.50 s
> stderr ---
26.50 s
> Error: Python API test subprocess failed.
26.50 s
> stdout:
26.50 s
> ┌────────────────────────────────────────────────────────┐
26.50 s
> │ You are running a restricted Symbolica instance. │
26.50 s
> │ │
26.50 s
> │ This mode is only permitted for non-commercial use and │
26.50 s
> │ is limited to one instance and core per machine. │
26.50 s
> │ │
26.50 s
> │ Hobbyists can easily acquire a free license key │
26.50 s
> │ that unlocks all cores and removes this banner: │
26.50 s
> │ │
26.50 s
> │ from symbolica import * │
26.50 s
> │ request_hobbyist_license('YOUR_NAME', 'YOUR_EMAIL') │
26.50 s
> │ │
26.50 s
> │ All other users can obtain a free 30-day trial key: │
26.50 s
> │ │
26.50 s
> │ from symbolica import * │
26.50 s
> │ request_trial_license('NAME', 'EMAIL', 'EMPLOYER') │
26.50 s
> │ │
26.50 s
> │ See https://symbolica.io/docs/get_started.html#license │
26.50 s
> └────────────────────────────────────────────────────────┘
26.50 s
> ┌───────────────────────────────────────────────────────────────────────────────────────────────────────────┐
26.50 s
> │ Cannot start new unlicensed Symbolica instance since there is already another one running on the machine. │
26.50 s
> └───────────────────────────────────────────────────────────────────────────────────────────────────────────┘
26.50 s
>
26.50 s
> stderr:
26.50 s
> ┌───────────────────────────────────┐
26.50 s
> │ The Symbolica license has expired │
26.50 s
> └───────────────────────────────────┘
26.50 s
>
26.50 s
>
26.50 s
> Location:
26.50 s
> tests/tests/test_python_api.rs:156:20
26.50 s
>
26.50 s
> ------------
26.50 s
> Summary [ 0.449s] 5 tests run: 0 passed , 5 failed , 0 skipped
26.50 s
> FAIL [ 0.344s] (1/5) gammaloop-integration-tests::test_python_api python_evaluate_sample_honors_generate_events_and_observable_snapshots
26.50 s
> stdout ---
26.50 s
>
26.50 s
> running 1 test
26.50 s
> test python_evaluate_sample_honors_generate_events_and_observable_snapshots ... FAILED
26.50 s
>
26.50 s
> failures:
26.50 s
>
26.50 s
> failures:
26.50 s
> python_evaluate_sample_honors_generate_events_and_observable_snapshots
26.50 s
>
26.50 s
> test result: FAILED. 0 passed; 1 failed; 0 ignored; 0 measured; 4 filtered out; finished in 0.33s
26.50 s
>
26.50 s
> stderr ---
26.50 s
> Error: Python API test subprocess failed.
26.50 s
> stdout:
26.50 s
> ┌────────────────────────────────────────────────────────┐
26.50 s
> │ You are running a restricted Symbolica instance. │
26.50 s
> │ │
26.50 s
> │ This mode is only permitted for non-commercial use and │
26.50 s
> │ is limited to one instance and core per machine. │
26.50 s
> │ │
26.50 s
> │ Hobbyists can easily acquire a free license key │
26.50 s
> │ that unlocks all cores and removes this banner: │
26.50 s
> │ │
26.50 s
> │ from symbolica import * │
26.50 s
> │ request_hobbyist_license('YOUR_NAME', 'YOUR_EMAIL') │
26.50 s
> │ │
26.50 s
> │ All other users can obtain a free 30-day trial key: │
26.50 s
> │ │
26.50 s
> │ from symbolica import * │
26.50 s
> │ request_trial_license('NAME', 'EMAIL', 'EMPLOYER') │
26.50 s
> │ │
26.50 s
> │ See https://symbolica.io/docs/get_started.html#license │
26.50 s
> └────────────────────────────────────────────────────────┘
26.50 s
> ┌───────────────────────────────────────────────────────────────────────────────────────────────────────────┐
26.50 s
> │ Cannot start new unlicensed Symbolica instance since there is already another one running on the machine. │
26.50 s
> └───────────────────────────────────────────────────────────────────────────────────────────────────────────┘
26.50 s
>
26.50 s
> stderr:
26.50 s
> ┌───────────────────────────────────┐
26.50 s
> │ The Symbolica license has expired │
26.50 s
> └───────────────────────────────────┘
26.50 s
>
26.50 s
>
26.50 s
> Location:
26.50 s
> tests/tests/test_python_api.rs:156:20
26.50 s
>
26.50 s
> FAIL [ 0.357s] (2/5) gammaloop-integration-tests::test_python_api python_evaluate_sample_preserves_graph_grouping_and_incoming_pdgs
26.50 s
> stdout ---
26.50 s
>
26.50 s
> running 1 test
26.50 s
> test python_evaluate_sample_preserves_graph_grouping_and_incoming_pdgs ... FAILED
26.50 s
>
26.50 s
> failures:
26.50 s
>
26.50 s
> failures:
26.50 s
> python_evaluate_sample_preserves_graph_grouping_and_incoming_pdgs
26.50 s
>
26.50 s
> test result: FAILED. 0 passed; 1 failed; 0 ignored; 0 measured; 4 filtered out; finished in 0.34s
26.50 s
>
26.50 s
> stderr ---
26.50 s
> Error: Python API test subprocess failed.
26.50 s
> stdout:
26.50 s
> ┌────────────────────────────────────────────────────────┐
26.50 s
> │ You are running a restricted Symbolica instance. │
26.50 s
> │ │
26.50 s
> │ This mode is only permitted for non-commercial use and │
26.50 s
> │ is limited to one instance and core per machine. │
26.50 s
> │ │
26.50 s
> │ Hobbyists can easily acquire a free license key │
26.50 s
> │ that unlocks all cores and removes this banner: │
26.50 s
> │ │
26.50 s
> │ from symbolica import * │
26.50 s
> │ request_hobbyist_license('YOUR_NAME', 'YOUR_EMAIL') │
26.50 s
> │ │
26.50 s
> │ All other users can obtain a free 30-day trial key: │
26.50 s
> │ │
26.50 s
> │ from symbolica import * │
26.50 s
> │ request_trial_license('NAME', 'EMAIL', 'EMPLOYER') │
26.50 s
> │ │
26.50 s
> │ See https://symbolica.io/docs/get_started.html#license │
26.50 s
> └────────────────────────────────────────────────────────┘
26.50 s
> ┌───────────────────────────────────────────────────────────────────────────────────────────────────────────┐
26.50 s
> │ Cannot start new unlicensed Symbolica instance since there is already another one running on the machine. │
26.50 s
> └───────────────────────────────────────────────────────────────────────────────────────────────────────────┘
26.50 s
>
26.50 s
> stderr:
26.50 s
> ┌───────────────────────────────────┐
26.50 s
> │ The Symbolica license has expired │
26.50 s
> └───────────────────────────────────┘
26.50 s
>
26.50 s
>
26.50 s
> Location:
26.50 s
> tests/tests/test_python_api.rs:156:20
26.50 s
>
26.50 s
> FAIL [ 0.361s] (3/5) gammaloop-integration-tests::test_python_api python_session_getters_return_live_toml_and_command_blocks
26.50 s
> stdout ---
26.50 s
>
26.50 s
> running 1 test
26.50 s
> test python_session_getters_return_live_toml_and_command_blocks ... FAILED
26.50 s
>
26.50 s
> failures:
26.50 s
>
26.50 s
> failures:
26.50 s
> python_session_getters_return_live_toml_and_command_blocks
26.50 s
>
26.50 s
> test result: FAILED. 0 passed; 1 failed; 0 ignored; 0 measured; 4 filtered out; finished in 0.35s
26.50 s
>
26.50 s
> stderr ---
26.50 s
> Error: Python API test subprocess failed.
26.50 s
> stdout:
26.50 s
> ┌────────────────────────────────────────────────────────┐
26.50 s
> │ You are running a restricted Symbolica instance. │
26.50 s
> │ │
26.50 s
> │ This mode is only permitted for non-commercial use and │
26.50 s
> │ is limited to one instance and core per machine. │
26.50 s
> │ │
26.50 s
> │ Hobbyists can easily acquire a free license key │
26.50 s
> │ that unlocks all cores and removes this banner: │
26.50 s
> │ │
26.50 s
> │ from symbolica import * │
26.50 s
> │ request_hobbyist_license('YOUR_NAME', 'YOUR_EMAIL') │
26.50 s
> │ │
26.50 s
> │ All other users can obtain a free 30-day trial key: │
26.50 s
> │ │
26.50 s
> │ from symbolica import * │
26.50 s
> │ request_trial_license('NAME', 'EMAIL', 'EMPLOYER') │
26.50 s
> │ │
26.50 s
> │ See https://symbolica.io/docs/get_started.html#license │
26.50 s
> └────────────────────────────────────────────────────────┘
26.50 s
> ┌───────────────────────────────────────────────────────────────────────────────────────────────────────────┐
26.50 s
> │ Cannot start new unlicensed Symbolica instance since there is already another one running on the machine. │
26.50 s
> └───────────────────────────────────────────────────────────────────────────────────────────────────────────┘
26.50 s
>
26.50 s
> stderr:
26.50 s
> ┌───────────────────────────────────┐
26.50 s
> │ The Symbolica license has expired │
26.50 s
> └───────────────────────────────────┘
26.50 s
>
26.50 s
>
26.50 s
> Location:
26.50 s
> tests/tests/test_python_api.rs:156:20
26.50 s
>
26.50 s
> FAIL [ 0.417s] (4/5) gammaloop-integration-tests::test_python_api python_evaluate_samples_batch_and_momentum_space_have_expected_shape
26.50 s
> stdout ---
26.50 s
>
26.50 s
> running 1 test
26.50 s
> test python_evaluate_samples_batch_and_momentum_space_have_expected_shape ... FAILED
26.50 s
>
26.50 s
> failures:
26.50 s
>
26.50 s
> failures:
26.50 s
> python_evaluate_samples_batch_and_momentum_space_have_expected_shape
26.50 s
>
26.50 s
> test result: FAILED. 0 passed; 1 failed; 0 ignored; 0 measured; 4 filtered out; finished in 0.41s
26.50 s
>
26.50 s
> stderr ---
26.50 s
> Error: Python API test subprocess failed.
26.50 s
> stdout:
26.50 s
> ┌────────────────────────────────────────────────────────┐
26.50 s
> │ You are running a restricted Symbolica instance. │
26.50 s
> │ │
26.50 s
> │ This mode is only permitted for non-commercial use and │
26.50 s
> │ is limited to one instance and core per machine. │
26.50 s
> │ │
26.50 s
> │ Hobbyists can easily acquire a free license key │
26.50 s
> │ that unlocks all cores and removes this banner: │
26.50 s
> │ │
26.50 s
> │ from symbolica import * │
26.50 s
> │ request_hobbyist_license('YOUR_NAME', 'YOUR_EMAIL') │
26.50 s
> │ │
26.50 s
> │ All other users can obtain a free 30-day trial key: │
26.50 s
> │ │
26.50 s
> │ from symbolica import * │
26.50 s
> │ request_trial_license('NAME', 'EMAIL', 'EMPLOYER') │
26.50 s
> │ │
26.50 s
> │ See https://symbolica.io/docs/get_started.html#license │
26.50 s
> └────────────────────────────────────────────────────────┘
26.50 s
> ┌───────────────────────────────────────────────────────────────────────────────────────────────────────────┐
26.50 s
> │ Cannot start new unlicensed Symbolica instance since there is already another one running on the machine. │
26.50 s
> └───────────────────────────────────────────────────────────────────────────────────────────────────────────┘
26.50 s
>
26.50 s
> stderr:
26.50 s
> ┌───────────────────────────────────┐
26.50 s
> │ The Symbolica license has expired │
26.50 s
> └───────────────────────────────────┘
26.50 s
> [2026-09-01 10:05:15.283] @gammaloop_api::se... INFO : Running command import model sm-default
26.50 s
> [2026-09-01 10:05:15.285] @import::model INFO : Loading built-in JSON model sm-default
26.50 s
> [2026-09-01 10:05:15.348] @gammalooprs::model INFO : The following 15 external parameters were forced to zero by the restriction card:
26.50 s
> lamWS, AWS, rhoWS, etaWS, ymc, yme, ymm, MC, Me, MM, WTau, muQ, muLe, muLmu, muLtau
26.50 s
> [2026-09-01 10:05:15.348] @gammalooprs::model INFO : The following 34 vertex rules were removed by the restriction card:
26.50 s
> V_82 -> (c~, d, G+) | V_83 -> (t~, d, G+) | V_84 -> (c~, s, G+) | V_85 -> (t~, s, G+) | V_86 -> (u~, b, G+) | V_87 -> (c~, b, G+) | V_90 -> (c~, d, W+) | V_91 -> (t~, d, W+) | V_92 -> (u~, s, W+) | V_94 -> (t~, s, W+) | V_95 -> (u~, b, W+) | V_96 -> (c~, b, W+) | V_101 -> (e+, e-, G0) | V_102 -> (mu+, mu-, G0) | V_104 -> (e+, e-, H) | V_105 -> (mu+, mu-, H) | V_110 -> (ve~, e-, G+) | V_111 -> (vm~, mu-, G+) | V_116 -> (b~, u, G-) | V_117 -> (d~, c, G-) | V_118 -> (s~, c, G-) | V_119 -> (b~, c, G-) | V_120 -> (d~, t, G-) | V_121 -> (s~, t, G-) | V_124 -> (s~, u, W-) | V_125 -> (b~, u, W-) | V_126 -> (d~, c, W-) | V_128 -> (b~, c, W-) | V_129 -> (d~, t, W-) | V_130 -> (s~, t, W-) | V_138 -> (c~, c, G0) | V_140 -> (c~, c, H) | V_145 -> (e+, ve, G-) | V_146 -> (mu+, vm, G-)
26.50 s
> [2026-09-01 10:05:15.348] @gammalooprs::model INFO : The following 36 couplings were removed by the restriction card:
26.50 s
> GC_13, GC_14, GC_16, GC_17, GC_18, GC_19, GC_20, GC_22, GC_23, GC_24, GC_25, GC_26, GC_28, GC_29, GC_42, GC_43, GC_44, GC_46, GC_47, GC_48, GC_84, GC_85, GC_86, GC_87, GC_88, GC_89, GC_90, GC_91, GC_92, GC_93, GC_101, GC_102, GC_103, GC_105, GC_106, GC_107
26.50 s
> [2026-09-01 10:05:15.359] @gammaloop_api::se... INFO : Running command set default-runtime kv kinematics.externals='{"type":"constant","data":{"momenta":[[32.0,0.0,0.0,32.0],[32.0,0.0,0.0,-32.0]],"helicities":[1,1]}}'
26.50 s
> [2026-09-01 10:05:15.360] @gammaloop_api::se... INFO : Running command set default-runtime kv subtraction.disable_threshold_subtraction=true
26.50 s
> [2026-09-01 10:05:15.361] @gammaloop_api::se... INFO : Running command generate xs e+ e- > d d~ g | e- a d g QED^2==4 [{{2}} QCD=0] --numerator-grouping group_identical_graphs_up_to_sign --clear-existing-processes --only-diagrams
26.50 s
> [2026-09-01 10:05:15.380] @feyngen::diagram_... INFO : 0s | Δ=0s | Starting Feynman graph generation with Symbolica...
26.50 s
> [2026-09-01 10:05:15.386] @feyngen::diagram_... INFO : 0s | Δ=0s | Number of graphs resulting from Symbolica generation: 246
26.50 s
> [2026-09-01 10:05:15.388] @feyngen::diagram_... INFO : 0s | Δ=0s | Number of graphs retained after enforcing supergraph particle content: 8
26.50 s
> [2026-09-01 10:05:15.388] @feyngen::diagram_... INFO : 0s | Δ=0s | Number of graphs retained after removal of vetoed topologies: 8
26.50 s
> [2026-09-01 10:05:15.389] @feyngen::diagram_... INFO : 0s | Δ=0s | Number of graphs after vertex info assignment: 8
26.50 s
> [2026-09-01 10:05:15.389] @feyngen::diagram_... INFO : 0s | Δ=0s | Number of graphs after all complete graphs filters are applied: 8
26.50 s
>
26.50 s
>
26.50 s
> Location:
26.50 s
> tests/tests/test_python_api.rs:156:20
26.50 s
>
26.50 s
> FAIL [ 0.447s] (5/5) gammaloop-integration-tests::test_python_api python_settings_wrappers_expose_nested_runtime_and_global_settings
26.50 s
> stdout ---
26.50 s
>
26.50 s
> running 1 test
26.50 s
> test python_settings_wrappers_expose_nested_runtime_and_global_settings ... FAILED
26.50 s
>
26.50 s
> failures:
26.50 s
>
26.50 s
> failures:
26.50 s
> python_settings_wrappers_expose_nested_runtime_and_global_settings
26.50 s
>
26.50 s
> test result: FAILED. 0 passed; 1 failed; 0 ignored; 0 measured; 4 filtered out; finished in 0.44s
26.50 s
>
26.50 s
> stderr ---
26.50 s
> Error: Python API test subprocess failed.
26.50 s
> stdout:
26.50 s
> ┌────────────────────────────────────────────────────────┐
26.50 s
> │ You are running a restricted Symbolica instance. │
26.50 s
> │ │
26.50 s
> │ This mode is only permitted for non-commercial use and │
26.50 s
> │ is limited to one instance and core per machine. │
26.50 s
> │ │
26.50 s
> │ Hobbyists can easily acquire a free license key │
26.50 s
> │ that unlocks all cores and removes this banner: │
26.50 s
> │ │
26.50 s
> │ from symbolica import * │
26.50 s
> │ request_hobbyist_license('YOUR_NAME', 'YOUR_EMAIL') │
26.50 s
> │ │
26.50 s
> │ All other users can obtain a free 30-day trial key: │
26.50 s
> │ │
26.50 s
> │ from symbolica import * │
26.50 s
> │ request_trial_license('NAME', 'EMAIL', 'EMPLOYER') │
26.50 s
> │ │
26.50 s
> │ See https://symbolica.io/docs/get_started.html#license │
26.50 s
> └────────────────────────────────────────────────────────┘
26.50 s
> ┌───────────────────────────────────────────────────────────────────────────────────────────────────────────┐
26.50 s
> │ Cannot start new unlicensed Symbolica instance since there is already another one running on the machine. │
26.50 s
> └───────────────────────────────────────────────────────────────────────────────────────────────────────────┘
26.50 s
>
26.50 s
> stderr:
26.50 s
> ┌───────────────────────────────────┐
26.50 s
> │ The Symbolica license has expired │
26.50 s
> └───────────────────────────────────┘
26.50 s
>
26.50 s
>
26.50 s
> Location:
26.50 s
> tests/tests/test_python_api.rs:156:20
26.50 s
>
26.50 s
> error : test run failed
26.50 s
>
26.50 s
> ========== nextest test summary ==========
26.50 s
> report: target/nextest/ci_gammaloop/junit.xml
26.50 s
> tests: 5, failures: 5, errors: 0
26.50 s
>
26.50 s
> 1. gammaloop-integration-tests::test_python_api::python_evaluate_sample_honors_generate_events_and_observable_snapshots
26.50 s
> failure: test failure with exit code 101
26.50 s
> Error: Python API test subprocess failed.
26.50 s
> stdout:
26.50 s
> ┌────────────────────────────────────────────────────────┐
26.50 s
> │ You are running a restricted Symbolica instance. │
26.50 s
> │ │
26.50 s
> │ This mode is only permitted for non-commercial use and │
26.50 s
> │ is limited to one instance and core per machine. │
26.50 s
> │ │
26.50 s
> │ Hobbyists can easily acquire a free license key │
26.50 s
> │ that unlocks all cores and removes this banner: │
26.50 s
> │ │
26.50 s
> │ from symbolica import * │
26.50 s
> │ request_hobbyist_license('YOUR_NAME', 'YOUR_EMAIL') │
26.50 s
> │ │
26.50 s
> │ All other users can obtain a free 30-day trial key: │
26.50 s
> │ │
26.50 s
> │ from symbolica import * │
26.50 s
> │ request_trial_license('NAME', 'EMAIL', 'EMPLOYER') │
26.50 s
> │ │
26.50 s
> │ See https://symbolica.io/docs/get_started.html#license │
26.50 s
> └────────────────────────────────────────────────────────┘
26.50 s
> ┌───────────────────────────────────────────────────────────────────────────────────────────────────────────┐
26.50 s
> │ Cannot start new unlicensed Symbolica instance since there is already another one running on the machine. │
26.50 s
> └───────────────────────────────────────────────────────────────────────────────────────────────────────────┘
26.50 s
>
26.50 s
> stderr:
26.50 s
> ┌───────────────────────────────────┐
26.50 s
> │ The Symbolica license has expired │
26.50 s
> └───────────────────────────────────┘
26.50 s
>
26.50 s
>
26.50 s
> Location:
26.50 s
> tests/tests/test_python_api.rs:156:20
26.50 s
> system-out
26.50 s
> running 1 test
26.50 s
> test python_evaluate_sample_honors_generate_events_and_observable_snapshots ... FAILED
26.50 s
>
26.50 s
> failures:
26.50 s
>
26.50 s
> failures:
26.50 s
> python_evaluate_sample_honors_generate_events_and_observable_snapshots
26.50 s
>
26.50 s
> test result: FAILED. 0 passed; 1 failed; 0 ignored; 0 measured; 4 filtered out; finished in 0.33s
26.50 s
> system-err
26.50 s
> Error: Python API test subprocess failed.
26.50 s
> stdout:
26.50 s
> ┌────────────────────────────────────────────────────────┐
26.50 s
> │ You are running a restricted Symbolica instance. │
26.50 s
> │ │
26.50 s
> │ This mode is only permitted for non-commercial use and │
26.50 s
> │ is limited to one instance and core per machine. │
26.50 s
> │ │
26.50 s
> │ Hobbyists can easily acquire a free license key │
26.50 s
> │ that unlocks all cores and removes this banner: │
26.50 s
> │ │
26.50 s
> │ from symbolica import * │
26.50 s
> │ request_hobbyist_license('YOUR_NAME', 'YOUR_EMAIL') │
26.50 s
> │ │
26.50 s
> │ All other users can obtain a free 30-day trial key: │
26.50 s
> │ │
26.50 s
> │ from symbolica import * │
26.50 s
> │ request_trial_license('NAME', 'EMAIL', 'EMPLOYER') │
26.50 s
> │ │
26.50 s
> │ See https://symbolica.io/docs/get_started.html#license │
26.50 s
> └────────────────────────────────────────────────────────┘
26.50 s
> ┌───────────────────────────────────────────────────────────────────────────────────────────────────────────┐
26.50 s
> │ Cannot start new unlicensed Symbolica instance since there is already another one running on the machine. │
26.50 s
> └───────────────────────────────────────────────────────────────────────────────────────────────────────────┘
26.50 s
>
26.50 s
> stderr:
26.50 s
> ┌───────────────────────────────────┐
26.50 s
> │ The Symbolica license has expired │
26.50 s
> └───────────────────────────────────┘
26.50 s
>
26.50 s
>
26.50 s
> Location:
26.50 s
> tests/tests/test_python_api.rs:156:20
26.50 s
>
26.50 s
> 2. gammaloop-integration-tests::test_python_api::python_evaluate_sample_preserves_graph_grouping_and_incoming_pdgs
26.50 s
> failure: test failure with exit code 101
26.50 s
> Error: Python API test subprocess failed.
26.50 s
> stdout:
26.50 s
> ┌────────────────────────────────────────────────────────┐
26.50 s
> │ You are running a restricted Symbolica instance. │
26.50 s
> │ │
26.50 s
> │ This mode is only permitted for non-commercial use and │
26.50 s
> │ is limited to one instance and core per machine. │
26.50 s
> │ │
26.50 s
> │ Hobbyists can easily acquire a free license key │
26.50 s
> │ that unlocks all cores and removes this banner: │
26.50 s
> │ │
26.50 s
> │ from symbolica import * │
26.50 s
> │ request_hobbyist_license('YOUR_NAME', 'YOUR_EMAIL') │
26.50 s
> │ │
26.50 s
> │ All other users can obtain a free 30-day trial key: │
26.50 s
> │ │
26.50 s
> │ from symbolica import * │
26.50 s
> │ request_trial_license('NAME', 'EMAIL', 'EMPLOYER') │
26.50 s
> │ │
26.50 s
> │ See https://symbolica.io/docs/get_started.html#license │
26.50 s
> └────────────────────────────────────────────────────────┘
26.50 s
> ┌───────────────────────────────────────────────────────────────────────────────────────────────────────────┐
26.50 s
> │ Cannot start new unlicensed Symbolica instance since there is already another one running on the machine. │
26.50 s
> └───────────────────────────────────────────────────────────────────────────────────────────────────────────┘
26.50 s
>
26.50 s
> stderr:
26.50 s
> ┌───────────────────────────────────┐
26.50 s
> │ The Symbolica license has expired │
26.50 s
> └───────────────────────────────────┘
26.50 s
>
26.50 s
>
26.50 s
> Location:
26.50 s
> tests/tests/test_python_api.rs:156:20
26.50 s
> system-out
26.50 s
> running 1 test
26.50 s
> test python_evaluate_sample_preserves_graph_grouping_and_incoming_pdgs ... FAILED
26.50 s
>
26.50 s
> failures:
26.50 s
>
26.50 s
> failures:
26.50 s
> python_evaluate_sample_preserves_graph_grouping_and_incoming_pdgs
26.50 s
>
26.50 s
> test result: FAILED. 0 passed; 1 failed; 0 ignored; 0 measured; 4 filtered out; finished in 0.34s
26.50 s
> system-err
26.50 s
> Error: Python API test subprocess failed.
26.50 s
> stdout:
26.50 s
> ┌────────────────────────────────────────────────────────┐
26.50 s
> │ You are running a restricted Symbolica instance. │
26.50 s
> │ │
26.50 s
> │ This mode is only permitted for non-commercial use and │
26.50 s
> │ is limited to one instance and core per machine. │
26.50 s
> │ │
26.50 s
> │ Hobbyists can easily acquire a free license key │
26.50 s
> │ that unlocks all cores and removes this banner: │
26.50 s
> │ │
26.50 s
> │ from symbolica import * │
26.50 s
> │ request_hobbyist_license('YOUR_NAME', 'YOUR_EMAIL') │
26.50 s
> │ │
26.50 s
> │ All other users can obtain a free 30-day trial key: │
26.50 s
> │ │
26.50 s
> │ from symbolica import * │
26.50 s
> │ request_trial_license('NAME', 'EMAIL', 'EMPLOYER') │
26.50 s
> │ │
26.50 s
> │ See https://symbolica.io/docs/get_started.html#license │
26.50 s
> └────────────────────────────────────────────────────────┘
26.50 s
> ┌───────────────────────────────────────────────────────────────────────────────────────────────────────────┐
26.50 s
> │ Cannot start new unlicensed Symbolica instance since there is already another one running on the machine. │
26.50 s
> └───────────────────────────────────────────────────────────────────────────────────────────────────────────┘
26.50 s
>
26.50 s
> stderr:
26.50 s
> ┌───────────────────────────────────┐
26.50 s
> │ The Symbolica license has expired │
26.50 s
> └───────────────────────────────────┘
26.50 s
>
26.50 s
>
26.50 s
> Location:
26.50 s
> tests/tests/test_python_api.rs:156:20
26.50 s
>
26.50 s
> 3. gammaloop-integration-tests::test_python_api::python_session_getters_return_live_toml_and_command_blocks
26.50 s
> failure: test failure with exit code 101
26.50 s
> Error: Python API test subprocess failed.
26.50 s
> stdout:
26.50 s
> ┌────────────────────────────────────────────────────────┐
26.50 s
> │ You are running a restricted Symbolica instance. │
26.50 s
> │ │
26.50 s
> │ This mode is only permitted for non-commercial use and │
26.50 s
> │ is limited to one instance and core per machine. │
26.50 s
> │ │
26.50 s
> │ Hobbyists can easily acquire a free license key │
26.50 s
> │ that unlocks all cores and removes this banner: │
26.50 s
> │ │
26.50 s
> │ from symbolica import * │
26.50 s
> │ request_hobbyist_license('YOUR_NAME', 'YOUR_EMAIL') │
26.50 s
> │ │
26.50 s
> │ All other users can obtain a free 30-day trial key: │
26.50 s
> │ │
26.50 s
> │ from symbolica import * │
26.50 s
> │ request_trial_license('NAME', 'EMAIL', 'EMPLOYER') │
26.50 s
> │ │
26.50 s
> │ See https://symbolica.io/docs/get_started.html#license │
26.50 s
> └────────────────────────────────────────────────────────┘
26.50 s
> ┌───────────────────────────────────────────────────────────────────────────────────────────────────────────┐
26.50 s
> │ Cannot start new unlicensed Symbolica instance since there is already another one running on the machine. │
26.50 s
> └───────────────────────────────────────────────────────────────────────────────────────────────────────────┘
26.50 s
>
26.50 s
> stderr:
26.50 s
> ┌───────────────────────────────────┐
26.50 s
> │ The Symbolica license has expired │
26.50 s
> └───────────────────────────────────┘
26.50 s
>
26.50 s
>
26.50 s
> Location:
26.50 s
> tests/tests/test_python_api.rs:156:20
26.50 s
> system-out
26.50 s
> running 1 test
26.50 s
> test python_session_getters_return_live_toml_and_command_blocks ... FAILED
26.50 s
>
26.50 s
> failures:
26.50 s
>
26.50 s
> failures:
26.50 s
> python_session_getters_return_live_toml_and_command_blocks
26.50 s
>
26.50 s
> test result: FAILED. 0 passed; 1 failed; 0 ignored; 0 measured; 4 filtered out; finished in 0.35s
26.50 s
> system-err
26.50 s
> Error: Python API test subprocess failed.
26.50 s
> stdout:
26.50 s
> ┌────────────────────────────────────────────────────────┐
26.50 s
> │ You are running a restricted Symbolica instance. │
26.50 s
> │ │
26.50 s
> │ This mode is only permitted for non-commercial use and │
26.50 s
> │ is limited to one instance and core per machine. │
26.50 s
> │ │
26.50 s
> │ Hobbyists can easily acquire a free license key │
26.50 s
> │ that unlocks all cores and removes this banner: │
26.50 s
> │ │
26.50 s
> │ from symbolica import * │
26.50 s
> │ request_hobbyist_license('YOUR_NAME', 'YOUR_EMAIL') │
26.50 s
> │ │
26.50 s
> │ All other users can obtain a free 30-day trial key: │
26.50 s
> │ │
26.50 s
> │ from symbolica import * │
26.50 s
> │ request_trial_license('NAME', 'EMAIL', 'EMPLOYER') │
26.50 s
> │ │
26.50 s
> │ See https://symbolica.io/docs/get_started.html#license │
26.50 s
> └────────────────────────────────────────────────────────┘
26.50 s
> ┌───────────────────────────────────────────────────────────────────────────────────────────────────────────┐
26.50 s
> │ Cannot start new unlicensed Symbolica instance since there is already another one running on the machine. │
26.50 s
> └───────────────────────────────────────────────────────────────────────────────────────────────────────────┘
26.50 s
>
26.50 s
> stderr:
26.50 s
> ┌───────────────────────────────────┐
26.50 s
> │ The Symbolica license has expired │
26.50 s
> └───────────────────────────────────┘
26.50 s
>
26.50 s
>
26.50 s
> Location:
26.50 s
> tests/tests/test_python_api.rs:156:20
26.50 s
>
26.50 s
> 4. gammaloop-integration-tests::test_python_api::python_evaluate_samples_batch_and_momentum_space_have_expected_shape
26.50 s
> failure: test failure with exit code 101
26.50 s
> Error: Python API test subprocess failed.
26.50 s
> stdout:
26.50 s
> ┌────────────────────────────────────────────────────────┐
26.50 s
> │ You are running a restricted Symbolica instance. │
26.50 s
> │ │
26.50 s
> │ This mode is only permitted for non-commercial use and │
26.50 s
> │ is limited to one instance and core per machine. │
26.50 s
> │ │
26.50 s
> │ Hobbyists can easily acquire a free license key │
26.50 s
> │ that unlocks all cores and removes this banner: │
26.50 s
> │ │
26.50 s
> │ from symbolica import * │
26.50 s
> │ request_hobbyist_license('YOUR_NAME', 'YOUR_EMAIL') │
26.50 s
> │ │
26.50 s
> │ All other users can obtain a free 30-day trial key: │
26.50 s
> │ │
26.50 s
> │ from symbolica import * │
26.50 s
> │ request_trial_license('NAME', 'EMAIL', 'EMPLOYER') │
26.50 s
> │ │
26.50 s
> │ See https://symbolica.io/docs/get_started.html#license │
26.50 s
> └────────────────────────────────────────────────────────┘
26.50 s
> ┌───────────────────────────────────────────────────────────────────────────────────────────────────────────┐
26.50 s
> │ Cannot start new unlicensed Symbolica instance since there is already another one running on the machine. │
26.50 s
> └───────────────────────────────────────────────────────────────────────────────────────────────────────────┘
26.50 s
>
26.50 s
> stderr:
26.50 s
> ┌───────────────────────────────────┐
26.50 s
> │ The Symbolica license has expired │
26.50 s
> └───────────────────────────────────┘
26.50 s
> [2026-09-01 10:05:15.283] @gammaloop_api::se... INFO : Running command import model sm-default
26.50 s
> [2026-09-01 10:05:15.285] @import::model INFO : Loading built-in JSON model sm-default
26.50 s
> [2026-09-01 10:05:15.348] @gammalooprs::model INFO : The following 15 external parameters were forced to zero by the restriction card:
26.50 s
> lamWS, AWS, rhoWS, etaWS, ymc, yme, ymm, MC, Me, MM, WTau, muQ, muLe, muLmu, muLtau
26.50 s
> [2026-09-01 10:05:15.348] @gammalooprs::model INFO : The following 34 vertex rules were removed by the restriction card:
26.50 s
> V_82 -> (c~, d, G+) | V_83 -> (t~, d, G+) | V_84 -> (c~, s, G+) | V_85 -> (t~, s, G+) | V_86 -> (u~, b, G+) | V_87 -> (c~, b, G+) | V_90 -> (c~, d, W+) | V_91 -> (t~, d, W+) | V_92 -> (u~, s, W+) | V_94 -> (t~, s, W+) | V_95 -> (u~, b, W+) | V_96 -> (c~, b, W+) | V_101 -> (e+, e-, G0) | V_102 -> (mu+, mu-, G0) | V_104 -> (e+, e-, H) | V_105 -> (mu+, mu-, H) | V_110 -> (ve~, e-, G+) | V_111 -> (vm~, mu-, G+) | V_116 -> (b~, u, G-) | V_117 -> (d~, c, G-) | V_118 -> (s~, c, G-) | V_119 -> (b~, c, G-) | V_120 -> (d~, t, G-) | V_121 -> (s~, t, G-) | V_124 -> (s~, u, W-) | V_125 -> (b~, u, W-) | V_126 -> (d~, c, W-) | V_128 -> (b~, c, W-) | V_129 -> (d~, t, W-) | V_130 -> (s~, t, W-) | V_138 -> (c~, c, G0) | V_140 -> (c~, c, H) | V_145 -> (e+, ve, G-) | V_146 -> (mu+, vm, G-)
26.50 s
> [2026-09-01 10:05:15.348] @gammalooprs::model INFO : The following 36 couplings were removed by the restriction card:
26.50 s
> GC_13, GC_14, GC_16, GC_17, GC_18, GC_19, GC_20, GC_22, GC_23, GC_24, GC_25, GC_26, GC_28, GC_29, GC_42, GC_43, GC_44, GC_46, GC_47, GC_48, GC_84, GC_85, GC_86, GC_87, GC_88, GC_89, GC_90, GC_91, GC_92, GC_93, GC_101, GC_102, GC_103, GC_105, GC_106, GC_107
26.50 s
> [2026-09-01 10:05:15.359] @gammaloop_api::se... INFO : Running command set default-runtime kv kinematics.externals='{"type":"constant","data":{"momenta":[[32.0,0.0,0.0,32.0],[32.0,0.0,0.0,-32.0]],"helicities":[1,1]}}'
26.50 s
> [2026-09-01 10:05:15.360] @gammaloop_api::se... INFO : Running command set default-runtime kv subtraction.disable_threshold_subtraction=true
26.50 s
> [2026-09-01 10:05:15.361] @gammaloop_api::se... INFO : Running command generate xs e+ e- > d d~ g | e- a d g QED^2==4 [{{2}} QCD=0] --numerator-grouping group_identical_graphs_up_to_sign --clear-existing-processes --only-diagrams
26.50 s
> [2026-09-01 10:05:15.380] @feyngen::diagram_... INFO : 0s | Δ=0s | Starting Feynman graph generation with Symbolica...
26.50 s
> [2026-09-01 10:05:15.386] @feyngen::diagram_... INFO : 0s | Δ=0s | Number of graphs resulting from Symbolica generation: 246
26.50 s
> [2026-09-01 10:05:15.388] @feyngen::diagram_... INFO : 0s | Δ=0s | Number of graphs retained after enforcing supergraph particle content: 8
26.50 s
> [2026-09-01 10:05:15.388] @feyngen::diagram_... INFO : 0s | Δ=0s | Number of graphs retained after removal of vetoed topologies: 8
26.50 s
> [2026-09-01 10:05:15.389] @feyngen::diagram_... INFO : 0s | Δ=0s | Number of graphs after vertex info assignment: 8
26.50 s
> [2026-09-01 10:05:15.389] @feyngen::diagram_... INFO : 0s | Δ=0s | Number of graphs after all complete graphs filters are applied: 8
26.50 s
>
26.50 s
>
26.50 s
> Location:
26.50 s
> tests/tests/test_python_api.rs:156:20
26.50 s
> system-out
26.50 s
> running 1 test
26.50 s
> test python_evaluate_samples_batch_and_momentum_space_have_expected_shape ... FAILED
26.50 s
>
26.50 s
> failures:
26.50 s
>
26.50 s
> failures:
26.50 s
> python_evaluate_samples_batch_and_momentum_space_have_expected_shape
26.50 s
>
26.50 s
> test result: FAILED. 0 passed; 1 failed; 0 ignored; 0 measured; 4 filtered out; finished in 0.41s
26.50 s
> system-err
26.50 s
> Error: Python API test subprocess failed.
26.50 s
> stdout:
26.50 s
> ┌────────────────────────────────────────────────────────┐
26.50 s
> │ You are running a restricted Symbolica instance. │
26.50 s
> │ │
26.50 s
> │ This mode is only permitted for non-commercial use and │
26.50 s
> │ is limited to one instance and core per machine. │
26.50 s
> │ │
26.50 s
> │ Hobbyists can easily acquire a free license key │
26.50 s
> │ that unlocks all cores and removes this banner: │
26.50 s
> │ │
26.50 s
> │ from symbolica import * │
26.50 s
> │ request_hobbyist_license('YOUR_NAME', 'YOUR_EMAIL') │
26.50 s
> │ │
26.50 s
> │ All other users can obtain a free 30-day trial key: │
26.50 s
> │ │
26.50 s
> │ from symbolica import * │
26.50 s
> │ request_trial_license('NAME', 'EMAIL', 'EMPLOYER') │
26.50 s
> │ │
26.50 s
> │ See https://symbolica.io/docs/get_started.html#license │
26.50 s
> └────────────────────────────────────────────────────────┘
26.50 s
> ┌───────────────────────────────────────────────────────────────────────────────────────────────────────────┐
26.50 s
> │ Cannot start new unlicensed Symbolica instance since there is already another one running on the machine. │
26.50 s
> └───────────────────────────────────────────────────────────────────────────────────────────────────────────┘
26.50 s
>
26.50 s
> stderr:
26.50 s
> ┌───────────────────────────────────┐
26.50 s
> │ The Symbolica license has expired │
26.50 s
> └───────────────────────────────────┘
26.50 s
> [2026-09-01 10:05:15.283] @gammaloop_api::se... INFO : Running command import model sm-default
26.50 s
> [2026-09-01 10:05:15.285] @import::model INFO : Loading built-in JSON model sm-default
26.50 s
> [2026-09-01 10:05:15.348] @gammalooprs::model INFO : The following 15 external parameters were forced to zero by the restriction card:
26.50 s
> lamWS, AWS, rhoWS, etaWS, ymc, yme, ymm, MC, Me, MM, WTau, muQ, muLe, muLmu, muLtau
26.50 s
> [2026-09-01 10:05:15.348] @gammalooprs::model INFO : The following 34 vertex rules were removed by the restriction card:
26.50 s
> V_82 -> (c~, d, G+) | V_83 -> (t~, d, G+) | V_84 -> (c~, s, G+) | V_85 -> (t~, s, G+) | V_86 -> (u~, b, G+) | V_87 -> (c~, b, G+) | V_90 -> (c~, d, W+) | V_91 -> (t~, d, W+) | V_92 -> (u~, s, W+) | V_94 -> (t~, s, W+) | V_95 -> (u~, b, W+) | V_96 -> (c~, b, W+) | V_101 -> (e+, e-, G0) | V_102 -> (mu+, mu-, G0) | V_104 -> (e+, e-, H) | V_105 -> (mu+, mu-, H) | V_110 -> (ve~, e-, G+) | V_111 -> (vm~, mu-, G+) | V_116 -> (b~, u, G-) | V_117 -> (d~, c, G-) | V_118 -> (s~, c, G-) | V_119 -> (b~, c, G-) | V_120 -> (d~, t, G-) | V_121 -> (s~, t, G-) | V_124 -> (s~, u, W-) | V_125 -> (b~, u, W-) | V_126 -> (d~, c, W-) | V_128 -> (b~, c, W-) | V_129 -> (d~, t, W-) | V_130 -> (s~, t, W-) | V_138 -> (c~, c, G0) | V_140 -> (c~, c, H) | V_145 -> (e+, ve, G-) | V_146 -> (mu+, vm, G-)
26.50 s
> [2026-09-01 10:05:15.348] @gammalooprs::model INFO : The following 36 couplings were removed by the restriction card:
26.50 s
> GC_13, GC_14, GC_16, GC_17, GC_18, GC_19, GC_20, GC_22, GC_23, GC_24, GC_25, GC_26, GC_28, GC_29, GC_42, GC_43, GC_44, GC_46, GC_47, GC_48, GC_84, GC_85, GC_86, GC_87, GC_88, GC_89, GC_90, GC_91, GC_92, GC_93, GC_101, GC_102, GC_103, GC_105, GC_106, GC_107
26.50 s
> [2026-09-01 10:05:15.359] @gammaloop_api::se... INFO : Running command set default-runtime kv kinematics.externals='{"type":"constant","data":{"momenta":[[32.0,0.0,0.0,32.0],[32.0,0.0,0.0,-32.0]],"helicities":[1,1]}}'
26.50 s
> [2026-09-01 10:05:15.360] @gammaloop_api::se... INFO : Running command set default-runtime kv subtraction.disable_threshold_subtraction=true
26.50 s
> [2026-09-01 10:05:15.361] @gammaloop_api::se... INFO : Running command generate xs e+ e- > d d~ g | e- a d g QED^2==4 [{{2}} QCD=0] --numerator-grouping group_identical_graphs_up_to_sign --clear-existing-processes --only-diagrams
26.50 s
> [2026-09-01 10:05:15.380] @feyngen::diagram_... INFO : 0s | Δ=0s | Starting Feynman graph generation with Symbolica...
26.50 s
> [2026-09-01 10:05:15.386] @feyngen::diagram_... INFO : 0s | Δ=0s | Number of graphs resulting from Symbolica generation: 246
26.50 s
> [2026-09-01 10:05:15.388] @feyngen::diagram_... INFO : 0s | Δ=0s | Number of graphs retained after enforcing supergraph particle content: 8
26.50 s
> [2026-09-01 10:05:15.388] @feyngen::diagram_... INFO : 0s | Δ=0s | Number of graphs retained after removal of vetoed topologies: 8
26.50 s
> [2026-09-01 10:05:15.389] @feyngen::diagram_... INFO : 0s | Δ=0s | Number of graphs after vertex info assignment: 8
26.50 s
> [2026-09-01 10:05:15.389] @feyngen::diagram_... INFO : 0s | Δ=0s | Number of graphs after all complete graphs filters are applied: 8
26.50 s
>
26.50 s
>
26.50 s
> Location:
26.50 s
> tests/tests/test_python_api.rs:156:20
26.50 s
>
26.50 s
> 5. gammaloop-integration-tests::test_python_api::python_settings_wrappers_expose_nested_runtime_and_global_settings
26.50 s
> failure: test failure with exit code 101
26.50 s
> Error: Python API test subprocess failed.
26.50 s
> stdout:
26.50 s
> ┌────────────────────────────────────────────────────────┐
26.50 s
> │ You are running a restricted Symbolica instance. │
26.50 s
> │ │
26.50 s
> │ This mode is only permitted for non-commercial use and │
26.50 s
> │ is limited to one instance and core per machine. │
26.50 s
> │ │
26.50 s
> │ Hobbyists can easily acquire a free license key │
26.50 s
> │ that unlocks all cores and removes this banner: │
26.50 s
> │ │
26.50 s
> │ from symbolica import * │
26.50 s
> │ request_hobbyist_license('YOUR_NAME', 'YOUR_EMAIL') │
26.50 s
> │ │
26.50 s
> │ All other users can obtain a free 30-day trial key: │
26.50 s
> │ │
26.50 s
> │ from symbolica import * │
26.50 s
> │ request_trial_license('NAME', 'EMAIL', 'EMPLOYER') │
26.50 s
> │ │
26.50 s
> │ See https://symbolica.io/docs/get_started.html#license │
26.50 s
> └────────────────────────────────────────────────────────┘
26.50 s
> ┌───────────────────────────────────────────────────────────────────────────────────────────────────────────┐
26.50 s
> │ Cannot start new unlicensed Symbolica instance since there is already another one running on the machine. │
26.50 s
> └───────────────────────────────────────────────────────────────────────────────────────────────────────────┘
26.50 s
>
26.50 s
> stderr:
26.50 s
> ┌───────────────────────────────────┐
26.50 s
> │ The Symbolica license has expired │
26.50 s
> └───────────────────────────────────┘
26.50 s
>
26.50 s
>
26.50 s
> Location:
26.50 s
> tests/tests/test_python_api.rs:156:20
26.50 s
> system-out
26.50 s
> running 1 test
26.50 s
> test python_settings_wrappers_expose_nested_runtime_and_global_settings ... FAILED
26.50 s
>
26.50 s
> failures:
26.50 s
>
26.50 s
> failures:
26.50 s
> python_settings_wrappers_expose_nested_runtime_and_global_settings
26.50 s
>
26.50 s
> test result: FAILED. 0 passed; 1 failed; 0 ignored; 0 measured; 4 filtered out; finished in 0.44s
26.50 s
> system-err
26.50 s
> Error: Python API test subprocess failed.
26.50 s
> stdout:
26.50 s
> ┌────────────────────────────────────────────────────────┐
26.50 s
> │ You are running a restricted Symbolica instance. │
26.50 s
> │ │
26.50 s
> │ This mode is only permitted for non-commercial use and │
26.50 s
> │ is limited to one instance and core per machine. │
26.50 s
> │ │
26.50 s
> │ Hobbyists can easily acquire a free license key │
26.50 s
> │ that unlocks all cores and removes this banner: │
26.50 s
> │ │
26.50 s
> │ from symbolica import * │
26.50 s
> │ request_hobbyist_license('YOUR_NAME', 'YOUR_EMAIL') │
26.50 s
> │ │
26.50 s
> │ All other users can obtain a free 30-day trial key: │
26.50 s
> │ │
26.50 s
> │ from symbolica import * │
26.50 s
> │ request_trial_license('NAME', 'EMAIL', 'EMPLOYER') │
26.50 s
> │ │
26.50 s
> │ See https://symbolica.io/docs/get_started.html#license │
26.50 s
> └────────────────────────────────────────────────────────┘
26.50 s
> ┌───────────────────────────────────────────────────────────────────────────────────────────────────────────┐
26.50 s
> │ Cannot start new unlicensed Symbolica instance since there is already another one running on the machine. │
26.50 s
> └───────────────────────────────────────────────────────────────────────────────────────────────────────────┘
26.50 s
>
26.50 s
> stderr:
26.50 s
> ┌───────────────────────────────────┐
26.50 s
> │ The Symbolica license has expired │
26.50 s
> └───────────────────────────────────┘
26.50 s
>
26.50 s
>
26.50 s
> Location:
26.50 s
> tests/tests/test_python_api.rs:156:20
26.50 s
> =========================================
26.50 s
For full logs, run:
26.50 s
nix log /nix/store/90vl6933shlgrvsg0q1k9hbam6pqxvdh-gammaloop-nextest-python-api.drv
26.76 s
[0 built (1 failed ), 0.0 Run failed.