test packages.x86_64-linux.nix-ci-check-gammaloop-nextest-python-api

Reproduce this run
Retry Run
  1. 0.08 s $ /nix/store/9ypz3flqsrl5xl495mm8h645gadjsxi1-coreutils-9.11/bin/timeout --kill-after=15s 7200s /nix/store/23zk8sgzamrbmj1fday15szf7f2279s8-nix-2.34.7/bin/nix --extra-experimental-features nix-command --extra-experimental-features flakes flake clone git+https://github.com/alphal00p/gammaloop --dest /tmp/nix-ci-worker/stable-pwd/repo/
  2. 0.09 s Cloning into '/tmp/nix-ci-worker/stable-pwd/repo'...
  3. 0.78 s remote: Enumerating objects: 65450, done.
  4. 0.89 s remote: Counting objects: 0% (1/8122) remote: Counting objects: 1% (82/8122) remote: Counting objects: 2% (163/8122) remote: Counting objects: 3% (244/8122) remote: Counting objects: 4% (325/8122) remote: Counting objects: 5% (407/8122) remote: Counting objects: 6% (488/8122) remote: Counting objects: 7% (569/8122) remote: Counting objects: 8% (650/8122) remote: Counting objects: 9% (731/8122) remote: Counting objects: 10% (813/8122) remote: Counting objects: 11% (894/8122) remote: Counting objects: 12% (975/8122) remote: Counting objects: 13% (1056/8122) remote: Counting objects: 14% (1138/8122) remote: Counting objects: 15% (1219/8122) remote: Counting objects: 16% (1300/8122) remote: Counting objects: 17% (1381/8122) remote: Counting objects: 18% (1462/8122) remote: Counting objects: 19% (1544/8122) remote: Counting objects: 20% (1625/8122) remote: Counting objects: 21% (1706/8122) remote: Counting objects: 22% (1787/8122) remote: Counting objects: 23% (1869/8122) remote: Counting objects: 24% (1950/8122) remote: Counting objects: 25% (2031/8122) remote: Counting objects: 26% (2112/8122) remote: Counting objects: 27% (2193/8122) remote: Counting objects: 28% (2275/8122) remote: Counting objects: 29% (2356/8122) remote: Counting objects: 30% (2437/8122) remote: Counting objects: 31% (2518/8122) remote: Counting objects: 32% (2600/8122) remote: Counting objects: 33% (2681/8122) remote: Counting objects: 34% (2762/8122) remote: Counting objects: 35% (2843/8122) remote: Counting objects: 36% (2924/8122) remote: Counting objects: 37% (3006/8122) remote: Counting objects: 38% (3087/8122) remote: Counting objects: 39% (3168/8122) remote: Counting objects: 40% (3249/8122) remote: Counting objects: 41% (3331/8122) remote: Counting objects: 42% (3412/8122) remote: Counting objects: 43% (3493/8122) remote: Counting objects: 44% (3574/8122) remote: Counting objects: 45% (3655/8122) remote: Counting objects: 46% (3737/8122) remote: Counting objects: 47% (3818/8122) remote: Counting objects: 48% (3899/8122) remote: Counting objects: 49% (3980/8122) remote: Counting objects: 50% (4061/8122) remote: Counting objects: 51% (4143/8122) remote: Counting objects: 52% (4224/8122) remote: Counting objects: 53% (4305/8122) remote: Counting objects: 54% (4386/8122) remote: Counting objects: 55% (4468/8122) remote: Counting objects: 56% (4549/8122) remote: Counting objects: 57% (4630/8122) remote: Counting objects: 58% (4711/8122) remote: Counting objects: 59% (4792/8122) remote: Counting objects: 60% (4874/8122) remote: Counting objects: 61% (4955/8122) remote: Counting objects: 62% (5036/8122) remote: Counting objects: 63% (5117/8122) remote: Counting objects: 64% (5199/8122) remote: Counting objects: 65% (5280/8122) remote: Counting objects: 66% (5361/8122) remote: Counting objects: 67% (5442/8122) remote: Counting objects: 68% (5523/8122) remote: Counting objects: 69% (5605/8122) remote: Counting objects: 70% (5686/8122) remote: Counting objects: 71% (5767/8122) remote: Counting objects: 72% (5848/8122) remote: Counting objects: 73% (5930/8122) remote: Counting objects: 74% (6011/8122) remote: Counting objects: 75% (6092/8122) remote: Counting objects: 76% (6173/8122) remote: Counting objects: 77% (6254/8122) remote: Counting objects: 78% (6336/8122) remote: Counting objects: 79% (6417/8122) remote: Counting objects: 80% (6498/8122) remote: Counting objects: 81% (6579/8122) remote: Counting objects: 82% (6661/8122) remote: Counting objects: 83% (6742/8122) remote: Counting objects: 84% (6823/8122) remote: Counting objects: 85% (6904/8122) remote: Counting objects: 86% (6985/8122) remote: Counting objects: 87% (7067/8122) remote: Counting objects: 88% (7148/8122) remote: Counting objects: 89% (7229/8122) remote: Counting objects: 90% (7310/8122) remote: Counting objects: 91% (7392/8122) remote: Counting objects: 92% (7473/8122) remote: Counting objects: 93% (7554/8122) remote: Counting objects: 94% (7635/8122) remote: Counting objects: 95% (7716/8122) remote: Counting objects: 96% (7798/8122) remote: Counting objects: 97% (7879/8122) remote: Counting objects: 98% (7960/8122) remote: Counting objects: 99% (8041/8122) remote: Counting objects: 100% (8122/8122) remote: Counting objects: 100% (8122/8122), done.
  5. 2.46 s remote: Compressing objects: 0% (1/1734) remote: Compressing objects: 1% (18/1734) remote: Compressing objects: 2% (35/1734) remote: Compressing objects: 3% (53/1734) remote: Compressing objects: 4% (70/1734) remote: Compressing objects: 5% (87/1734) remote: Compressing objects: 6% (105/1734) remote: Compressing objects: 7% (122/1734) remote: Compressing objects: 8% (139/1734) remote: Compressing objects: 9% (157/1734) remote: Compressing objects: 10% (174/1734) remote: Compressing objects: 11% (191/1734) remote: Compressing objects: 12% (209/1734) remote: Compressing objects: 13% (226/1734) remote: Compressing objects: 14% (243/1734) remote: Compressing objects: 15% (261/1734) remote: Compressing objects: 16% (278/1734) remote: Compressing objects: 17% (295/1734) remote: Compressing objects: 18% (313/1734) remote: Compressing objects: 18% (318/1734) remote: Compressing objects: 19% (330/1734) remote: Compressing objects: 20% (347/1734) remote: Compressing objects: 21% (365/1734) remote: Compressing objects: 22% (382/1734) remote: Compressing objects: 23% (399/1734) remote: Compressing objects: 24% (417/1734) remote: Compressing objects: 25% (434/1734) remote: Compressing objects: 26% (451/1734) remote: Compressing objects: 27% (469/1734) remote: Compressing objects: 28% (486/1734) remote: Compressing objects: 29% (503/1734) remote: Compressing objects: 30% (521/1734) remote: Compressing objects: 31% (538/1734) remote: Compressing objects: 32% (555/1734) remote: Compressing objects: 33% (573/1734) remote: Compressing objects: 34% (590/1734) remote: Compressing objects: 35% (607/1734) remote: Compressing objects: 36% (625/1734) remote: Compressing objects: 37% (642/1734) remote: Compressing objects: 38% (659/1734) remote: Compressing objects: 39% (677/1734) remote: Compressing objects: 40% (694/1734) remote: Compressing objects: 41% (711/1734) remote: Compressing objects: 42% (729/1734) remote: Compressing objects: 43% (746/1734) remote: Compressing objects: 44% (763/1734) remote: Compressing objects: 45% (781/1734) remote: Compressing objects: 46% (798/1734) remote: Compressing objects: 47% (815/1734) remote: Compressing objects: 48% (833/1734) remote: Compressing objects: 49% (850/1734) remote: Compressing objects: 50% (867/1734) remote: Compressing objects: 51% (885/1734) remote: Compressing objects: 52% (902/1734) remote: Compressing objects: 53% (920/1734) remote: Compressing objects: 54% (937/1734) remote: Compressing objects: 55% (954/1734) remote: Compressing objects: 56% (972/1734) remote: Compressing objects: 57% (989/1734) remote: Compressing objects: 58% (1006/1734) remote: Compressing objects: 59% (1024/1734) remote: Compressing objects: 60% (1041/1734) remote: Compressing objects: 61% (1058/1734) remote: Compressing objects: 62% (1076/1734) remote: Compressing objects: 63% (1093/1734) remote: Compressing objects: 64% (1110/1734) remote: Compressing objects: 65% (1128/1734) remote: Compressing objects: 66% (1145/1734) remote: Compressing objects: 67% (1162/1734) remote: Compressing objects: 68% (1180/1734) remote: Compressing objects: 69% (1197/1734) remote: Compressing objects: 70% (1214/1734) remote: Compressing objects: 71% (1232/1734) remote: Compressing objects: 72% (1249/1734) remote: Compressing objects: 73% (1266/1734) remote: Compressing objects: 74% (1284/1734) remote: Compressing objects: 75% (1301/1734) remote: Compressing objects: 76% (1318/1734) remote: Compressing objects: 77% (1336/1734) remote: Compressing objects: 78% (1353/1734) remote: Compressing objects: 79% (1370/1734) remote: Compressing objects: 80% (1388/1734) remote: Compressing objects: 81% (1405/1734) remote: Compressing objects: 82% (1422/1734) remote: Compressing objects: 83% (1440/1734) remote: Compressing objects: 84% (1457/1734) remote: Compressing objects: 85% (1474/1734) remote: Compressing objects: 86% (1492/1734) remote: Compressing objects: 87% (1509/1734) remote: Compressing objects: 88% (1526/1734) remote: Compressing objects: 89% (1544/1734) remote: Compressing objects: 90% (1561/1734) remote: Compressing objects: 91% (1578/1734) remote: Compressing objects: 92% (1596/1734) remote: Compressing objects: 93% (1613/1734) remote: Compressing objects: 94% (1630/1734) remote: Compressing objects: 95% (1648/1734) remote: Compressing objects: 96% (1665/1734) remote: Compressing objects: 97% (1682/1734) remote: Compressing objects: 98% (1700/1734) remote: Compressing objects: 99% (1717/1734) remote: Compressing objects: 100% (1734/1734) remote: Compressing objects: 100% (1734/1734), done.
  6. 5.12 s Receiving objects: 0% (1/65450) Receiving objects: 1% (655/65450) Receiving objects: 2% (1309/65450) Receiving objects: 3% (1964/65450) Receiving objects: 4% (2618/65450) Receiving objects: 5% (3273/65450) Receiving objects: 6% (3927/65450) Receiving objects: 7% (4582/65450) Receiving objects: 8% (5236/65450) Receiving objects: 9% (5891/65450) Receiving objects: 10% (6545/65450) Receiving objects: 11% (7200/65450) Receiving objects: 12% (7854/65450), 13.34 MiB | 26.66 MiB/s Receiving objects: 13% (8509/65450), 13.34 MiB | 26.66 MiB/s Receiving objects: 14% (9163/65450), 13.34 MiB | 26.66 MiB/s Receiving objects: 15% (9818/65450), 13.34 MiB | 26.66 MiB/s Receiving objects: 16% (10472/65450), 13.34 MiB | 26.66 MiB/s Receiving objects: 17% (11127/65450), 13.34 MiB | 26.66 MiB/s Receiving objects: 18% (11781/65450), 13.34 MiB | 26.66 MiB/s Receiving objects: 19% (12436/65450), 13.34 MiB | 26.66 MiB/s Receiving objects: 20% (13090/65450), 13.34 MiB | 26.66 MiB/s Receiving objects: 21% (13745/65450), 13.34 MiB | 26.66 MiB/s Receiving objects: 22% (14399/65450), 13.34 MiB | 26.66 MiB/s Receiving objects: 23% (15054/65450), 13.34 MiB | 26.66 MiB/s Receiving objects: 24% (15708/65450), 13.34 MiB | 26.66 MiB/s Receiving objects: 25% (16363/65450), 13.34 MiB | 26.66 MiB/s Receiving objects: 26% (17017/65450), 13.34 MiB | 26.66 MiB/s Receiving objects: 27% (17672/65450), 13.34 MiB | 26.66 MiB/s Receiving objects: 28% (18326/65450), 13.34 MiB | 26.66 MiB/s Receiving objects: 29% (18981/65450), 13.34 MiB | 26.66 MiB/s Receiving objects: 30% (19635/65450), 13.34 MiB | 26.66 MiB/s Receiving objects: 31% (20290/65450), 13.34 MiB | 26.66 MiB/s Receiving objects: 32% (20944/65450), 13.34 MiB | 26.66 MiB/s Receiving objects: 33% (21599/65450), 13.34 MiB | 26.66 MiB/s Receiving objects: 34% (22253/65450), 13.34 MiB | 26.66 MiB/s Receiving objects: 35% (22908/65450), 13.34 MiB | 26.66 MiB/s Receiving objects: 36% (23562/65450), 13.34 MiB | 26.66 MiB/s Receiving objects: 37% (24217/65450), 13.34 MiB | 26.66 MiB/s Receiving objects: 38% (24871/65450), 13.34 MiB | 26.66 MiB/s Receiving objects: 39% (25526/65450), 13.34 MiB | 26.66 MiB/s Receiving objects: 40% (26180/65450), 13.34 MiB | 26.66 MiB/s Receiving objects: 41% (26835/65450), 13.34 MiB | 26.66 MiB/s Receiving objects: 42% (27489/65450), 13.34 MiB | 26.66 MiB/s Receiving objects: 43% (28144/65450), 13.34 MiB | 26.66 MiB/s Receiving objects: 44% (28798/65450), 13.34 MiB | 26.66 MiB/s Receiving objects: 45% (29453/65450), 13.34 MiB | 26.66 MiB/s Receiving objects: 46% (30107/65450), 13.34 MiB | 26.66 MiB/s Receiving objects: 47% (30762/65450), 13.34 MiB | 26.66 MiB/s Receiving objects: 48% (31416/65450), 13.34 MiB | 26.66 MiB/s Receiving objects: 49% (32071/65450), 13.34 MiB | 26.66 MiB/s Receiving objects: 50% (32725/65450), 13.34 MiB | 26.66 MiB/s Receiving objects: 51% (33380/65450), 13.34 MiB | 26.66 MiB/s Receiving objects: 52% (34034/65450), 13.34 MiB | 26.66 MiB/s Receiving objects: 52% (34129/65450), 13.34 MiB | 26.66 MiB/s Receiving objects: 53% (34689/65450), 33.53 MiB | 33.52 MiB/s Receiving objects: 54% (35343/65450), 33.53 MiB | 33.52 MiB/s Receiving objects: 55% (35998/65450), 33.53 MiB | 33.52 MiB/s Receiving objects: 56% (36652/65450), 33.53 MiB | 33.52 MiB/s Receiving objects: 57% (37307/65450), 33.53 MiB | 33.52 MiB/s Receiving objects: 58% (37961/65450), 33.53 MiB | 33.52 MiB/s Receiving objects: 59% (38616/65450), 33.53 MiB | 33.52 MiB/s Receiving objects: 60% (39270/65450), 33.53 MiB | 33.52 MiB/s Receiving objects: 61% (39925/65450), 33.53 MiB | 33.52 MiB/s Receiving objects: 62% (40579/65450), 33.53 MiB | 33.52 MiB/s Receiving objects: 63% (41234/65450), 33.53 MiB | 33.52 MiB/s Receiving objects: 64% (41888/65450), 50.07 MiB | 33.37 MiB/s Receiving objects: 65% (42543/65450), 50.07 MiB | 33.37 MiB/s Receiving objects: 66% (43197/65450), 50.07 MiB | 33.37 MiB/s Receiving objects: 67% (43852/65450), 50.07 MiB | 33.37 MiB/s Receiving objects: 68% (44506/65450), 50.07 MiB | 33.37 MiB/s Receiving objects: 69% (45161/65450), 50.07 MiB | 33.37 MiB/s Receiving objects: 70% (45815/65450), 50.07 MiB | 33.37 MiB/s Receiving objects: 71% (46470/65450), 50.07 MiB | 33.37 MiB/s Receiving objects: 72% (47124/65450), 50.07 MiB | 33.37 MiB/s Receiving objects: 73% (47779/65450), 50.07 MiB | 33.37 MiB/s Receiving objects: 74% (48433/65450), 50.07 MiB | 33.37 MiB/s Receiving objects: 75% (49088/65450), 50.07 MiB | 33.37 MiB/s Receiving objects: 75% (49216/65450), 67.52 MiB | 33.35 MiB/s Receiving objects: 76% (49742/65450), 67.52 MiB | 33.35 MiB/s Receiving objects: 77% (50397/65450), 67.52 MiB | 33.35 MiB/s Receiving objects: 78% (51051/65450), 67.52 MiB | 33.35 MiB/s Receiving objects: 79% (51706/65450), 67.52 MiB | 33.35 MiB/s Receiving objects: 80% (52360/65450), 67.52 MiB | 33.35 MiB/s Receiving objects: 81% (53015/65450), 67.52 MiB | 33.35 MiB/s Receiving objects: 82% (53669/65450), 67.52 MiB | 33.35 MiB/s Receiving objects: 83% (54324/65450), 67.52 MiB | 33.35 MiB/s Receiving objects: 84% (54978/65450), 67.52 MiB | 33.35 MiB/s Receiving objects: 85% (55633/65450), 67.52 MiB | 33.35 MiB/s Receiving objects: 86% (56287/65450), 67.52 MiB | 33.35 MiB/s Receiving objects: 87% (56942/65450), 67.52 MiB | 33.35 MiB/s Receiving objects: 88% (57596/65450), 67.52 MiB | 33.35 MiB/s Receiving objects: 89% (58251/65450), 67.52 MiB | 33.35 MiB/s Receiving objects: 90% (58905/65450), 67.52 MiB | 33.35 MiB/s Receiving objects: 91% (59560/65450), 67.52 MiB | 33.35 MiB/s Receiving objects: 92% (60214/65450), 67.52 MiB | 33.35 MiB/s Receiving objects: 93% (60869/65450), 67.52 MiB | 33.35 MiB/s Receiving objects: 94% (61523/65450), 84.36 MiB | 33.41 MiB/s Receiving objects: 95% (62178/65450), 84.36 MiB | 33.41 MiB/s Receiving objects: 96% (62832/65450), 84.36 MiB | 33.41 MiB/s Receiving objects: 97% (63487/65450), 84.36 MiB | 33.41 MiB/s Receiving objects: 98% (64141/65450), 84.36 MiB | 33.41 MiB/s Receiving objects: 99% (64796/65450), 84.36 MiB | 33.41 MiB/s remote: Total 65450 (delta 6945), reused 6547 (delta 6369), pack-reused 57328 (from 1)
  7. 5.14 s Receiving objects: 100% (65450/65450), 84.36 MiB | 33.41 MiB/s Receiving objects: 100% (65450/65450), 88.68 MiB | 33.35 MiB/s, done.
  8. 6.67 s Resolving deltas: 0% (0/46042) Resolving deltas: 1% (461/46042) Resolving deltas: 2% (921/46042) Resolving deltas: 3% (1382/46042) Resolving deltas: 4% (1842/46042) Resolving deltas: 5% (2303/46042) Resolving deltas: 6% (2763/46042) Resolving deltas: 7% (3223/46042) Resolving deltas: 8% (3684/46042) Resolving deltas: 9% (4144/46042) Resolving deltas: 10% (4605/46042) Resolving deltas: 11% (5065/46042) Resolving deltas: 12% (5526/46042) Resolving deltas: 13% (5986/46042) Resolving deltas: 14% (6446/46042) Resolving deltas: 15% (6907/46042) Resolving deltas: 16% (7368/46042) Resolving deltas: 17% (7828/46042) Resolving deltas: 18% (8288/46042) Resolving deltas: 19% (8748/46042) Resolving deltas: 20% (9210/46042) Resolving deltas: 21% (9669/46042) Resolving deltas: 22% (10130/46042) Resolving deltas: 23% (10590/46042) Resolving deltas: 24% (11051/46042) Resolving deltas: 25% (11511/46042) Resolving deltas: 26% (11971/46042) Resolving deltas: 27% (12432/46042) Resolving deltas: 28% (12893/46042) Resolving deltas: 29% (13353/46042) Resolving deltas: 30% (13813/46042) Resolving deltas: 31% (14275/46042) Resolving deltas: 32% (14734/46042) Resolving deltas: 33% (15194/46042) Resolving deltas: 34% (15655/46042) Resolving deltas: 35% (16115/46042) Resolving deltas: 36% (16576/46042) Resolving deltas: 37% (17036/46042) Resolving deltas: 38% (17496/46042) Resolving deltas: 39% (17957/46042) Resolving deltas: 40% (18417/46042) Resolving deltas: 41% (18878/46042) Resolving deltas: 42% (19339/46042) Resolving deltas: 43% (19799/46042) Resolving deltas: 44% (20259/46042) Resolving deltas: 45% (20719/46042) Resolving deltas: 46% (21180/46042) Resolving deltas: 47% (21640/46042) Resolving deltas: 48% (22101/46042) Resolving deltas: 49% (22561/46042) Resolving deltas: 50% (23021/46042) Resolving deltas: 51% (23482/46042) Resolving deltas: 52% (23942/46042) Resolving deltas: 53% (24403/46042) Resolving deltas: 54% (24863/46042) Resolving deltas: 55% (25324/46042) Resolving deltas: 56% (25784/46042) Resolving deltas: 57% (26244/46042) Resolving deltas: 58% (26705/46042) Resolving deltas: 59% (27165/46042) Resolving deltas: 60% (27626/46042) Resolving deltas: 61% (28086/46042) Resolving deltas: 62% (28547/46042) Resolving deltas: 63% (29007/46042) Resolving deltas: 64% (29467/46042) Resolving deltas: 65% (29928/46042) Resolving deltas: 66% (30388/46042) Resolving deltas: 67% (30849/46042) Resolving deltas: 68% (31309/46042) Resolving deltas: 69% (31769/46042) Resolving deltas: 70% (32230/46042) Resolving deltas: 71% (32690/46042) Resolving deltas: 71% (33077/46042) Resolving deltas: 72% (33151/46042) Resolving deltas: 73% (33611/46042) Resolving deltas: 74% (34072/46042) Resolving deltas: 75% (34532/46042) Resolving deltas: 76% (34992/46042) Resolving deltas: 77% (35453/46042) Resolving deltas: 78% (35913/46042) Resolving deltas: 79% (36375/46042) Resolving deltas: 80% (36834/46042) Resolving deltas: 81% (37295/46042) Resolving deltas: 82% (37755/46042) Resolving deltas: 83% (38215/46042) Resolving deltas: 84% (38676/46042) Resolving deltas: 85% (39136/46042) Resolving deltas: 86% (39597/46042) Resolving deltas: 87% (40057/46042) Resolving deltas: 88% (40517/46042) Resolving deltas: 89% (40978/46042) Resolving deltas: 90% (41438/46042) Resolving deltas: 91% (41899/46042) Resolving deltas: 92% (42359/46042) Resolving deltas: 93% (42820/46042) Resolving deltas: 94% (43280/46042) Resolving deltas: 95% (43740/46042) Resolving deltas: 96% (44201/46042) Resolving deltas: 97% (44661/46042) Resolving deltas: 98% (45122/46042) Resolving deltas: 99% (45582/46042) Resolving deltas: 100% (46042/46042) Resolving deltas: 100% (46042/46042), done.
  9. 7.10 s Fetching commit de1fcd35ce25218ec941344369f9e542139a673d for finite_T_and_mu ...
  10. 7.10 s $ /nix/store/bcnisk3ydfgv26v2gw3zlky24g00yww2-git-2.54.0/bin/git fetch origin de1fcd35ce25218ec941344369f9e542139a673d
  11. 7.63 s From https://github.com/alphal00p/gammaloop
  12. 7.63 s * branch de1fcd35ce25218ec941344369f9e542139a673d -> FETCH_HEAD
  13. 7.65 s $ /nix/store/9ypz3flqsrl5xl495mm8h645gadjsxi1-coreutils-9.11/bin/timeout --kill-after=15s 7200s /nix/store/bcnisk3ydfgv26v2gw3zlky24g00yww2-git-2.54.0/bin/git -c advice.detachedHead=false checkout de1fcd35ce25218ec941344369f9e542139a673d
  14. 7.86 s HEAD is now at de1fcd35 fix integrated counterterm orientation localization
  15. 7.87 s $ /nix/store/9ypz3flqsrl5xl495mm8h645gadjsxi1-coreutils-9.11/bin/timeout --kill-after=15s 7200s /nix/store/23zk8sgzamrbmj1fday15szf7f2279s8-nix-2.34.7/bin/nix --extra-experimental-features nix-command --extra-experimental-features flakes --log-format internal-json run .#packages.x86_64-linux.nix-ci-check-gammaloop-nextest-python-api --print-build-logs
  16. 8.27 s error (ignored): SQLite database '/var/cache/nix-ci-worker/eval-cache-v6/236836d192e3189eaf5ff1d2159b989a5433dded7d996aca53c52fa23761689f.sqlite' is busy
  17. 16.15 s
  18. 25.80 s evaluating derivation 'g copying '/nix/store/jlx6 evaluating derivation 'g copying '/nix/store/jlx6 evaluating derivation 'g copying '/nix/store/jlx6 evaluating derivation 'g copying '/nix/store/jlx6 evaluating derivation 'g copying '/nix/store/jlx6 evaluating derivation 'g copying '/nix/store/jlx6 evaluating derivation 'g copying '/nix/store/jlx6 evaluating derivation 'g copying '/nix/store/jlx6 evaluating derivation 'g copying '/nix/store/jlx6 evaluating derivation 'g copying '/nix/store/jlx6 evaluating derivation 'g copying '/nix/store/jlx6 evaluating derivation 'g copying '/nix/store/jlx6 evaluating derivation 'g copying '/nix/store/jlx6 evaluating derivation 'g copying '/nix/store/jlx6 evaluating derivation 'g copying '/nix/store/jlx6 evaluating derivation 'g copying '/nix/store/jlx6 evaluating derivation 'g copying '/nix/store/jlx6 evaluating derivation 'g querying gammaloop-nexte [0/1 built, 0.0 KiB DL] [1/0/1 built, 0.0 KiB DLgammaloop-nextest-python-api> Extracting 1 binary, 1 build script output directory, and 3 linked paths to /build/nextest-archive-vvGvrM
  19. 25.89 s gammaloop-nextest-python-api> Extracted 18 files to /build/nextest-archive-vvGvrM in 0.09s
  20. 25.90 s gammaloop-nextest-python-api> ------------
  21. 25.90 s gammaloop-nextest-python-api> Nextest run ID 361f0336-5d5f-4d81-89fd-6e44a3c0536f with nextest profile: ci_gammaloop
  22. 25.90 s gammaloop-nextest-python-api> Starting 5 tests across 1 binary
  23. 26.25 s gammaloop-nextest-python-api> FAIL [ 0.344s] (1/5) gammaloop-integration-tests::test_python_api python_evaluate_sample_honors_generate_events_and_observable_snapshots
  24. 26.25 s gammaloop-nextest-python-api> stdout ---
  25. 26.25 s gammaloop-nextest-python-api>
  26. 26.25 s gammaloop-nextest-python-api> running 1 test
  27. 26.25 s gammaloop-nextest-python-api> test python_evaluate_sample_honors_generate_events_and_observable_snapshots ... FAILED
  28. 26.25 s gammaloop-nextest-python-api>
  29. 26.25 s gammaloop-nextest-python-api> failures:
  30. 26.25 s gammaloop-nextest-python-api>
  31. 26.25 s gammaloop-nextest-python-api> failures:
  32. 26.25 s gammaloop-nextest-python-api> python_evaluate_sample_honors_generate_events_and_observable_snapshots
  33. 26.25 s gammaloop-nextest-python-api>
  34. 26.25 s gammaloop-nextest-python-api> test result: FAILED. 0 passed; 1 failed; 0 ignored; 0 measured; 4 filtered out; finished in 0.33s
  35. 26.25 s gammaloop-nextest-python-api>
  36. 26.25 s gammaloop-nextest-python-api> stderr ---
  37. 26.25 s gammaloop-nextest-python-api> Error: Python API test subprocess failed.
  38. 26.25 s gammaloop-nextest-python-api> stdout:
  39. 26.25 s gammaloop-nextest-python-api> ┌────────────────────────────────────────────────────────┐
  40. 26.25 s gammaloop-nextest-python-api> │ You are running a restricted Symbolica instance. │
  41. 26.25 s gammaloop-nextest-python-api> │ │
  42. 26.25 s gammaloop-nextest-python-api> │ This mode is only permitted for non-commercial use and │
  43. 26.25 s gammaloop-nextest-python-api> │ is limited to one instance and core per machine. │
  44. 26.25 s gammaloop-nextest-python-api> │ │
  45. 26.25 s gammaloop-nextest-python-api> │ Hobbyists can easily acquire a free license key │
  46. 26.25 s gammaloop-nextest-python-api> │ that unlocks all cores and removes this banner: │
  47. 26.25 s gammaloop-nextest-python-api> │ │
  48. 26.25 s gammaloop-nextest-python-api> │ from symbolica import * │
  49. 26.25 s gammaloop-nextest-python-api> │ request_hobbyist_license('YOUR_NAME', 'YOUR_EMAIL') │
  50. 26.25 s gammaloop-nextest-python-api> │ │
  51. 26.25 s gammaloop-nextest-python-api> │ All other users can obtain a free 30-day trial key: │
  52. 26.25 s gammaloop-nextest-python-api> │ │
  53. 26.25 s gammaloop-nextest-python-api> │ from symbolica import * │
  54. 26.25 s gammaloop-nextest-python-api> │ request_trial_license('NAME', 'EMAIL', 'EMPLOYER') │
  55. 26.25 s gammaloop-nextest-python-api> │ │
  56. 26.25 s gammaloop-nextest-python-api> │ See https://symbolica.io/docs/get_started.html#license │
  57. 26.25 s gammaloop-nextest-python-api> └────────────────────────────────────────────────────────┘
  58. 26.25 s gammaloop-nextest-python-api> ┌───────────────────────────────────────────────────────────────────────────────────────────────────────────┐
  59. 26.25 s gammaloop-nextest-python-api> │ Cannot start new unlicensed Symbolica instance since there is already another one running on the machine. │
  60. 26.25 s gammaloop-nextest-python-api> └───────────────────────────────────────────────────────────────────────────────────────────────────────────┘
  61. 26.25 s gammaloop-nextest-python-api>
  62. 26.25 s gammaloop-nextest-python-api> stderr:
  63. 26.25 s gammaloop-nextest-python-api> ┌───────────────────────────────────┐
  64. 26.25 s gammaloop-nextest-python-api> │ The Symbolica license has expired │
  65. 26.25 s gammaloop-nextest-python-api> └───────────────────────────────────┘
  66. 26.25 s gammaloop-nextest-python-api>
  67. 26.25 s gammaloop-nextest-python-api>
  68. 26.25 s gammaloop-nextest-python-api> Location:
  69. 26.25 s gammaloop-nextest-python-api> tests/tests/test_python_api.rs:156:20
  70. 26.25 s gammaloop-nextest-python-api>
  71. 26.26 s gammaloop-nextest-python-api> FAIL [ 0.357s] (2/5) gammaloop-integration-tests::test_python_api python_evaluate_sample_preserves_graph_grouping_and_incoming_pdgs
  72. 26.26 s gammaloop-nextest-python-api> stdout ---
  73. 26.26 s gammaloop-nextest-python-api>
  74. 26.26 s gammaloop-nextest-python-api> running 1 test
  75. 26.26 s gammaloop-nextest-python-api> test python_evaluate_sample_preserves_graph_grouping_and_incoming_pdgs ... FAILED
  76. 26.26 s gammaloop-nextest-python-api>
  77. 26.26 s gammaloop-nextest-python-api> failures:
  78. 26.26 s gammaloop-nextest-python-api>
  79. 26.26 s gammaloop-nextest-python-api> failures:
  80. 26.26 s gammaloop-nextest-python-api> python_evaluate_sample_preserves_graph_grouping_and_incoming_pdgs
  81. 26.26 s gammaloop-nextest-python-api>
  82. 26.26 s gammaloop-nextest-python-api> test result: FAILED. 0 passed; 1 failed; 0 ignored; 0 measured; 4 filtered out; finished in 0.34s
  83. 26.26 s gammaloop-nextest-python-api>
  84. 26.26 s gammaloop-nextest-python-api> stderr ---
  85. 26.26 s gammaloop-nextest-python-api> Error: Python API test subprocess failed.
  86. 26.26 s gammaloop-nextest-python-api> stdout:
  87. 26.26 s gammaloop-nextest-python-api> ┌────────────────────────────────────────────────────────┐
  88. 26.26 s gammaloop-nextest-python-api> │ You are running a restricted Symbolica instance. │
  89. 26.26 s gammaloop-nextest-python-api> │ │
  90. 26.26 s gammaloop-nextest-python-api> │ This mode is only permitted for non-commercial use and │
  91. 26.26 s gammaloop-nextest-python-api> │ is limited to one instance and core per machine. │
  92. 26.26 s gammaloop-nextest-python-api> │ │
  93. 26.26 s gammaloop-nextest-python-api> │ Hobbyists can easily acquire a free license key │
  94. 26.26 s gammaloop-nextest-python-api> │ that unlocks all cores and removes this banner: │
  95. 26.26 s gammaloop-nextest-python-api> │ │
  96. 26.26 s gammaloop-nextest-python-api> │ from symbolica import * │
  97. 26.26 s gammaloop-nextest-python-api> │ request_hobbyist_license('YOUR_NAME', 'YOUR_EMAIL') │
  98. 26.26 s gammaloop-nextest-python-api> │ │
  99. 26.26 s gammaloop-nextest-python-api> │ All other users can obtain a free 30-day trial key: │
  100. 26.26 s gammaloop-nextest-python-api> │ │
  101. 26.26 s gammaloop-nextest-python-api> │ from symbolica import * │
  102. 26.26 s gammaloop-nextest-python-api> │ request_trial_license('NAME', 'EMAIL', 'EMPLOYER') │
  103. 26.26 s gammaloop-nextest-python-api> │ │
  104. 26.26 s gammaloop-nextest-python-api> │ See https://symbolica.io/docs/get_started.html#license │
  105. 26.26 s gammaloop-nextest-python-api> └────────────────────────────────────────────────────────┘
  106. 26.26 s gammaloop-nextest-python-api> ┌───────────────────────────────────────────────────────────────────────────────────────────────────────────┐
  107. 26.26 s gammaloop-nextest-python-api> │ Cannot start new unlicensed Symbolica instance since there is already another one running on the machine. │
  108. 26.26 s gammaloop-nextest-python-api> └───────────────────────────────────────────────────────────────────────────────────────────────────────────┘
  109. 26.26 s gammaloop-nextest-python-api>
  110. 26.26 s gammaloop-nextest-python-api> stderr:
  111. 26.26 s gammaloop-nextest-python-api> ┌───────────────────────────────────┐
  112. 26.26 s gammaloop-nextest-python-api> │ The Symbolica license has expired │
  113. 26.26 s gammaloop-nextest-python-api> └───────────────────────────────────┘
  114. 26.26 s gammaloop-nextest-python-api>
  115. 26.26 s gammaloop-nextest-python-api>
  116. 26.26 s gammaloop-nextest-python-api> Location:
  117. 26.26 s gammaloop-nextest-python-api> tests/tests/test_python_api.rs:156:20
  118. 26.26 s gammaloop-nextest-python-api>
  119. 26.27 s gammaloop-nextest-python-api> FAIL [ 0.361s] (3/5) gammaloop-integration-tests::test_python_api python_session_getters_return_live_toml_and_command_blocks
  120. 26.27 s gammaloop-nextest-python-api> stdout ---
  121. 26.27 s gammaloop-nextest-python-api>
  122. 26.27 s gammaloop-nextest-python-api> running 1 test
  123. 26.27 s gammaloop-nextest-python-api> test python_session_getters_return_live_toml_and_command_blocks ... FAILED
  124. 26.27 s gammaloop-nextest-python-api>
  125. 26.27 s gammaloop-nextest-python-api> failures:
  126. 26.27 s gammaloop-nextest-python-api>
  127. 26.27 s gammaloop-nextest-python-api> failures:
  128. 26.27 s gammaloop-nextest-python-api> python_session_getters_return_live_toml_and_command_blocks
  129. 26.27 s gammaloop-nextest-python-api>
  130. 26.27 s gammaloop-nextest-python-api> test result: FAILED. 0 passed; 1 failed; 0 ignored; 0 measured; 4 filtered out; finished in 0.35s
  131. 26.27 s gammaloop-nextest-python-api>
  132. 26.27 s gammaloop-nextest-python-api> stderr ---
  133. 26.27 s gammaloop-nextest-python-api> Error: Python API test subprocess failed.
  134. 26.27 s gammaloop-nextest-python-api> stdout:
  135. 26.27 s gammaloop-nextest-python-api> ┌────────────────────────────────────────────────────────┐
  136. 26.27 s gammaloop-nextest-python-api> │ You are running a restricted Symbolica instance. │
  137. 26.27 s gammaloop-nextest-python-api> │ │
  138. 26.27 s gammaloop-nextest-python-api> │ This mode is only permitted for non-commercial use and │
  139. 26.27 s gammaloop-nextest-python-api> │ is limited to one instance and core per machine. │
  140. 26.27 s gammaloop-nextest-python-api> │ │
  141. 26.27 s gammaloop-nextest-python-api> │ Hobbyists can easily acquire a free license key │
  142. 26.27 s gammaloop-nextest-python-api> │ that unlocks all cores and removes this banner: │
  143. 26.27 s gammaloop-nextest-python-api> │ │
  144. 26.27 s gammaloop-nextest-python-api> │ from symbolica import * │
  145. 26.27 s gammaloop-nextest-python-api> │ request_hobbyist_license('YOUR_NAME', 'YOUR_EMAIL') │
  146. 26.27 s gammaloop-nextest-python-api> │ │
  147. 26.27 s gammaloop-nextest-python-api> │ All other users can obtain a free 30-day trial key: │
  148. 26.27 s gammaloop-nextest-python-api> │ │
  149. 26.27 s gammaloop-nextest-python-api> │ from symbolica import * │
  150. 26.27 s gammaloop-nextest-python-api> │ request_trial_license('NAME', 'EMAIL', 'EMPLOYER') │
  151. 26.27 s gammaloop-nextest-python-api> │ │
  152. 26.27 s gammaloop-nextest-python-api> │ See https://symbolica.io/docs/get_started.html#license │
  153. 26.27 s gammaloop-nextest-python-api> └────────────────────────────────────────────────────────┘
  154. 26.27 s gammaloop-nextest-python-api> ┌───────────────────────────────────────────────────────────────────────────────────────────────────────────┐
  155. 26.27 s gammaloop-nextest-python-api> │ Cannot start new unlicensed Symbolica instance since there is already another one running on the machine. │
  156. 26.27 s gammaloop-nextest-python-api> └───────────────────────────────────────────────────────────────────────────────────────────────────────────┘
  157. 26.27 s gammaloop-nextest-python-api>
  158. 26.27 s gammaloop-nextest-python-api> stderr:
  159. 26.27 s gammaloop-nextest-python-api> ┌───────────────────────────────────┐
  160. 26.27 s gammaloop-nextest-python-api> │ The Symbolica license has expired │
  161. 26.27 s gammaloop-nextest-python-api> └───────────────────────────────────┘
  162. 26.27 s gammaloop-nextest-python-api>
  163. 26.27 s gammaloop-nextest-python-api>
  164. 26.27 s gammaloop-nextest-python-api> Location:
  165. 26.27 s gammaloop-nextest-python-api> tests/tests/test_python_api.rs:156:20
  166. 26.27 s gammaloop-nextest-python-api>
  167. 26.32 s gammaloop-nextest-python-api> FAIL [ 0.417s] (4/5) gammaloop-integration-tests::test_python_api python_evaluate_samples_batch_and_momentum_space_have_expected_shape
  168. 26.32 s gammaloop-nextest-python-api> stdout ---
  169. 26.32 s gammaloop-nextest-python-api>
  170. 26.32 s gammaloop-nextest-python-api> running 1 test
  171. 26.32 s gammaloop-nextest-python-api> test python_evaluate_samples_batch_and_momentum_space_have_expected_shape ... FAILED
  172. 26.32 s gammaloop-nextest-python-api>
  173. 26.32 s gammaloop-nextest-python-api> failures:
  174. 26.32 s gammaloop-nextest-python-api>
  175. 26.32 s gammaloop-nextest-python-api> failures:
  176. 26.32 s gammaloop-nextest-python-api> python_evaluate_samples_batch_and_momentum_space_have_expected_shape
  177. 26.32 s gammaloop-nextest-python-api>
  178. 26.32 s gammaloop-nextest-python-api> test result: FAILED. 0 passed; 1 failed; 0 ignored; 0 measured; 4 filtered out; finished in 0.41s
  179. 26.32 s gammaloop-nextest-python-api>
  180. 26.32 s gammaloop-nextest-python-api> stderr ---
  181. 26.32 s gammaloop-nextest-python-api> Error: Python API test subprocess failed.
  182. 26.32 s gammaloop-nextest-python-api> stdout:
  183. 26.32 s gammaloop-nextest-python-api> ┌────────────────────────────────────────────────────────┐
  184. 26.32 s gammaloop-nextest-python-api> │ You are running a restricted Symbolica instance. │
  185. 26.32 s gammaloop-nextest-python-api> │ │
  186. 26.32 s gammaloop-nextest-python-api> │ This mode is only permitted for non-commercial use and │
  187. 26.32 s gammaloop-nextest-python-api> │ is limited to one instance and core per machine. │
  188. 26.32 s gammaloop-nextest-python-api> │ │
  189. 26.32 s gammaloop-nextest-python-api> │ Hobbyists can easily acquire a free license key │
  190. 26.32 s gammaloop-nextest-python-api> │ that unlocks all cores and removes this banner: │
  191. 26.32 s gammaloop-nextest-python-api> │ │
  192. 26.32 s gammaloop-nextest-python-api> │ from symbolica import * │
  193. 26.32 s gammaloop-nextest-python-api> │ request_hobbyist_license('YOUR_NAME', 'YOUR_EMAIL') │
  194. 26.32 s gammaloop-nextest-python-api> │ │
  195. 26.32 s gammaloop-nextest-python-api> │ All other users can obtain a free 30-day trial key: │
  196. 26.32 s gammaloop-nextest-python-api> │ │
  197. 26.32 s gammaloop-nextest-python-api> │ from symbolica import * │
  198. 26.32 s gammaloop-nextest-python-api> │ request_trial_license('NAME', 'EMAIL', 'EMPLOYER') │
  199. 26.32 s gammaloop-nextest-python-api> │ │
  200. 26.32 s gammaloop-nextest-python-api> │ See https://symbolica.io/docs/get_started.html#license │
  201. 26.32 s gammaloop-nextest-python-api> └────────────────────────────────────────────────────────┘
  202. 26.32 s gammaloop-nextest-python-api> ┌───────────────────────────────────────────────────────────────────────────────────────────────────────────┐
  203. 26.32 s gammaloop-nextest-python-api> │ Cannot start new unlicensed Symbolica instance since there is already another one running on the machine. │
  204. 26.32 s gammaloop-nextest-python-api> └───────────────────────────────────────────────────────────────────────────────────────────────────────────┘
  205. 26.32 s gammaloop-nextest-python-api>
  206. 26.32 s gammaloop-nextest-python-api> stderr:
  207. 26.32 s gammaloop-nextest-python-api> ┌───────────────────────────────────┐
  208. 26.32 s gammaloop-nextest-python-api> │ The Symbolica license has expired │
  209. 26.32 s gammaloop-nextest-python-api> └───────────────────────────────────┘
  210. 26.32 s gammaloop-nextest-python-api> [2026-09-01 10:05:15.283] @gammaloop_api::se... INFO : Running command import model sm-default
  211. 26.32 s gammaloop-nextest-python-api> [2026-09-01 10:05:15.285] @import::model INFO : Loading built-in JSON model sm-default
  212. 26.32 s gammaloop-nextest-python-api> [2026-09-01 10:05:15.348] @gammalooprs::model INFO : The following 15 external parameters were forced to zero by the restriction card:
  213. 26.32 s gammaloop-nextest-python-api> lamWS, AWS, rhoWS, etaWS, ymc, yme, ymm, MC, Me, MM, WTau, muQ, muLe, muLmu, muLtau
  214. 26.32 s gammaloop-nextest-python-api> [2026-09-01 10:05:15.348] @gammalooprs::model INFO : The following 34 vertex rules were removed by the restriction card:
  215. 26.32 s gammaloop-nextest-python-api> V_82 -> (c~, d, G+) | V_83 -> (t~, d, G+) | V_84 -> (c~, s, G+) | V_85 -> (t~, s, G+) | V_86 -> (u~, b, G+) | V_87 -> (c~, b, G+) | V_90 -> (c~, d, W+) | V_91 -> (t~, d, W+) | V_92 -> (u~, s, W+) | V_94 -> (t~, s, W+) | V_95 -> (u~, b, W+) | V_96 -> (c~, b, W+) | V_101 -> (e+, e-, G0) | V_102 -> (mu+, mu-, G0) | V_104 -> (e+, e-, H) | V_105 -> (mu+, mu-, H) | V_110 -> (ve~, e-, G+) | V_111 -> (vm~, mu-, G+) | V_116 -> (b~, u, G-) | V_117 -> (d~, c, G-) | V_118 -> (s~, c, G-) | V_119 -> (b~, c, G-) | V_120 -> (d~, t, G-) | V_121 -> (s~, t, G-) | V_124 -> (s~, u, W-) | V_125 -> (b~, u, W-) | V_126 -> (d~, c, W-) | V_128 -> (b~, c, W-) | V_129 -> (d~, t, W-) | V_130 -> (s~, t, W-) | V_138 -> (c~, c, G0) | V_140 -> (c~, c, H) | V_145 -> (e+, ve, G-) | V_146 -> (mu+, vm, G-)
  216. 26.33 s gammaloop-nextest-python-api> [2026-09-01 10:05:15.348] @gammalooprs::model INFO : The following 36 couplings were removed by the restriction card:
  217. 26.33 s gammaloop-nextest-python-api> GC_13, GC_14, GC_16, GC_17, GC_18, GC_19, GC_20, GC_22, GC_23, GC_24, GC_25, GC_26, GC_28, GC_29, GC_42, GC_43, GC_44, GC_46, GC_47, GC_48, GC_84, GC_85, GC_86, GC_87, GC_88, GC_89, GC_90, GC_91, GC_92, GC_93, GC_101, GC_102, GC_103, GC_105, GC_106, GC_107
  218. 26.33 s gammaloop-nextest-python-api> [2026-09-01 10:05:15.359] @gammaloop_api::se... INFO : Running command set default-runtime kv kinematics.externals='{"type":"constant","data":{"momenta":[[32.0,0.0,0.0,32.0],[32.0,0.0,0.0,-32.0]],"helicities":[1,1]}}'
  219. 26.33 s gammaloop-nextest-python-api> [2026-09-01 10:05:15.360] @gammaloop_api::se... INFO : Running command set default-runtime kv subtraction.disable_threshold_subtraction=true
  220. 26.33 s gammaloop-nextest-python-api> [2026-09-01 10:05:15.361] @gammaloop_api::se... INFO : Running command generate xs e+ e- > d d~ g | e- a d g QED^2==4 [{{2}} QCD=0] --numerator-grouping group_identical_graphs_up_to_sign --clear-existing-processes --only-diagrams
  221. 26.33 s gammaloop-nextest-python-api> [2026-09-01 10:05:15.380] @feyngen::diagram_... INFO : 0s | Δ=0s | Starting Feynman graph generation with Symbolica...
  222. 26.33 s gammaloop-nextest-python-api> [2026-09-01 10:05:15.386] @feyngen::diagram_... INFO : 0s | Δ=0s | Number of graphs resulting from Symbolica generation: 246
  223. 26.33 s gammaloop-nextest-python-api> [2026-09-01 10:05:15.388] @feyngen::diagram_... INFO : 0s | Δ=0s | Number of graphs retained after enforcing supergraph particle content: 8
  224. 26.33 s gammaloop-nextest-python-api> [2026-09-01 10:05:15.388] @feyngen::diagram_... INFO : 0s | Δ=0s | Number of graphs retained after removal of vetoed topologies: 8
  225. 26.33 s gammaloop-nextest-python-api> [2026-09-01 10:05:15.389] @feyngen::diagram_... INFO : 0s | Δ=0s | Number of graphs after vertex info assignment: 8
  226. 26.33 s gammaloop-nextest-python-api> [2026-09-01 10:05:15.389] @feyngen::diagram_... INFO : 0s | Δ=0s | Number of graphs after all complete graphs filters are applied: 8
  227. 26.33 s gammaloop-nextest-python-api>
  228. 26.33 s gammaloop-nextest-python-api>
  229. 26.33 s gammaloop-nextest-python-api> Location:
  230. 26.33 s gammaloop-nextest-python-api> tests/tests/test_python_api.rs:156:20
  231. 26.33 s gammaloop-nextest-python-api>
  232. 26.35 s gammaloop-nextest-python-api> FAIL [ 0.447s] (5/5) gammaloop-integration-tests::test_python_api python_settings_wrappers_expose_nested_runtime_and_global_settings
  233. 26.35 s gammaloop-nextest-python-api> stdout ---
  234. 26.35 s gammaloop-nextest-python-api>
  235. 26.35 s gammaloop-nextest-python-api> running 1 test
  236. 26.35 s gammaloop-nextest-python-api> test python_settings_wrappers_expose_nested_runtime_and_global_settings ... FAILED
  237. 26.35 s gammaloop-nextest-python-api>
  238. 26.35 s gammaloop-nextest-python-api> failures:
  239. 26.35 s gammaloop-nextest-python-api>
  240. 26.35 s gammaloop-nextest-python-api> failures:
  241. 26.35 s gammaloop-nextest-python-api> python_settings_wrappers_expose_nested_runtime_and_global_settings
  242. 26.35 s gammaloop-nextest-python-api>
  243. 26.35 s gammaloop-nextest-python-api> test result: FAILED. 0 passed; 1 failed; 0 ignored; 0 measured; 4 filtered out; finished in 0.44s
  244. 26.35 s gammaloop-nextest-python-api>
  245. 26.35 s gammaloop-nextest-python-api> stderr ---
  246. 26.35 s gammaloop-nextest-python-api> Error: Python API test subprocess failed.
  247. 26.35 s gammaloop-nextest-python-api> stdout:
  248. 26.35 s gammaloop-nextest-python-api> ┌────────────────────────────────────────────────────────┐
  249. 26.35 s gammaloop-nextest-python-api> │ You are running a restricted Symbolica instance. │
  250. 26.35 s gammaloop-nextest-python-api> │ │
  251. 26.35 s gammaloop-nextest-python-api> │ This mode is only permitted for non-commercial use and │
  252. 26.35 s gammaloop-nextest-python-api> │ is limited to one instance and core per machine. │
  253. 26.35 s gammaloop-nextest-python-api> │ │
  254. 26.35 s gammaloop-nextest-python-api> │ Hobbyists can easily acquire a free license key │
  255. 26.35 s gammaloop-nextest-python-api> │ that unlocks all cores and removes this banner: │
  256. 26.36 s gammaloop-nextest-python-api> │ │
  257. 26.36 s gammaloop-nextest-python-api> │ from symbolica import * │
  258. 26.36 s gammaloop-nextest-python-api> │ request_hobbyist_license('YOUR_NAME', 'YOUR_EMAIL') │
  259. 26.36 s gammaloop-nextest-python-api> │ │
  260. 26.36 s gammaloop-nextest-python-api> │ All other users can obtain a free 30-day trial key: │
  261. 26.36 s gammaloop-nextest-python-api> │ │
  262. 26.36 s gammaloop-nextest-python-api> │ from symbolica import * │
  263. 26.36 s gammaloop-nextest-python-api> │ request_trial_license('NAME', 'EMAIL', 'EMPLOYER') │
  264. 26.36 s gammaloop-nextest-python-api> │ │
  265. 26.36 s gammaloop-nextest-python-api> │ See https://symbolica.io/docs/get_started.html#license │
  266. 26.36 s gammaloop-nextest-python-api> └────────────────────────────────────────────────────────┘
  267. 26.36 s gammaloop-nextest-python-api> ┌───────────────────────────────────────────────────────────────────────────────────────────────────────────┐
  268. 26.36 s gammaloop-nextest-python-api> │ Cannot start new unlicensed Symbolica instance since there is already another one running on the machine. │
  269. 26.36 s gammaloop-nextest-python-api> └───────────────────────────────────────────────────────────────────────────────────────────────────────────┘
  270. 26.36 s gammaloop-nextest-python-api>
  271. 26.36 s gammaloop-nextest-python-api> stderr:
  272. 26.36 s gammaloop-nextest-python-api> ┌───────────────────────────────────┐
  273. 26.36 s gammaloop-nextest-python-api> │ The Symbolica license has expired │
  274. 26.36 s gammaloop-nextest-python-api> └───────────────────────────────────┘
  275. 26.36 s gammaloop-nextest-python-api>
  276. 26.36 s gammaloop-nextest-python-api>
  277. 26.36 s gammaloop-nextest-python-api> Location:
  278. 26.36 s gammaloop-nextest-python-api> tests/tests/test_python_api.rs:156:20
  279. 26.36 s gammaloop-nextest-python-api>
  280. 26.36 s gammaloop-nextest-python-api> ------------
  281. 26.36 s gammaloop-nextest-python-api> Summary [ 0.449s] 5 tests run: 0 passed, 5 failed, 0 skipped
  282. 26.36 s gammaloop-nextest-python-api> FAIL [ 0.344s] (1/5) gammaloop-integration-tests::test_python_api python_evaluate_sample_honors_generate_events_and_observable_snapshots
  283. 26.36 s gammaloop-nextest-python-api> stdout ---
  284. 26.36 s gammaloop-nextest-python-api>
  285. 26.36 s gammaloop-nextest-python-api> running 1 test
  286. 26.36 s gammaloop-nextest-python-api> test python_evaluate_sample_honors_generate_events_and_observable_snapshots ... FAILED
  287. 26.36 s gammaloop-nextest-python-api>
  288. 26.36 s gammaloop-nextest-python-api> failures:
  289. 26.36 s gammaloop-nextest-python-api>
  290. 26.36 s gammaloop-nextest-python-api> failures:
  291. 26.36 s gammaloop-nextest-python-api> python_evaluate_sample_honors_generate_events_and_observable_snapshots
  292. 26.36 s gammaloop-nextest-python-api>
  293. 26.36 s gammaloop-nextest-python-api> test result: FAILED. 0 passed; 1 failed; 0 ignored; 0 measured; 4 filtered out; finished in 0.33s
  294. 26.36 s gammaloop-nextest-python-api>
  295. 26.36 s gammaloop-nextest-python-api> stderr ---
  296. 26.36 s gammaloop-nextest-python-api> Error: Python API test subprocess failed.
  297. 26.36 s gammaloop-nextest-python-api> stdout:
  298. 26.36 s gammaloop-nextest-python-api> ┌────────────────────────────────────────────────────────┐
  299. 26.36 s gammaloop-nextest-python-api> │ You are running a restricted Symbolica instance. │
  300. 26.36 s gammaloop-nextest-python-api> │ │
  301. 26.36 s gammaloop-nextest-python-api> │ This mode is only permitted for non-commercial use and │
  302. 26.36 s gammaloop-nextest-python-api> │ is limited to one instance and core per machine. │
  303. 26.36 s gammaloop-nextest-python-api> │ │
  304. 26.36 s gammaloop-nextest-python-api> │ Hobbyists can easily acquire a free license key │
  305. 26.36 s gammaloop-nextest-python-api> │ that unlocks all cores and removes this banner: │
  306. 26.36 s gammaloop-nextest-python-api> │ │
  307. 26.36 s gammaloop-nextest-python-api> │ from symbolica import * │
  308. 26.36 s gammaloop-nextest-python-api> │ request_hobbyist_license('YOUR_NAME', 'YOUR_EMAIL') │
  309. 26.36 s gammaloop-nextest-python-api> │ │
  310. 26.36 s gammaloop-nextest-python-api> │ All other users can obtain a free 30-day trial key: │
  311. 26.36 s gammaloop-nextest-python-api> │ │
  312. 26.36 s gammaloop-nextest-python-api> │ from symbolica import * │
  313. 26.36 s gammaloop-nextest-python-api> │ request_trial_license('NAME', 'EMAIL', 'EMPLOYER') │
  314. 26.36 s gammaloop-nextest-python-api> │ │
  315. 26.36 s gammaloop-nextest-python-api> │ See https://symbolica.io/docs/get_started.html#license │
  316. 26.36 s gammaloop-nextest-python-api> └────────────────────────────────────────────────────────┘
  317. 26.36 s gammaloop-nextest-python-api> ┌───────────────────────────────────────────────────────────────────────────────────────────────────────────┐
  318. 26.36 s gammaloop-nextest-python-api> │ Cannot start new unlicensed Symbolica instance since there is already another one running on the machine. │
  319. 26.36 s gammaloop-nextest-python-api> └───────────────────────────────────────────────────────────────────────────────────────────────────────────┘
  320. 26.36 s gammaloop-nextest-python-api>
  321. 26.36 s gammaloop-nextest-python-api> stderr:
  322. 26.36 s gammaloop-nextest-python-api> ┌───────────────────────────────────┐
  323. 26.36 s gammaloop-nextest-python-api> │ The Symbolica license has expired │
  324. 26.36 s gammaloop-nextest-python-api> └───────────────────────────────────┘
  325. 26.36 s gammaloop-nextest-python-api>
  326. 26.36 s gammaloop-nextest-python-api>
  327. 26.36 s gammaloop-nextest-python-api> Location:
  328. 26.36 s gammaloop-nextest-python-api> tests/tests/test_python_api.rs:156:20
  329. 26.36 s gammaloop-nextest-python-api>
  330. 26.36 s gammaloop-nextest-python-api> FAIL [ 0.357s] (2/5) gammaloop-integration-tests::test_python_api python_evaluate_sample_preserves_graph_grouping_and_incoming_pdgs
  331. 26.36 s gammaloop-nextest-python-api> stdout ---
  332. 26.36 s gammaloop-nextest-python-api>
  333. 26.36 s gammaloop-nextest-python-api> running 1 test
  334. 26.36 s gammaloop-nextest-python-api> test python_evaluate_sample_preserves_graph_grouping_and_incoming_pdgs ... FAILED
  335. 26.36 s gammaloop-nextest-python-api>
  336. 26.36 s gammaloop-nextest-python-api> failures:
  337. 26.36 s gammaloop-nextest-python-api>
  338. 26.36 s gammaloop-nextest-python-api> failures:
  339. 26.36 s gammaloop-nextest-python-api> python_evaluate_sample_preserves_graph_grouping_and_incoming_pdgs
  340. 26.36 s gammaloop-nextest-python-api>
  341. 26.36 s gammaloop-nextest-python-api> test result: FAILED. 0 passed; 1 failed; 0 ignored; 0 measured; 4 filtered out; finished in 0.34s
  342. 26.36 s gammaloop-nextest-python-api>
  343. 26.36 s gammaloop-nextest-python-api> stderr ---
  344. 26.36 s gammaloop-nextest-python-api> Error: Python API test subprocess failed.
  345. 26.36 s gammaloop-nextest-python-api> stdout:
  346. 26.36 s gammaloop-nextest-python-api> ┌────────────────────────────────────────────────────────┐
  347. 26.36 s gammaloop-nextest-python-api> │ You are running a restricted Symbolica instance. │
  348. 26.36 s gammaloop-nextest-python-api> │ │
  349. 26.36 s gammaloop-nextest-python-api> │ This mode is only permitted for non-commercial use and │
  350. 26.36 s gammaloop-nextest-python-api> │ is limited to one instance and core per machine. │
  351. 26.36 s gammaloop-nextest-python-api> │ │
  352. 26.36 s gammaloop-nextest-python-api> │ Hobbyists can easily acquire a free license key │
  353. 26.36 s gammaloop-nextest-python-api> │ that unlocks all cores and removes this banner: │
  354. 26.36 s gammaloop-nextest-python-api> │ │
  355. 26.36 s gammaloop-nextest-python-api> │ from symbolica import * │
  356. 26.36 s gammaloop-nextest-python-api> │ request_hobbyist_license('YOUR_NAME', 'YOUR_EMAIL') │
  357. 26.36 s gammaloop-nextest-python-api> │ │
  358. 26.36 s gammaloop-nextest-python-api> │ All other users can obtain a free 30-day trial key: │
  359. 26.36 s gammaloop-nextest-python-api> │ │
  360. 26.36 s gammaloop-nextest-python-api> │ from symbolica import * │
  361. 26.36 s gammaloop-nextest-python-api> │ request_trial_license('NAME', 'EMAIL', 'EMPLOYER') │
  362. 26.36 s gammaloop-nextest-python-api> │ │
  363. 26.36 s gammaloop-nextest-python-api> │ See https://symbolica.io/docs/get_started.html#license │
  364. 26.36 s gammaloop-nextest-python-api> └────────────────────────────────────────────────────────┘
  365. 26.36 s gammaloop-nextest-python-api> ┌───────────────────────────────────────────────────────────────────────────────────────────────────────────┐
  366. 26.36 s gammaloop-nextest-python-api> │ Cannot start new unlicensed Symbolica instance since there is already another one running on the machine. │
  367. 26.36 s gammaloop-nextest-python-api> └───────────────────────────────────────────────────────────────────────────────────────────────────────────┘
  368. 26.36 s gammaloop-nextest-python-api>
  369. 26.36 s gammaloop-nextest-python-api> stderr:
  370. 26.36 s gammaloop-nextest-python-api> ┌───────────────────────────────────┐
  371. 26.36 s gammaloop-nextest-python-api> │ The Symbolica license has expired │
  372. 26.36 s gammaloop-nextest-python-api> └───────────────────────────────────┘
  373. 26.36 s gammaloop-nextest-python-api>
  374. 26.36 s gammaloop-nextest-python-api>
  375. 26.36 s gammaloop-nextest-python-api> Location:
  376. 26.36 s gammaloop-nextest-python-api> tests/tests/test_python_api.rs:156:20
  377. 26.36 s gammaloop-nextest-python-api>
  378. 26.36 s gammaloop-nextest-python-api> FAIL [ 0.361s] (3/5) gammaloop-integration-tests::test_python_api python_session_getters_return_live_toml_and_command_blocks
  379. 26.36 s gammaloop-nextest-python-api> stdout ---
  380. 26.36 s gammaloop-nextest-python-api>
  381. 26.36 s gammaloop-nextest-python-api> running 1 test
  382. 26.36 s gammaloop-nextest-python-api> test python_session_getters_return_live_toml_and_command_blocks ... FAILED
  383. 26.36 s gammaloop-nextest-python-api>
  384. 26.36 s gammaloop-nextest-python-api> failures:
  385. 26.36 s gammaloop-nextest-python-api>
  386. 26.36 s gammaloop-nextest-python-api> failures:
  387. 26.36 s gammaloop-nextest-python-api> python_session_getters_return_live_toml_and_command_blocks
  388. 26.36 s gammaloop-nextest-python-api>
  389. 26.36 s gammaloop-nextest-python-api> test result: FAILED. 0 passed; 1 failed; 0 ignored; 0 measured; 4 filtered out; finished in 0.35s
  390. 26.36 s gammaloop-nextest-python-api>
  391. 26.36 s gammaloop-nextest-python-api> stderr ---
  392. 26.36 s gammaloop-nextest-python-api> Error: Python API test subprocess failed.
  393. 26.36 s gammaloop-nextest-python-api> stdout:
  394. 26.36 s gammaloop-nextest-python-api> ┌────────────────────────────────────────────────────────┐
  395. 26.36 s gammaloop-nextest-python-api> │ You are running a restricted Symbolica instance. │
  396. 26.36 s gammaloop-nextest-python-api> │ │
  397. 26.36 s gammaloop-nextest-python-api> │ This mode is only permitted for non-commercial use and │
  398. 26.36 s gammaloop-nextest-python-api> │ is limited to one instance and core per machine. │
  399. 26.36 s gammaloop-nextest-python-api> │ │
  400. 26.36 s gammaloop-nextest-python-api> │ Hobbyists can easily acquire a free license key │
  401. 26.36 s gammaloop-nextest-python-api> │ that unlocks all cores and removes this banner: │
  402. 26.36 s gammaloop-nextest-python-api> │ │
  403. 26.36 s gammaloop-nextest-python-api> │ from symbolica import * │
  404. 26.36 s gammaloop-nextest-python-api> │ request_hobbyist_license('YOUR_NAME', 'YOUR_EMAIL') │
  405. 26.36 s gammaloop-nextest-python-api> │ │
  406. 26.36 s gammaloop-nextest-python-api> │ All other users can obtain a free 30-day trial key: │
  407. 26.36 s gammaloop-nextest-python-api> │ │
  408. 26.36 s gammaloop-nextest-python-api> │ from symbolica import * │
  409. 26.36 s gammaloop-nextest-python-api> │ request_trial_license('NAME', 'EMAIL', 'EMPLOYER') │
  410. 26.36 s gammaloop-nextest-python-api> │ │
  411. 26.36 s gammaloop-nextest-python-api> │ See https://symbolica.io/docs/get_started.html#license │
  412. 26.36 s gammaloop-nextest-python-api> └────────────────────────────────────────────────────────┘
  413. 26.36 s gammaloop-nextest-python-api> ┌───────────────────────────────────────────────────────────────────────────────────────────────────────────┐
  414. 26.36 s gammaloop-nextest-python-api> │ Cannot start new unlicensed Symbolica instance since there is already another one running on the machine. │
  415. 26.36 s gammaloop-nextest-python-api> └───────────────────────────────────────────────────────────────────────────────────────────────────────────┘
  416. 26.36 s gammaloop-nextest-python-api>
  417. 26.36 s gammaloop-nextest-python-api> stderr:
  418. 26.36 s gammaloop-nextest-python-api> ┌───────────────────────────────────┐
  419. 26.36 s gammaloop-nextest-python-api> │ The Symbolica license has expired │
  420. 26.36 s gammaloop-nextest-python-api> └───────────────────────────────────┘
  421. 26.36 s gammaloop-nextest-python-api>
  422. 26.36 s gammaloop-nextest-python-api>
  423. 26.36 s gammaloop-nextest-python-api> Location:
  424. 26.36 s gammaloop-nextest-python-api> tests/tests/test_python_api.rs:156:20
  425. 26.36 s gammaloop-nextest-python-api>
  426. 26.36 s gammaloop-nextest-python-api> FAIL [ 0.417s] (4/5) gammaloop-integration-tests::test_python_api python_evaluate_samples_batch_and_momentum_space_have_expected_shape
  427. 26.36 s gammaloop-nextest-python-api> stdout ---
  428. 26.36 s gammaloop-nextest-python-api>
  429. 26.36 s gammaloop-nextest-python-api> running 1 test
  430. 26.36 s gammaloop-nextest-python-api> test python_evaluate_samples_batch_and_momentum_space_have_expected_shape ... FAILED
  431. 26.36 s gammaloop-nextest-python-api>
  432. 26.36 s gammaloop-nextest-python-api> failures:
  433. 26.36 s gammaloop-nextest-python-api>
  434. 26.36 s gammaloop-nextest-python-api> failures:
  435. 26.36 s gammaloop-nextest-python-api> python_evaluate_samples_batch_and_momentum_space_have_expected_shape
  436. 26.36 s gammaloop-nextest-python-api>
  437. 26.36 s gammaloop-nextest-python-api> test result: FAILED. 0 passed; 1 failed; 0 ignored; 0 measured; 4 filtered out; finished in 0.41s
  438. 26.36 s gammaloop-nextest-python-api>
  439. 26.36 s gammaloop-nextest-python-api> stderr ---
  440. 26.36 s gammaloop-nextest-python-api> Error: Python API test subprocess failed.
  441. 26.36 s gammaloop-nextest-python-api> stdout:
  442. 26.36 s gammaloop-nextest-python-api> ┌────────────────────────────────────────────────────────┐
  443. 26.36 s gammaloop-nextest-python-api> │ You are running a restricted Symbolica instance. │
  444. 26.36 s gammaloop-nextest-python-api> │ │
  445. 26.36 s gammaloop-nextest-python-api> │ This mode is only permitted for non-commercial use and │
  446. 26.36 s gammaloop-nextest-python-api> │ is limited to one instance and core per machine. │
  447. 26.36 s gammaloop-nextest-python-api> │ │
  448. 26.36 s gammaloop-nextest-python-api> │ Hobbyists can easily acquire a free license key │
  449. 26.36 s gammaloop-nextest-python-api> │ that unlocks all cores and removes this banner: │
  450. 26.36 s gammaloop-nextest-python-api> │ │
  451. 26.36 s gammaloop-nextest-python-api> │ from symbolica import * │
  452. 26.36 s gammaloop-nextest-python-api> │ request_hobbyist_license('YOUR_NAME', 'YOUR_EMAIL') │
  453. 26.36 s gammaloop-nextest-python-api> │ │
  454. 26.36 s gammaloop-nextest-python-api> │ All other users can obtain a free 30-day trial key: │
  455. 26.36 s gammaloop-nextest-python-api> │ │
  456. 26.36 s gammaloop-nextest-python-api> │ from symbolica import * │
  457. 26.36 s gammaloop-nextest-python-api> │ request_trial_license('NAME', 'EMAIL', 'EMPLOYER') │
  458. 26.36 s gammaloop-nextest-python-api> │ │
  459. 26.36 s gammaloop-nextest-python-api> │ See https://symbolica.io/docs/get_started.html#license │
  460. 26.36 s gammaloop-nextest-python-api> └────────────────────────────────────────────────────────┘
  461. 26.36 s gammaloop-nextest-python-api> ┌───────────────────────────────────────────────────────────────────────────────────────────────────────────┐
  462. 26.36 s gammaloop-nextest-python-api> │ Cannot start new unlicensed Symbolica instance since there is already another one running on the machine. │
  463. 26.37 s gammaloop-nextest-python-api> └───────────────────────────────────────────────────────────────────────────────────────────────────────────┘
  464. 26.37 s gammaloop-nextest-python-api>
  465. 26.37 s gammaloop-nextest-python-api> stderr:
  466. 26.37 s gammaloop-nextest-python-api> ┌───────────────────────────────────┐
  467. 26.37 s gammaloop-nextest-python-api> │ The Symbolica license has expired │
  468. 26.37 s gammaloop-nextest-python-api> └───────────────────────────────────┘
  469. 26.37 s gammaloop-nextest-python-api> [2026-09-01 10:05:15.283] @gammaloop_api::se... INFO : Running command import model sm-default
  470. 26.37 s gammaloop-nextest-python-api> [2026-09-01 10:05:15.285] @import::model INFO : Loading built-in JSON model sm-default
  471. 26.37 s gammaloop-nextest-python-api> [2026-09-01 10:05:15.348] @gammalooprs::model INFO : The following 15 external parameters were forced to zero by the restriction card:
  472. 26.37 s gammaloop-nextest-python-api> lamWS, AWS, rhoWS, etaWS, ymc, yme, ymm, MC, Me, MM, WTau, muQ, muLe, muLmu, muLtau
  473. 26.37 s gammaloop-nextest-python-api> [2026-09-01 10:05:15.348] @gammalooprs::model INFO : The following 34 vertex rules were removed by the restriction card:
  474. 26.37 s gammaloop-nextest-python-api> V_82 -> (c~, d, G+) | V_83 -> (t~, d, G+) | V_84 -> (c~, s, G+) | V_85 -> (t~, s, G+) | V_86 -> (u~, b, G+) | V_87 -> (c~, b, G+) | V_90 -> (c~, d, W+) | V_91 -> (t~, d, W+) | V_92 -> (u~, s, W+) | V_94 -> (t~, s, W+) | V_95 -> (u~, b, W+) | V_96 -> (c~, b, W+) | V_101 -> (e+, e-, G0) | V_102 -> (mu+, mu-, G0) | V_104 -> (e+, e-, H) | V_105 -> (mu+, mu-, H) | V_110 -> (ve~, e-, G+) | V_111 -> (vm~, mu-, G+) | V_116 -> (b~, u, G-) | V_117 -> (d~, c, G-) | V_118 -> (s~, c, G-) | V_119 -> (b~, c, G-) | V_120 -> (d~, t, G-) | V_121 -> (s~, t, G-) | V_124 -> (s~, u, W-) | V_125 -> (b~, u, W-) | V_126 -> (d~, c, W-) | V_128 -> (b~, c, W-) | V_129 -> (d~, t, W-) | V_130 -> (s~, t, W-) | V_138 -> (c~, c, G0) | V_140 -> (c~, c, H) | V_145 -> (e+, ve, G-) | V_146 -> (mu+, vm, G-)
  475. 26.37 s gammaloop-nextest-python-api> [2026-09-01 10:05:15.348] @gammalooprs::model INFO : The following 36 couplings were removed by the restriction card:
  476. 26.37 s gammaloop-nextest-python-api> GC_13, GC_14, GC_16, GC_17, GC_18, GC_19, GC_20, GC_22, GC_23, GC_24, GC_25, GC_26, GC_28, GC_29, GC_42, GC_43, GC_44, GC_46, GC_47, GC_48, GC_84, GC_85, GC_86, GC_87, GC_88, GC_89, GC_90, GC_91, GC_92, GC_93, GC_101, GC_102, GC_103, GC_105, GC_106, GC_107
  477. 26.37 s gammaloop-nextest-python-api> [2026-09-01 10:05:15.359] @gammaloop_api::se... INFO : Running command set default-runtime kv kinematics.externals='{"type":"constant","data":{"momenta":[[32.0,0.0,0.0,32.0],[32.0,0.0,0.0,-32.0]],"helicities":[1,1]}}'
  478. 26.37 s gammaloop-nextest-python-api> [2026-09-01 10:05:15.360] @gammaloop_api::se... INFO : Running command set default-runtime kv subtraction.disable_threshold_subtraction=true
  479. 26.37 s gammaloop-nextest-python-api> [2026-09-01 10:05:15.361] @gammaloop_api::se... INFO : Running command generate xs e+ e- > d d~ g | e- a d g QED^2==4 [{{2}} QCD=0] --numerator-grouping group_identical_graphs_up_to_sign --clear-existing-processes --only-diagrams
  480. 26.37 s gammaloop-nextest-python-api> [2026-09-01 10:05:15.380] @feyngen::diagram_... INFO : 0s | Δ=0s | Starting Feynman graph generation with Symbolica...
  481. 26.37 s gammaloop-nextest-python-api> [2026-09-01 10:05:15.386] @feyngen::diagram_... INFO : 0s | Δ=0s | Number of graphs resulting from Symbolica generation: 246
  482. 26.37 s gammaloop-nextest-python-api> [2026-09-01 10:05:15.388] @feyngen::diagram_... INFO : 0s | Δ=0s | Number of graphs retained after enforcing supergraph particle content: 8
  483. 26.37 s gammaloop-nextest-python-api> [2026-09-01 10:05:15.388] @feyngen::diagram_... INFO : 0s | Δ=0s | Number of graphs retained after removal of vetoed topologies: 8
  484. 26.37 s gammaloop-nextest-python-api> [2026-09-01 10:05:15.389] @feyngen::diagram_... INFO : 0s | Δ=0s | Number of graphs after vertex info assignment: 8
  485. 26.37 s gammaloop-nextest-python-api> [2026-09-01 10:05:15.389] @feyngen::diagram_... INFO : 0s | Δ=0s | Number of graphs after all complete graphs filters are applied: 8
  486. 26.37 s gammaloop-nextest-python-api>
  487. 26.37 s gammaloop-nextest-python-api>
  488. 26.37 s gammaloop-nextest-python-api> Location:
  489. 26.37 s gammaloop-nextest-python-api> tests/tests/test_python_api.rs:156:20
  490. 26.37 s gammaloop-nextest-python-api>
  491. 26.37 s gammaloop-nextest-python-api> FAIL [ 0.447s] (5/5) gammaloop-integration-tests::test_python_api python_settings_wrappers_expose_nested_runtime_and_global_settings
  492. 26.37 s gammaloop-nextest-python-api> stdout ---
  493. 26.37 s gammaloop-nextest-python-api>
  494. 26.37 s gammaloop-nextest-python-api> running 1 test
  495. 26.37 s gammaloop-nextest-python-api> test python_settings_wrappers_expose_nested_runtime_and_global_settings ... FAILED
  496. 26.37 s gammaloop-nextest-python-api>
  497. 26.37 s gammaloop-nextest-python-api> failures:
  498. 26.37 s gammaloop-nextest-python-api>
  499. 26.37 s gammaloop-nextest-python-api> failures:
  500. 26.37 s gammaloop-nextest-python-api> python_settings_wrappers_expose_nested_runtime_and_global_settings
  501. 26.37 s gammaloop-nextest-python-api>
  502. 26.37 s gammaloop-nextest-python-api> test result: FAILED. 0 passed; 1 failed; 0 ignored; 0 measured; 4 filtered out; finished in 0.44s
  503. 26.37 s gammaloop-nextest-python-api>
  504. 26.37 s gammaloop-nextest-python-api> stderr ---
  505. 26.37 s gammaloop-nextest-python-api> Error: Python API test subprocess failed.
  506. 26.37 s gammaloop-nextest-python-api> stdout:
  507. 26.37 s gammaloop-nextest-python-api> ┌────────────────────────────────────────────────────────┐
  508. 26.37 s gammaloop-nextest-python-api> │ You are running a restricted Symbolica instance. │
  509. 26.37 s gammaloop-nextest-python-api> │ │
  510. 26.37 s gammaloop-nextest-python-api> │ This mode is only permitted for non-commercial use and │
  511. 26.37 s gammaloop-nextest-python-api> │ is limited to one instance and core per machine. │
  512. 26.37 s gammaloop-nextest-python-api> │ │
  513. 26.37 s gammaloop-nextest-python-api> │ Hobbyists can easily acquire a free license key │
  514. 26.37 s gammaloop-nextest-python-api> │ that unlocks all cores and removes this banner: │
  515. 26.37 s gammaloop-nextest-python-api> │ │
  516. 26.37 s gammaloop-nextest-python-api> │ from symbolica import * │
  517. 26.37 s gammaloop-nextest-python-api> │ request_hobbyist_license('YOUR_NAME', 'YOUR_EMAIL') │
  518. 26.37 s gammaloop-nextest-python-api> │ │
  519. 26.37 s gammaloop-nextest-python-api> │ All other users can obtain a free 30-day trial key: │
  520. 26.37 s gammaloop-nextest-python-api> │ │
  521. 26.37 s gammaloop-nextest-python-api> │ from symbolica import * │
  522. 26.37 s gammaloop-nextest-python-api> │ request_trial_license('NAME', 'EMAIL', 'EMPLOYER') │
  523. 26.37 s gammaloop-nextest-python-api> │ │
  524. 26.37 s gammaloop-nextest-python-api> │ See https://symbolica.io/docs/get_started.html#license │
  525. 26.37 s gammaloop-nextest-python-api> └────────────────────────────────────────────────────────┘
  526. 26.37 s gammaloop-nextest-python-api> ┌───────────────────────────────────────────────────────────────────────────────────────────────────────────┐
  527. 26.37 s gammaloop-nextest-python-api> │ Cannot start new unlicensed Symbolica instance since there is already another one running on the machine. │
  528. 26.37 s gammaloop-nextest-python-api> └───────────────────────────────────────────────────────────────────────────────────────────────────────────┘
  529. 26.37 s gammaloop-nextest-python-api>
  530. 26.37 s gammaloop-nextest-python-api> stderr:
  531. 26.37 s gammaloop-nextest-python-api> ┌───────────────────────────────────┐
  532. 26.37 s gammaloop-nextest-python-api> │ The Symbolica license has expired │
  533. 26.37 s gammaloop-nextest-python-api> └───────────────────────────────────┘
  534. 26.37 s gammaloop-nextest-python-api>
  535. 26.37 s gammaloop-nextest-python-api>
  536. 26.37 s gammaloop-nextest-python-api> Location:
  537. 26.37 s gammaloop-nextest-python-api> tests/tests/test_python_api.rs:156:20
  538. 26.37 s gammaloop-nextest-python-api>
  539. 26.38 s gammaloop-nextest-python-api> error: test run failed
  540. 26.41 s gammaloop-nextest-python-api>
  541. 26.41 s gammaloop-nextest-python-api> ========== nextest test summary ==========
  542. 26.41 s gammaloop-nextest-python-api> report: target/nextest/ci_gammaloop/junit.xml
  543. 26.41 s gammaloop-nextest-python-api> tests: 5, failures: 5, errors: 0
  544. 26.41 s gammaloop-nextest-python-api>
  545. 26.41 s gammaloop-nextest-python-api> 1. gammaloop-integration-tests::test_python_api::python_evaluate_sample_honors_generate_events_and_observable_snapshots
  546. 26.41 s gammaloop-nextest-python-api> failure: test failure with exit code 101
  547. 26.41 s gammaloop-nextest-python-api> Error: Python API test subprocess failed.
  548. 26.41 s gammaloop-nextest-python-api> stdout:
  549. 26.41 s gammaloop-nextest-python-api> ┌────────────────────────────────────────────────────────┐
  550. 26.41 s gammaloop-nextest-python-api> │ You are running a restricted Symbolica instance. │
  551. 26.41 s gammaloop-nextest-python-api> │ │
  552. 26.41 s gammaloop-nextest-python-api> │ This mode is only permitted for non-commercial use and │
  553. 26.41 s gammaloop-nextest-python-api> │ is limited to one instance and core per machine. │
  554. 26.41 s gammaloop-nextest-python-api> │ │
  555. 26.41 s gammaloop-nextest-python-api> │ Hobbyists can easily acquire a free license key │
  556. 26.41 s gammaloop-nextest-python-api> │ that unlocks all cores and removes this banner: │
  557. 26.41 s gammaloop-nextest-python-api> │ │
  558. 26.41 s gammaloop-nextest-python-api> │ from symbolica import * │
  559. 26.41 s gammaloop-nextest-python-api> │ request_hobbyist_license('YOUR_NAME', 'YOUR_EMAIL') │
  560. 26.41 s gammaloop-nextest-python-api> │ │
  561. 26.41 s gammaloop-nextest-python-api> │ All other users can obtain a free 30-day trial key: │
  562. 26.41 s gammaloop-nextest-python-api> │ │
  563. 26.41 s gammaloop-nextest-python-api> │ from symbolica import * │
  564. 26.41 s gammaloop-nextest-python-api> │ request_trial_license('NAME', 'EMAIL', 'EMPLOYER') │
  565. 26.41 s gammaloop-nextest-python-api> │ │
  566. 26.41 s gammaloop-nextest-python-api> │ See https://symbolica.io/docs/get_started.html#license │
  567. 26.41 s gammaloop-nextest-python-api> └────────────────────────────────────────────────────────┘
  568. 26.41 s gammaloop-nextest-python-api> ┌───────────────────────────────────────────────────────────────────────────────────────────────────────────┐
  569. 26.41 s gammaloop-nextest-python-api> │ Cannot start new unlicensed Symbolica instance since there is already another one running on the machine. │
  570. 26.41 s gammaloop-nextest-python-api> └───────────────────────────────────────────────────────────────────────────────────────────────────────────┘
  571. 26.41 s gammaloop-nextest-python-api>
  572. 26.41 s gammaloop-nextest-python-api> stderr:
  573. 26.41 s gammaloop-nextest-python-api> ┌───────────────────────────────────┐
  574. 26.41 s gammaloop-nextest-python-api> │ The Symbolica license has expired │
  575. 26.41 s gammaloop-nextest-python-api> └───────────────────────────────────┘
  576. 26.41 s gammaloop-nextest-python-api>
  577. 26.41 s gammaloop-nextest-python-api>
  578. 26.41 s gammaloop-nextest-python-api> Location:
  579. 26.41 s gammaloop-nextest-python-api> tests/tests/test_python_api.rs:156:20
  580. 26.41 s gammaloop-nextest-python-api> system-out
  581. 26.41 s gammaloop-nextest-python-api> running 1 test
  582. 26.41 s gammaloop-nextest-python-api> test python_evaluate_sample_honors_generate_events_and_observable_snapshots ... FAILED
  583. 26.41 s gammaloop-nextest-python-api>
  584. 26.41 s gammaloop-nextest-python-api> failures:
  585. 26.41 s gammaloop-nextest-python-api>
  586. 26.41 s gammaloop-nextest-python-api> failures:
  587. 26.41 s gammaloop-nextest-python-api> python_evaluate_sample_honors_generate_events_and_observable_snapshots
  588. 26.41 s gammaloop-nextest-python-api>
  589. 26.41 s gammaloop-nextest-python-api> test result: FAILED. 0 passed; 1 failed; 0 ignored; 0 measured; 4 filtered out; finished in 0.33s
  590. 26.41 s gammaloop-nextest-python-api> system-err
  591. 26.41 s gammaloop-nextest-python-api> Error: Python API test subprocess failed.
  592. 26.41 s gammaloop-nextest-python-api> stdout:
  593. 26.41 s gammaloop-nextest-python-api> ┌────────────────────────────────────────────────────────┐
  594. 26.41 s gammaloop-nextest-python-api> │ You are running a restricted Symbolica instance. │
  595. 26.41 s gammaloop-nextest-python-api> │ │
  596. 26.41 s gammaloop-nextest-python-api> │ This mode is only permitted for non-commercial use and │
  597. 26.41 s gammaloop-nextest-python-api> │ is limited to one instance and core per machine. │
  598. 26.41 s gammaloop-nextest-python-api> │ │
  599. 26.41 s gammaloop-nextest-python-api> │ Hobbyists can easily acquire a free license key │
  600. 26.41 s gammaloop-nextest-python-api> │ that unlocks all cores and removes this banner: │
  601. 26.41 s gammaloop-nextest-python-api> │ │
  602. 26.41 s gammaloop-nextest-python-api> │ from symbolica import * │
  603. 26.41 s gammaloop-nextest-python-api> │ request_hobbyist_license('YOUR_NAME', 'YOUR_EMAIL') │
  604. 26.41 s gammaloop-nextest-python-api> │ │
  605. 26.41 s gammaloop-nextest-python-api> │ All other users can obtain a free 30-day trial key: │
  606. 26.41 s gammaloop-nextest-python-api> │ │
  607. 26.41 s gammaloop-nextest-python-api> │ from symbolica import * │
  608. 26.41 s gammaloop-nextest-python-api> │ request_trial_license('NAME', 'EMAIL', 'EMPLOYER') │
  609. 26.41 s gammaloop-nextest-python-api> │ │
  610. 26.41 s gammaloop-nextest-python-api> │ See https://symbolica.io/docs/get_started.html#license │
  611. 26.41 s gammaloop-nextest-python-api> └────────────────────────────────────────────────────────┘
  612. 26.41 s gammaloop-nextest-python-api> ┌───────────────────────────────────────────────────────────────────────────────────────────────────────────┐
  613. 26.41 s gammaloop-nextest-python-api> │ Cannot start new unlicensed Symbolica instance since there is already another one running on the machine. │
  614. 26.41 s gammaloop-nextest-python-api> └───────────────────────────────────────────────────────────────────────────────────────────────────────────┘
  615. 26.41 s gammaloop-nextest-python-api>
  616. 26.41 s gammaloop-nextest-python-api> stderr:
  617. 26.41 s gammaloop-nextest-python-api> ┌───────────────────────────────────┐
  618. 26.41 s gammaloop-nextest-python-api> │ The Symbolica license has expired │
  619. 26.41 s gammaloop-nextest-python-api> └───────────────────────────────────┘
  620. 26.41 s gammaloop-nextest-python-api>
  621. 26.41 s gammaloop-nextest-python-api>
  622. 26.41 s gammaloop-nextest-python-api> Location:
  623. 26.41 s gammaloop-nextest-python-api> tests/tests/test_python_api.rs:156:20
  624. 26.41 s gammaloop-nextest-python-api>
  625. 26.41 s gammaloop-nextest-python-api> 2. gammaloop-integration-tests::test_python_api::python_evaluate_sample_preserves_graph_grouping_and_incoming_pdgs
  626. 26.41 s gammaloop-nextest-python-api> failure: test failure with exit code 101
  627. 26.41 s gammaloop-nextest-python-api> Error: Python API test subprocess failed.
  628. 26.41 s gammaloop-nextest-python-api> stdout:
  629. 26.41 s gammaloop-nextest-python-api> ┌────────────────────────────────────────────────────────┐
  630. 26.41 s gammaloop-nextest-python-api> │ You are running a restricted Symbolica instance. │
  631. 26.41 s gammaloop-nextest-python-api> │ │
  632. 26.41 s gammaloop-nextest-python-api> │ This mode is only permitted for non-commercial use and │
  633. 26.41 s gammaloop-nextest-python-api> │ is limited to one instance and core per machine. │
  634. 26.41 s gammaloop-nextest-python-api> │ │
  635. 26.41 s gammaloop-nextest-python-api> │ Hobbyists can easily acquire a free license key │
  636. 26.41 s gammaloop-nextest-python-api> │ that unlocks all cores and removes this banner: │
  637. 26.41 s gammaloop-nextest-python-api> │ │
  638. 26.41 s gammaloop-nextest-python-api> │ from symbolica import * │
  639. 26.41 s gammaloop-nextest-python-api> │ request_hobbyist_license('YOUR_NAME', 'YOUR_EMAIL') │
  640. 26.41 s gammaloop-nextest-python-api> │ │
  641. 26.41 s gammaloop-nextest-python-api> │ All other users can obtain a free 30-day trial key: │
  642. 26.41 s gammaloop-nextest-python-api> │ │
  643. 26.41 s gammaloop-nextest-python-api> │ from symbolica import * │
  644. 26.41 s gammaloop-nextest-python-api> │ request_trial_license('NAME', 'EMAIL', 'EMPLOYER') │
  645. 26.41 s gammaloop-nextest-python-api> │ │
  646. 26.41 s gammaloop-nextest-python-api> │ See https://symbolica.io/docs/get_started.html#license │
  647. 26.41 s gammaloop-nextest-python-api> └────────────────────────────────────────────────────────┘
  648. 26.41 s gammaloop-nextest-python-api> ┌───────────────────────────────────────────────────────────────────────────────────────────────────────────┐
  649. 26.41 s gammaloop-nextest-python-api> │ Cannot start new unlicensed Symbolica instance since there is already another one running on the machine. │
  650. 26.41 s gammaloop-nextest-python-api> └───────────────────────────────────────────────────────────────────────────────────────────────────────────┘
  651. 26.41 s gammaloop-nextest-python-api>
  652. 26.41 s gammaloop-nextest-python-api> stderr:
  653. 26.41 s gammaloop-nextest-python-api> ┌───────────────────────────────────┐
  654. 26.41 s gammaloop-nextest-python-api> │ The Symbolica license has expired │
  655. 26.41 s gammaloop-nextest-python-api> └───────────────────────────────────┘
  656. 26.41 s gammaloop-nextest-python-api>
  657. 26.41 s gammaloop-nextest-python-api>
  658. 26.41 s gammaloop-nextest-python-api> Location:
  659. 26.41 s gammaloop-nextest-python-api> tests/tests/test_python_api.rs:156:20
  660. 26.41 s gammaloop-nextest-python-api> system-out
  661. 26.41 s gammaloop-nextest-python-api> running 1 test
  662. 26.41 s gammaloop-nextest-python-api> test python_evaluate_sample_preserves_graph_grouping_and_incoming_pdgs ... FAILED
  663. 26.41 s gammaloop-nextest-python-api>
  664. 26.41 s gammaloop-nextest-python-api> failures:
  665. 26.41 s gammaloop-nextest-python-api>
  666. 26.41 s gammaloop-nextest-python-api> failures:
  667. 26.41 s gammaloop-nextest-python-api> python_evaluate_sample_preserves_graph_grouping_and_incoming_pdgs
  668. 26.41 s gammaloop-nextest-python-api>
  669. 26.41 s gammaloop-nextest-python-api> test result: FAILED. 0 passed; 1 failed; 0 ignored; 0 measured; 4 filtered out; finished in 0.34s
  670. 26.41 s gammaloop-nextest-python-api> system-err
  671. 26.41 s gammaloop-nextest-python-api> Error: Python API test subprocess failed.
  672. 26.41 s gammaloop-nextest-python-api> stdout:
  673. 26.41 s gammaloop-nextest-python-api> ┌────────────────────────────────────────────────────────┐
  674. 26.41 s gammaloop-nextest-python-api> │ You are running a restricted Symbolica instance. │
  675. 26.41 s gammaloop-nextest-python-api> │ │
  676. 26.41 s gammaloop-nextest-python-api> │ This mode is only permitted for non-commercial use and │
  677. 26.41 s gammaloop-nextest-python-api> │ is limited to one instance and core per machine. │
  678. 26.41 s gammaloop-nextest-python-api> │ │
  679. 26.41 s gammaloop-nextest-python-api> │ Hobbyists can easily acquire a free license key │
  680. 26.41 s gammaloop-nextest-python-api> │ that unlocks all cores and removes this banner: │
  681. 26.41 s gammaloop-nextest-python-api> │ │
  682. 26.41 s gammaloop-nextest-python-api> │ from symbolica import * │
  683. 26.41 s gammaloop-nextest-python-api> │ request_hobbyist_license('YOUR_NAME', 'YOUR_EMAIL') │
  684. 26.41 s gammaloop-nextest-python-api> │ │
  685. 26.41 s gammaloop-nextest-python-api> │ All other users can obtain a free 30-day trial key: │
  686. 26.41 s gammaloop-nextest-python-api> │ │
  687. 26.41 s gammaloop-nextest-python-api> │ from symbolica import * │
  688. 26.41 s gammaloop-nextest-python-api> │ request_trial_license('NAME', 'EMAIL', 'EMPLOYER') │
  689. 26.41 s gammaloop-nextest-python-api> │ │
  690. 26.41 s gammaloop-nextest-python-api> │ See https://symbolica.io/docs/get_started.html#license │
  691. 26.41 s gammaloop-nextest-python-api> └────────────────────────────────────────────────────────┘
  692. 26.41 s gammaloop-nextest-python-api> ┌───────────────────────────────────────────────────────────────────────────────────────────────────────────┐
  693. 26.41 s gammaloop-nextest-python-api> │ Cannot start new unlicensed Symbolica instance since there is already another one running on the machine. │
  694. 26.41 s gammaloop-nextest-python-api> └───────────────────────────────────────────────────────────────────────────────────────────────────────────┘
  695. 26.41 s gammaloop-nextest-python-api>
  696. 26.41 s gammaloop-nextest-python-api> stderr:
  697. 26.41 s gammaloop-nextest-python-api> ┌───────────────────────────────────┐
  698. 26.41 s gammaloop-nextest-python-api> │ The Symbolica license has expired │
  699. 26.41 s gammaloop-nextest-python-api> └───────────────────────────────────┘
  700. 26.41 s gammaloop-nextest-python-api>
  701. 26.41 s gammaloop-nextest-python-api>
  702. 26.41 s gammaloop-nextest-python-api> Location:
  703. 26.41 s gammaloop-nextest-python-api> tests/tests/test_python_api.rs:156:20
  704. 26.41 s gammaloop-nextest-python-api>
  705. 26.41 s gammaloop-nextest-python-api> 3. gammaloop-integration-tests::test_python_api::python_session_getters_return_live_toml_and_command_blocks
  706. 26.41 s gammaloop-nextest-python-api> failure: test failure with exit code 101
  707. 26.41 s gammaloop-nextest-python-api> Error: Python API test subprocess failed.
  708. 26.41 s gammaloop-nextest-python-api> stdout:
  709. 26.41 s gammaloop-nextest-python-api> ┌────────────────────────────────────────────────────────┐
  710. 26.41 s gammaloop-nextest-python-api> │ You are running a restricted Symbolica instance. │
  711. 26.41 s gammaloop-nextest-python-api> │ │
  712. 26.41 s gammaloop-nextest-python-api> │ This mode is only permitted for non-commercial use and │
  713. 26.41 s gammaloop-nextest-python-api> │ is limited to one instance and core per machine. │
  714. 26.41 s gammaloop-nextest-python-api> │ │
  715. 26.41 s gammaloop-nextest-python-api> │ Hobbyists can easily acquire a free license key │
  716. 26.41 s gammaloop-nextest-python-api> │ that unlocks all cores and removes this banner: │
  717. 26.41 s gammaloop-nextest-python-api> │ │
  718. 26.41 s gammaloop-nextest-python-api> │ from symbolica import * │
  719. 26.41 s gammaloop-nextest-python-api> │ request_hobbyist_license('YOUR_NAME', 'YOUR_EMAIL') │
  720. 26.41 s gammaloop-nextest-python-api> │ │
  721. 26.41 s gammaloop-nextest-python-api> │ All other users can obtain a free 30-day trial key: │
  722. 26.41 s gammaloop-nextest-python-api> │ │
  723. 26.42 s gammaloop-nextest-python-api> │ from symbolica import * │
  724. 26.42 s gammaloop-nextest-python-api> │ request_trial_license('NAME', 'EMAIL', 'EMPLOYER') │
  725. 26.42 s gammaloop-nextest-python-api> │ │
  726. 26.42 s gammaloop-nextest-python-api> │ See https://symbolica.io/docs/get_started.html#license │
  727. 26.42 s gammaloop-nextest-python-api> └────────────────────────────────────────────────────────┘
  728. 26.42 s gammaloop-nextest-python-api> ┌───────────────────────────────────────────────────────────────────────────────────────────────────────────┐
  729. 26.42 s gammaloop-nextest-python-api> │ Cannot start new unlicensed Symbolica instance since there is already another one running on the machine. │
  730. 26.42 s gammaloop-nextest-python-api> └───────────────────────────────────────────────────────────────────────────────────────────────────────────┘
  731. 26.42 s gammaloop-nextest-python-api>
  732. 26.42 s gammaloop-nextest-python-api> stderr:
  733. 26.42 s gammaloop-nextest-python-api> ┌───────────────────────────────────┐
  734. 26.42 s gammaloop-nextest-python-api> │ The Symbolica license has expired │
  735. 26.42 s gammaloop-nextest-python-api> └───────────────────────────────────┘
  736. 26.42 s gammaloop-nextest-python-api>
  737. 26.42 s gammaloop-nextest-python-api>
  738. 26.42 s gammaloop-nextest-python-api> Location:
  739. 26.42 s gammaloop-nextest-python-api> tests/tests/test_python_api.rs:156:20
  740. 26.42 s gammaloop-nextest-python-api> system-out
  741. 26.42 s gammaloop-nextest-python-api> running 1 test
  742. 26.42 s gammaloop-nextest-python-api> test python_session_getters_return_live_toml_and_command_blocks ... FAILED
  743. 26.42 s gammaloop-nextest-python-api>
  744. 26.42 s gammaloop-nextest-python-api> failures:
  745. 26.42 s gammaloop-nextest-python-api>
  746. 26.42 s gammaloop-nextest-python-api> failures:
  747. 26.42 s gammaloop-nextest-python-api> python_session_getters_return_live_toml_and_command_blocks
  748. 26.42 s gammaloop-nextest-python-api>
  749. 26.42 s gammaloop-nextest-python-api> test result: FAILED. 0 passed; 1 failed; 0 ignored; 0 measured; 4 filtered out; finished in 0.35s
  750. 26.42 s gammaloop-nextest-python-api> system-err
  751. 26.42 s gammaloop-nextest-python-api> Error: Python API test subprocess failed.
  752. 26.42 s gammaloop-nextest-python-api> stdout:
  753. 26.42 s gammaloop-nextest-python-api> ┌────────────────────────────────────────────────────────┐
  754. 26.42 s gammaloop-nextest-python-api> │ You are running a restricted Symbolica instance. │
  755. 26.42 s gammaloop-nextest-python-api> │ │
  756. 26.42 s gammaloop-nextest-python-api> │ This mode is only permitted for non-commercial use and │
  757. 26.42 s gammaloop-nextest-python-api> │ is limited to one instance and core per machine. │
  758. 26.42 s gammaloop-nextest-python-api> │ │
  759. 26.42 s gammaloop-nextest-python-api> │ Hobbyists can easily acquire a free license key │
  760. 26.42 s gammaloop-nextest-python-api> │ that unlocks all cores and removes this banner: │
  761. 26.42 s gammaloop-nextest-python-api> │ │
  762. 26.42 s gammaloop-nextest-python-api> │ from symbolica import * │
  763. 26.42 s gammaloop-nextest-python-api> │ request_hobbyist_license('YOUR_NAME', 'YOUR_EMAIL') │
  764. 26.42 s gammaloop-nextest-python-api> │ │
  765. 26.42 s gammaloop-nextest-python-api> │ All other users can obtain a free 30-day trial key: │
  766. 26.42 s gammaloop-nextest-python-api> │ │
  767. 26.42 s gammaloop-nextest-python-api> │ from symbolica import * │
  768. 26.42 s gammaloop-nextest-python-api> │ request_trial_license('NAME', 'EMAIL', 'EMPLOYER') │
  769. 26.42 s gammaloop-nextest-python-api> │ │
  770. 26.42 s gammaloop-nextest-python-api> │ See https://symbolica.io/docs/get_started.html#license │
  771. 26.42 s gammaloop-nextest-python-api> └────────────────────────────────────────────────────────┘
  772. 26.42 s gammaloop-nextest-python-api> ┌───────────────────────────────────────────────────────────────────────────────────────────────────────────┐
  773. 26.42 s gammaloop-nextest-python-api> │ Cannot start new unlicensed Symbolica instance since there is already another one running on the machine. │
  774. 26.42 s gammaloop-nextest-python-api> └───────────────────────────────────────────────────────────────────────────────────────────────────────────┘
  775. 26.42 s gammaloop-nextest-python-api>
  776. 26.42 s gammaloop-nextest-python-api> stderr:
  777. 26.42 s gammaloop-nextest-python-api> ┌───────────────────────────────────┐
  778. 26.42 s gammaloop-nextest-python-api> │ The Symbolica license has expired │
  779. 26.42 s gammaloop-nextest-python-api> └───────────────────────────────────┘
  780. 26.42 s gammaloop-nextest-python-api>
  781. 26.42 s gammaloop-nextest-python-api>
  782. 26.42 s gammaloop-nextest-python-api> Location:
  783. 26.42 s gammaloop-nextest-python-api> tests/tests/test_python_api.rs:156:20
  784. 26.42 s gammaloop-nextest-python-api>
  785. 26.42 s gammaloop-nextest-python-api> 4. gammaloop-integration-tests::test_python_api::python_evaluate_samples_batch_and_momentum_space_have_expected_shape
  786. 26.42 s gammaloop-nextest-python-api> failure: test failure with exit code 101
  787. 26.42 s gammaloop-nextest-python-api> Error: Python API test subprocess failed.
  788. 26.42 s gammaloop-nextest-python-api> stdout:
  789. 26.42 s gammaloop-nextest-python-api> ┌────────────────────────────────────────────────────────┐
  790. 26.42 s gammaloop-nextest-python-api> │ You are running a restricted Symbolica instance. │
  791. 26.42 s gammaloop-nextest-python-api> │ │
  792. 26.42 s gammaloop-nextest-python-api> │ This mode is only permitted for non-commercial use and │
  793. 26.42 s gammaloop-nextest-python-api> │ is limited to one instance and core per machine. │
  794. 26.42 s gammaloop-nextest-python-api> │ │
  795. 26.42 s gammaloop-nextest-python-api> │ Hobbyists can easily acquire a free license key │
  796. 26.42 s gammaloop-nextest-python-api> │ that unlocks all cores and removes this banner: │
  797. 26.42 s gammaloop-nextest-python-api> │ │
  798. 26.42 s gammaloop-nextest-python-api> │ from symbolica import * │
  799. 26.42 s gammaloop-nextest-python-api> │ request_hobbyist_license('YOUR_NAME', 'YOUR_EMAIL') │
  800. 26.42 s gammaloop-nextest-python-api> │ │
  801. 26.42 s gammaloop-nextest-python-api> │ All other users can obtain a free 30-day trial key: │
  802. 26.42 s gammaloop-nextest-python-api> │ │
  803. 26.42 s gammaloop-nextest-python-api> │ from symbolica import * │
  804. 26.42 s gammaloop-nextest-python-api> │ request_trial_license('NAME', 'EMAIL', 'EMPLOYER') │
  805. 26.42 s gammaloop-nextest-python-api> │ │
  806. 26.42 s gammaloop-nextest-python-api> │ See https://symbolica.io/docs/get_started.html#license │
  807. 26.42 s gammaloop-nextest-python-api> └────────────────────────────────────────────────────────┘
  808. 26.42 s gammaloop-nextest-python-api> ┌───────────────────────────────────────────────────────────────────────────────────────────────────────────┐
  809. 26.42 s gammaloop-nextest-python-api> │ Cannot start new unlicensed Symbolica instance since there is already another one running on the machine. │
  810. 26.42 s gammaloop-nextest-python-api> └───────────────────────────────────────────────────────────────────────────────────────────────────────────┘
  811. 26.42 s gammaloop-nextest-python-api>
  812. 26.42 s gammaloop-nextest-python-api> stderr:
  813. 26.42 s gammaloop-nextest-python-api> ┌───────────────────────────────────┐
  814. 26.42 s gammaloop-nextest-python-api> │ The Symbolica license has expired │
  815. 26.42 s gammaloop-nextest-python-api> └───────────────────────────────────┘
  816. 26.42 s gammaloop-nextest-python-api> [2026-09-01 10:05:15.283] @gammaloop_api::se... INFO : Running command import model sm-default
  817. 26.42 s gammaloop-nextest-python-api> [2026-09-01 10:05:15.285] @import::model INFO : Loading built-in JSON model sm-default
  818. 26.42 s gammaloop-nextest-python-api> [2026-09-01 10:05:15.348] @gammalooprs::model INFO : The following 15 external parameters were forced to zero by the restriction card:
  819. 26.42 s gammaloop-nextest-python-api> lamWS, AWS, rhoWS, etaWS, ymc, yme, ymm, MC, Me, MM, WTau, muQ, muLe, muLmu, muLtau
  820. 26.42 s gammaloop-nextest-python-api> [2026-09-01 10:05:15.348] @gammalooprs::model INFO : The following 34 vertex rules were removed by the restriction card:
  821. 26.42 s gammaloop-nextest-python-api> V_82 -> (c~, d, G+) | V_83 -> (t~, d, G+) | V_84 -> (c~, s, G+) | V_85 -> (t~, s, G+) | V_86 -> (u~, b, G+) | V_87 -> (c~, b, G+) | V_90 -> (c~, d, W+) | V_91 -> (t~, d, W+) | V_92 -> (u~, s, W+) | V_94 -> (t~, s, W+) | V_95 -> (u~, b, W+) | V_96 -> (c~, b, W+) | V_101 -> (e+, e-, G0) | V_102 -> (mu+, mu-, G0) | V_104 -> (e+, e-, H) | V_105 -> (mu+, mu-, H) | V_110 -> (ve~, e-, G+) | V_111 -> (vm~, mu-, G+) | V_116 -> (b~, u, G-) | V_117 -> (d~, c, G-) | V_118 -> (s~, c, G-) | V_119 -> (b~, c, G-) | V_120 -> (d~, t, G-) | V_121 -> (s~, t, G-) | V_124 -> (s~, u, W-) | V_125 -> (b~, u, W-) | V_126 -> (d~, c, W-) | V_128 -> (b~, c, W-) | V_129 -> (d~, t, W-) | V_130 -> (s~, t, W-) | V_138 -> (c~, c, G0) | V_140 -> (c~, c, H) | V_145 -> (e+, ve, G-) | V_146 -> (mu+, vm, G-)
  822. 26.42 s gammaloop-nextest-python-api> [2026-09-01 10:05:15.348] @gammalooprs::model INFO : The following 36 couplings were removed by the restriction card:
  823. 26.42 s gammaloop-nextest-python-api> GC_13, GC_14, GC_16, GC_17, GC_18, GC_19, GC_20, GC_22, GC_23, GC_24, GC_25, GC_26, GC_28, GC_29, GC_42, GC_43, GC_44, GC_46, GC_47, GC_48, GC_84, GC_85, GC_86, GC_87, GC_88, GC_89, GC_90, GC_91, GC_92, GC_93, GC_101, GC_102, GC_103, GC_105, GC_106, GC_107
  824. 26.42 s gammaloop-nextest-python-api> [2026-09-01 10:05:15.359] @gammaloop_api::se... INFO : Running command set default-runtime kv kinematics.externals='{"type":"constant","data":{"momenta":[[32.0,0.0,0.0,32.0],[32.0,0.0,0.0,-32.0]],"helicities":[1,1]}}'
  825. 26.42 s gammaloop-nextest-python-api> [2026-09-01 10:05:15.360] @gammaloop_api::se... INFO : Running command set default-runtime kv subtraction.disable_threshold_subtraction=true
  826. 26.42 s gammaloop-nextest-python-api> [2026-09-01 10:05:15.361] @gammaloop_api::se... INFO : Running command generate xs e+ e- > d d~ g | e- a d g QED^2==4 [{{2}} QCD=0] --numerator-grouping group_identical_graphs_up_to_sign --clear-existing-processes --only-diagrams
  827. 26.42 s gammaloop-nextest-python-api> [2026-09-01 10:05:15.380] @feyngen::diagram_... INFO : 0s | Δ=0s | Starting Feynman graph generation with Symbolica...
  828. 26.42 s gammaloop-nextest-python-api> [2026-09-01 10:05:15.386] @feyngen::diagram_... INFO : 0s | Δ=0s | Number of graphs resulting from Symbolica generation: 246
  829. 26.42 s gammaloop-nextest-python-api> [2026-09-01 10:05:15.388] @feyngen::diagram_... INFO : 0s | Δ=0s | Number of graphs retained after enforcing supergraph particle content: 8
  830. 26.42 s gammaloop-nextest-python-api> [2026-09-01 10:05:15.388] @feyngen::diagram_... INFO : 0s | Δ=0s | Number of graphs retained after removal of vetoed topologies: 8
  831. 26.42 s gammaloop-nextest-python-api> [2026-09-01 10:05:15.389] @feyngen::diagram_... INFO : 0s | Δ=0s | Number of graphs after vertex info assignment: 8
  832. 26.42 s gammaloop-nextest-python-api> [2026-09-01 10:05:15.389] @feyngen::diagram_... INFO : 0s | Δ=0s | Number of graphs after all complete graphs filters are applied: 8
  833. 26.42 s gammaloop-nextest-python-api>
  834. 26.42 s gammaloop-nextest-python-api>
  835. 26.42 s gammaloop-nextest-python-api> Location:
  836. 26.42 s gammaloop-nextest-python-api> tests/tests/test_python_api.rs:156:20
  837. 26.42 s gammaloop-nextest-python-api> system-out
  838. 26.42 s gammaloop-nextest-python-api> running 1 test
  839. 26.42 s gammaloop-nextest-python-api> test python_evaluate_samples_batch_and_momentum_space_have_expected_shape ... FAILED
  840. 26.42 s gammaloop-nextest-python-api>
  841. 26.42 s gammaloop-nextest-python-api> failures:
  842. 26.42 s gammaloop-nextest-python-api>
  843. 26.42 s gammaloop-nextest-python-api> failures:
  844. 26.42 s gammaloop-nextest-python-api> python_evaluate_samples_batch_and_momentum_space_have_expected_shape
  845. 26.42 s gammaloop-nextest-python-api>
  846. 26.42 s gammaloop-nextest-python-api> test result: FAILED. 0 passed; 1 failed; 0 ignored; 0 measured; 4 filtered out; finished in 0.41s
  847. 26.42 s gammaloop-nextest-python-api> system-err
  848. 26.42 s gammaloop-nextest-python-api> Error: Python API test subprocess failed.
  849. 26.42 s gammaloop-nextest-python-api> stdout:
  850. 26.42 s gammaloop-nextest-python-api> ┌────────────────────────────────────────────────────────┐
  851. 26.42 s gammaloop-nextest-python-api> │ You are running a restricted Symbolica instance. │
  852. 26.42 s gammaloop-nextest-python-api> │ │
  853. 26.42 s gammaloop-nextest-python-api> │ This mode is only permitted for non-commercial use and │
  854. 26.42 s gammaloop-nextest-python-api> │ is limited to one instance and core per machine. │
  855. 26.42 s gammaloop-nextest-python-api> │ │
  856. 26.42 s gammaloop-nextest-python-api> │ Hobbyists can easily acquire a free license key │
  857. 26.42 s gammaloop-nextest-python-api> │ that unlocks all cores and removes this banner: │
  858. 26.42 s gammaloop-nextest-python-api> │ │
  859. 26.42 s gammaloop-nextest-python-api> │ from symbolica import * │
  860. 26.42 s gammaloop-nextest-python-api> │ request_hobbyist_license('YOUR_NAME', 'YOUR_EMAIL') │
  861. 26.42 s gammaloop-nextest-python-api> │ │
  862. 26.42 s gammaloop-nextest-python-api> │ All other users can obtain a free 30-day trial key: │
  863. 26.42 s gammaloop-nextest-python-api> │ │
  864. 26.42 s gammaloop-nextest-python-api> │ from symbolica import * │
  865. 26.42 s gammaloop-nextest-python-api> │ request_trial_license('NAME', 'EMAIL', 'EMPLOYER') │
  866. 26.42 s gammaloop-nextest-python-api> │ │
  867. 26.42 s gammaloop-nextest-python-api> │ See https://symbolica.io/docs/get_started.html#license │
  868. 26.42 s gammaloop-nextest-python-api> └────────────────────────────────────────────────────────┘
  869. 26.42 s gammaloop-nextest-python-api> ┌───────────────────────────────────────────────────────────────────────────────────────────────────────────┐
  870. 26.42 s gammaloop-nextest-python-api> │ Cannot start new unlicensed Symbolica instance since there is already another one running on the machine. │
  871. 26.42 s gammaloop-nextest-python-api> └───────────────────────────────────────────────────────────────────────────────────────────────────────────┘
  872. 26.42 s gammaloop-nextest-python-api>
  873. 26.42 s gammaloop-nextest-python-api> stderr:
  874. 26.42 s gammaloop-nextest-python-api> ┌───────────────────────────────────┐
  875. 26.42 s gammaloop-nextest-python-api> │ The Symbolica license has expired │
  876. 26.42 s gammaloop-nextest-python-api> └───────────────────────────────────┘
  877. 26.42 s gammaloop-nextest-python-api> [2026-09-01 10:05:15.283] @gammaloop_api::se... INFO : Running command import model sm-default
  878. 26.42 s gammaloop-nextest-python-api> [2026-09-01 10:05:15.285] @import::model INFO : Loading built-in JSON model sm-default
  879. 26.42 s gammaloop-nextest-python-api> [2026-09-01 10:05:15.348] @gammalooprs::model INFO : The following 15 external parameters were forced to zero by the restriction card:
  880. 26.42 s gammaloop-nextest-python-api> lamWS, AWS, rhoWS, etaWS, ymc, yme, ymm, MC, Me, MM, WTau, muQ, muLe, muLmu, muLtau
  881. 26.42 s gammaloop-nextest-python-api> [2026-09-01 10:05:15.348] @gammalooprs::model INFO : The following 34 vertex rules were removed by the restriction card:
  882. 26.42 s gammaloop-nextest-python-api> V_82 -> (c~, d, G+) | V_83 -> (t~, d, G+) | V_84 -> (c~, s, G+) | V_85 -> (t~, s, G+) | V_86 -> (u~, b, G+) | V_87 -> (c~, b, G+) | V_90 -> (c~, d, W+) | V_91 -> (t~, d, W+) | V_92 -> (u~, s, W+) | V_94 -> (t~, s, W+) | V_95 -> (u~, b, W+) | V_96 -> (c~, b, W+) | V_101 -> (e+, e-, G0) | V_102 -> (mu+, mu-, G0) | V_104 -> (e+, e-, H) | V_105 -> (mu+, mu-, H) | V_110 -> (ve~, e-, G+) | V_111 -> (vm~, mu-, G+) | V_116 -> (b~, u, G-) | V_117 -> (d~, c, G-) | V_118 -> (s~, c, G-) | V_119 -> (b~, c, G-) | V_120 -> (d~, t, G-) | V_121 -> (s~, t, G-) | V_124 -> (s~, u, W-) | V_125 -> (b~, u, W-) | V_126 -> (d~, c, W-) | V_128 -> (b~, c, W-) | V_129 -> (d~, t, W-) | V_130 -> (s~, t, W-) | V_138 -> (c~, c, G0) | V_140 -> (c~, c, H) | V_145 -> (e+, ve, G-) | V_146 -> (mu+, vm, G-)
  883. 26.42 s gammaloop-nextest-python-api> [2026-09-01 10:05:15.348] @gammalooprs::model INFO : The following 36 couplings were removed by the restriction card:
  884. 26.42 s gammaloop-nextest-python-api> GC_13, GC_14, GC_16, GC_17, GC_18, GC_19, GC_20, GC_22, GC_23, GC_24, GC_25, GC_26, GC_28, GC_29, GC_42, GC_43, GC_44, GC_46, GC_47, GC_48, GC_84, GC_85, GC_86, GC_87, GC_88, GC_89, GC_90, GC_91, GC_92, GC_93, GC_101, GC_102, GC_103, GC_105, GC_106, GC_107
  885. 26.42 s gammaloop-nextest-python-api> [2026-09-01 10:05:15.359] @gammaloop_api::se... INFO : Running command set default-runtime kv kinematics.externals='{"type":"constant","data":{"momenta":[[32.0,0.0,0.0,32.0],[32.0,0.0,0.0,-32.0]],"helicities":[1,1]}}'
  886. 26.42 s gammaloop-nextest-python-api> [2026-09-01 10:05:15.360] @gammaloop_api::se... INFO : Running command set default-runtime kv subtraction.disable_threshold_subtraction=true
  887. 26.42 s gammaloop-nextest-python-api> [2026-09-01 10:05:15.361] @gammaloop_api::se... INFO : Running command generate xs e+ e- > d d~ g | e- a d g QED^2==4 [{{2}} QCD=0] --numerator-grouping group_identical_graphs_up_to_sign --clear-existing-processes --only-diagrams
  888. 26.42 s gammaloop-nextest-python-api> [2026-09-01 10:05:15.380] @feyngen::diagram_... INFO : 0s | Δ=0s | Starting Feynman graph generation with Symbolica...
  889. 26.42 s gammaloop-nextest-python-api> [2026-09-01 10:05:15.386] @feyngen::diagram_... INFO : 0s | Δ=0s | Number of graphs resulting from Symbolica generation: 246
  890. 26.42 s gammaloop-nextest-python-api> [2026-09-01 10:05:15.388] @feyngen::diagram_... INFO : 0s | Δ=0s | Number of graphs retained after enforcing supergraph particle content: 8
  891. 26.42 s gammaloop-nextest-python-api> [2026-09-01 10:05:15.388] @feyngen::diagram_... INFO : 0s | Δ=0s | Number of graphs retained after removal of vetoed topologies: 8
  892. 26.42 s gammaloop-nextest-python-api> [2026-09-01 10:05:15.389] @feyngen::diagram_... INFO : 0s | Δ=0s | Number of graphs after vertex info assignment: 8
  893. 26.42 s gammaloop-nextest-python-api> [2026-09-01 10:05:15.389] @feyngen::diagram_... INFO : 0s | Δ=0s | Number of graphs after all complete graphs filters are applied: 8
  894. 26.42 s gammaloop-nextest-python-api>
  895. 26.42 s gammaloop-nextest-python-api>
  896. 26.42 s gammaloop-nextest-python-api> Location:
  897. 26.42 s gammaloop-nextest-python-api> tests/tests/test_python_api.rs:156:20
  898. 26.42 s gammaloop-nextest-python-api>
  899. 26.42 s gammaloop-nextest-python-api> 5. gammaloop-integration-tests::test_python_api::python_settings_wrappers_expose_nested_runtime_and_global_settings
  900. 26.42 s gammaloop-nextest-python-api> failure: test failure with exit code 101
  901. 26.42 s gammaloop-nextest-python-api> Error: Python API test subprocess failed.
  902. 26.42 s gammaloop-nextest-python-api> stdout:
  903. 26.42 s gammaloop-nextest-python-api> ┌────────────────────────────────────────────────────────┐
  904. 26.42 s gammaloop-nextest-python-api> │ You are running a restricted Symbolica instance. │
  905. 26.42 s gammaloop-nextest-python-api> │ │
  906. 26.42 s gammaloop-nextest-python-api> │ This mode is only permitted for non-commercial use and │
  907. 26.42 s gammaloop-nextest-python-api> │ is limited to one instance and core per machine. │
  908. 26.42 s gammaloop-nextest-python-api> │ │
  909. 26.42 s gammaloop-nextest-python-api> │ Hobbyists can easily acquire a free license key │
  910. 26.42 s gammaloop-nextest-python-api> │ that unlocks all cores and removes this banner: │
  911. 26.42 s gammaloop-nextest-python-api> │ │
  912. 26.42 s gammaloop-nextest-python-api> │ from symbolica import * │
  913. 26.42 s gammaloop-nextest-python-api> │ request_hobbyist_license('YOUR_NAME', 'YOUR_EMAIL') │
  914. 26.42 s gammaloop-nextest-python-api> │ │
  915. 26.42 s gammaloop-nextest-python-api> │ All other users can obtain a free 30-day trial key: │
  916. 26.42 s gammaloop-nextest-python-api> │ │
  917. 26.42 s gammaloop-nextest-python-api> │ from symbolica import * │
  918. 26.42 s gammaloop-nextest-python-api> │ request_trial_license('NAME', 'EMAIL', 'EMPLOYER') │
  919. 26.42 s gammaloop-nextest-python-api> │ │
  920. 26.42 s gammaloop-nextest-python-api> │ See https://symbolica.io/docs/get_started.html#license │
  921. 26.42 s gammaloop-nextest-python-api> └────────────────────────────────────────────────────────┘
  922. 26.42 s gammaloop-nextest-python-api> ┌───────────────────────────────────────────────────────────────────────────────────────────────────────────┐
  923. 26.42 s gammaloop-nextest-python-api> │ Cannot start new unlicensed Symbolica instance since there is already another one running on the machine. │
  924. 26.42 s gammaloop-nextest-python-api> └───────────────────────────────────────────────────────────────────────────────────────────────────────────┘
  925. 26.42 s gammaloop-nextest-python-api>
  926. 26.42 s gammaloop-nextest-python-api> stderr:
  927. 26.42 s gammaloop-nextest-python-api> ┌───────────────────────────────────┐
  928. 26.42 s gammaloop-nextest-python-api> │ The Symbolica license has expired │
  929. 26.42 s gammaloop-nextest-python-api> └───────────────────────────────────┘
  930. 26.42 s gammaloop-nextest-python-api>
  931. 26.42 s gammaloop-nextest-python-api>
  932. 26.42 s gammaloop-nextest-python-api> Location:
  933. 26.42 s gammaloop-nextest-python-api> tests/tests/test_python_api.rs:156:20
  934. 26.42 s gammaloop-nextest-python-api> system-out
  935. 26.42 s gammaloop-nextest-python-api> running 1 test
  936. 26.42 s gammaloop-nextest-python-api> test python_settings_wrappers_expose_nested_runtime_and_global_settings ... FAILED
  937. 26.42 s gammaloop-nextest-python-api>
  938. 26.42 s gammaloop-nextest-python-api> failures:
  939. 26.42 s gammaloop-nextest-python-api>
  940. 26.42 s gammaloop-nextest-python-api> failures:
  941. 26.42 s gammaloop-nextest-python-api> python_settings_wrappers_expose_nested_runtime_and_global_settings
  942. 26.42 s gammaloop-nextest-python-api>
  943. 26.42 s gammaloop-nextest-python-api> test result: FAILED. 0 passed; 1 failed; 0 ignored; 0 measured; 4 filtered out; finished in 0.44s
  944. 26.42 s gammaloop-nextest-python-api> system-err
  945. 26.42 s gammaloop-nextest-python-api> Error: Python API test subprocess failed.
  946. 26.42 s gammaloop-nextest-python-api> stdout:
  947. 26.42 s gammaloop-nextest-python-api> ┌────────────────────────────────────────────────────────┐
  948. 26.42 s gammaloop-nextest-python-api> │ You are running a restricted Symbolica instance. │
  949. 26.42 s gammaloop-nextest-python-api> │ │
  950. 26.42 s gammaloop-nextest-python-api> │ This mode is only permitted for non-commercial use and │
  951. 26.42 s gammaloop-nextest-python-api> │ is limited to one instance and core per machine. │
  952. 26.42 s gammaloop-nextest-python-api> │ │
  953. 26.42 s gammaloop-nextest-python-api> │ Hobbyists can easily acquire a free license key │
  954. 26.42 s gammaloop-nextest-python-api> │ that unlocks all cores and removes this banner: │
  955. 26.42 s gammaloop-nextest-python-api> │ │
  956. 26.42 s gammaloop-nextest-python-api> │ from symbolica import * │
  957. 26.42 s gammaloop-nextest-python-api> │ request_hobbyist_license('YOUR_NAME', 'YOUR_EMAIL') │
  958. 26.42 s gammaloop-nextest-python-api> │ │
  959. 26.42 s gammaloop-nextest-python-api> │ All other users can obtain a free 30-day trial key: │
  960. 26.42 s gammaloop-nextest-python-api> │ │
  961. 26.42 s gammaloop-nextest-python-api> │ from symbolica import * │
  962. 26.42 s gammaloop-nextest-python-api> │ request_trial_license('NAME', 'EMAIL', 'EMPLOYER') │
  963. 26.42 s gammaloop-nextest-python-api> │ │
  964. 26.42 s gammaloop-nextest-python-api> │ See https://symbolica.io/docs/get_started.html#license │
  965. 26.42 s gammaloop-nextest-python-api> └────────────────────────────────────────────────────────┘
  966. 26.42 s gammaloop-nextest-python-api> ┌───────────────────────────────────────────────────────────────────────────────────────────────────────────┐
  967. 26.42 s gammaloop-nextest-python-api> │ Cannot start new unlicensed Symbolica instance since there is already another one running on the machine. │
  968. 26.42 s gammaloop-nextest-python-api> └───────────────────────────────────────────────────────────────────────────────────────────────────────────┘
  969. 26.42 s gammaloop-nextest-python-api>
  970. 26.42 s gammaloop-nextest-python-api> stderr:
  971. 26.42 s gammaloop-nextest-python-api> ┌───────────────────────────────────┐
  972. 26.42 s gammaloop-nextest-python-api> │ The Symbolica license has expired │
  973. 26.42 s gammaloop-nextest-python-api> └───────────────────────────────────┘
  974. 26.42 s gammaloop-nextest-python-api>
  975. 26.42 s gammaloop-nextest-python-api>
  976. 26.42 s gammaloop-nextest-python-api> Location:
  977. 26.42 s gammaloop-nextest-python-api> tests/tests/test_python_api.rs:156:20
  978. 26.42 s gammaloop-nextest-python-api> =========================================
  979. 26.49 s error: Cannot build '/nix/store/90vl6933shlgrvsg0q1k9hbam6pqxvdh-gammaloop-nextest-python-api.drv'.
  980. 26.49 s Reason: builder failed with exit code 100.
  981. 26.49 s Output paths:
  982. 26.49 s /nix/store/ghyr21i59xgm2lhlwag6cmm3fgmdax99-gammaloop-nextest-python-api
  983. 26.49 s Last 961 log lines:
  984. 26.49 s > Extracting 1 binary, 1 build script output directory, and 3 linked paths to /build/nextest-archive-vvGvrM
  985. 26.49 s > Extracted 18 files to /build/nextest-archive-vvGvrM in 0.09s
  986. 26.49 s > ------------
  987. 26.49 s > Nextest run ID 361f0336-5d5f-4d81-89fd-6e44a3c0536f with nextest profile: ci_gammaloop
  988. 26.49 s > Starting 5 tests across 1 binary
  989. 26.49 s > FAIL [ 0.344s] (1/5) gammaloop-integration-tests::test_python_api python_evaluate_sample_honors_generate_events_and_observable_snapshots
  990. 26.49 s > stdout ---
  991. 26.49 s >
  992. 26.49 s > running 1 test
  993. 26.49 s > test python_evaluate_sample_honors_generate_events_and_observable_snapshots ... FAILED
  994. 26.49 s >
  995. 26.49 s > failures:
  996. 26.49 s >
  997. 26.49 s > failures:
  998. 26.49 s > python_evaluate_sample_honors_generate_events_and_observable_snapshots
  999. 26.49 s >
  1000. 26.49 s > test result: FAILED. 0 passed; 1 failed; 0 ignored; 0 measured; 4 filtered out; finished in 0.33s
  1001. 26.49 s >
  1002. 26.49 s > stderr ---
  1003. 26.49 s > Error: Python API test subprocess failed.
  1004. 26.49 s > stdout:
  1005. 26.49 s > ┌────────────────────────────────────────────────────────┐
  1006. 26.49 s > │ You are running a restricted Symbolica instance. │
  1007. 26.49 s > │ │
  1008. 26.49 s > │ This mode is only permitted for non-commercial use and │
  1009. 26.49 s > │ is limited to one instance and core per machine. │
  1010. 26.49 s > │ │
  1011. 26.49 s > │ Hobbyists can easily acquire a free license key │
  1012. 26.49 s > │ that unlocks all cores and removes this banner: │
  1013. 26.49 s > │ │
  1014. 26.49 s > │ from symbolica import * │
  1015. 26.49 s > │ request_hobbyist_license('YOUR_NAME', 'YOUR_EMAIL') │
  1016. 26.49 s > │ │
  1017. 26.49 s > │ All other users can obtain a free 30-day trial key: │
  1018. 26.49 s > │ │
  1019. 26.49 s > │ from symbolica import * │
  1020. 26.49 s > │ request_trial_license('NAME', 'EMAIL', 'EMPLOYER') │
  1021. 26.49 s > │ │
  1022. 26.49 s > │ See https://symbolica.io/docs/get_started.html#license │
  1023. 26.49 s > └────────────────────────────────────────────────────────┘
  1024. 26.49 s > ┌───────────────────────────────────────────────────────────────────────────────────────────────────────────┐
  1025. 26.49 s > │ Cannot start new unlicensed Symbolica instance since there is already another one running on the machine. │
  1026. 26.49 s > └───────────────────────────────────────────────────────────────────────────────────────────────────────────┘
  1027. 26.49 s >
  1028. 26.49 s > stderr:
  1029. 26.49 s > ┌───────────────────────────────────┐
  1030. 26.49 s > │ The Symbolica license has expired │
  1031. 26.49 s > └───────────────────────────────────┘
  1032. 26.49 s >
  1033. 26.49 s >
  1034. 26.49 s > Location:
  1035. 26.49 s > tests/tests/test_python_api.rs:156:20
  1036. 26.49 s >
  1037. 26.49 s > FAIL [ 0.357s] (2/5) gammaloop-integration-tests::test_python_api python_evaluate_sample_preserves_graph_grouping_and_incoming_pdgs
  1038. 26.49 s > stdout ---
  1039. 26.49 s >
  1040. 26.49 s > running 1 test
  1041. 26.49 s > test python_evaluate_sample_preserves_graph_grouping_and_incoming_pdgs ... FAILED
  1042. 26.49 s >
  1043. 26.49 s > failures:
  1044. 26.49 s >
  1045. 26.49 s > failures:
  1046. 26.49 s > python_evaluate_sample_preserves_graph_grouping_and_incoming_pdgs
  1047. 26.49 s >
  1048. 26.49 s > test result: FAILED. 0 passed; 1 failed; 0 ignored; 0 measured; 4 filtered out; finished in 0.34s
  1049. 26.49 s >
  1050. 26.49 s > stderr ---
  1051. 26.49 s > Error: Python API test subprocess failed.
  1052. 26.49 s > stdout:
  1053. 26.49 s > ┌────────────────────────────────────────────────────────┐
  1054. 26.49 s > │ You are running a restricted Symbolica instance. │
  1055. 26.49 s > │ │
  1056. 26.49 s > │ This mode is only permitted for non-commercial use and │
  1057. 26.49 s > │ is limited to one instance and core per machine. │
  1058. 26.49 s > │ │
  1059. 26.49 s > │ Hobbyists can easily acquire a free license key │
  1060. 26.49 s > │ that unlocks all cores and removes this banner: │
  1061. 26.49 s > │ │
  1062. 26.49 s > │ from symbolica import * │
  1063. 26.49 s > │ request_hobbyist_license('YOUR_NAME', 'YOUR_EMAIL') │
  1064. 26.49 s > │ │
  1065. 26.49 s > │ All other users can obtain a free 30-day trial key: │
  1066. 26.49 s > │ │
  1067. 26.49 s > │ from symbolica import * │
  1068. 26.49 s > │ request_trial_license('NAME', 'EMAIL', 'EMPLOYER') │
  1069. 26.49 s > │ │
  1070. 26.49 s > │ See https://symbolica.io/docs/get_started.html#license │
  1071. 26.49 s > └────────────────────────────────────────────────────────┘
  1072. 26.49 s > ┌───────────────────────────────────────────────────────────────────────────────────────────────────────────┐
  1073. 26.49 s > │ Cannot start new unlicensed Symbolica instance since there is already another one running on the machine. │
  1074. 26.49 s > └───────────────────────────────────────────────────────────────────────────────────────────────────────────┘
  1075. 26.49 s >
  1076. 26.49 s > stderr:
  1077. 26.49 s > ┌───────────────────────────────────┐
  1078. 26.49 s > │ The Symbolica license has expired │
  1079. 26.49 s > └───────────────────────────────────┘
  1080. 26.49 s >
  1081. 26.49 s >
  1082. 26.49 s > Location:
  1083. 26.49 s > tests/tests/test_python_api.rs:156:20
  1084. 26.49 s >
  1085. 26.49 s > FAIL [ 0.361s] (3/5) gammaloop-integration-tests::test_python_api python_session_getters_return_live_toml_and_command_blocks
  1086. 26.49 s > stdout ---
  1087. 26.49 s >
  1088. 26.49 s > running 1 test
  1089. 26.49 s > test python_session_getters_return_live_toml_and_command_blocks ... FAILED
  1090. 26.49 s >
  1091. 26.49 s > failures:
  1092. 26.49 s >
  1093. 26.49 s > failures:
  1094. 26.49 s > python_session_getters_return_live_toml_and_command_blocks
  1095. 26.49 s >
  1096. 26.49 s > test result: FAILED. 0 passed; 1 failed; 0 ignored; 0 measured; 4 filtered out; finished in 0.35s
  1097. 26.49 s >
  1098. 26.49 s > stderr ---
  1099. 26.49 s > Error: Python API test subprocess failed.
  1100. 26.49 s > stdout:
  1101. 26.50 s > ┌────────────────────────────────────────────────────────┐
  1102. 26.50 s > │ You are running a restricted Symbolica instance. │
  1103. 26.50 s > │ │
  1104. 26.50 s > │ This mode is only permitted for non-commercial use and │
  1105. 26.50 s > │ is limited to one instance and core per machine. │
  1106. 26.50 s > │ │
  1107. 26.50 s > │ Hobbyists can easily acquire a free license key │
  1108. 26.50 s > │ that unlocks all cores and removes this banner: │
  1109. 26.50 s > │ │
  1110. 26.50 s > │ from symbolica import * │
  1111. 26.50 s > │ request_hobbyist_license('YOUR_NAME', 'YOUR_EMAIL') │
  1112. 26.50 s > │ │
  1113. 26.50 s > │ All other users can obtain a free 30-day trial key: │
  1114. 26.50 s > │ │
  1115. 26.50 s > │ from symbolica import * │
  1116. 26.50 s > │ request_trial_license('NAME', 'EMAIL', 'EMPLOYER') │
  1117. 26.50 s > │ │
  1118. 26.50 s > │ See https://symbolica.io/docs/get_started.html#license │
  1119. 26.50 s > └────────────────────────────────────────────────────────┘
  1120. 26.50 s > ┌───────────────────────────────────────────────────────────────────────────────────────────────────────────┐
  1121. 26.50 s > │ Cannot start new unlicensed Symbolica instance since there is already another one running on the machine. │
  1122. 26.50 s > └───────────────────────────────────────────────────────────────────────────────────────────────────────────┘
  1123. 26.50 s >
  1124. 26.50 s > stderr:
  1125. 26.50 s > ┌───────────────────────────────────┐
  1126. 26.50 s > │ The Symbolica license has expired │
  1127. 26.50 s > └───────────────────────────────────┘
  1128. 26.50 s >
  1129. 26.50 s >
  1130. 26.50 s > Location:
  1131. 26.50 s > tests/tests/test_python_api.rs:156:20
  1132. 26.50 s >
  1133. 26.50 s > FAIL [ 0.417s] (4/5) gammaloop-integration-tests::test_python_api python_evaluate_samples_batch_and_momentum_space_have_expected_shape
  1134. 26.50 s > stdout ---
  1135. 26.50 s >
  1136. 26.50 s > running 1 test
  1137. 26.50 s > test python_evaluate_samples_batch_and_momentum_space_have_expected_shape ... FAILED
  1138. 26.50 s >
  1139. 26.50 s > failures:
  1140. 26.50 s >
  1141. 26.50 s > failures:
  1142. 26.50 s > python_evaluate_samples_batch_and_momentum_space_have_expected_shape
  1143. 26.50 s >
  1144. 26.50 s > test result: FAILED. 0 passed; 1 failed; 0 ignored; 0 measured; 4 filtered out; finished in 0.41s
  1145. 26.50 s >
  1146. 26.50 s > stderr ---
  1147. 26.50 s > Error: Python API test subprocess failed.
  1148. 26.50 s > stdout:
  1149. 26.50 s > ┌────────────────────────────────────────────────────────┐
  1150. 26.50 s > │ You are running a restricted Symbolica instance. │
  1151. 26.50 s > │ │
  1152. 26.50 s > │ This mode is only permitted for non-commercial use and │
  1153. 26.50 s > │ is limited to one instance and core per machine. │
  1154. 26.50 s > │ │
  1155. 26.50 s > │ Hobbyists can easily acquire a free license key │
  1156. 26.50 s > │ that unlocks all cores and removes this banner: │
  1157. 26.50 s > │ │
  1158. 26.50 s > │ from symbolica import * │
  1159. 26.50 s > │ request_hobbyist_license('YOUR_NAME', 'YOUR_EMAIL') │
  1160. 26.50 s > │ │
  1161. 26.50 s > │ All other users can obtain a free 30-day trial key: │
  1162. 26.50 s > │ │
  1163. 26.50 s > │ from symbolica import * │
  1164. 26.50 s > │ request_trial_license('NAME', 'EMAIL', 'EMPLOYER') │
  1165. 26.50 s > │ │
  1166. 26.50 s > │ See https://symbolica.io/docs/get_started.html#license │
  1167. 26.50 s > └────────────────────────────────────────────────────────┘
  1168. 26.50 s > ┌───────────────────────────────────────────────────────────────────────────────────────────────────────────┐
  1169. 26.50 s > │ Cannot start new unlicensed Symbolica instance since there is already another one running on the machine. │
  1170. 26.50 s > └───────────────────────────────────────────────────────────────────────────────────────────────────────────┘
  1171. 26.50 s >
  1172. 26.50 s > stderr:
  1173. 26.50 s > ┌───────────────────────────────────┐
  1174. 26.50 s > │ The Symbolica license has expired │
  1175. 26.50 s > └───────────────────────────────────┘
  1176. 26.50 s > [2026-09-01 10:05:15.283] @gammaloop_api::se... INFO : Running command import model sm-default
  1177. 26.50 s > [2026-09-01 10:05:15.285] @import::model INFO : Loading built-in JSON model sm-default
  1178. 26.50 s > [2026-09-01 10:05:15.348] @gammalooprs::model INFO : The following 15 external parameters were forced to zero by the restriction card:
  1179. 26.50 s > lamWS, AWS, rhoWS, etaWS, ymc, yme, ymm, MC, Me, MM, WTau, muQ, muLe, muLmu, muLtau
  1180. 26.50 s > [2026-09-01 10:05:15.348] @gammalooprs::model INFO : The following 34 vertex rules were removed by the restriction card:
  1181. 26.50 s > V_82 -> (c~, d, G+) | V_83 -> (t~, d, G+) | V_84 -> (c~, s, G+) | V_85 -> (t~, s, G+) | V_86 -> (u~, b, G+) | V_87 -> (c~, b, G+) | V_90 -> (c~, d, W+) | V_91 -> (t~, d, W+) | V_92 -> (u~, s, W+) | V_94 -> (t~, s, W+) | V_95 -> (u~, b, W+) | V_96 -> (c~, b, W+) | V_101 -> (e+, e-, G0) | V_102 -> (mu+, mu-, G0) | V_104 -> (e+, e-, H) | V_105 -> (mu+, mu-, H) | V_110 -> (ve~, e-, G+) | V_111 -> (vm~, mu-, G+) | V_116 -> (b~, u, G-) | V_117 -> (d~, c, G-) | V_118 -> (s~, c, G-) | V_119 -> (b~, c, G-) | V_120 -> (d~, t, G-) | V_121 -> (s~, t, G-) | V_124 -> (s~, u, W-) | V_125 -> (b~, u, W-) | V_126 -> (d~, c, W-) | V_128 -> (b~, c, W-) | V_129 -> (d~, t, W-) | V_130 -> (s~, t, W-) | V_138 -> (c~, c, G0) | V_140 -> (c~, c, H) | V_145 -> (e+, ve, G-) | V_146 -> (mu+, vm, G-)
  1182. 26.50 s > [2026-09-01 10:05:15.348] @gammalooprs::model INFO : The following 36 couplings were removed by the restriction card:
  1183. 26.50 s > GC_13, GC_14, GC_16, GC_17, GC_18, GC_19, GC_20, GC_22, GC_23, GC_24, GC_25, GC_26, GC_28, GC_29, GC_42, GC_43, GC_44, GC_46, GC_47, GC_48, GC_84, GC_85, GC_86, GC_87, GC_88, GC_89, GC_90, GC_91, GC_92, GC_93, GC_101, GC_102, GC_103, GC_105, GC_106, GC_107
  1184. 26.50 s > [2026-09-01 10:05:15.359] @gammaloop_api::se... INFO : Running command set default-runtime kv kinematics.externals='{"type":"constant","data":{"momenta":[[32.0,0.0,0.0,32.0],[32.0,0.0,0.0,-32.0]],"helicities":[1,1]}}'
  1185. 26.50 s > [2026-09-01 10:05:15.360] @gammaloop_api::se... INFO : Running command set default-runtime kv subtraction.disable_threshold_subtraction=true
  1186. 26.50 s > [2026-09-01 10:05:15.361] @gammaloop_api::se... INFO : Running command generate xs e+ e- > d d~ g | e- a d g QED^2==4 [{{2}} QCD=0] --numerator-grouping group_identical_graphs_up_to_sign --clear-existing-processes --only-diagrams
  1187. 26.50 s > [2026-09-01 10:05:15.380] @feyngen::diagram_... INFO : 0s | Δ=0s | Starting Feynman graph generation with Symbolica...
  1188. 26.50 s > [2026-09-01 10:05:15.386] @feyngen::diagram_... INFO : 0s | Δ=0s | Number of graphs resulting from Symbolica generation: 246
  1189. 26.50 s > [2026-09-01 10:05:15.388] @feyngen::diagram_... INFO : 0s | Δ=0s | Number of graphs retained after enforcing supergraph particle content: 8
  1190. 26.50 s > [2026-09-01 10:05:15.388] @feyngen::diagram_... INFO : 0s | Δ=0s | Number of graphs retained after removal of vetoed topologies: 8
  1191. 26.50 s > [2026-09-01 10:05:15.389] @feyngen::diagram_... INFO : 0s | Δ=0s | Number of graphs after vertex info assignment: 8
  1192. 26.50 s > [2026-09-01 10:05:15.389] @feyngen::diagram_... INFO : 0s | Δ=0s | Number of graphs after all complete graphs filters are applied: 8
  1193. 26.50 s >
  1194. 26.50 s >
  1195. 26.50 s > Location:
  1196. 26.50 s > tests/tests/test_python_api.rs:156:20
  1197. 26.50 s >
  1198. 26.50 s > FAIL [ 0.447s] (5/5) gammaloop-integration-tests::test_python_api python_settings_wrappers_expose_nested_runtime_and_global_settings
  1199. 26.50 s > stdout ---
  1200. 26.50 s >
  1201. 26.50 s > running 1 test
  1202. 26.50 s > test python_settings_wrappers_expose_nested_runtime_and_global_settings ... FAILED
  1203. 26.50 s >
  1204. 26.50 s > failures:
  1205. 26.50 s >
  1206. 26.50 s > failures:
  1207. 26.50 s > python_settings_wrappers_expose_nested_runtime_and_global_settings
  1208. 26.50 s >
  1209. 26.50 s > test result: FAILED. 0 passed; 1 failed; 0 ignored; 0 measured; 4 filtered out; finished in 0.44s
  1210. 26.50 s >
  1211. 26.50 s > stderr ---
  1212. 26.50 s > Error: Python API test subprocess failed.
  1213. 26.50 s > stdout:
  1214. 26.50 s > ┌────────────────────────────────────────────────────────┐
  1215. 26.50 s > │ You are running a restricted Symbolica instance. │
  1216. 26.50 s > │ │
  1217. 26.50 s > │ This mode is only permitted for non-commercial use and │
  1218. 26.50 s > │ is limited to one instance and core per machine. │
  1219. 26.50 s > │ │
  1220. 26.50 s > │ Hobbyists can easily acquire a free license key │
  1221. 26.50 s > │ that unlocks all cores and removes this banner: │
  1222. 26.50 s > │ │
  1223. 26.50 s > │ from symbolica import * │
  1224. 26.50 s > │ request_hobbyist_license('YOUR_NAME', 'YOUR_EMAIL') │
  1225. 26.50 s > │ │
  1226. 26.50 s > │ All other users can obtain a free 30-day trial key: │
  1227. 26.50 s > │ │
  1228. 26.50 s > │ from symbolica import * │
  1229. 26.50 s > │ request_trial_license('NAME', 'EMAIL', 'EMPLOYER') │
  1230. 26.50 s > │ │
  1231. 26.50 s > │ See https://symbolica.io/docs/get_started.html#license │
  1232. 26.50 s > └────────────────────────────────────────────────────────┘
  1233. 26.50 s > ┌───────────────────────────────────────────────────────────────────────────────────────────────────────────┐
  1234. 26.50 s > │ Cannot start new unlicensed Symbolica instance since there is already another one running on the machine. │
  1235. 26.50 s > └───────────────────────────────────────────────────────────────────────────────────────────────────────────┘
  1236. 26.50 s >
  1237. 26.50 s > stderr:
  1238. 26.50 s > ┌───────────────────────────────────┐
  1239. 26.50 s > │ The Symbolica license has expired │
  1240. 26.50 s > └───────────────────────────────────┘
  1241. 26.50 s >
  1242. 26.50 s >
  1243. 26.50 s > Location:
  1244. 26.50 s > tests/tests/test_python_api.rs:156:20
  1245. 26.50 s >
  1246. 26.50 s > ------------
  1247. 26.50 s > Summary [ 0.449s] 5 tests run: 0 passed, 5 failed, 0 skipped
  1248. 26.50 s > FAIL [ 0.344s] (1/5) gammaloop-integration-tests::test_python_api python_evaluate_sample_honors_generate_events_and_observable_snapshots
  1249. 26.50 s > stdout ---
  1250. 26.50 s >
  1251. 26.50 s > running 1 test
  1252. 26.50 s > test python_evaluate_sample_honors_generate_events_and_observable_snapshots ... FAILED
  1253. 26.50 s >
  1254. 26.50 s > failures:
  1255. 26.50 s >
  1256. 26.50 s > failures:
  1257. 26.50 s > python_evaluate_sample_honors_generate_events_and_observable_snapshots
  1258. 26.50 s >
  1259. 26.50 s > test result: FAILED. 0 passed; 1 failed; 0 ignored; 0 measured; 4 filtered out; finished in 0.33s
  1260. 26.50 s >
  1261. 26.50 s > stderr ---
  1262. 26.50 s > Error: Python API test subprocess failed.
  1263. 26.50 s > stdout:
  1264. 26.50 s > ┌────────────────────────────────────────────────────────┐
  1265. 26.50 s > │ You are running a restricted Symbolica instance. │
  1266. 26.50 s > │ │
  1267. 26.50 s > │ This mode is only permitted for non-commercial use and │
  1268. 26.50 s > │ is limited to one instance and core per machine. │
  1269. 26.50 s > │ │
  1270. 26.50 s > │ Hobbyists can easily acquire a free license key │
  1271. 26.50 s > │ that unlocks all cores and removes this banner: │
  1272. 26.50 s > │ │
  1273. 26.50 s > │ from symbolica import * │
  1274. 26.50 s > │ request_hobbyist_license('YOUR_NAME', 'YOUR_EMAIL') │
  1275. 26.50 s > │ │
  1276. 26.50 s > │ All other users can obtain a free 30-day trial key: │
  1277. 26.50 s > │ │
  1278. 26.50 s > │ from symbolica import * │
  1279. 26.50 s > │ request_trial_license('NAME', 'EMAIL', 'EMPLOYER') │
  1280. 26.50 s > │ │
  1281. 26.50 s > │ See https://symbolica.io/docs/get_started.html#license │
  1282. 26.50 s > └────────────────────────────────────────────────────────┘
  1283. 26.50 s > ┌───────────────────────────────────────────────────────────────────────────────────────────────────────────┐
  1284. 26.50 s > │ Cannot start new unlicensed Symbolica instance since there is already another one running on the machine. │
  1285. 26.50 s > └───────────────────────────────────────────────────────────────────────────────────────────────────────────┘
  1286. 26.50 s >
  1287. 26.50 s > stderr:
  1288. 26.50 s > ┌───────────────────────────────────┐
  1289. 26.50 s > │ The Symbolica license has expired │
  1290. 26.50 s > └───────────────────────────────────┘
  1291. 26.50 s >
  1292. 26.50 s >
  1293. 26.50 s > Location:
  1294. 26.50 s > tests/tests/test_python_api.rs:156:20
  1295. 26.50 s >
  1296. 26.50 s > FAIL [ 0.357s] (2/5) gammaloop-integration-tests::test_python_api python_evaluate_sample_preserves_graph_grouping_and_incoming_pdgs
  1297. 26.50 s > stdout ---
  1298. 26.50 s >
  1299. 26.50 s > running 1 test
  1300. 26.50 s > test python_evaluate_sample_preserves_graph_grouping_and_incoming_pdgs ... FAILED
  1301. 26.50 s >
  1302. 26.50 s > failures:
  1303. 26.50 s >
  1304. 26.50 s > failures:
  1305. 26.50 s > python_evaluate_sample_preserves_graph_grouping_and_incoming_pdgs
  1306. 26.50 s >
  1307. 26.50 s > test result: FAILED. 0 passed; 1 failed; 0 ignored; 0 measured; 4 filtered out; finished in 0.34s
  1308. 26.50 s >
  1309. 26.50 s > stderr ---
  1310. 26.50 s > Error: Python API test subprocess failed.
  1311. 26.50 s > stdout:
  1312. 26.50 s > ┌────────────────────────────────────────────────────────┐
  1313. 26.50 s > │ You are running a restricted Symbolica instance. │
  1314. 26.50 s > │ │
  1315. 26.50 s > │ This mode is only permitted for non-commercial use and │
  1316. 26.50 s > │ is limited to one instance and core per machine. │
  1317. 26.50 s > │ │
  1318. 26.50 s > │ Hobbyists can easily acquire a free license key │
  1319. 26.50 s > │ that unlocks all cores and removes this banner: │
  1320. 26.50 s > │ │
  1321. 26.50 s > │ from symbolica import * │
  1322. 26.50 s > │ request_hobbyist_license('YOUR_NAME', 'YOUR_EMAIL') │
  1323. 26.50 s > │ │
  1324. 26.50 s > │ All other users can obtain a free 30-day trial key: │
  1325. 26.50 s > │ │
  1326. 26.50 s > │ from symbolica import * │
  1327. 26.50 s > │ request_trial_license('NAME', 'EMAIL', 'EMPLOYER') │
  1328. 26.50 s > │ │
  1329. 26.50 s > │ See https://symbolica.io/docs/get_started.html#license │
  1330. 26.50 s > └────────────────────────────────────────────────────────┘
  1331. 26.50 s > ┌───────────────────────────────────────────────────────────────────────────────────────────────────────────┐
  1332. 26.50 s > │ Cannot start new unlicensed Symbolica instance since there is already another one running on the machine. │
  1333. 26.50 s > └───────────────────────────────────────────────────────────────────────────────────────────────────────────┘
  1334. 26.50 s >
  1335. 26.50 s > stderr:
  1336. 26.50 s > ┌───────────────────────────────────┐
  1337. 26.50 s > │ The Symbolica license has expired │
  1338. 26.50 s > └───────────────────────────────────┘
  1339. 26.50 s >
  1340. 26.50 s >
  1341. 26.50 s > Location:
  1342. 26.50 s > tests/tests/test_python_api.rs:156:20
  1343. 26.50 s >
  1344. 26.50 s > FAIL [ 0.361s] (3/5) gammaloop-integration-tests::test_python_api python_session_getters_return_live_toml_and_command_blocks
  1345. 26.50 s > stdout ---
  1346. 26.50 s >
  1347. 26.50 s > running 1 test
  1348. 26.50 s > test python_session_getters_return_live_toml_and_command_blocks ... FAILED
  1349. 26.50 s >
  1350. 26.50 s > failures:
  1351. 26.50 s >
  1352. 26.50 s > failures:
  1353. 26.50 s > python_session_getters_return_live_toml_and_command_blocks
  1354. 26.50 s >
  1355. 26.50 s > test result: FAILED. 0 passed; 1 failed; 0 ignored; 0 measured; 4 filtered out; finished in 0.35s
  1356. 26.50 s >
  1357. 26.50 s > stderr ---
  1358. 26.50 s > Error: Python API test subprocess failed.
  1359. 26.50 s > stdout:
  1360. 26.50 s > ┌────────────────────────────────────────────────────────┐
  1361. 26.50 s > │ You are running a restricted Symbolica instance. │
  1362. 26.50 s > │ │
  1363. 26.50 s > │ This mode is only permitted for non-commercial use and │
  1364. 26.50 s > │ is limited to one instance and core per machine. │
  1365. 26.50 s > │ │
  1366. 26.50 s > │ Hobbyists can easily acquire a free license key │
  1367. 26.50 s > │ that unlocks all cores and removes this banner: │
  1368. 26.50 s > │ │
  1369. 26.50 s > │ from symbolica import * │
  1370. 26.50 s > │ request_hobbyist_license('YOUR_NAME', 'YOUR_EMAIL') │
  1371. 26.50 s > │ │
  1372. 26.50 s > │ All other users can obtain a free 30-day trial key: │
  1373. 26.50 s > │ │
  1374. 26.50 s > │ from symbolica import * │
  1375. 26.50 s > │ request_trial_license('NAME', 'EMAIL', 'EMPLOYER') │
  1376. 26.50 s > │ │
  1377. 26.50 s > │ See https://symbolica.io/docs/get_started.html#license │
  1378. 26.50 s > └────────────────────────────────────────────────────────┘
  1379. 26.50 s > ┌───────────────────────────────────────────────────────────────────────────────────────────────────────────┐
  1380. 26.50 s > │ Cannot start new unlicensed Symbolica instance since there is already another one running on the machine. │
  1381. 26.50 s > └───────────────────────────────────────────────────────────────────────────────────────────────────────────┘
  1382. 26.50 s >
  1383. 26.50 s > stderr:
  1384. 26.50 s > ┌───────────────────────────────────┐
  1385. 26.50 s > │ The Symbolica license has expired │
  1386. 26.50 s > └───────────────────────────────────┘
  1387. 26.50 s >
  1388. 26.50 s >
  1389. 26.50 s > Location:
  1390. 26.50 s > tests/tests/test_python_api.rs:156:20
  1391. 26.50 s >
  1392. 26.50 s > FAIL [ 0.417s] (4/5) gammaloop-integration-tests::test_python_api python_evaluate_samples_batch_and_momentum_space_have_expected_shape
  1393. 26.50 s > stdout ---
  1394. 26.50 s >
  1395. 26.50 s > running 1 test
  1396. 26.50 s > test python_evaluate_samples_batch_and_momentum_space_have_expected_shape ... FAILED
  1397. 26.50 s >
  1398. 26.50 s > failures:
  1399. 26.50 s >
  1400. 26.50 s > failures:
  1401. 26.50 s > python_evaluate_samples_batch_and_momentum_space_have_expected_shape
  1402. 26.50 s >
  1403. 26.50 s > test result: FAILED. 0 passed; 1 failed; 0 ignored; 0 measured; 4 filtered out; finished in 0.41s
  1404. 26.50 s >
  1405. 26.50 s > stderr ---
  1406. 26.50 s > Error: Python API test subprocess failed.
  1407. 26.50 s > stdout:
  1408. 26.50 s > ┌────────────────────────────────────────────────────────┐
  1409. 26.50 s > │ You are running a restricted Symbolica instance. │
  1410. 26.50 s > │ │
  1411. 26.50 s > │ This mode is only permitted for non-commercial use and │
  1412. 26.50 s > │ is limited to one instance and core per machine. │
  1413. 26.50 s > │ │
  1414. 26.50 s > │ Hobbyists can easily acquire a free license key │
  1415. 26.50 s > │ that unlocks all cores and removes this banner: │
  1416. 26.50 s > │ │
  1417. 26.50 s > │ from symbolica import * │
  1418. 26.50 s > │ request_hobbyist_license('YOUR_NAME', 'YOUR_EMAIL') │
  1419. 26.50 s > │ │
  1420. 26.50 s > │ All other users can obtain a free 30-day trial key: │
  1421. 26.50 s > │ │
  1422. 26.50 s > │ from symbolica import * │
  1423. 26.50 s > │ request_trial_license('NAME', 'EMAIL', 'EMPLOYER') │
  1424. 26.50 s > │ │
  1425. 26.50 s > │ See https://symbolica.io/docs/get_started.html#license │
  1426. 26.50 s > └────────────────────────────────────────────────────────┘
  1427. 26.50 s > ┌───────────────────────────────────────────────────────────────────────────────────────────────────────────┐
  1428. 26.50 s > │ Cannot start new unlicensed Symbolica instance since there is already another one running on the machine. │
  1429. 26.50 s > └───────────────────────────────────────────────────────────────────────────────────────────────────────────┘
  1430. 26.50 s >
  1431. 26.50 s > stderr:
  1432. 26.50 s > ┌───────────────────────────────────┐
  1433. 26.50 s > │ The Symbolica license has expired │
  1434. 26.50 s > └───────────────────────────────────┘
  1435. 26.50 s > [2026-09-01 10:05:15.283] @gammaloop_api::se... INFO : Running command import model sm-default
  1436. 26.50 s > [2026-09-01 10:05:15.285] @import::model INFO : Loading built-in JSON model sm-default
  1437. 26.50 s > [2026-09-01 10:05:15.348] @gammalooprs::model INFO : The following 15 external parameters were forced to zero by the restriction card:
  1438. 26.50 s > lamWS, AWS, rhoWS, etaWS, ymc, yme, ymm, MC, Me, MM, WTau, muQ, muLe, muLmu, muLtau
  1439. 26.50 s > [2026-09-01 10:05:15.348] @gammalooprs::model INFO : The following 34 vertex rules were removed by the restriction card:
  1440. 26.50 s > V_82 -> (c~, d, G+) | V_83 -> (t~, d, G+) | V_84 -> (c~, s, G+) | V_85 -> (t~, s, G+) | V_86 -> (u~, b, G+) | V_87 -> (c~, b, G+) | V_90 -> (c~, d, W+) | V_91 -> (t~, d, W+) | V_92 -> (u~, s, W+) | V_94 -> (t~, s, W+) | V_95 -> (u~, b, W+) | V_96 -> (c~, b, W+) | V_101 -> (e+, e-, G0) | V_102 -> (mu+, mu-, G0) | V_104 -> (e+, e-, H) | V_105 -> (mu+, mu-, H) | V_110 -> (ve~, e-, G+) | V_111 -> (vm~, mu-, G+) | V_116 -> (b~, u, G-) | V_117 -> (d~, c, G-) | V_118 -> (s~, c, G-) | V_119 -> (b~, c, G-) | V_120 -> (d~, t, G-) | V_121 -> (s~, t, G-) | V_124 -> (s~, u, W-) | V_125 -> (b~, u, W-) | V_126 -> (d~, c, W-) | V_128 -> (b~, c, W-) | V_129 -> (d~, t, W-) | V_130 -> (s~, t, W-) | V_138 -> (c~, c, G0) | V_140 -> (c~, c, H) | V_145 -> (e+, ve, G-) | V_146 -> (mu+, vm, G-)
  1441. 26.50 s > [2026-09-01 10:05:15.348] @gammalooprs::model INFO : The following 36 couplings were removed by the restriction card:
  1442. 26.50 s > GC_13, GC_14, GC_16, GC_17, GC_18, GC_19, GC_20, GC_22, GC_23, GC_24, GC_25, GC_26, GC_28, GC_29, GC_42, GC_43, GC_44, GC_46, GC_47, GC_48, GC_84, GC_85, GC_86, GC_87, GC_88, GC_89, GC_90, GC_91, GC_92, GC_93, GC_101, GC_102, GC_103, GC_105, GC_106, GC_107
  1443. 26.50 s > [2026-09-01 10:05:15.359] @gammaloop_api::se... INFO : Running command set default-runtime kv kinematics.externals='{"type":"constant","data":{"momenta":[[32.0,0.0,0.0,32.0],[32.0,0.0,0.0,-32.0]],"helicities":[1,1]}}'
  1444. 26.50 s > [2026-09-01 10:05:15.360] @gammaloop_api::se... INFO : Running command set default-runtime kv subtraction.disable_threshold_subtraction=true
  1445. 26.50 s > [2026-09-01 10:05:15.361] @gammaloop_api::se... INFO : Running command generate xs e+ e- > d d~ g | e- a d g QED^2==4 [{{2}} QCD=0] --numerator-grouping group_identical_graphs_up_to_sign --clear-existing-processes --only-diagrams
  1446. 26.50 s > [2026-09-01 10:05:15.380] @feyngen::diagram_... INFO : 0s | Δ=0s | Starting Feynman graph generation with Symbolica...
  1447. 26.50 s > [2026-09-01 10:05:15.386] @feyngen::diagram_... INFO : 0s | Δ=0s | Number of graphs resulting from Symbolica generation: 246
  1448. 26.50 s > [2026-09-01 10:05:15.388] @feyngen::diagram_... INFO : 0s | Δ=0s | Number of graphs retained after enforcing supergraph particle content: 8
  1449. 26.50 s > [2026-09-01 10:05:15.388] @feyngen::diagram_... INFO : 0s | Δ=0s | Number of graphs retained after removal of vetoed topologies: 8
  1450. 26.50 s > [2026-09-01 10:05:15.389] @feyngen::diagram_... INFO : 0s | Δ=0s | Number of graphs after vertex info assignment: 8
  1451. 26.50 s > [2026-09-01 10:05:15.389] @feyngen::diagram_... INFO : 0s | Δ=0s | Number of graphs after all complete graphs filters are applied: 8
  1452. 26.50 s >
  1453. 26.50 s >
  1454. 26.50 s > Location:
  1455. 26.50 s > tests/tests/test_python_api.rs:156:20
  1456. 26.50 s >
  1457. 26.50 s > FAIL [ 0.447s] (5/5) gammaloop-integration-tests::test_python_api python_settings_wrappers_expose_nested_runtime_and_global_settings
  1458. 26.50 s > stdout ---
  1459. 26.50 s >
  1460. 26.50 s > running 1 test
  1461. 26.50 s > test python_settings_wrappers_expose_nested_runtime_and_global_settings ... FAILED
  1462. 26.50 s >
  1463. 26.50 s > failures:
  1464. 26.50 s >
  1465. 26.50 s > failures:
  1466. 26.50 s > python_settings_wrappers_expose_nested_runtime_and_global_settings
  1467. 26.50 s >
  1468. 26.50 s > test result: FAILED. 0 passed; 1 failed; 0 ignored; 0 measured; 4 filtered out; finished in 0.44s
  1469. 26.50 s >
  1470. 26.50 s > stderr ---
  1471. 26.50 s > Error: Python API test subprocess failed.
  1472. 26.50 s > stdout:
  1473. 26.50 s > ┌────────────────────────────────────────────────────────┐
  1474. 26.50 s > │ You are running a restricted Symbolica instance. │
  1475. 26.50 s > │ │
  1476. 26.50 s > │ This mode is only permitted for non-commercial use and │
  1477. 26.50 s > │ is limited to one instance and core per machine. │
  1478. 26.50 s > │ │
  1479. 26.50 s > │ Hobbyists can easily acquire a free license key │
  1480. 26.50 s > │ that unlocks all cores and removes this banner: │
  1481. 26.50 s > │ │
  1482. 26.50 s > │ from symbolica import * │
  1483. 26.50 s > │ request_hobbyist_license('YOUR_NAME', 'YOUR_EMAIL') │
  1484. 26.50 s > │ │
  1485. 26.50 s > │ All other users can obtain a free 30-day trial key: │
  1486. 26.50 s > │ │
  1487. 26.50 s > │ from symbolica import * │
  1488. 26.50 s > │ request_trial_license('NAME', 'EMAIL', 'EMPLOYER') │
  1489. 26.50 s > │ │
  1490. 26.50 s > │ See https://symbolica.io/docs/get_started.html#license │
  1491. 26.50 s > └────────────────────────────────────────────────────────┘
  1492. 26.50 s > ┌───────────────────────────────────────────────────────────────────────────────────────────────────────────┐
  1493. 26.50 s > │ Cannot start new unlicensed Symbolica instance since there is already another one running on the machine. │
  1494. 26.50 s > └───────────────────────────────────────────────────────────────────────────────────────────────────────────┘
  1495. 26.50 s >
  1496. 26.50 s > stderr:
  1497. 26.50 s > ┌───────────────────────────────────┐
  1498. 26.50 s > │ The Symbolica license has expired │
  1499. 26.50 s > └───────────────────────────────────┘
  1500. 26.50 s >
  1501. 26.50 s >
  1502. 26.50 s > Location:
  1503. 26.50 s > tests/tests/test_python_api.rs:156:20
  1504. 26.50 s >
  1505. 26.50 s > error: test run failed
  1506. 26.50 s >
  1507. 26.50 s > ========== nextest test summary ==========
  1508. 26.50 s > report: target/nextest/ci_gammaloop/junit.xml
  1509. 26.50 s > tests: 5, failures: 5, errors: 0
  1510. 26.50 s >
  1511. 26.50 s > 1. gammaloop-integration-tests::test_python_api::python_evaluate_sample_honors_generate_events_and_observable_snapshots
  1512. 26.50 s > failure: test failure with exit code 101
  1513. 26.50 s > Error: Python API test subprocess failed.
  1514. 26.50 s > stdout:
  1515. 26.50 s > ┌────────────────────────────────────────────────────────┐
  1516. 26.50 s > │ You are running a restricted Symbolica instance. │
  1517. 26.50 s > │ │
  1518. 26.50 s > │ This mode is only permitted for non-commercial use and │
  1519. 26.50 s > │ is limited to one instance and core per machine. │
  1520. 26.50 s > │ │
  1521. 26.50 s > │ Hobbyists can easily acquire a free license key │
  1522. 26.50 s > │ that unlocks all cores and removes this banner: │
  1523. 26.50 s > │ │
  1524. 26.50 s > │ from symbolica import * │
  1525. 26.50 s > │ request_hobbyist_license('YOUR_NAME', 'YOUR_EMAIL') │
  1526. 26.50 s > │ │
  1527. 26.50 s > │ All other users can obtain a free 30-day trial key: │
  1528. 26.50 s > │ │
  1529. 26.50 s > │ from symbolica import * │
  1530. 26.50 s > │ request_trial_license('NAME', 'EMAIL', 'EMPLOYER') │
  1531. 26.50 s > │ │
  1532. 26.50 s > │ See https://symbolica.io/docs/get_started.html#license │
  1533. 26.50 s > └────────────────────────────────────────────────────────┘
  1534. 26.50 s > ┌───────────────────────────────────────────────────────────────────────────────────────────────────────────┐
  1535. 26.50 s > │ Cannot start new unlicensed Symbolica instance since there is already another one running on the machine. │
  1536. 26.50 s > └───────────────────────────────────────────────────────────────────────────────────────────────────────────┘
  1537. 26.50 s >
  1538. 26.50 s > stderr:
  1539. 26.50 s > ┌───────────────────────────────────┐
  1540. 26.50 s > │ The Symbolica license has expired │
  1541. 26.50 s > └───────────────────────────────────┘
  1542. 26.50 s >
  1543. 26.50 s >
  1544. 26.50 s > Location:
  1545. 26.50 s > tests/tests/test_python_api.rs:156:20
  1546. 26.50 s > system-out
  1547. 26.50 s > running 1 test
  1548. 26.50 s > test python_evaluate_sample_honors_generate_events_and_observable_snapshots ... FAILED
  1549. 26.50 s >
  1550. 26.50 s > failures:
  1551. 26.50 s >
  1552. 26.50 s > failures:
  1553. 26.50 s > python_evaluate_sample_honors_generate_events_and_observable_snapshots
  1554. 26.50 s >
  1555. 26.50 s > test result: FAILED. 0 passed; 1 failed; 0 ignored; 0 measured; 4 filtered out; finished in 0.33s
  1556. 26.50 s > system-err
  1557. 26.50 s > Error: Python API test subprocess failed.
  1558. 26.50 s > stdout:
  1559. 26.50 s > ┌────────────────────────────────────────────────────────┐
  1560. 26.50 s > │ You are running a restricted Symbolica instance. │
  1561. 26.50 s > │ │
  1562. 26.50 s > │ This mode is only permitted for non-commercial use and │
  1563. 26.50 s > │ is limited to one instance and core per machine. │
  1564. 26.50 s > │ │
  1565. 26.50 s > │ Hobbyists can easily acquire a free license key │
  1566. 26.50 s > │ that unlocks all cores and removes this banner: │
  1567. 26.50 s > │ │
  1568. 26.50 s > │ from symbolica import * │
  1569. 26.50 s > │ request_hobbyist_license('YOUR_NAME', 'YOUR_EMAIL') │
  1570. 26.50 s > │ │
  1571. 26.50 s > │ All other users can obtain a free 30-day trial key: │
  1572. 26.50 s > │ │
  1573. 26.50 s > │ from symbolica import * │
  1574. 26.50 s > │ request_trial_license('NAME', 'EMAIL', 'EMPLOYER') │
  1575. 26.50 s > │ │
  1576. 26.50 s > │ See https://symbolica.io/docs/get_started.html#license │
  1577. 26.50 s > └────────────────────────────────────────────────────────┘
  1578. 26.50 s > ┌───────────────────────────────────────────────────────────────────────────────────────────────────────────┐
  1579. 26.50 s > │ Cannot start new unlicensed Symbolica instance since there is already another one running on the machine. │
  1580. 26.50 s > └───────────────────────────────────────────────────────────────────────────────────────────────────────────┘
  1581. 26.50 s >
  1582. 26.50 s > stderr:
  1583. 26.50 s > ┌───────────────────────────────────┐
  1584. 26.50 s > │ The Symbolica license has expired │
  1585. 26.50 s > └───────────────────────────────────┘
  1586. 26.50 s >
  1587. 26.50 s >
  1588. 26.50 s > Location:
  1589. 26.50 s > tests/tests/test_python_api.rs:156:20
  1590. 26.50 s >
  1591. 26.50 s > 2. gammaloop-integration-tests::test_python_api::python_evaluate_sample_preserves_graph_grouping_and_incoming_pdgs
  1592. 26.50 s > failure: test failure with exit code 101
  1593. 26.50 s > Error: Python API test subprocess failed.
  1594. 26.50 s > stdout:
  1595. 26.50 s > ┌────────────────────────────────────────────────────────┐
  1596. 26.50 s > │ You are running a restricted Symbolica instance. │
  1597. 26.50 s > │ │
  1598. 26.50 s > │ This mode is only permitted for non-commercial use and │
  1599. 26.50 s > │ is limited to one instance and core per machine. │
  1600. 26.50 s > │ │
  1601. 26.50 s > │ Hobbyists can easily acquire a free license key │
  1602. 26.50 s > │ that unlocks all cores and removes this banner: │
  1603. 26.50 s > │ │
  1604. 26.50 s > │ from symbolica import * │
  1605. 26.50 s > │ request_hobbyist_license('YOUR_NAME', 'YOUR_EMAIL') │
  1606. 26.50 s > │ │
  1607. 26.50 s > │ All other users can obtain a free 30-day trial key: │
  1608. 26.50 s > │ │
  1609. 26.50 s > │ from symbolica import * │
  1610. 26.50 s > │ request_trial_license('NAME', 'EMAIL', 'EMPLOYER') │
  1611. 26.50 s > │ │
  1612. 26.50 s > │ See https://symbolica.io/docs/get_started.html#license │
  1613. 26.50 s > └────────────────────────────────────────────────────────┘
  1614. 26.50 s > ┌───────────────────────────────────────────────────────────────────────────────────────────────────────────┐
  1615. 26.50 s > │ Cannot start new unlicensed Symbolica instance since there is already another one running on the machine. │
  1616. 26.50 s > └───────────────────────────────────────────────────────────────────────────────────────────────────────────┘
  1617. 26.50 s >
  1618. 26.50 s > stderr:
  1619. 26.50 s > ┌───────────────────────────────────┐
  1620. 26.50 s > │ The Symbolica license has expired │
  1621. 26.50 s > └───────────────────────────────────┘
  1622. 26.50 s >
  1623. 26.50 s >
  1624. 26.50 s > Location:
  1625. 26.50 s > tests/tests/test_python_api.rs:156:20
  1626. 26.50 s > system-out
  1627. 26.50 s > running 1 test
  1628. 26.50 s > test python_evaluate_sample_preserves_graph_grouping_and_incoming_pdgs ... FAILED
  1629. 26.50 s >
  1630. 26.50 s > failures:
  1631. 26.50 s >
  1632. 26.50 s > failures:
  1633. 26.50 s > python_evaluate_sample_preserves_graph_grouping_and_incoming_pdgs
  1634. 26.50 s >
  1635. 26.50 s > test result: FAILED. 0 passed; 1 failed; 0 ignored; 0 measured; 4 filtered out; finished in 0.34s
  1636. 26.50 s > system-err
  1637. 26.50 s > Error: Python API test subprocess failed.
  1638. 26.50 s > stdout:
  1639. 26.50 s > ┌────────────────────────────────────────────────────────┐
  1640. 26.50 s > │ You are running a restricted Symbolica instance. │
  1641. 26.50 s > │ │
  1642. 26.50 s > │ This mode is only permitted for non-commercial use and │
  1643. 26.50 s > │ is limited to one instance and core per machine. │
  1644. 26.50 s > │ │
  1645. 26.50 s > │ Hobbyists can easily acquire a free license key │
  1646. 26.50 s > │ that unlocks all cores and removes this banner: │
  1647. 26.50 s > │ │
  1648. 26.50 s > │ from symbolica import * │
  1649. 26.50 s > │ request_hobbyist_license('YOUR_NAME', 'YOUR_EMAIL') │
  1650. 26.50 s > │ │
  1651. 26.50 s > │ All other users can obtain a free 30-day trial key: │
  1652. 26.50 s > │ │
  1653. 26.50 s > │ from symbolica import * │
  1654. 26.50 s > │ request_trial_license('NAME', 'EMAIL', 'EMPLOYER') │
  1655. 26.50 s > │ │
  1656. 26.50 s > │ See https://symbolica.io/docs/get_started.html#license │
  1657. 26.50 s > └────────────────────────────────────────────────────────┘
  1658. 26.50 s > ┌───────────────────────────────────────────────────────────────────────────────────────────────────────────┐
  1659. 26.50 s > │ Cannot start new unlicensed Symbolica instance since there is already another one running on the machine. │
  1660. 26.50 s > └───────────────────────────────────────────────────────────────────────────────────────────────────────────┘
  1661. 26.50 s >
  1662. 26.50 s > stderr:
  1663. 26.50 s > ┌───────────────────────────────────┐
  1664. 26.50 s > │ The Symbolica license has expired │
  1665. 26.50 s > └───────────────────────────────────┘
  1666. 26.50 s >
  1667. 26.50 s >
  1668. 26.50 s > Location:
  1669. 26.50 s > tests/tests/test_python_api.rs:156:20
  1670. 26.50 s >
  1671. 26.50 s > 3. gammaloop-integration-tests::test_python_api::python_session_getters_return_live_toml_and_command_blocks
  1672. 26.50 s > failure: test failure with exit code 101
  1673. 26.50 s > Error: Python API test subprocess failed.
  1674. 26.50 s > stdout:
  1675. 26.50 s > ┌────────────────────────────────────────────────────────┐
  1676. 26.50 s > │ You are running a restricted Symbolica instance. │
  1677. 26.50 s > │ │
  1678. 26.50 s > │ This mode is only permitted for non-commercial use and │
  1679. 26.50 s > │ is limited to one instance and core per machine. │
  1680. 26.50 s > │ │
  1681. 26.50 s > │ Hobbyists can easily acquire a free license key │
  1682. 26.50 s > │ that unlocks all cores and removes this banner: │
  1683. 26.50 s > │ │
  1684. 26.50 s > │ from symbolica import * │
  1685. 26.50 s > │ request_hobbyist_license('YOUR_NAME', 'YOUR_EMAIL') │
  1686. 26.50 s > │ │
  1687. 26.50 s > │ All other users can obtain a free 30-day trial key: │
  1688. 26.50 s > │ │
  1689. 26.50 s > │ from symbolica import * │
  1690. 26.50 s > │ request_trial_license('NAME', 'EMAIL', 'EMPLOYER') │
  1691. 26.50 s > │ │
  1692. 26.50 s > │ See https://symbolica.io/docs/get_started.html#license │
  1693. 26.50 s > └────────────────────────────────────────────────────────┘
  1694. 26.50 s > ┌───────────────────────────────────────────────────────────────────────────────────────────────────────────┐
  1695. 26.50 s > │ Cannot start new unlicensed Symbolica instance since there is already another one running on the machine. │
  1696. 26.50 s > └───────────────────────────────────────────────────────────────────────────────────────────────────────────┘
  1697. 26.50 s >
  1698. 26.50 s > stderr:
  1699. 26.50 s > ┌───────────────────────────────────┐
  1700. 26.50 s > │ The Symbolica license has expired │
  1701. 26.50 s > └───────────────────────────────────┘
  1702. 26.50 s >
  1703. 26.50 s >
  1704. 26.50 s > Location:
  1705. 26.50 s > tests/tests/test_python_api.rs:156:20
  1706. 26.50 s > system-out
  1707. 26.50 s > running 1 test
  1708. 26.50 s > test python_session_getters_return_live_toml_and_command_blocks ... FAILED
  1709. 26.50 s >
  1710. 26.50 s > failures:
  1711. 26.50 s >
  1712. 26.50 s > failures:
  1713. 26.50 s > python_session_getters_return_live_toml_and_command_blocks
  1714. 26.50 s >
  1715. 26.50 s > test result: FAILED. 0 passed; 1 failed; 0 ignored; 0 measured; 4 filtered out; finished in 0.35s
  1716. 26.50 s > system-err
  1717. 26.50 s > Error: Python API test subprocess failed.
  1718. 26.50 s > stdout:
  1719. 26.50 s > ┌────────────────────────────────────────────────────────┐
  1720. 26.50 s > │ You are running a restricted Symbolica instance. │
  1721. 26.50 s > │ │
  1722. 26.50 s > │ This mode is only permitted for non-commercial use and │
  1723. 26.50 s > │ is limited to one instance and core per machine. │
  1724. 26.50 s > │ │
  1725. 26.50 s > │ Hobbyists can easily acquire a free license key │
  1726. 26.50 s > │ that unlocks all cores and removes this banner: │
  1727. 26.50 s > │ │
  1728. 26.50 s > │ from symbolica import * │
  1729. 26.50 s > │ request_hobbyist_license('YOUR_NAME', 'YOUR_EMAIL') │
  1730. 26.50 s > │ │
  1731. 26.50 s > │ All other users can obtain a free 30-day trial key: │
  1732. 26.50 s > │ │
  1733. 26.50 s > │ from symbolica import * │
  1734. 26.50 s > │ request_trial_license('NAME', 'EMAIL', 'EMPLOYER') │
  1735. 26.50 s > │ │
  1736. 26.50 s > │ See https://symbolica.io/docs/get_started.html#license │
  1737. 26.50 s > └────────────────────────────────────────────────────────┘
  1738. 26.50 s > ┌───────────────────────────────────────────────────────────────────────────────────────────────────────────┐
  1739. 26.50 s > │ Cannot start new unlicensed Symbolica instance since there is already another one running on the machine. │
  1740. 26.50 s > └───────────────────────────────────────────────────────────────────────────────────────────────────────────┘
  1741. 26.50 s >
  1742. 26.50 s > stderr:
  1743. 26.50 s > ┌───────────────────────────────────┐
  1744. 26.50 s > │ The Symbolica license has expired │
  1745. 26.50 s > └───────────────────────────────────┘
  1746. 26.50 s >
  1747. 26.50 s >
  1748. 26.50 s > Location:
  1749. 26.50 s > tests/tests/test_python_api.rs:156:20
  1750. 26.50 s >
  1751. 26.50 s > 4. gammaloop-integration-tests::test_python_api::python_evaluate_samples_batch_and_momentum_space_have_expected_shape
  1752. 26.50 s > failure: test failure with exit code 101
  1753. 26.50 s > Error: Python API test subprocess failed.
  1754. 26.50 s > stdout:
  1755. 26.50 s > ┌────────────────────────────────────────────────────────┐
  1756. 26.50 s > │ You are running a restricted Symbolica instance. │
  1757. 26.50 s > │ │
  1758. 26.50 s > │ This mode is only permitted for non-commercial use and │
  1759. 26.50 s > │ is limited to one instance and core per machine. │
  1760. 26.50 s > │ │
  1761. 26.50 s > │ Hobbyists can easily acquire a free license key │
  1762. 26.50 s > │ that unlocks all cores and removes this banner: │
  1763. 26.50 s > │ │
  1764. 26.50 s > │ from symbolica import * │
  1765. 26.50 s > │ request_hobbyist_license('YOUR_NAME', 'YOUR_EMAIL') │
  1766. 26.50 s > │ │
  1767. 26.50 s > │ All other users can obtain a free 30-day trial key: │
  1768. 26.50 s > │ │
  1769. 26.50 s > │ from symbolica import * │
  1770. 26.50 s > │ request_trial_license('NAME', 'EMAIL', 'EMPLOYER') │
  1771. 26.50 s > │ │
  1772. 26.50 s > │ See https://symbolica.io/docs/get_started.html#license │
  1773. 26.50 s > └────────────────────────────────────────────────────────┘
  1774. 26.50 s > ┌───────────────────────────────────────────────────────────────────────────────────────────────────────────┐
  1775. 26.50 s > │ Cannot start new unlicensed Symbolica instance since there is already another one running on the machine. │
  1776. 26.50 s > └───────────────────────────────────────────────────────────────────────────────────────────────────────────┘
  1777. 26.50 s >
  1778. 26.50 s > stderr:
  1779. 26.50 s > ┌───────────────────────────────────┐
  1780. 26.50 s > │ The Symbolica license has expired │
  1781. 26.50 s > └───────────────────────────────────┘
  1782. 26.50 s > [2026-09-01 10:05:15.283] @gammaloop_api::se... INFO : Running command import model sm-default
  1783. 26.50 s > [2026-09-01 10:05:15.285] @import::model INFO : Loading built-in JSON model sm-default
  1784. 26.50 s > [2026-09-01 10:05:15.348] @gammalooprs::model INFO : The following 15 external parameters were forced to zero by the restriction card:
  1785. 26.50 s > lamWS, AWS, rhoWS, etaWS, ymc, yme, ymm, MC, Me, MM, WTau, muQ, muLe, muLmu, muLtau
  1786. 26.50 s > [2026-09-01 10:05:15.348] @gammalooprs::model INFO : The following 34 vertex rules were removed by the restriction card:
  1787. 26.50 s > V_82 -> (c~, d, G+) | V_83 -> (t~, d, G+) | V_84 -> (c~, s, G+) | V_85 -> (t~, s, G+) | V_86 -> (u~, b, G+) | V_87 -> (c~, b, G+) | V_90 -> (c~, d, W+) | V_91 -> (t~, d, W+) | V_92 -> (u~, s, W+) | V_94 -> (t~, s, W+) | V_95 -> (u~, b, W+) | V_96 -> (c~, b, W+) | V_101 -> (e+, e-, G0) | V_102 -> (mu+, mu-, G0) | V_104 -> (e+, e-, H) | V_105 -> (mu+, mu-, H) | V_110 -> (ve~, e-, G+) | V_111 -> (vm~, mu-, G+) | V_116 -> (b~, u, G-) | V_117 -> (d~, c, G-) | V_118 -> (s~, c, G-) | V_119 -> (b~, c, G-) | V_120 -> (d~, t, G-) | V_121 -> (s~, t, G-) | V_124 -> (s~, u, W-) | V_125 -> (b~, u, W-) | V_126 -> (d~, c, W-) | V_128 -> (b~, c, W-) | V_129 -> (d~, t, W-) | V_130 -> (s~, t, W-) | V_138 -> (c~, c, G0) | V_140 -> (c~, c, H) | V_145 -> (e+, ve, G-) | V_146 -> (mu+, vm, G-)
  1788. 26.50 s > [2026-09-01 10:05:15.348] @gammalooprs::model INFO : The following 36 couplings were removed by the restriction card:
  1789. 26.50 s > GC_13, GC_14, GC_16, GC_17, GC_18, GC_19, GC_20, GC_22, GC_23, GC_24, GC_25, GC_26, GC_28, GC_29, GC_42, GC_43, GC_44, GC_46, GC_47, GC_48, GC_84, GC_85, GC_86, GC_87, GC_88, GC_89, GC_90, GC_91, GC_92, GC_93, GC_101, GC_102, GC_103, GC_105, GC_106, GC_107
  1790. 26.50 s > [2026-09-01 10:05:15.359] @gammaloop_api::se... INFO : Running command set default-runtime kv kinematics.externals='{"type":"constant","data":{"momenta":[[32.0,0.0,0.0,32.0],[32.0,0.0,0.0,-32.0]],"helicities":[1,1]}}'
  1791. 26.50 s > [2026-09-01 10:05:15.360] @gammaloop_api::se... INFO : Running command set default-runtime kv subtraction.disable_threshold_subtraction=true
  1792. 26.50 s > [2026-09-01 10:05:15.361] @gammaloop_api::se... INFO : Running command generate xs e+ e- > d d~ g | e- a d g QED^2==4 [{{2}} QCD=0] --numerator-grouping group_identical_graphs_up_to_sign --clear-existing-processes --only-diagrams
  1793. 26.50 s > [2026-09-01 10:05:15.380] @feyngen::diagram_... INFO : 0s | Δ=0s | Starting Feynman graph generation with Symbolica...
  1794. 26.50 s > [2026-09-01 10:05:15.386] @feyngen::diagram_... INFO : 0s | Δ=0s | Number of graphs resulting from Symbolica generation: 246
  1795. 26.50 s > [2026-09-01 10:05:15.388] @feyngen::diagram_... INFO : 0s | Δ=0s | Number of graphs retained after enforcing supergraph particle content: 8
  1796. 26.50 s > [2026-09-01 10:05:15.388] @feyngen::diagram_... INFO : 0s | Δ=0s | Number of graphs retained after removal of vetoed topologies: 8
  1797. 26.50 s > [2026-09-01 10:05:15.389] @feyngen::diagram_... INFO : 0s | Δ=0s | Number of graphs after vertex info assignment: 8
  1798. 26.50 s > [2026-09-01 10:05:15.389] @feyngen::diagram_... INFO : 0s | Δ=0s | Number of graphs after all complete graphs filters are applied: 8
  1799. 26.50 s >
  1800. 26.50 s >
  1801. 26.50 s > Location:
  1802. 26.50 s > tests/tests/test_python_api.rs:156:20
  1803. 26.50 s > system-out
  1804. 26.50 s > running 1 test
  1805. 26.50 s > test python_evaluate_samples_batch_and_momentum_space_have_expected_shape ... FAILED
  1806. 26.50 s >
  1807. 26.50 s > failures:
  1808. 26.50 s >
  1809. 26.50 s > failures:
  1810. 26.50 s > python_evaluate_samples_batch_and_momentum_space_have_expected_shape
  1811. 26.50 s >
  1812. 26.50 s > test result: FAILED. 0 passed; 1 failed; 0 ignored; 0 measured; 4 filtered out; finished in 0.41s
  1813. 26.50 s > system-err
  1814. 26.50 s > Error: Python API test subprocess failed.
  1815. 26.50 s > stdout:
  1816. 26.50 s > ┌────────────────────────────────────────────────────────┐
  1817. 26.50 s > │ You are running a restricted Symbolica instance. │
  1818. 26.50 s > │ │
  1819. 26.50 s > │ This mode is only permitted for non-commercial use and │
  1820. 26.50 s > │ is limited to one instance and core per machine. │
  1821. 26.50 s > │ │
  1822. 26.50 s > │ Hobbyists can easily acquire a free license key │
  1823. 26.50 s > │ that unlocks all cores and removes this banner: │
  1824. 26.50 s > │ │
  1825. 26.50 s > │ from symbolica import * │
  1826. 26.50 s > │ request_hobbyist_license('YOUR_NAME', 'YOUR_EMAIL') │
  1827. 26.50 s > │ │
  1828. 26.50 s > │ All other users can obtain a free 30-day trial key: │
  1829. 26.50 s > │ │
  1830. 26.50 s > │ from symbolica import * │
  1831. 26.50 s > │ request_trial_license('NAME', 'EMAIL', 'EMPLOYER') │
  1832. 26.50 s > │ │
  1833. 26.50 s > │ See https://symbolica.io/docs/get_started.html#license │
  1834. 26.50 s > └────────────────────────────────────────────────────────┘
  1835. 26.50 s > ┌───────────────────────────────────────────────────────────────────────────────────────────────────────────┐
  1836. 26.50 s > │ Cannot start new unlicensed Symbolica instance since there is already another one running on the machine. │
  1837. 26.50 s > └───────────────────────────────────────────────────────────────────────────────────────────────────────────┘
  1838. 26.50 s >
  1839. 26.50 s > stderr:
  1840. 26.50 s > ┌───────────────────────────────────┐
  1841. 26.50 s > │ The Symbolica license has expired │
  1842. 26.50 s > └───────────────────────────────────┘
  1843. 26.50 s > [2026-09-01 10:05:15.283] @gammaloop_api::se... INFO : Running command import model sm-default
  1844. 26.50 s > [2026-09-01 10:05:15.285] @import::model INFO : Loading built-in JSON model sm-default
  1845. 26.50 s > [2026-09-01 10:05:15.348] @gammalooprs::model INFO : The following 15 external parameters were forced to zero by the restriction card:
  1846. 26.50 s > lamWS, AWS, rhoWS, etaWS, ymc, yme, ymm, MC, Me, MM, WTau, muQ, muLe, muLmu, muLtau
  1847. 26.50 s > [2026-09-01 10:05:15.348] @gammalooprs::model INFO : The following 34 vertex rules were removed by the restriction card:
  1848. 26.50 s > V_82 -> (c~, d, G+) | V_83 -> (t~, d, G+) | V_84 -> (c~, s, G+) | V_85 -> (t~, s, G+) | V_86 -> (u~, b, G+) | V_87 -> (c~, b, G+) | V_90 -> (c~, d, W+) | V_91 -> (t~, d, W+) | V_92 -> (u~, s, W+) | V_94 -> (t~, s, W+) | V_95 -> (u~, b, W+) | V_96 -> (c~, b, W+) | V_101 -> (e+, e-, G0) | V_102 -> (mu+, mu-, G0) | V_104 -> (e+, e-, H) | V_105 -> (mu+, mu-, H) | V_110 -> (ve~, e-, G+) | V_111 -> (vm~, mu-, G+) | V_116 -> (b~, u, G-) | V_117 -> (d~, c, G-) | V_118 -> (s~, c, G-) | V_119 -> (b~, c, G-) | V_120 -> (d~, t, G-) | V_121 -> (s~, t, G-) | V_124 -> (s~, u, W-) | V_125 -> (b~, u, W-) | V_126 -> (d~, c, W-) | V_128 -> (b~, c, W-) | V_129 -> (d~, t, W-) | V_130 -> (s~, t, W-) | V_138 -> (c~, c, G0) | V_140 -> (c~, c, H) | V_145 -> (e+, ve, G-) | V_146 -> (mu+, vm, G-)
  1849. 26.50 s > [2026-09-01 10:05:15.348] @gammalooprs::model INFO : The following 36 couplings were removed by the restriction card:
  1850. 26.50 s > GC_13, GC_14, GC_16, GC_17, GC_18, GC_19, GC_20, GC_22, GC_23, GC_24, GC_25, GC_26, GC_28, GC_29, GC_42, GC_43, GC_44, GC_46, GC_47, GC_48, GC_84, GC_85, GC_86, GC_87, GC_88, GC_89, GC_90, GC_91, GC_92, GC_93, GC_101, GC_102, GC_103, GC_105, GC_106, GC_107
  1851. 26.50 s > [2026-09-01 10:05:15.359] @gammaloop_api::se... INFO : Running command set default-runtime kv kinematics.externals='{"type":"constant","data":{"momenta":[[32.0,0.0,0.0,32.0],[32.0,0.0,0.0,-32.0]],"helicities":[1,1]}}'
  1852. 26.50 s > [2026-09-01 10:05:15.360] @gammaloop_api::se... INFO : Running command set default-runtime kv subtraction.disable_threshold_subtraction=true
  1853. 26.50 s > [2026-09-01 10:05:15.361] @gammaloop_api::se... INFO : Running command generate xs e+ e- > d d~ g | e- a d g QED^2==4 [{{2}} QCD=0] --numerator-grouping group_identical_graphs_up_to_sign --clear-existing-processes --only-diagrams
  1854. 26.50 s > [2026-09-01 10:05:15.380] @feyngen::diagram_... INFO : 0s | Δ=0s | Starting Feynman graph generation with Symbolica...
  1855. 26.50 s > [2026-09-01 10:05:15.386] @feyngen::diagram_... INFO : 0s | Δ=0s | Number of graphs resulting from Symbolica generation: 246
  1856. 26.50 s > [2026-09-01 10:05:15.388] @feyngen::diagram_... INFO : 0s | Δ=0s | Number of graphs retained after enforcing supergraph particle content: 8
  1857. 26.50 s > [2026-09-01 10:05:15.388] @feyngen::diagram_... INFO : 0s | Δ=0s | Number of graphs retained after removal of vetoed topologies: 8
  1858. 26.50 s > [2026-09-01 10:05:15.389] @feyngen::diagram_... INFO : 0s | Δ=0s | Number of graphs after vertex info assignment: 8
  1859. 26.50 s > [2026-09-01 10:05:15.389] @feyngen::diagram_... INFO : 0s | Δ=0s | Number of graphs after all complete graphs filters are applied: 8
  1860. 26.50 s >
  1861. 26.50 s >
  1862. 26.50 s > Location:
  1863. 26.50 s > tests/tests/test_python_api.rs:156:20
  1864. 26.50 s >
  1865. 26.50 s > 5. gammaloop-integration-tests::test_python_api::python_settings_wrappers_expose_nested_runtime_and_global_settings
  1866. 26.50 s > failure: test failure with exit code 101
  1867. 26.50 s > Error: Python API test subprocess failed.
  1868. 26.50 s > stdout:
  1869. 26.50 s > ┌────────────────────────────────────────────────────────┐
  1870. 26.50 s > │ You are running a restricted Symbolica instance. │
  1871. 26.50 s > │ │
  1872. 26.50 s > │ This mode is only permitted for non-commercial use and │
  1873. 26.50 s > │ is limited to one instance and core per machine. │
  1874. 26.50 s > │ │
  1875. 26.50 s > │ Hobbyists can easily acquire a free license key │
  1876. 26.50 s > │ that unlocks all cores and removes this banner: │
  1877. 26.50 s > │ │
  1878. 26.50 s > │ from symbolica import * │
  1879. 26.50 s > │ request_hobbyist_license('YOUR_NAME', 'YOUR_EMAIL') │
  1880. 26.50 s > │ │
  1881. 26.50 s > │ All other users can obtain a free 30-day trial key: │
  1882. 26.50 s > │ │
  1883. 26.50 s > │ from symbolica import * │
  1884. 26.50 s > │ request_trial_license('NAME', 'EMAIL', 'EMPLOYER') │
  1885. 26.50 s > │ │
  1886. 26.50 s > │ See https://symbolica.io/docs/get_started.html#license │
  1887. 26.50 s > └────────────────────────────────────────────────────────┘
  1888. 26.50 s > ┌───────────────────────────────────────────────────────────────────────────────────────────────────────────┐
  1889. 26.50 s > │ Cannot start new unlicensed Symbolica instance since there is already another one running on the machine. │
  1890. 26.50 s > └───────────────────────────────────────────────────────────────────────────────────────────────────────────┘
  1891. 26.50 s >
  1892. 26.50 s > stderr:
  1893. 26.50 s > ┌───────────────────────────────────┐
  1894. 26.50 s > │ The Symbolica license has expired │
  1895. 26.50 s > └───────────────────────────────────┘
  1896. 26.50 s >
  1897. 26.50 s >
  1898. 26.50 s > Location:
  1899. 26.50 s > tests/tests/test_python_api.rs:156:20
  1900. 26.50 s > system-out
  1901. 26.50 s > running 1 test
  1902. 26.50 s > test python_settings_wrappers_expose_nested_runtime_and_global_settings ... FAILED
  1903. 26.50 s >
  1904. 26.50 s > failures:
  1905. 26.50 s >
  1906. 26.50 s > failures:
  1907. 26.50 s > python_settings_wrappers_expose_nested_runtime_and_global_settings
  1908. 26.50 s >
  1909. 26.50 s > test result: FAILED. 0 passed; 1 failed; 0 ignored; 0 measured; 4 filtered out; finished in 0.44s
  1910. 26.50 s > system-err
  1911. 26.50 s > Error: Python API test subprocess failed.
  1912. 26.50 s > stdout:
  1913. 26.50 s > ┌────────────────────────────────────────────────────────┐
  1914. 26.50 s > │ You are running a restricted Symbolica instance. │
  1915. 26.50 s > │ │
  1916. 26.50 s > │ This mode is only permitted for non-commercial use and │
  1917. 26.50 s > │ is limited to one instance and core per machine. │
  1918. 26.50 s > │ │
  1919. 26.50 s > │ Hobbyists can easily acquire a free license key │
  1920. 26.50 s > │ that unlocks all cores and removes this banner: │
  1921. 26.50 s > │ │
  1922. 26.50 s > │ from symbolica import * │
  1923. 26.50 s > │ request_hobbyist_license('YOUR_NAME', 'YOUR_EMAIL') │
  1924. 26.50 s > │ │
  1925. 26.50 s > │ All other users can obtain a free 30-day trial key: │
  1926. 26.50 s > │ │
  1927. 26.50 s > │ from symbolica import * │
  1928. 26.50 s > │ request_trial_license('NAME', 'EMAIL', 'EMPLOYER') │
  1929. 26.50 s > │ │
  1930. 26.50 s > │ See https://symbolica.io/docs/get_started.html#license │
  1931. 26.50 s > └────────────────────────────────────────────────────────┘
  1932. 26.50 s > ┌───────────────────────────────────────────────────────────────────────────────────────────────────────────┐
  1933. 26.50 s > │ Cannot start new unlicensed Symbolica instance since there is already another one running on the machine. │
  1934. 26.50 s > └───────────────────────────────────────────────────────────────────────────────────────────────────────────┘
  1935. 26.50 s >
  1936. 26.50 s > stderr:
  1937. 26.50 s > ┌───────────────────────────────────┐
  1938. 26.50 s > │ The Symbolica license has expired │
  1939. 26.50 s > └───────────────────────────────────┘
  1940. 26.50 s >
  1941. 26.50 s >
  1942. 26.50 s > Location:
  1943. 26.50 s > tests/tests/test_python_api.rs:156:20
  1944. 26.50 s > =========================================
  1945. 26.50 s For full logs, run:
  1946. 26.50 s nix log /nix/store/90vl6933shlgrvsg0q1k9hbam6pqxvdh-gammaloop-nextest-python-api.drv
  1947. 26.76 s [0 built (1 failed), 0.0Run failed.