build devShells.x86_64-linux.default
1.36 s
$ /nix/store/9ypz3flqsrl5xl495mm8h645gadjsxi1-coreutils-9.11/bin/timeout --kill-after=15s 7200s /nix/store/23zk8sgzamrbmj1fday15szf7f2279s8-nix-2.34.7/bin/nix --extra-experimental-features nix-command --extra-experimental-features flakes --log-format internal-json build --no-link --print-out-paths git+https://github.com/alphal00p/gammaloop?ref=finite_T_and_mu_pre_rebase&rev=da7b4c22f8a72cca8ddcc8537d642827d66b54b5&shallow=1#devShells.x86_64-linux.default --print-build-logs
28.09 s
46.93 s
Downloading cached rust-lib-src from https://cache.nix-ci.com
47.09 s
Downloading cached mailcap from https://cache.nix-ci.com
47.09 s
Downloading cached tzdata from https://cache.nix-ci.com
47.09 s
Downloading cached bacon from https://cache.nix-ci.com
47.09 s
Downloading cached brotli-1.2.0-lib from https://cache.nix-ci.com
47.09 s
Downloading cached cargo-udeps from https://cache.nix-ci.com
47.09 s
Downloading cached cargo-edit from https://cache.nix-ci.com
47.09 s
Downloading cached cargo-nextest from https://cache.nix-ci.com
47.09 s
Downloading cached cargo-watch from https://cache.nix-ci.com
47.09 s
Downloading cached cargo-machete from https://cache.nix-ci.com
47.09 s
Downloading cached cargo-insta from https://cache.nix-ci.com
47.09 s
Downloading cached dejavu-fonts-minimal from https://cache.nix-ci.com
47.09 s
Downloading cached curl-8.18.0-man from https://cache.nix-ci.com
47.09 s
Downloading cached d3-flame-graph-templates from https://cache.nix-ci.com
47.09 s
Downloading cached cargo-deny from https://cache.nix-ci.com
47.09 s
Downloading cached expand-response-params from https://cache.nix-ci.com
47.10 s
Downloaded cached mailcap (116 KiB) in 14ms
47.16 s
Downloaded cached dejavu-fonts-minimal (742 KiB) in 73ms
47.21 s
Downloaded cached expand-response-params (16 KiB) in 120ms
47.23 s
Downloaded cached d3-flame-graph-templates (66 KiB) in 138ms
47.24 s
Downloaded cached curl-8.18.0-man (78 KiB) in 147ms
47.27 s
Downloaded cached brotli-1.2.0-lib (961 KiB) in 176ms
47.33 s
Building /nix/store/189gy3760f09dic2wc8l0my4a7ckz0qi-builder.pl.drv
47.33 s
Progress: 0 of 82 built (1 building), 1 of 246 downloaded from cache (15 downloading)
47.33 s
Progress: 0 of 82 built (1 building), 2 of 246 downloaded from cache (14 downloading)
47.33 s
Progress: 0 of 82 built (1 building), 3 of 246 downloaded from cache (13 downloading)
47.34 s
Progress: 0 of 82 built (1 building), 4 of 246 downloaded from cache (12 downloading)
47.34 s
Progress: 0 of 82 built (1 building), 5 of 246 downloaded from cache (11 downloading)
47.34 s
Progress: 0 of 82 built (1 building), 6 of 246 downloaded from cache (10 downloading)
47.34 s
Downloading cached bin from https://cache.nix-ci.com
47.35 s
Downloading cached cargo-auditable from https://cache.nix-ci.com
47.35 s
Downloading cached bzip2-1.0.8-dev from https://cache.nix-ci.com
47.35 s
Downloading cached c-ares from https://cache.nix-ci.com
47.35 s
Downloading cached cargo-build-hook.sh from https://cache.nix-ci.com
47.35 s
Downloading cached c-ares from https://cache.nix-ci.com
47.38 s
Downloaded cached cargo-machete (6.6 MiB) in 286ms
47.38 s
Progress: 0 of 82 built (1 building), 7 of 246 downloaded from cache (15 downloading)
47.39 s
Downloading cached binutils-wrapper from https://cache.nix-ci.com
47.39 s
Downloaded cached tzdata (2 MiB) in 300ms
47.39 s
Progress: 0 of 81 built (1 building), 8 of 246 downloaded from cache (15 downloading)
47.39 s
Downloading cached brotli from https://cache.nix-ci.com
47.40 s
Downloaded cached cargo-insta (6.2 MiB) in 313ms
47.40 s
Progress: 0 of 81 built (1 building), 9 of 246 downloaded from cache (15 downloading)
47.40 s
Downloading cached cargo-check-hook.sh from https://cache.nix-ci.com
47.41 s
[builder.pl] Phase: patchPhase
47.42 s
[builder.pl] Phase: updateAutotoolsGnuConfigScriptsPhase
47.45 s
[builder.pl] Phase: configurePhase
47.49 s
Downloaded cached bin (264 B) in 150ms
47.49 s
Progress: 0 of 80 built (1 building), 10 of 246 downloaded from cache (15 downloading)
47.49 s
Downloading cached cargo-install-hook.sh from https://cache.nix-ci.com
47.49 s
Downloaded cached cargo-build-hook.sh (2688 B) in 143ms
47.49 s
Progress: 0 of 79 built (1 building), 11 of 246 downloaded from cache (15 downloading)
47.49 s
Downloading cached cargo-setup-hook.sh from https://cache.nix-ci.com
47.50 s
Downloaded cached c-ares (276 KiB) in 149ms
47.50 s
Progress: 0 of 78 built (1 building), 12 of 246 downloaded from cache (15 downloading)
47.50 s
Downloading cached clinnet from https://cache.nix-ci.com
47.50 s
Downloaded cached binutils-wrapper (55 KiB) in 112ms
47.50 s
Progress: 0 of 78 built (1 building), 13 of 246 downloaded from cache (15 downloading)
47.50 s
[builder.pl] no configure script, doing nothing
47.50 s
Downloading cached dav1d from https://cache.nix-ci.com
47.51 s
Downloaded cached brotli (53 KiB) in 116ms
47.51 s
Progress: 0 of 78 built (1 building), 14 of 246 downloaded from cache (15 downloading)
47.51 s
Downloading cached die-hook from https://cache.nix-ci.com
47.51 s
Downloaded cached bzip2-1.0.8-dev (8168 B) in 163ms
47.51 s
Progress: 0 of 78 built (1 building), 15 of 246 downloaded from cache (15 downloading)
47.51 s
Downloading cached brotli-1.2.0-dev from https://cache.nix-ci.com
47.51 s
[builder.pl] Phase: buildPhase
47.52 s
Downloaded cached cargo-check-hook.sh (2608 B) in 113ms
47.52 s
Progress: 0 of 78 built (1 building), 16 of 246 downloaded from cache (15 downloading)
47.52 s
Downloading cached expat from https://cache.nix-ci.com
47.54 s
[builder.pl] Phase: checkPhase
47.55 s
Downloaded cached c-ares (382 KiB) in 199ms
47.55 s
Downloaded cached cargo-watch (4.5 MiB) in 460ms
47.55 s
Progress: 0 of 77 built (1 building), 17 of 246 downloaded from cache (15 downloading)
47.55 s
Progress: 0 of 77 built (1 building), 18 of 246 downloaded from cache (14 downloading)
47.55 s
Downloading cached fontconfig from https://cache.nix-ci.com
47.56 s
Downloading cached fribidi from https://cache.nix-ci.com
47.56 s
Downloaded cached cargo-auditable (2.6 MiB) in 219ms
47.56 s
Progress: 0 of 76 built (1 building), 19 of 246 downloaded from cache (15 downloading)
47.57 s
Downloaded cached cargo-install-hook.sh (2008 B) in 77ms
47.57 s
Progress: 0 of 76 built (1 building), 20 of 246 downloaded from cache (15 downloading)
47.57 s
Downloading cached c-ares-1.34.6-dev from https://cache.nix-ci.com
47.57 s
Downloading cached gdbm-1.26-lib from https://cache.nix-ci.com
47.58 s
[builder.pl] Phase: installPhase
47.59 s
[builder.pl] no Makefile or custom installPhase, doing nothing
47.59 s
[builder.pl] Phase: fixupPhase
47.66 s
[builder.pl] shrinking RPATHs of ELF executables and libraries in /nix/store/fcqldgczpc2v9w9fg5nkibc6km2d2k70-builder.pl
47.66 s
[builder.pl] checking for references to /build/ in /nix/store/fcqldgczpc2v9w9fg5nkibc6km2d2k70-builder.pl...
47.70 s
[builder.pl] patching script interpreter paths in /nix/store/fcqldgczpc2v9w9fg5nkibc6km2d2k70-builder.pl
47.73 s
Downloaded cached cargo-edit (9.6 MiB) in 643ms
47.73 s
Progress: 0 of 75 built (1 building), 21 of 246 downloaded from cache (15 downloading)
47.73 s
Downloading cached gettext from https://cache.nix-ci.com
47.75 s
Downloaded cached clinnet (675 KiB) in 249ms
47.75 s
Downloaded cached fribidi (162 KiB) in 198ms
47.76 s
Downloaded cached cargo-setup-hook.sh (3896 B) in 267ms
47.76 s
Downloaded cached c-ares-1.34.6-dev (128 KiB) in 196ms
47.76 s
Downloaded cached die-hook (928 B) in 256ms
47.77 s
Downloaded cached cargo-deny (8.7 MiB) in 677ms
47.77 s
Downloaded cached brotli-1.2.0-dev (57 KiB) in 257ms
47.78 s
Downloaded cached expat (300 KiB) in 260ms
47.78 s
Downloaded cached gdbm-1.26-lib (448 KiB) in 212ms
47.80 s
Downloaded cached bacon (6.8 MiB) in 709ms
47.82 s
Downloaded cached fontconfig (1.2 MiB) in 262ms
47.86 s
[builder.pl:post-build] Uploading to the NixCI cache: /nix/store/fcqldgczpc2v9w9fg5nkibc6km2d2k70-builder.pl
47.93 s
Downloaded cached dav1d (2.5 MiB) in 422ms
48.07 s
Downloaded cached cargo-nextest (25.4 MiB) in 975ms
48.28 s
Downloaded cached cargo-udeps (18.4 MiB) in 1.1s
48.29 s
Downloaded cached gettext (18.6 MiB) in 554ms
48.31 s
Downloaded cached rust-lib-src (43.4 MiB) in 1.3s
48.38 s
[builder.pl:post-build] warning: 'warn-short-path-literals' is deprecated, use 'lint-short-path-literals = ignore' instead
50.52 s
[builder.pl:post-build] copying 0 paths...
51.31 s
[builder.pl:post-build] warning: 'warn-short-path-literals' is deprecated, use 'lint-short-path-literals = ignore' instead
52.31 s
[builder.pl:post-build] copying 0 paths...
52.60 s
Uploaded builder.pl in 4.8s
52.61 s
Progress: 1 of 75 built, 21 of 246 downloaded from cache (16 downloading)
52.61 s
Built builder.pl in 5.2s
52.61 s
Progress: 1 of 74 built, 22 of 246 downloaded from cache (15 downloading)
52.61 s
Progress: 1 of 74 built, 23 of 246 downloaded from cache (14 downloading)
52.61 s
Progress: 1 of 74 built, 24 of 246 downloaded from cache (13 downloading)
52.61 s
Progress: 1 of 74 built, 25 of 246 downloaded from cache (12 downloading)
52.61 s
Progress: 1 of 74 built, 26 of 246 downloaded from cache (11 downloading)
52.61 s
Progress: 1 of 74 built, 27 of 246 downloaded from cache (10 downloading)
52.61 s
Progress: 1 of 74 built, 28 of 246 downloaded from cache (9 downloading)
52.61 s
Progress: 1 of 74 built, 29 of 246 downloaded from cache (8 downloading)
52.61 s
Progress: 1 of 74 built, 30 of 246 downloaded from cache (7 downloading)
52.61 s
Progress: 1 of 74 built, 31 of 246 downloaded from cache (6 downloading)
52.61 s
Progress: 1 of 74 built, 32 of 246 downloaded from cache (5 downloading)
52.61 s
Progress: 1 of 74 built, 33 of 246 downloaded from cache (4 downloading)
52.61 s
Progress: 1 of 74 built, 34 of 246 downloaded from cache (3 downloading)
52.61 s
Progress: 1 of 74 built, 35 of 246 downloaded from cache (2 downloading)
52.61 s
Progress: 1 of 74 built, 36 of 246 downloaded from cache (1 downloading)
52.61 s
Progress: 1 of 74 built, 37 of 246 downloaded from cache
52.61 s
Downloading cached gumbo from https://cache.nix-ci.com
52.61 s
Downloading cached giflib from https://cache.nix-ci.com
52.61 s
Downloading cached gfortran-15.2.0-libgcc from https://cache.nix-ci.com
52.61 s
Downloading cached gnum4 from https://cache.nix-ci.com
52.61 s
Downloading cached glibc-iconv from https://cache.nix-ci.com
52.61 s
Downloading cached jemalloc-5.3.0-unstable-2025-09 from https://cache.nix-ci.com
52.61 s
Downloading cached json-c from https://cache.nix-ci.com
52.61 s
Downloading cached lerc from https://cache.nix-ci.com
52.61 s
Downloading cached graphite2 from https://cache.nix-ci.com
52.61 s
Downloading cached gmp-with-cxx from https://cache.nix-ci.com
52.61 s
Downloading cached jbig2dec from https://cache.nix-ci.com
52.61 s
Downloading cached just from https://cache.nix-ci.com
52.62 s
Downloading cached krb5-1.22.1-lib from https://cache.nix-ci.com
52.62 s
Downloading cached lcms2 from https://cache.nix-ci.com
52.62 s
Downloading cached glibc-locales-2.42 from https://cache.nix-ci.com
52.62 s
Downloading cached icu4c from https://cache.nix-ci.com
52.71 s
Downloaded cached json-c (244 KiB) in 93ms
52.71 s
Progress: 1 of 67 built, 38 of 246 downloaded from cache (15 downloading)
52.71 s
Downloaded cached gfortran-15.2.0-libgcc (193 KiB) in 98ms
52.71 s
Progress: 1 of 67 built, 39 of 246 downloaded from cache (15 downloading)
52.71 s
Downloading cached libdatrie-2019-12-20-lib from https://cache.nix-ci.com
52.71 s
Downloading cached libdeflate from https://cache.nix-ci.com
52.74 s
Downloaded cached graphite2 (227 KiB) in 122ms
52.75 s
Downloaded cached glibc-iconv (528 B) in 140ms
52.76 s
Progress: 1 of 67 built, 40 of 246 downloaded from cache (15 downloading)
52.76 s
Progress: 1 of 67 built, 41 of 246 downloaded from cache (15 downloading)
52.76 s
Downloading cached gfortran-15.2.0-lib from https://cache.nix-ci.com
52.76 s
Downloading cached libev from https://cache.nix-ci.com
52.79 s
Downloaded cached lcms2 (484 KiB) in 172ms
52.80 s
Downloaded cached gmp-with-cxx (765 KiB) in 188ms
52.81 s
Downloaded cached gnum4 (1 MiB) in 202ms
52.84 s
Downloaded cached giflib (407 KiB) in 226ms
52.85 s
Progress: 1 of 67 built, 42 of 246 downloaded from cache (15 downloading)
52.85 s
Downloaded cached libdatrie-2019-12-20-lib (42 KiB) in 138ms
52.85 s
Progress: 1 of 67 built, 43 of 246 downloaded from cache (15 downloading)
52.85 s
Progress: 1 of 67 built, 44 of 246 downloaded from cache (14 downloading)
52.85 s
Progress: 1 of 67 built, 45 of 246 downloaded from cache (13 downloading)
52.85 s
Downloading cached libffi from https://cache.nix-ci.com
52.85 s
Progress: 1 of 67 built, 46 of 246 downloaded from cache (12 downloading)
52.87 s
Downloaded cached gumbo (425 KiB) in 260ms
52.90 s
Downloading cached libjpeg-turbo from https://cache.nix-ci.com
52.90 s
Downloading cached libpfm from https://cache.nix-ci.com
52.90 s
Downloaded cached lerc (850 KiB) in 284ms
52.90 s
Downloading cached libice from https://cache.nix-ci.com
52.90 s
Downloading cached libidn2-2.3.8-bin from https://cache.nix-ci.com
52.93 s
Downloaded cached jemalloc-5.3.0-unstable-2025-09 (3.7 MiB) in 313ms
52.95 s
Downloaded cached libdeflate (458 KiB) in 236ms
52.97 s
Progress: 1 of 65 built, 47 of 246 downloaded from cache (15 downloading)
52.97 s
Progress: 1 of 65 built, 48 of 246 downloaded from cache (14 downloading)
52.97 s
Downloaded cached krb5-1.22.1-lib (2.8 MiB) in 354ms
52.97 s
Progress: 1 of 65 built, 49 of 246 downloaded from cache (13 downloading)
52.97 s
Progress: 1 of 65 built, 50 of 246 downloaded from cache (12 downloading)
52.97 s
Downloading cached libpng-apng from https://cache.nix-ci.com
52.97 s
Downloading cached gmp-with-cxx-6.3.0-dev from https://cache.nix-ci.com
52.97 s
Downloading cached libselinux from https://cache.nix-ci.com
52.98 s
Downloading cached form from https://cache.nix-ci.com
53.01 s
Downloaded cached just (5 MiB) in 391ms
53.01 s
Downloaded cached jbig2dec (383 KiB) in 401ms
53.02 s
Progress: 1 of 65 built, 51 of 246 downloaded from cache (15 downloading)
53.02 s
Progress: 1 of 65 built, 52 of 246 downloaded from cache (14 downloading)
53.02 s
Progress: 1 of 65 built, 53 of 246 downloaded from cache (13 downloading)
53.02 s
Downloading cached libssh2 from https://cache.nix-ci.com
53.02 s
Downloading cached libtasn1 from https://cache.nix-ci.com
53.02 s
Downloading cached libthai from https://cache.nix-ci.com
53.03 s
Downloaded cached libev (225 KiB) in 275ms
53.05 s
Progress: 1 of 64 built, 54 of 246 downloaded from cache (15 downloading)
53.05 s
Downloaded cached glibc-locales-2.42 (2.9 MiB) in 428ms
53.05 s
Downloading cached libtool-2.5.4-lib from https://cache.nix-ci.com
53.05 s
Progress: 1 of 64 built, 55 of 246 downloaded from cache (15 downloading)
53.06 s
Downloading cached libtraceevent from https://cache.nix-ci.com
53.08 s
Downloaded cached libpng-apng (269 KiB) in 104ms
53.08 s
Downloaded cached libidn2-2.3.8-bin (37 KiB) in 184ms
53.11 s
Progress: 1 of 63 built, 56 of 246 downloaded from cache (15 downloading)
53.11 s
Progress: 1 of 63 built, 57 of 246 downloaded from cache (15 downloading)
53.11 s
Downloading cached libuv from https://cache.nix-ci.com
53.12 s
Downloaded cached libffi (72 KiB) in 267ms
53.12 s
Downloading cached freetype from https://cache.nix-ci.com
53.13 s
Downloaded cached libselinux (690 KiB) in 156ms
53.13 s
Progress: 1 of 63 built, 58 of 246 downloaded from cache (15 downloading)
53.13 s
Progress: 1 of 63 built, 59 of 246 downloaded from cache (14 downloading)
53.13 s
Downloading cached libidn2-2.3.8-dev from https://cache.nix-ci.com
53.13 s
Downloading cached libpng-apng-1.6.55-dev from https://cache.nix-ci.com
53.17 s
Downloaded cached libthai (637 KiB) in 147ms
53.19 s
Downloaded cached libssh2 (326 KiB) in 171ms
53.22 s
Downloaded cached libtool-2.5.4-lib (56 KiB) in 169ms
53.23 s
Progress: 1 of 63 built, 60 of 246 downloaded from cache (15 downloading)
53.23 s
Progress: 1 of 63 built, 61 of 246 downloaded from cache (15 downloading)
53.23 s
Progress: 1 of 63 built, 62 of 246 downloaded from cache (14 downloading)
53.23 s
Downloaded cached libtasn1 (95 KiB) in 208ms
53.23 s
Downloading cached libffi-3.5.2-dev from https://cache.nix-ci.com
53.23 s
Downloading cached libxau from https://cache.nix-ci.com
53.23 s
Downloading cached libvmaf from https://cache.nix-ci.com
53.24 s
Progress: 1 of 63 built, 63 of 246 downloaded from cache (15 downloading)
53.24 s
Downloaded cached libice (125 KiB) in 342ms
53.24 s
Progress: 1 of 63 built, 64 of 246 downloaded from cache (15 downloading)
53.24 s
Downloading cached libxcrypt from https://cache.nix-ci.com
53.24 s
Downloading cached libxdmcp from https://cache.nix-ci.com
53.25 s
Downloaded cached libidn2-2.3.8-dev (15 KiB) in 119ms
53.27 s
Downloaded cached gmp-with-cxx-6.3.0-dev (211 KiB) in 296ms
53.28 s
Progress: 1 of 63 built, 65 of 246 downloaded from cache (15 downloading)
53.28 s
Progress: 1 of 63 built, 66 of 246 downloaded from cache (15 downloading)
53.28 s
Downloaded cached libjpeg-turbo (2 MiB) in 384ms
53.28 s
Downloading cached libxml2 from https://cache.nix-ci.com
53.28 s
Downloading cached llhttp from https://cache.nix-ci.com
53.29 s
Progress: 1 of 62 built, 67 of 246 downloaded from cache (15 downloading)
53.30 s
Downloading cached lzo from https://cache.nix-ci.com
53.30 s
Downloaded cached libtraceevent (609 KiB) in 240ms
53.31 s
Downloaded cached libpfm (6.4 MiB) in 411ms
53.33 s
Progress: 1 of 62 built, 68 of 246 downloaded from cache (15 downloading)
53.33 s
Downloaded cached gfortran-15.2.0-lib (13.3 MiB) in 576ms
53.33 s
Progress: 1 of 62 built, 69 of 246 downloaded from cache (15 downloading)
53.33 s
Progress: 1 of 62 built, 70 of 246 downloaded from cache (14 downloading)
53.33 s
Downloading cached libwebp from https://cache.nix-ci.com
53.33 s
Downloading cached libjpeg-turbo-3.1.3-bin from https://cache.nix-ci.com
53.33 s
Downloading cached libyuv from https://cache.nix-ci.com
53.35 s
Downloaded cached libpng-apng-1.6.55-dev (265 KiB) in 217ms
53.38 s
Downloaded cached libuv (271 KiB) in 263ms
53.39 s
Progress: 1 of 62 built, 71 of 246 downloaded from cache (15 downloading)
53.39 s
Progress: 1 of 62 built, 72 of 246 downloaded from cache (15 downloading)
53.39 s
Downloading cached gfortran from https://cache.nix-ci.com
53.39 s
Downloaded cached libxau (27 KiB) in 166ms
53.40 s
Downloading cached make-binary-wrapper-hook from https://cache.nix-ci.com
53.42 s
Downloaded cached libxcrypt (141 KiB) in 176ms
53.43 s
Downloaded cached freetype (2.1 MiB) in 316ms
53.45 s
Progress: 1 of 62 built, 73 of 246 downloaded from cache (15 downloading)
53.45 s
Downloaded cached libffi-3.5.2-dev (21 KiB) in 221ms
53.45 s
Progress: 1 of 62 built, 74 of 246 downloaded from cache (15 downloading)
53.45 s
Progress: 1 of 62 built, 75 of 246 downloaded from cache (14 downloading)
53.45 s
Progress: 1 of 62 built, 76 of 246 downloaded from cache (13 downloading)
53.45 s
Downloading cached libuv-1.52.0-dev from https://cache.nix-ci.com
53.48 s
Downloaded cached libxdmcp (31 KiB) in 238ms
53.50 s
Downloading cached maturin from https://cache.nix-ci.com
53.50 s
Downloaded cached form (3.8 MiB) in 519ms
53.50 s
Downloading cached mpfr from https://cache.nix-ci.com
53.50 s
Downloading cached mpdecimal from https://cache.nix-ci.com
53.53 s
Downloaded cached llhttp (89 KiB) in 244ms
53.54 s
Downloaded cached libjpeg-turbo-3.1.3-bin (340 KiB) in 206ms
53.56 s
Progress: 1 of 62 built, 77 of 246 downloaded from cache (15 downloading)
53.56 s
Progress: 1 of 62 built, 78 of 246 downloaded from cache (14 downloading)
53.56 s
Progress: 1 of 62 built, 79 of 246 downloaded from cache (13 downloading)
53.56 s
Progress: 1 of 62 built, 80 of 246 downloaded from cache (12 downloading)
53.56 s
Downloading cached freetype-2.13.3-dev from https://cache.nix-ci.com
53.56 s
Downloading cached ncompress from https://cache.nix-ci.com
53.56 s
Downloaded cached libxml2 (1.4 MiB) in 284ms
53.57 s
Downloading cached ncurses from https://cache.nix-ci.com
53.57 s
Downloading cached fontconfig-2.17.1-lib from https://cache.nix-ci.com
53.59 s
Downloaded cached libvmaf (2.7 MiB) in 359ms
53.59 s
Downloaded cached lzo (159 KiB) in 297ms
53.59 s
Progress: 1 of 61 built, 81 of 246 downloaded from cache (15 downloading)
53.59 s
Progress: 1 of 61 built, 82 of 246 downloaded from cache (15 downloading)
53.59 s
Progress: 1 of 61 built, 83 of 246 downloaded from cache (14 downloading)
53.60 s
Downloading cached libjpeg-turbo-3.1.3-dev from https://cache.nix-ci.com
53.60 s
Downloading cached libxcb from https://cache.nix-ci.com
53.60 s
Downloading cached llhttp-9.3.1-dev from https://cache.nix-ci.com
53.61 s
Downloaded cached libwebp (1.7 MiB) in 277ms
53.61 s
Progress: 1 of 61 built, 84 of 246 downloaded from cache (15 downloading)
53.61 s
Downloading cached libaom from https://cache.nix-ci.com
53.67 s
Downloaded cached make-binary-wrapper-hook (18 KiB) in 274ms
53.69 s
Progress: 1 of 61 built, 85 of 246 downloaded from cache (15 downloading)
53.69 s
Downloaded cached libuv-1.52.0-dev (109 KiB) in 234ms
53.69 s
Downloading cached libtiff from https://cache.nix-ci.com
53.69 s
Progress: 1 of 60 built, 86 of 246 downloaded from cache (15 downloading)
53.69 s
Downloading cached llvm-21.1.8-lib from https://cache.nix-ci.com
53.70 s
Downloaded cached mpdecimal (220 KiB) in 198ms
53.70 s
Progress: 1 of 60 built, 87 of 246 downloaded from cache (15 downloading)
53.70 s
Downloading cached nghttp2-1.67.1-lib from https://cache.nix-ci.com
53.74 s
Downloaded cached freetype-2.13.3-dev (879 KiB) in 173ms
53.74 s
Downloaded cached llhttp-9.3.1-dev (37 KiB) in 145ms
53.75 s
Downloaded cached libjpeg-turbo-3.1.3-dev (216 KiB) in 150ms
53.76 s
Downloaded cached fontconfig-2.17.1-lib (414 KiB) in 196ms
53.78 s
Downloaded cached libxcb (1.4 MiB) in 186ms
53.78 s
Progress: 1 of 60 built, 88 of 246 downloaded from cache (15 downloading)
53.79 s
Downloading cached nghttp2-1.67.1-lib from https://cache.nix-ci.com
53.80 s
Downloaded cached ncompress (74 KiB) in 234ms
53.82 s
Downloaded cached libyuv (3.9 MiB) in 485ms
53.83 s
Downloaded cached libtiff (739 KiB) in 141ms
53.83 s
Progress: 1 of 60 built, 89 of 246 downloaded from cache (15 downloading)
53.83 s
Progress: 1 of 60 built, 90 of 246 downloaded from cache (14 downloading)
53.83 s
Progress: 1 of 60 built, 91 of 246 downloaded from cache (13 downloading)
53.83 s
Progress: 1 of 60 built, 92 of 246 downloaded from cache (12 downloading)
53.84 s
Downloading cached nghttp3 from https://cache.nix-ci.com
53.84 s
Downloading cached ngtcp2 from https://cache.nix-ci.com
53.84 s
Progress: 1 of 60 built, 93 of 246 downloaded from cache (15 downloading)
53.84 s
Downloaded cached mpfr (803 KiB) in 343ms
53.84 s
Progress: 1 of 60 built, 94 of 246 downloaded from cache (14 downloading)
53.84 s
Progress: 1 of 60 built, 95 of 246 downloaded from cache (13 downloading)
53.84 s
Downloading cached nickel from https://cache.nix-ci.com
53.84 s
Downloading cached fontconfig-2.17.1-bin from https://cache.nix-ci.com
53.84 s
Downloading cached nickel-1.16.0-nls from https://cache.nix-ci.com
53.84 s
Progress: 1 of 60 built, 96 of 246 downloaded from cache (15 downloading)
53.84 s
Downloading cached libx11 from https://cache.nix-ci.com
53.85 s
Downloading cached libxcb-1.17.0-dev from https://cache.nix-ci.com
53.85 s
Downloading cached lcms2-2.18-bin from https://cache.nix-ci.com
53.93 s
Downloaded cached nghttp2-1.67.1-lib (225 KiB) in 230ms
53.94 s
Progress: 1 of 59 built, 97 of 246 downloaded from cache (15 downloading)
53.94 s
Downloading cached libmpc from https://cache.nix-ci.com
54.09 s
Downloaded cached icu4c (38.2 MiB) in 1.4s
54.10 s
Progress: 1 of 59 built, 98 of 246 downloaded from cache (15 downloading)
54.10 s
Downloaded cached nghttp3 (227 KiB) in 264ms
54.11 s
Downloading cached libtiff-4.7.1-bin from https://cache.nix-ci.com
54.12 s
Progress: 1 of 59 built, 99 of 246 downloaded from cache (15 downloading)
54.12 s
Downloading cached icu4c-76.1-dev from https://cache.nix-ci.com
54.13 s
Downloaded cached nghttp2-1.67.1-lib (225 KiB) in 337ms
54.13 s
Progress: 1 of 59 built, 100 of 246 downloaded from cache (15 downloading)
54.13 s
Downloading cached libwebp from https://cache.nix-ci.com
54.16 s
Downloaded cached fontconfig-2.17.1-bin (201 KiB) in 312ms
54.16 s
Progress: 1 of 59 built, 101 of 246 downloaded from cache (15 downloading)
54.16 s
Downloading cached mpfr-4.2.2-dev from https://cache.nix-ci.com
54.18 s
Downloaded cached lcms2-2.18-bin (205 KiB) in 332ms
54.18 s
Progress: 1 of 59 built, 102 of 246 downloaded from cache (15 downloading)
54.18 s
Downloading cached fontconfig-2.17.1-dev from https://cache.nix-ci.com
54.21 s
Downloaded cached ngtcp2 (487 KiB) in 370ms
54.24 s
Downloaded cached libmpc (281 KiB) in 297ms
54.25 s
Progress: 1 of 59 built, 103 of 246 downloaded from cache (15 downloading)
54.25 s
Downloaded cached libxcb-1.17.0-dev (2.1 MiB) in 399ms
54.25 s
Progress: 1 of 59 built, 104 of 246 downloaded from cache (15 downloading)
54.25 s
Downloading cached lcms2-2.18-dev from https://cache.nix-ci.com
54.25 s
Progress: 1 of 59 built, 105 of 246 downloaded from cache (14 downloading)
54.25 s
Downloading cached nghttp2 from https://cache.nix-ci.com
54.25 s
Downloading cached nghttp2 from https://cache.nix-ci.com
54.28 s
Downloaded cached libaom (8.4 MiB) in 671ms
54.28 s
Progress: 1 of 58 built, 106 of 246 downloaded from cache (15 downloading)
54.28 s
Downloading cached nghttp3-1.14.0-dev from https://cache.nix-ci.com
54.48 s
Downloaded cached fontconfig-2.17.1-dev (41 KiB) in 301ms
54.51 s
Progress: 1 of 58 built, 107 of 246 downloaded from cache (15 downloading)
54.51 s
Downloaded cached libx11 (2.6 MiB) in 668ms
54.52 s
Downloading cached ngtcp2-1.19.0-dev from https://cache.nix-ci.com
54.52 s
Downloaded cached libtiff-4.7.1-bin (734 KiB) in 415ms
54.52 s
Progress: 1 of 58 built, 108 of 246 downloaded from cache (15 downloading)
54.54 s
Progress: 1 of 58 built, 109 of 246 downloaded from cache (15 downloading)
54.54 s
Downloading cached nspr from https://cache.nix-ci.com
54.55 s
Downloaded cached lcms2-2.18-dev (137 KiB) in 305ms
54.56 s
Downloading cached libxext from https://cache.nix-ci.com
54.56 s
Downloaded cached mpfr-4.2.2-dev (64 KiB) in 405ms
54.60 s
Downloaded cached nghttp3-1.14.0-dev (118 KiB) in 312ms
54.62 s
Downloaded cached libwebp (1.7 MiB) in 488ms
54.62 s
Downloaded cached ncurses (3.7 MiB) in 1.0s
54.63 s
Progress: 1 of 58 built, 110 of 246 downloaded from cache (15 downloading)
54.63 s
Progress: 1 of 58 built, 111 of 246 downloaded from cache (15 downloading)
54.63 s
Progress: 1 of 58 built, 112 of 246 downloaded from cache (14 downloading)
54.63 s
Progress: 1 of 58 built, 113 of 246 downloaded from cache (13 downloading)
54.63 s
Progress: 1 of 58 built, 114 of 246 downloaded from cache (12 downloading)
54.63 s
Downloading cached libtiff-4.7.1-dev from https://cache.nix-ci.com
54.63 s
Downloading cached nss-cacert from https://cache.nix-ci.com
54.63 s
Downloading cached libxpm from https://cache.nix-ci.com
54.64 s
Downloading cached libxrender from https://cache.nix-ci.com
54.64 s
Downloading cached numactl from https://cache.nix-ci.com
54.67 s
Downloaded cached nghttp2 (2.5 MiB) in 424ms
54.67 s
Progress: 1 of 57 built, 115 of 246 downloaded from cache (15 downloading)
54.68 s
Downloading cached libedit-20251016 from https://cache.nix-ci.com
54.70 s
Downloaded cached icu4c-76.1-dev (5.8 MiB) in 573ms
54.71 s
Progress: 1 of 57 built, 116 of 246 downloaded from cache (15 downloading)
54.71 s
Downloaded cached nghttp2 (2.5 MiB) in 465ms
54.71 s
Downloading cached nghttp2-1.67.1-dev from https://cache.nix-ci.com
54.71 s
Progress: 1 of 57 built, 117 of 246 downloaded from cache (15 downloading)
54.72 s
Downloading cached openjpeg from https://cache.nix-ci.com
54.83 s
Downloaded cached libxext (93 KiB) in 266ms
54.84 s
Progress: 1 of 57 built, 118 of 246 downloaded from cache (15 downloading)
54.84 s
Downloading cached nghttp2-1.67.1-dev from https://cache.nix-ci.com
54.85 s
Downloaded cached ngtcp2-1.19.0-dev (271 KiB) in 332ms
54.85 s
Downloaded cached libtiff-4.7.1-dev (106 KiB) in 219ms
54.86 s
Progress: 1 of 57 built, 119 of 246 downloaded from cache (15 downloading)
54.86 s
Downloading cached libglvnd from https://cache.nix-ci.com
54.88 s
Progress: 1 of 57 built, 120 of 246 downloaded from cache (15 downloading)
54.88 s
Downloaded cached libxrender (53 KiB) in 237ms
54.88 s
Progress: 1 of 57 built, 121 of 246 downloaded from cache (15 downloading)
54.88 s
Downloading cached libxi from https://cache.nix-ci.com
54.88 s
Downloading cached libxxf86vm from https://cache.nix-ci.com
54.90 s
Downloaded cached nss-cacert (732 KiB) in 269ms
54.91 s
Progress: 1 of 57 built, 122 of 246 downloaded from cache (15 downloading)
54.91 s
Downloaded cached libedit-20251016 (261 KiB) in 232ms
54.91 s
Downloading cached libxft from https://cache.nix-ci.com
54.93 s
Downloaded cached nghttp2-1.67.1-dev (241 KiB) in 221ms
54.95 s
Progress: 1 of 56 built, 123 of 246 downloaded from cache (15 downloading)
54.95 s
Progress: 1 of 56 built, 124 of 246 downloaded from cache (15 downloading)
54.95 s
Downloading cached dash from https://cache.nix-ci.com
54.95 s
Downloading cached libxrandr from https://cache.nix-ci.com
54.95 s
Downloaded cached nspr (349 KiB) in 406ms
54.95 s
Progress: 1 of 56 built, 125 of 246 downloaded from cache (15 downloading)
54.95 s
Downloading cached krb5 from https://cache.nix-ci.com
54.98 s
Downloaded cached nickel-1.16.0-nls (18.3 MiB) in 1.1s
54.98 s
Progress: 1 of 56 built, 126 of 246 downloaded from cache (15 downloading)
54.98 s
Downloading cached nspr-4.38.2-dev from https://cache.nix-ci.com
55.02 s
Downloaded cached libxpm (87 KiB) in 383ms
55.02 s
Downloaded cached numactl (269 KiB) in 382ms
55.12 s
Downloaded cached openjpeg (1.6 MiB) in 406ms
55.14 s
Building /nix/store/v2bggyh4x9dllhrb6anc5xlh707bv74w-nls-1.16.0.drv
55.14 s
Progress: 1 of 55 built (1 building), 127 of 246 downloaded from cache (15 downloading)
55.14 s
Progress: 1 of 55 built (1 building), 128 of 246 downloaded from cache (14 downloading)
55.14 s
Progress: 1 of 55 built (1 building), 129 of 246 downloaded from cache (13 downloading)
55.14 s
Downloading cached perl from https://cache.nix-ci.com
55.14 s
Downloading cached openssl-3.6.1-bin from https://cache.nix-ci.com
55.14 s
Downloading cached p11-kit from https://cache.nix-ci.com
55.19 s
Downloaded cached nghttp2-1.67.1-dev (241 KiB) in 350ms
55.20 s
Progress: 1 of 55 built (1 building), 130 of 246 downloaded from cache (15 downloading)
55.20 s
Downloaded cached libxrandr (62 KiB) in 251ms
55.20 s
Downloading cached openjpeg-2.5.4-dev from https://cache.nix-ci.com
55.20 s
Downloaded cached maturin (25 MiB) in 1.7s
55.21 s
Downloaded cached libxi (87 KiB) in 333ms
55.21 s
Progress: 1 of 55 built (1 building), 131 of 246 downloaded from cache (15 downloading)
55.21 s
Progress: 1 of 55 built (1 building), 132 of 246 downloaded from cache (15 downloading)
55.21 s
Progress: 1 of 55 built (1 building), 133 of 246 downloaded from cache (14 downloading)
55.21 s
Downloading cached pixman from https://cache.nix-ci.com
55.21 s
Downloading cached poppler-data from https://cache.nix-ci.com
55.21 s
Downloading cached pkg-config from https://cache.nix-ci.com
55.24 s
Downloaded cached dash (189 KiB) in 291ms
55.24 s
Downloaded cached libxft (151 KiB) in 333ms
55.25 s
Downloaded cached libglvnd (2.5 MiB) in 393ms
55.28 s
Downloaded cached libxxf86vm (40 KiB) in 398ms
55.33 s
Downloaded cached nspr-4.38.2-dev (576 KiB) in 340ms
55.33 s
Downloaded cached nickel (29.9 MiB) in 1.4s
55.35 s
Downloaded cached krb5 (1.3 MiB) in 399ms
55.41 s
Downloaded cached openssl-3.6.1-bin (1.3 MiB) in 267ms
55.48 s
Downloaded cached p11-kit (5.7 MiB) in 337ms
55.49 s
[nls:post-build] Uploading to the NixCI cache: /nix/store/nd5wyzd5mhfpdmn8j451bmrmfhgmip5h-nls-1.16.0
55.56 s
Downloaded cached pixman (858 KiB) in 344ms
55.57 s
Downloaded cached openjpeg-2.5.4-dev (79 KiB) in 370ms
55.60 s
Downloaded cached pkg-config (673 KiB) in 390ms
55.94 s
Downloaded cached poppler-data (12.4 MiB) in 723ms
56.77 s
[nls:post-build] warning: 'warn-short-path-literals' is deprecated, use 'lint-short-path-literals = ignore' instead
57.55 s
Downloaded cached perl (55 MiB) in 2.4s
58.17 s
[nls:post-build] copying 0 paths...
59.06 s
[nls:post-build] warning: 'warn-short-path-literals' is deprecated, use 'lint-short-path-literals = ignore' instead
63.11 s
Downloaded cached gfortran (315.5 MiB) in 9.7s
63.88 s
Downloaded cached llvm-21.1.8-lib (540.2 MiB) in 10.1s
65.78 s
[nls:post-build] copying 0 paths...
65.99 s
Uploaded nls in 10.6s
65.99 s
Progress: 2 of 55 built, 133 of 246 downloaded from cache (16 downloading)
65.99 s
Built nls in 10.8s
65.99 s
Progress: 2 of 54 built, 134 of 246 downloaded from cache (15 downloading)
65.99 s
Progress: 2 of 54 built, 135 of 246 downloaded from cache (14 downloading)
65.99 s
Progress: 2 of 54 built, 136 of 246 downloaded from cache (13 downloading)
65.99 s
Progress: 2 of 54 built, 137 of 246 downloaded from cache (12 downloading)
65.99 s
Progress: 2 of 54 built, 138 of 246 downloaded from cache (11 downloading)
65.99 s
Progress: 2 of 54 built, 139 of 246 downloaded from cache (10 downloading)
65.99 s
Progress: 2 of 54 built, 140 of 246 downloaded from cache (9 downloading)
65.99 s
Progress: 2 of 54 built, 141 of 246 downloaded from cache (8 downloading)
65.99 s
Progress: 2 of 54 built, 142 of 246 downloaded from cache (7 downloading)
65.99 s
Progress: 2 of 54 built, 143 of 246 downloaded from cache (6 downloading)
65.99 s
Progress: 2 of 54 built, 144 of 246 downloaded from cache (5 downloading)
65.99 s
Progress: 2 of 54 built, 145 of 246 downloaded from cache (4 downloading)
65.99 s
Progress: 2 of 54 built, 146 of 246 downloaded from cache (3 downloading)
65.99 s
Progress: 2 of 54 built, 147 of 246 downloaded from cache (2 downloading)
65.99 s
Progress: 2 of 54 built, 148 of 246 downloaded from cache (1 downloading)
65.99 s
Progress: 2 of 54 built, 149 of 246 downloaded from cache
65.99 s
Downloading cached readline from https://cache.nix-ci.com
65.99 s
Downloading cached rust-analyzer-unwrapped-2026-04 from https://cache.nix-ci.com
65.99 s
Downloading cached tinymist from https://cache.nix-ci.com
65.99 s
Downloading cached typst from https://cache.nix-ci.com
65.99 s
Downloading cached tdf from https://cache.nix-ci.com
65.99 s
Downloading cached util-linux-minimal-2.41.3-lib from https://cache.nix-ci.com
65.99 s
Downloading cached sqlite from https://cache.nix-ci.com
65.99 s
Downloading cached typstyle from https://cache.nix-ci.com
65.99 s
Downloading cached sqlite-3.51.2-bin from https://cache.nix-ci.com
66.00 s
Downloading cached rust-script from https://cache.nix-ci.com
66.00 s
Downloading cached simdutf from https://cache.nix-ci.com
66.00 s
Downloading cached slang from https://cache.nix-ci.com
66.00 s
Downloading cached simdjson from https://cache.nix-ci.com
66.00 s
Downloading cached publicsuffix-list-0-unstable-2026-03 from https://cache.nix-ci.com
66.00 s
Downloading cached unzip from https://cache.nix-ci.com
66.00 s
Downloading cached simdutf from https://cache.nix-ci.com
66.12 s
Downloaded cached readline (494 KiB) in 133ms
66.13 s
Progress: 2 of 51 built, 150 of 246 downloaded from cache (15 downloading)
66.13 s
Downloading cached freeglut-mupdf-3.0.0-r13ae6aa2c2f9a7b4266fc2e6116c876237f40477 from https://cache.nix-ci.com
66.24 s
Downloaded cached publicsuffix-list-0-unstable-2026-03 (328 KiB) in 239ms
66.24 s
Progress: 2 of 51 built, 151 of 246 downloaded from cache (15 downloading)
66.25 s
Downloading cached bash-interactive from https://cache.nix-ci.com
66.25 s
Downloaded cached simdutf (977 KiB) in 252ms
66.25 s
Progress: 2 of 51 built, 152 of 246 downloaded from cache (15 downloading)
66.25 s
Downloading cached gfortran-wrapper from https://cache.nix-ci.com
66.25 s
Downloaded cached unzip (522 KiB) in 250ms
66.26 s
Progress: 2 of 51 built, 153 of 246 downloaded from cache (15 downloading)
66.27 s
Downloading cached krb5-1.22.1-dev from https://cache.nix-ci.com
66.29 s
Downloaded cached util-linux-minimal-2.41.3-lib (2 MiB) in 296ms
66.30 s
Downloaded cached simdutf (1.3 MiB) in 295ms
66.33 s
Downloaded cached simdjson (7.5 MiB) in 331ms
66.38 s
Downloaded cached sqlite (5.6 MiB) in 384ms
66.40 s
Downloaded cached slang (2.7 MiB) in 406ms
66.42 s
Building /nix/store/0kkyb6fydl85hc5rrfczaj8w2rmrk0s6-rscls-0.2.3.tar.gz.drv
66.42 s
Progress: 2 of 50 built (1 building), 154 of 246 downloaded from cache (15 downloading)
66.42 s
Progress: 2 of 50 built (1 building), 155 of 246 downloaded from cache (14 downloading)
66.42 s
Progress: 2 of 50 built (1 building), 156 of 246 downloaded from cache (13 downloading)
66.42 s
Progress: 2 of 50 built (1 building), 157 of 246 downloaded from cache (12 downloading)
66.42 s
Progress: 2 of 50 built (1 building), 158 of 246 downloaded from cache (11 downloading)
66.43 s
Downloading cached libpsl from https://cache.nix-ci.com
66.43 s
Downloading cached openssl-3.6.1-dev from https://cache.nix-ci.com
66.43 s
Downloading cached uv from https://cache.nix-ci.com
66.43 s
Downloading cached rustc from https://cache.nix-ci.com
66.43 s
[rscls] structuredAttrs is enabled
66.43 s
Downloading cached pkg-config-wrapper from https://cache.nix-ci.com
66.46 s
Downloaded cached freeglut-mupdf-3.0.0-r13ae6aa2c2f9a7b4266fc2e6116c876237f40477 (1.1 MiB) in 331ms
66.46 s
Progress: 2 of 50 built (1 building), 159 of 246 downloaded from cache (15 downloading)
66.47 s
Downloaded cached sqlite-3.51.2-bin (2.1 MiB) in 474ms
66.47 s
Progress: 2 of 50 built (1 building), 160 of 246 downloaded from cache (15 downloading)
66.47 s
Downloading cached ada from https://cache.nix-ci.com
66.49 s
Downloading cached glib from https://cache.nix-ci.com
66.49 s
Downloaded cached typstyle (2.2 MiB) in 500ms
66.49 s
Progress: 2 of 50 built (1 building), 161 of 246 downloaded from cache (15 downloading)
66.50 s
Downloading cached nss from https://cache.nix-ci.com
66.51 s
Downloaded cached gfortran-wrapper (74 KiB) in 259ms
66.51 s
Progress: 2 of 49 built (1 building), 162 of 246 downloaded from cache (15 downloading)
66.51 s
Downloading cached python3 from https://cache.nix-ci.com
66.51 s
Downloaded cached krb5-1.22.1-dev (748 KiB) in 241ms
66.51 s
Progress: 2 of 48 built (1 building), 163 of 246 downloaded from cache (15 downloading)
66.51 s
[rscls]
66.51 s
[rscls] trying https://crates.io/api/v1/crates/rscls/0.2.3/download
66.51 s
Downloading cached sqlite-3.51.2-dev from https://cache.nix-ci.com
66.52 s
[rscls] % Total % Received % Xferd Average Speed Time Time Time Current
66.52 s
[rscls] Dload Upload Total Spent Left Speed
66.55 s
Downloaded cached libpsl (114 KiB) in 127ms
66.55 s
Progress: 2 of 48 built (1 building), 164 of 246 downloaded from cache (15 downloading)
66.56 s
Downloading cached uvwasi from https://cache.nix-ci.com
66.56 s
Downloaded cached pkg-config-wrapper (11 KiB) in 128ms
66.56 s
Progress: 2 of 48 built (1 building), 165 of 246 downloaded from cache (15 downloading)
66.57 s
Downloading cached curl from https://cache.nix-ci.com
66.64 s
Downloaded cached ada (1.3 MiB) in 169ms
66.64 s
Progress: 2 of 47 built (1 building), 166 of 246 downloaded from cache (15 downloading)
66.64 s
Downloading cached libpsl-0.21.5-dev from https://cache.nix-ci.com
66.65 s
Downloaded cached rust-script (3.3 MiB) in 655ms
66.65 s
Progress: 2 of 47 built (1 building), 167 of 246 downloaded from cache (15 downloading)
66.65 s
Downloading cached xorgproto from https://cache.nix-ci.com
66.66 s
Downloaded cached openssl-3.6.1-dev (1.9 MiB) in 228ms
66.66 s
Progress: 2 of 46 built (1 building), 168 of 246 downloaded from cache (15 downloading)
66.66 s
Downloading cached zlib-ng from https://cache.nix-ci.com
66.68 s
Downloaded cached sqlite-3.51.2-dev (695 KiB) in 170ms
66.68 s
Progress: 2 of 45 built (1 building), 169 of 246 downloaded from cache (15 downloading)
66.68 s
Downloaded cached bash-interactive (7.1 MiB) in 438ms
66.68 s
Progress: 2 of 45 built (1 building), 170 of 246 downloaded from cache (15 downloading)
66.69 s
Downloading cached libssh2-1.11.1-dev from https://cache.nix-ci.com
66.69 s
Downloading cached rustc-bootstrap from https://cache.nix-ci.com
66.71 s
Downloaded cached uvwasi (238 KiB) in 154ms
66.72 s
Progress: 2 of 45 built (1 building), 171 of 246 downloaded from cache (15 downloading)
66.74 s
Downloading cached nodejs-slim from https://cache.nix-ci.com
66.77 s
Downloaded cached curl (1.1 MiB) in 192ms
66.77 s
Progress: 2 of 45 built (1 building), 172 of 246 downloaded from cache (15 downloading)
66.77 s
Downloading cached curl-8.18.0-bin from https://cache.nix-ci.com
66.78 s
Downloaded cached libpsl-0.21.5-dev (7800 B) in 144ms
66.79 s
Progress: 2 of 45 built (1 building), 173 of 246 downloaded from cache (15 downloading)
66.79 s
Downloading cached elfutils from https://cache.nix-ci.com
66.90 s
Downloaded cached libssh2-1.11.1-dev (83 KiB) in 210ms
66.90 s
Progress: 2 of 45 built (1 building), 174 of 246 downloaded from cache (15 downloading)
66.90 s
Downloaded cached xorgproto (1.6 MiB) in 243ms
66.90 s
Progress: 2 of 45 built (1 building), 175 of 246 downloaded from cache (14 downloading)
66.90 s
Downloading cached libxau-1.0.12-dev from https://cache.nix-ci.com
66.90 s
Downloading cached libx11-1.8.13-dev from https://cache.nix-ci.com
66.90 s
[rscls] 0 0 0 0 0 0 0 0 0
66.92 s
Downloaded cached zlib-ng (192 KiB) in 259ms
66.92 s
Progress: 2 of 45 built (1 building), 176 of 246 downloaded from cache (15 downloading)
66.92 s
Downloading cached git-minimal from https://cache.nix-ci.com
66.97 s
Downloaded cached nss (4 MiB) in 474ms
66.97 s
Downloaded cached curl-8.18.0-bin (369 KiB) in 205ms
66.97 s
Progress: 2 of 45 built (1 building), 177 of 246 downloaded from cache (15 downloading)
66.97 s
Progress: 2 of 45 built (1 building), 178 of 246 downloaded from cache (14 downloading)
66.97 s
Downloading cached curl-8.18.0-dev from https://cache.nix-ci.com
66.98 s
Downloading cached nss-3.112.3-dev from https://cache.nix-ci.com
67.07 s
Downloaded cached libx11-1.8.13-dev (250 KiB) in 165ms
67.07 s
Progress: 2 of 45 built (1 building), 179 of 246 downloaded from cache (15 downloading)
67.07 s
Downloading cached libxrender-0.9.12-dev from https://cache.nix-ci.com
67.08 s
Downloaded cached libxau-1.0.12-dev (7000 B) in 182ms
67.09 s
Progress: 2 of 45 built (1 building), 180 of 246 downloaded from cache (15 downloading)
67.09 s
Downloading cached libxext-1.3.7-dev from https://cache.nix-ci.com
67.18 s
Downloaded cached elfutils (4 MiB) in 394ms
67.18 s
Progress: 2 of 45 built (1 building), 181 of 246 downloaded from cache (15 downloading)
67.24 s
Downloaded cached curl-8.18.0-dev (274 KiB) in 264ms
67.24 s
Progress: 2 of 45 built (1 building), 182 of 246 downloaded from cache (14 downloading)
67.30 s
Downloaded cached tdf (13.4 MiB) in 1.3s
67.30 s
Progress: 2 of 45 built (1 building), 183 of 246 downloaded from cache (13 downloading)
67.31 s
Downloaded cached libxrender-0.9.12-dev (35 KiB) in 232ms
67.31 s
Progress: 2 of 44 built (1 building), 184 of 246 downloaded from cache (12 downloading)
67.32 s
Downloaded cached libxext-1.3.7-dev (58 KiB) in 238ms
67.32 s
Progress: 2 of 44 built (1 building), 185 of 246 downloaded from cache (11 downloading)
67.34 s
Downloaded cached nss-3.112.3-dev (1.4 MiB) in 367ms
67.35 s
Progress: 2 of 44 built (1 building), 186 of 246 downloaded from cache (10 downloading)
67.49 s
[rscls] 100 21604 100 21604 0 0 22501 0 0
67.51 s
[rscls] unpacking source archive /build/download.tar.gz
67.68 s
Downloaded cached glib (15.1 MiB) in 1.1s
67.71 s
[rscls:post-build] Uploading to the NixCI cache: /nix/store/mmsbv6swhwgf8lppwapxb1zcnvcjdqhq-rscls-0.2.3.tar.gz
68.20 s
[rscls:post-build] warning: 'warn-short-path-literals' is deprecated, use 'lint-short-path-literals = ignore' instead
68.34 s
[rscls:post-build] copying 1 paths...
68.34 s
[rscls:post-build] copying path '/nix/store/mmsbv6swhwgf8lppwapxb1zcnvcjdqhq-rscls-0.2.3.tar.gz' to 'https://cache.nix-ci.com'...
68.64 s
Downloaded cached rust-analyzer-unwrapped-2026-04 (48.6 MiB) in 2.6s
69.06 s
Downloaded cached git-minimal (51.5 MiB) in 2.1s
69.20 s
Downloaded cached typst (42.4 MiB) in 3.2s
70.49 s
Downloaded cached uv (64.6 MiB) in 4.0s
70.97 s
Downloaded cached nodejs-slim (81.2 MiB) in 4.2s
72.24 s
Downloaded cached python3 (106.8 MiB) in 5.7s
74.10 s
[rscls:post-build] warning: 'warn-short-path-literals' is deprecated, use 'lint-short-path-literals = ignore' instead
74.47 s
[rscls:post-build] copying 1 paths...
74.47 s
[rscls:post-build] copying path '/nix/store/0kkyb6fydl85hc5rrfczaj8w2rmrk0s6-rscls-0.2.3.tar.gz.drv' to 'https://cache.nix-ci.com'...
74.57 s
Downloaded cached tinymist (170.2 MiB) in 8.5s
78.48 s
Downloaded cached rustc-bootstrap (575 MiB) in 11.7s
81.88 s
Uploaded rscls in 14.2s
81.93 s
Progress: 3 of 45 built, 186 of 246 downloaded from cache (10 downloading)
81.93 s
Built rscls in 15.5s
81.93 s
Progress: 3 of 44 built, 187 of 246 downloaded from cache (9 downloading)
81.93 s
Progress: 3 of 44 built, 188 of 246 downloaded from cache (8 downloading)
81.93 s
Progress: 3 of 44 built, 189 of 246 downloaded from cache (7 downloading)
81.93 s
Progress: 3 of 44 built, 190 of 246 downloaded from cache (6 downloading)
81.93 s
Progress: 3 of 44 built, 191 of 246 downloaded from cache (5 downloading)
81.93 s
Progress: 3 of 44 built, 192 of 246 downloaded from cache (4 downloading)
81.93 s
Progress: 3 of 44 built, 193 of 246 downloaded from cache (3 downloading)
81.93 s
Progress: 3 of 44 built, 194 of 246 downloaded from cache (2 downloading)
81.93 s
Progress: 3 of 44 built, 195 of 246 downloaded from cache (1 downloading)
81.93 s
Downloading cached babeltrace from https://cache.nix-ci.com
81.93 s
Downloading cached cairo from https://cache.nix-ci.com
81.93 s
Downloading cached glib-2.86.3-bin from https://cache.nix-ci.com
81.93 s
Downloading cached python3.13-charset-normalizer from https://cache.nix-ci.com
81.93 s
Downloading cached nodejs-slim-24.14.0-npm from https://cache.nix-ci.com
81.93 s
Downloading cached nix-prefetch-git from https://cache.nix-ci.com
81.93 s
Downloading cached python3.13-mccabe from https://cache.nix-ci.com
81.93 s
Downloading cached nodejs-slim-24.14.0-corepack from https://cache.nix-ci.com
81.93 s
Downloading cached python3.13-filelock from https://cache.nix-ci.com
81.93 s
Downloading cached harfbuzz from https://cache.nix-ci.com
81.93 s
Downloading cached python3.13-idna from https://cache.nix-ci.com
81.93 s
Downloading cached python3.13-distlib from https://cache.nix-ci.com
81.93 s
Downloading cached python3.13-certifi from https://cache.nix-ci.com
81.93 s
Downloading cached gts from https://cache.nix-ci.com
81.93 s
Downloading cached gdk-pixbuf from https://cache.nix-ci.com
82.00 s
Downloaded cached nodejs-slim-24.14.0-corepack (1 MiB) in 68ms
82.00 s
Progress: 3 of 40 built, 196 of 246 downloaded from cache (15 downloading)
82.00 s
Downloading cached python3.13-packaging from https://cache.nix-ci.com
82.03 s
Downloaded cached python3.13-certifi (529 KiB) in 103ms
82.03 s
Progress: 3 of 40 built, 197 of 246 downloaded from cache (15 downloading)
82.03 s
Downloading cached python3.13-platformdirs from https://cache.nix-ci.com
82.04 s
Downloaded cached glib-2.86.3-bin (582 KiB) in 106ms
82.04 s
Progress: 3 of 39 built, 198 of 246 downloaded from cache (15 downloading)
82.04 s
Downloading cached python3.13-pycodestyle from https://cache.nix-ci.com
82.04 s
Downloaded cached python3.13-idna (919 KiB) in 106ms
82.04 s
Progress: 3 of 39 built, 199 of 246 downloaded from cache (15 downloading)
82.04 s
Downloading cached python3.13-pyflakes from https://cache.nix-ci.com
82.04 s
Downloaded cached python3.13-charset-normalizer (800 KiB) in 109ms
82.04 s
Progress: 3 of 38 built, 200 of 246 downloaded from cache (15 downloading)
82.04 s
Downloading cached python3.13-pysocks from https://cache.nix-ci.com
82.05 s
Downloaded cached python3.13-filelock (148 KiB) in 116ms
82.05 s
Progress: 3 of 37 built, 201 of 246 downloaded from cache (15 downloading)
82.05 s
Downloading cached python3.13-tomli from https://cache.nix-ci.com
82.07 s
Downloaded cached python3.13-distlib (1.3 MiB) in 137ms
82.07 s
Progress: 3 of 37 built, 202 of 246 downloaded from cache (15 downloading)
82.07 s
Downloading cached python3.13-tomli-w from https://cache.nix-ci.com
82.08 s
Downloaded cached python3.13-mccabe (56 KiB) in 147ms
82.08 s
Downloaded cached cairo (2.1 MiB) in 151ms
82.08 s
Progress: 3 of 37 built, 203 of 246 downloaded from cache (15 downloading)
82.08 s
Downloading cached python3.13-urllib3 from https://cache.nix-ci.com
82.08 s
Progress: 3 of 37 built, 204 of 246 downloaded from cache (15 downloading)
82.08 s
Downloading cached rust-analyzer-2026-04 from https://cache.nix-ci.com
82.09 s
Downloaded cached nix-prefetch-git (19 KiB) in 165ms
82.09 s
Progress: 3 of 37 built, 205 of 246 downloaded from cache (15 downloading)
82.09 s
Downloading cached poppler-utils from https://cache.nix-ci.com
82.10 s
Downloaded cached python3.13-packaging (698 KiB) in 98ms
82.10 s
Progress: 3 of 36 built, 206 of 246 downloaded from cache (15 downloading)
82.11 s
Downloading cached rustc-bootstrap-wrapper from https://cache.nix-ci.com
82.12 s
Downloaded cached babeltrace (885 KiB) in 195ms
82.12 s
Progress: 3 of 36 built, 207 of 246 downloaded from cache (15 downloading)
82.13 s
Downloading cached glib-2.86.3-dev from https://cache.nix-ci.com
82.13 s
Downloaded cached python3.13-platformdirs (254 KiB) in 95ms
82.14 s
Progress: 3 of 36 built, 208 of 246 downloaded from cache (15 downloading)
82.14 s
Downloading cached perf-linux from https://cache.nix-ci.com
82.16 s
Downloaded cached rust-analyzer-2026-04 (768 B) in 73ms
82.16 s
Progress: 3 of 36 built, 209 of 246 downloaded from cache (15 downloading)
82.16 s
Downloading cached python3.13-virtualenv from https://cache.nix-ci.com
82.16 s
Downloaded cached gts (440 KiB) in 226ms
82.16 s
Progress: 3 of 35 built, 210 of 246 downloaded from cache (15 downloading)
82.18 s
Downloaded cached rustc-bootstrap-wrapper (3744 B) in 70ms
82.18 s
Progress: 3 of 35 built, 211 of 246 downloaded from cache (14 downloading)
82.18 s
Downloading cached cargo-bootstrap from https://cache.nix-ci.com
82.20 s
Downloaded cached harfbuzz (3.6 MiB) in 275ms
82.20 s
Downloaded cached gdk-pixbuf (2.8 MiB) in 274ms
82.20 s
Progress: 3 of 35 built, 212 of 246 downloaded from cache (14 downloading)
82.21 s
Progress: 3 of 35 built, 213 of 246 downloaded from cache (15 downloading)
82.21 s
Downloading cached mupdf from https://cache.nix-ci.com
82.21 s
Downloading cached libavif from https://cache.nix-ci.com
82.21 s
Downloading cached pango from https://cache.nix-ci.com
82.22 s
Downloaded cached python3.13-urllib3 (1.3 MiB) in 136ms
82.22 s
Progress: 3 of 35 built, 214 of 246 downloaded from cache (15 downloading)
82.22 s
Downloaded cached python3.13-pysocks (134 KiB) in 177ms
82.22 s
Progress: 3 of 34 built, 215 of 246 downloaded from cache (15 downloading)
82.22 s
Downloaded cached python3.13-tomli (114 KiB) in 177ms
82.22 s
Downloading cached python3.13-requests from https://cache.nix-ci.com
82.22 s
Progress: 3 of 33 built, 216 of 246 downloaded from cache (14 downloading)
82.23 s
Downloaded cached python3.13-pycodestyle (324 KiB) in 197ms
82.23 s
Progress: 3 of 32 built, 217 of 246 downloaded from cache (13 downloading)
82.25 s
Downloaded cached python3.13-pyflakes (1.1 MiB) in 210ms
82.25 s
Progress: 3 of 32 built, 218 of 246 downloaded from cache (12 downloading)
82.25 s
Downloading cached python3.13-flake8 from https://cache.nix-ci.com
82.26 s
Downloaded cached python3.13-tomli-w (39 KiB) in 192ms
82.26 s
Progress: 3 of 32 built, 219 of 246 downloaded from cache (12 downloading)
82.42 s
Downloaded cached libavif (1011 KiB) in 210ms
82.43 s
Downloaded cached pango (907 KiB) in 221ms
82.46 s
Downloaded cached poppler-utils (6.3 MiB) in 366ms
82.46 s
Building /nix/store/yk80nm71i5w6mwbs9ns7xiqx6b2l7gpm-python3-3.13.12-env.drv
82.47 s
Progress: 3 of 31 built (1 building), 220 of 246 downloaded from cache (11 downloading)
82.47 s
Progress: 3 of 31 built (1 building), 221 of 246 downloaded from cache (10 downloading)
82.47 s
Progress: 3 of 31 built (1 building), 222 of 246 downloaded from cache (9 downloading)
82.47 s
Downloading cached gd from https://cache.nix-ci.com
82.49 s
Downloaded cached python3.13-requests (623 KiB) in 267ms
82.50 s
Progress: 3 of 31 built (1 building), 223 of 246 downloaded from cache (9 downloading)
82.60 s
Building /nix/store/0kbyqb7gpywcm8rbdni3iydmr057wqyb-python3-3.13.12-env.drv
82.60 s
[python3-3.13.12-env] created 219 symlinks in user environment
82.66 s
Downloaded cached python3.13-virtualenv (7 MiB) in 498ms
82.66 s
Downloaded cached python3.13-flake8 (584 KiB) in 405ms
82.66 s
Progress: 3 of 30 built (2 building), 224 of 246 downloaded from cache (8 downloading)
82.66 s
Progress: 3 of 29 built (2 building), 225 of 246 downloaded from cache (7 downloading)
82.67 s
Downloaded cached gd (545 KiB) in 204ms
82.70 s
Downloaded cached glib-2.86.3-dev (15 MiB) in 579ms
82.75 s
Downloaded cached nodejs-slim-24.14.0-npm (9.8 MiB) in 821ms
82.77 s
Building /nix/store/19zchzyn7wdgg4qzv3kyviinysn1bfv5-pythoncheck.sh.drv
82.82 s
Downloaded cached perf-linux (11.8 MiB) in 682ms
82.87 s
Building /nix/store/j85bbhxgp0p728kjmx83l4p8xkkkww3d-pythoncheck.sh.drv
82.87 s
Progress: 3 of 28 built (4 building), 226 of 246 downloaded from cache (6 downloading)
82.87 s
Progress: 3 of 28 built (4 building), 227 of 246 downloaded from cache (5 downloading)
82.87 s
Progress: 3 of 28 built (4 building), 228 of 246 downloaded from cache (4 downloading)
82.87 s
Progress: 3 of 28 built (4 building), 229 of 246 downloaded from cache (3 downloading)
82.87 s
[python3-3.13.12-env] created 241 symlinks in user environment
82.96 s
[pythoncheck.sh:post-build] Uploading to the NixCI cache: /nix/store/dnvwgdyw359bs0915q7rvz1m2pfwpl4i-pythoncheck.sh
83.15 s
[pythoncheck.sh:post-build] warning: 'warn-short-path-literals' is deprecated, use 'lint-short-path-literals = ignore' instead
83.26 s
Downloaded cached cargo-bootstrap (37.1 MiB) in 1.0s
83.36 s
Downloaded cached rustc (1004.1 MiB) in 16.9s
83.85 s
[pythoncheck.sh:post-build] copying 0 paths...
84.57 s
[pythoncheck.sh:post-build] warning: 'warn-short-path-literals' is deprecated, use 'lint-short-path-literals = ignore' instead
84.67 s
[pythoncheck.sh:post-build] copying 0 paths...
84.92 s
Uploaded pythoncheck.sh in 2.0s
84.92 s
Progress: 4 of 29 built (3 building), 229 of 246 downloaded from cache (3 downloading)
84.92 s
Built pythoncheck.sh in 2.1s
84.92 s
Downloading cached nodejs from https://cache.nix-ci.com
84.92 s
Downloading cached cargo-flamegraph from https://cache.nix-ci.com
84.92 s
Downloading cached graphviz from https://cache.nix-ci.com
84.92 s
Downloading cached cairo-1.18.4-dev from https://cache.nix-ci.com
85.01 s
Building /nix/store/32b99pzvd3ql22i43zdrhij0m6sf2y7j-pythoncheck.sh.drv
85.01 s
Progress: 4 of 28 built (4 building), 230 of 246 downloaded from cache (6 downloading)
85.01 s
Progress: 4 of 28 built (4 building), 231 of 246 downloaded from cache (5 downloading)
85.02 s
Downloaded cached cairo-1.18.4-dev (184 KiB) in 94ms
85.14 s
[python3-3.13.12-env:post-build] Uploading to the NixCI cache: /nix/store/bs39qcqk1wkfsclss94xcc8zv0iqjszi-python3-3.13.12-env
85.14 s
Downloaded cached nodejs (772 KiB) in 224ms
85.24 s
Downloaded cached cargo-flamegraph (5.4 MiB) in 324ms
85.32 s
Downloaded cached graphviz (7.2 MiB) in 393ms
85.75 s
[python3-3.13.12-env:post-build] warning: 'warn-short-path-literals' is deprecated, use 'lint-short-path-literals = ignore' instead
86.32 s
Downloaded cached mupdf (51.4 MiB) in 4.1s
87.02 s
[python3-3.13.12-env:post-build] copying 0 paths...
87.62 s
[python3-3.13.12-env:post-build] warning: 'warn-short-path-literals' is deprecated, use 'lint-short-path-literals = ignore' instead
87.73 s
[python3-3.13.12-env:post-build] copying 0 paths...
87.97 s
Uploaded python3-3.13.12-env in 2.9s
87.97 s
Progress: 5 of 29 built (3 building), 231 of 246 downloaded from cache (5 downloading)
87.97 s
Built python3-3.13.12-env in 5.5s
88.08 s
[pythoncheck.sh:post-build] Uploading to the NixCI cache: /nix/store/q10f0fqrld4bvqnlq5l2dblplvi9d8pg-pythoncheck.sh
88.62 s
[pythoncheck.sh:post-build] warning: 'warn-short-path-literals' is deprecated, use 'lint-short-path-literals = ignore' instead
89.10 s
[pythoncheck.sh:post-build] copying 0 paths...
89.56 s
[pythoncheck.sh:post-build] warning: 'warn-short-path-literals' is deprecated, use 'lint-short-path-literals = ignore' instead
89.77 s
[pythoncheck.sh:post-build] copying 0 paths...
90.02 s
Uploaded pythoncheck.sh in 2.0s
90.02 s
Progress: 6 of 30 built (2 building), 231 of 246 downloaded from cache (5 downloading)
90.02 s
Built pythoncheck.sh in 7.1s
90.02 s
Downloading cached rustc-wrapper from https://cache.nix-ci.com
90.08 s
Building /nix/store/vima4rg4yl2aqm1bbfzwpj71ivg612pw-pythoncheck.sh.drv
90.08 s
Progress: 6 of 28 built (3 building), 232 of 246 downloaded from cache (5 downloading)
90.08 s
Progress: 6 of 28 built (3 building), 233 of 246 downloaded from cache (4 downloading)
90.08 s
Progress: 6 of 28 built (3 building), 234 of 246 downloaded from cache (3 downloading)
90.08 s
Progress: 6 of 28 built (3 building), 235 of 246 downloaded from cache (2 downloading)
90.08 s
Progress: 6 of 28 built (3 building), 236 of 246 downloaded from cache (1 downloading)
90.09 s
Downloaded cached rustc-wrapper (3368 B) in 70ms
90.20 s
[python3-3.13.12-env:post-build] Uploading to the NixCI cache: /nix/store/rfh8283cg3amd71cmhq2ypr98p7036k7-python3-3.13.12-env
90.73 s
[python3-3.13.12-env:post-build] warning: 'warn-short-path-literals' is deprecated, use 'lint-short-path-literals = ignore' instead
91.77 s
[python3-3.13.12-env:post-build] copying 0 paths...
92.48 s
[python3-3.13.12-env:post-build] warning: 'warn-short-path-literals' is deprecated, use 'lint-short-path-literals = ignore' instead
92.62 s
[python3-3.13.12-env:post-build] copying 0 paths...
92.86 s
Uploaded python3-3.13.12-env in 2.7s
92.86 s
Progress: 7 of 29 built (2 building), 236 of 246 downloaded from cache (1 downloading)
92.86 s
Built python3-3.13.12-env in 10.2s
92.99 s
[pythoncheck.sh:post-build] Uploading to the NixCI cache: /nix/store/mghfpkj4kp134ivyfmqi8px0cvzv6i4v-pythoncheck.sh
93.51 s
[pythoncheck.sh:post-build] warning: 'warn-short-path-literals' is deprecated, use 'lint-short-path-literals = ignore' instead
94.98 s
[pythoncheck.sh:post-build] copying 0 paths...
95.67 s
[pythoncheck.sh:post-build] warning: 'warn-short-path-literals' is deprecated, use 'lint-short-path-literals = ignore' instead
95.79 s
[pythoncheck.sh:post-build] copying 0 paths...
95.99 s
Uploaded pythoncheck.sh in 3.1s
95.99 s
Progress: 8 of 30 built (1 building), 236 of 246 downloaded from cache (1 downloading)
95.99 s
Built pythoncheck.sh in 10.9s
95.99 s
Downloading cached yaml-language-server from https://cache.nix-ci.com
95.99 s
Downloading cached mupdf-1.27.2-bin from https://cache.nix-ci.com
95.99 s
Downloading cached dot-language-server from https://cache.nix-ci.com
95.99 s
Downloading cached poppler-utils-25.10.0-dev from https://cache.nix-ci.com
95.99 s
Downloading cached pyright-internal from https://cache.nix-ci.com
96.09 s
Building /nix/store/bhi611ynwipaff55yy429jp3f3z4a296-fetch-cargo-vendor-util.drv
96.09 s
Progress: 8 of 26 built (2 building), 237 of 246 downloaded from cache (5 downloading)
96.17 s
Downloaded cached mupdf-1.27.2-bin (833 KiB) in 179ms
96.22 s
[pythoncheck.sh:post-build] Uploading to the NixCI cache: /nix/store/v0z6h8wypyfgp1c9nrdn3kj1mrggcld0-pythoncheck.sh
96.30 s
Downloaded cached poppler-utils-25.10.0-dev (1.7 MiB) in 309ms
96.38 s
Downloaded cached dot-language-server (3.2 MiB) in 385ms
96.63 s
Downloaded cached yaml-language-server (17.2 MiB) in 641ms
96.70 s
[pythoncheck.sh:post-build] warning: 'warn-short-path-literals' is deprecated, use 'lint-short-path-literals = ignore' instead
97.26 s
[pythoncheck.sh:post-build] copying 0 paths...
97.92 s
[pythoncheck.sh:post-build] warning: 'warn-short-path-literals' is deprecated, use 'lint-short-path-literals = ignore' instead
98.03 s
[pythoncheck.sh:post-build] copying 0 paths...
98.23 s
Uploaded pythoncheck.sh in 2.1s
98.24 s
Progress: 9 of 27 built (1 building), 237 of 246 downloaded from cache (5 downloading)
98.24 s
Built pythoncheck.sh in 8.1s
98.24 s
Downloading cached cargo from https://cache.nix-ci.com
98.30 s
Building /nix/store/8cxsihcvxack3k922snf9g88lql7plba-replace-workspace-values.drv
98.30 s
Progress: 9 of 25 built (2 building), 238 of 246 downloaded from cache (5 downloading)
98.30 s
Progress: 9 of 25 built (2 building), 239 of 246 downloaded from cache (4 downloading)
98.30 s
Progress: 9 of 25 built (2 building), 240 of 246 downloaded from cache (3 downloading)
98.30 s
Progress: 9 of 25 built (2 building), 241 of 246 downloaded from cache (2 downloading)
98.37 s
[fetch-cargo-vendor-util:post-build] Uploading to the NixCI cache: /nix/store/rpickx0wnl28rz29529irv9s97w7fdk6-fetch-cargo-vendor-util
98.56 s
[fetch-cargo-vendor-util:post-build] warning: 'warn-short-path-literals' is deprecated, use 'lint-short-path-literals = ignore' instead
98.91 s
Downloaded cached cargo (37.6 MiB) in 675ms
99.51 s
[fetch-cargo-vendor-util:post-build] copying 0 paths...
100.19 s
[fetch-cargo-vendor-util:post-build] warning: 'warn-short-path-literals' is deprecated, use 'lint-short-path-literals = ignore' instead
100.33 s
[fetch-cargo-vendor-util:post-build] copying 0 paths...
100.57 s
Uploaded fetch-cargo-vendor-util in 2.2s
100.58 s
Progress: 10 of 26 built (1 building), 241 of 246 downloaded from cache (2 downloading)
100.58 s
Built fetch-cargo-vendor-util in 4.4s
100.58 s
Downloading cached mupdf-1.27.2-dev from https://cache.nix-ci.com
100.60 s
Downloaded cached pyright-internal (183.5 MiB) in 4.6s
100.82 s
Building /nix/store/yjiiziqs3wdx3szv6j8mp3m8z043pgil-clinnet-0.1.8-vendor-staging.drv
100.87 s
Downloaded cached mupdf-1.27.2-dev (758 KiB) in 287ms
100.91 s
Building /nix/store/kgw08xi5rq1i8xs7pp2zqg9hzdsm0lzr-rscls-0.2.3-vendor-staging.drv
100.91 s
Progress: 10 of 22 built (3 building), 242 of 246 downloaded from cache (2 downloading)
100.91 s
Progress: 10 of 22 built (3 building), 243 of 246 downloaded from cache (1 downloading)
100.91 s
Progress: 10 of 22 built (3 building), 244 of 246 downloaded from cache
100.91 s
[clinnet-0.1.8-vendor-staging] Phase: unpackPhase
100.91 s
[clinnet-0.1.8-vendor-staging] unpacking source archive /nix/store/2i132kj3rylcpf3q5yy61794w9j2mg0v-clinnet-0.1.8.tar.gz
100.96 s
[replace-workspace-values:post-build] Uploading to the NixCI cache: /nix/store/nal4dxi3l18hz19ld26di9n37ixr0afh-replace-workspace-values
101.39 s
[replace-workspace-values:post-build] warning: 'warn-short-path-literals' is deprecated, use 'lint-short-path-literals = ignore' instead
101.67 s
[replace-workspace-values:post-build] copying 0 paths...
102.30 s
[replace-workspace-values:post-build] warning: 'warn-short-path-literals' is deprecated, use 'lint-short-path-literals = ignore' instead
102.44 s
[replace-workspace-values:post-build] copying 0 paths...
102.71 s
Uploaded replace-workspace-values in 1.7s
102.71 s
Progress: 11 of 23 built (2 building), 244 of 246 downloaded from cache
102.71 s
Built replace-workspace-values in 4.4s
102.71 s
[clinnet-0.1.8-vendor-staging] source root is clinnet-0.1.8.tar.gz
102.71 s
[clinnet-0.1.8-vendor-staging] Phase: patchPhase
102.71 s
[clinnet-0.1.8-vendor-staging] Phase: updateAutotoolsGnuConfigScriptsPhase
102.71 s
[clinnet-0.1.8-vendor-staging] Phase: buildPhase
102.71 s
[clinnet-0.1.8-vendor-staging] Skipping local dependency: clinnet
102.71 s
[clinnet-0.1.8-vendor-staging] Fetching https://crates.io/api/v1/crates/anstream/0.6.21/download -> tarballs/anstream-0.6.21.tar.gz
102.71 s
[clinnet-0.1.8-vendor-staging] Fetching https://crates.io/api/v1/crates/arrayref/0.3.9/download -> tarballs/arrayref-0.3.9.tar.gz
102.71 s
[clinnet-0.1.8-vendor-staging] Fetching https://crates.io/api/v1/crates/cc/1.2.45/download -> tarballs/cc-1.2.45.tar.gz
102.71 s
[clinnet-0.1.8-vendor-staging] Fetching https://crates.io/api/v1/crates/colorchoice/1.0.4/download -> tarballs/colorchoice-1.0.4.tar.gz
102.71 s
[clinnet-0.1.8-vendor-staging] Fetching https://crates.io/api/v1/crates/crossbeam-utils/0.8.21/download -> tarballs/crossbeam-utils-0.8.21.tar.gz
102.71 s
[clinnet-0.1.8-vendor-staging] Fetching https://crates.io/api/v1/crates/encode_unicode/1.0.0/download -> tarballs/encode_unicode-1.0.0.tar.gz
102.71 s
[clinnet-0.1.8-vendor-staging] Fetching https://crates.io/api/v1/crates/is_terminal_polyfill/1.70.2/download -> tarballs/is_terminal_polyfill-1.70.2.tar.gz
102.71 s
[clinnet-0.1.8-vendor-staging] Fetching https://crates.io/api/v1/crates/memchr/2.7.4/download -> tarballs/memchr-2.7.4.tar.gz
102.71 s
[clinnet-0.1.8-vendor-staging] Fetching https://crates.io/api/v1/crates/parking_lot_core/0.9.12/download -> tarballs/parking_lot_core-0.9.12.tar.gz
102.71 s
[clinnet-0.1.8-vendor-staging] Fetching https://crates.io/api/v1/crates/rayon-core/1.12.1/download -> tarballs/rayon-core-1.12.1.tar.gz
102.71 s
[clinnet-0.1.8-vendor-staging] Fetching https://crates.io/api/v1/crates/rustversion/1.0.22/download -> tarballs/rustversion-1.0.22.tar.gz
102.71 s
[clinnet-0.1.8-vendor-staging] Fetching https://crates.io/api/v1/crates/serde_derive/1.0.225/download -> tarballs/serde_derive-1.0.225.tar.gz
102.71 s
[clinnet-0.1.8-vendor-staging] Fetching https://crates.io/api/v1/crates/strsim/0.11.1/download -> tarballs/strsim-0.11.1.tar.gz
102.71 s
[clinnet-0.1.8-vendor-staging] Fetching https://crates.io/api/v1/crates/unicode-width/0.2.2/download -> tarballs/unicode-width-0.2.2.tar.gz
102.71 s
[clinnet-0.1.8-vendor-staging] Fetching https://crates.io/api/v1/crates/wasm-bindgen-macro/0.2.105/download -> tarballs/wasm-bindgen-macro-0.2.105.tar.gz
102.71 s
[clinnet-0.1.8-vendor-staging] Fetching https://crates.io/api/v1/crates/windows-sys/0.59.0/download -> tarballs/windows-sys-0.59.0.tar.gz
102.71 s
[clinnet-0.1.8-vendor-staging] Fetching https://crates.io/api/v1/crates/windows_aarch64_msvc/0.52.6/download -> tarballs/windows_aarch64_msvc-0.52.6.tar.gz
102.71 s
[clinnet-0.1.8-vendor-staging] Fetching https://crates.io/api/v1/crates/windows_i686_msvc/0.52.6/download -> tarballs/windows_i686_msvc-0.52.6.tar.gz
102.71 s
[clinnet-0.1.8-vendor-staging] Fetching https://crates.io/api/v1/crates/windows_x86_64_msvc/0.52.6/download -> tarballs/windows_x86_64_msvc-0.52.6.tar.gz
102.71 s
[clinnet-0.1.8-vendor-staging] multiprocessing.pool.RemoteTraceback :
102.71 s
[clinnet-0.1.8-vendor-staging] """
102.71 s
[clinnet-0.1.8-vendor-staging] Traceback (most recent call last):
102.71 s
[clinnet-0.1.8-vendor-staging] File "/nix/store/rfh8283cg3amd71cmhq2ypr98p7036k7-python3-3.13.12-env/lib/python3.13/multiprocessing/pool.py", line 125, in worker
102.71 s
[clinnet-0.1.8-vendor-staging] result = (True, func(*args, **kwds))
102.71 s
[clinnet-0.1.8-vendor-staging] ~~~~^^^^^^^^^^^^^^^
102.71 s
[clinnet-0.1.8-vendor-staging] File "/nix/store/rfh8283cg3amd71cmhq2ypr98p7036k7-python3-3.13.12-env/lib/python3.13/multiprocessing/pool.py", line 51, in starmapstar
102.71 s
[clinnet-0.1.8-vendor-staging] return list(itertools.starmap(args[0], args[1]))
102.71 s
[clinnet-0.1.8-vendor-staging] File "/nix/store/rpickx0wnl28rz29529irv9s97w7fdk6-fetch-cargo-vendor-util/bin/fetch-cargo-vendor-util", line 87, in download_tarball
102.71 s
[clinnet-0.1.8-vendor-staging] calculated_checksum = download_file_with_checksum(session, url, tarball_out_dir)
102.71 s
[clinnet-0.1.8-vendor-staging] File "/nix/store/rpickx0wnl28rz29529irv9s97w7fdk6-fetch-cargo-vendor-util/bin/fetch-cargo-vendor-util", line 53, in download_file_with_checksum
102.71 s
[clinnet-0.1.8-vendor-staging] raise Exception(f"Failed to fetch file from {url}. Status code: {response.status_code}")
102.71 s
[clinnet-0.1.8-vendor-staging] Exception: Failed to fetch file from https://crates.io/api/v1/crates/arrayref/0.3.9/download. Status code: 403
102.71 s
[clinnet-0.1.8-vendor-staging] """
102.71 s
[clinnet-0.1.8-vendor-staging]
102.71 s
[clinnet-0.1.8-vendor-staging] The above exception was the direct cause of the following exception:
102.71 s
[clinnet-0.1.8-vendor-staging]
102.71 s
[clinnet-0.1.8-vendor-staging] Traceback (most recent call last):
102.71 s
[clinnet-0.1.8-vendor-staging] File "/nix/store/rpickx0wnl28rz29529irv9s97w7fdk6-fetch-cargo-vendor-util/bin/fetch-cargo-vendor-util" , line 414 , in <module>
102.71 s
[clinnet-0.1.8-vendor-staging] main ()
102.71 s
[clinnet-0.1.8-vendor-staging] ~~~~ ^^
102.71 s
[clinnet-0.1.8-vendor-staging] File "/nix/store/rpickx0wnl28rz29529irv9s97w7fdk6-fetch-cargo-vendor-util/bin/fetch-cargo-vendor-util" , line 410 , in main
102.71 s
[clinnet-0.1.8-vendor-staging] subcommand_func ()
102.71 s
[clinnet-0.1.8-vendor-staging] ~~~~~~~~~~~~~~~ ^^
102.71 s
[rscls-0.2.3-vendor-staging] Phase: unpackPhase
102.71 s
[rscls-0.2.3-vendor-staging] unpacking source archive /nix/store/mmsbv6swhwgf8lppwapxb1zcnvcjdqhq-rscls-0.2.3.tar.gz
102.71 s
[rscls-0.2.3-vendor-staging] source root is rscls-0.2.3.tar.gz
102.71 s
[rscls-0.2.3-vendor-staging] Phase: patchPhase
102.71 s
[rscls-0.2.3-vendor-staging] Phase: updateAutotoolsGnuConfigScriptsPhase
102.71 s
[rscls-0.2.3-vendor-staging] Phase: buildPhase
102.71 s
[rscls-0.2.3-vendor-staging] Skipping local dependency: rscls
102.71 s
[rscls-0.2.3-vendor-staging] Fetching https://crates.io/api/v1/crates/anstream/0.6.21/download -> tarballs/anstream-0.6.21.tar.gz
102.71 s
[rscls-0.2.3-vendor-staging] Fetching https://crates.io/api/v1/crates/bitflags/2.11.0/download -> tarballs/bitflags-2.11.0.tar.gz
102.71 s
[rscls-0.2.3-vendor-staging] Fetching https://crates.io/api/v1/crates/clap_derive/4.5.55/download -> tarballs/clap_derive-4.5.55.tar.gz
102.71 s
[rscls-0.2.3-vendor-staging] Fetching https://crates.io/api/v1/crates/errno/0.3.14/download -> tarballs/errno-0.3.14.tar.gz
102.71 s
[rscls-0.2.3-vendor-staging] Fetching https://crates.io/api/v1/crates/futures-executor/0.3.31/download -> tarballs/futures-executor-0.3.31.tar.gz
102.71 s
[rscls-0.2.3-vendor-staging] Fetching https://crates.io/api/v1/crates/heck/0.5.0/download -> tarballs/heck-0.5.0.tar.gz
102.71 s
[rscls-0.2.3-vendor-staging] Fetching https://crates.io/api/v1/crates/icu_properties_data/2.1.2/download -> tarballs/icu_properties_data-2.1.2.tar.gz
102.71 s
[rscls-0.2.3-vendor-staging] Fetching https://crates.io/api/v1/crates/itoa/1.0.17/download -> tarballs/itoa-1.0.17.tar.gz
102.71 s
[rscls-0.2.3-vendor-staging] Fetching https://crates.io/api/v1/crates/lsp-server/0.7.9/download -> tarballs/lsp-server-0.7.9.tar.gz
102.71 s
[rscls-0.2.3-vendor-staging] Fetching https://crates.io/api/v1/crates/once_cell_polyfill/1.70.2/download -> tarballs/once_cell_polyfill-1.70.2.tar.gz
102.71 s
[rscls-0.2.3-vendor-staging] Fetching https://crates.io/api/v1/crates/pin-project-lite/0.2.16/download -> tarballs/pin-project-lite-0.2.16.tar.gz
102.71 s
[rscls-0.2.3-vendor-staging] Fetching https://crates.io/api/v1/crates/scopeguard/1.2.0/download -> tarballs/scopeguard-1.2.0.tar.gz
102.71 s
[rscls-0.2.3-vendor-staging] Fetching https://crates.io/api/v1/crates/sharded-slab/0.1.7/download -> tarballs/sharded-slab-0.1.7.tar.gz
102.71 s
[rscls-0.2.3-vendor-staging] Fetching https://crates.io/api/v1/crates/syn/2.0.115/download -> tarballs/syn-2.0.115.tar.gz
102.71 s
[rscls-0.2.3-vendor-staging] Fetching https://crates.io/api/v1/crates/tokio/1.49.0/download -> tarballs/tokio-1.49.0.tar.gz
102.71 s
[rscls-0.2.3-vendor-staging] Fetching https://crates.io/api/v1/crates/tracing-log/0.2.0/download -> tarballs/tracing-log-0.2.0.tar.gz
102.71 s
[rscls-0.2.3-vendor-staging] Fetching https://crates.io/api/v1/crates/valuable/0.1.1/download -> tarballs/valuable-0.1.1.tar.gz
102.71 s
[rscls-0.2.3-vendor-staging] Fetching https://crates.io/api/v1/crates/yoke-derive/0.8.1/download -> tarballs/yoke-derive-0.8.1.tar.gz
102.71 s
[rscls-0.2.3-vendor-staging] Fetching https://crates.io/api/v1/crates/zmij/1.0.21/download -> tarballs/zmij-1.0.21.tar.gz
102.71 s
[rscls-0.2.3-vendor-staging] multiprocessing.pool.RemoteTraceback :
102.71 s
[rscls-0.2.3-vendor-staging] """
102.71 s
[rscls-0.2.3-vendor-staging] Traceback (most recent call last):
102.71 s
[rscls-0.2.3-vendor-staging] File "/nix/store/rfh8283cg3amd71cmhq2ypr98p7036k7-python3-3.13.12-env/lib/python3.13/multiprocessing/pool.py", line 125, in worker
102.71 s
[rscls-0.2.3-vendor-staging] result = (True, func(*args, **kwds))
102.71 s
[rscls-0.2.3-vendor-staging] ~~~~^^^^^^^^^^^^^^^
102.71 s
[rscls-0.2.3-vendor-staging] File "/nix/store/rfh8283cg3amd71cmhq2ypr98p7036k7-python3-3.13.12-env/lib/python3.13/multiprocessing/pool.py", line 51, in starmapstar
102.71 s
[rscls-0.2.3-vendor-staging] return list(itertools.starmap(args[0], args[1]))
102.71 s
[rscls-0.2.3-vendor-staging] File "/nix/store/rpickx0wnl28rz29529irv9s97w7fdk6-fetch-cargo-vendor-util/bin/fetch-cargo-vendor-util", line 87, in download_tarball
102.71 s
[rscls-0.2.3-vendor-staging] calculated_checksum = download_file_with_checksum(session, url, tarball_out_dir)
102.71 s
[rscls-0.2.3-vendor-staging] File "/nix/store/rpickx0wnl28rz29529irv9s97w7fdk6-fetch-cargo-vendor-util/bin/fetch-cargo-vendor-util", line 53, in download_file_with_checksum
102.71 s
[rscls-0.2.3-vendor-staging] raise Exception(f"Failed to fetch file from {url}. Status code: {response.status_code}")
102.71 s
[rscls-0.2.3-vendor-staging] Exception: Failed to fetch file from https://crates.io/api/v1/crates/futures-executor/0.3.31/download. Status code: 403
102.71 s
[rscls-0.2.3-vendor-staging] """
102.71 s
[rscls-0.2.3-vendor-staging]
102.71 s
[rscls-0.2.3-vendor-staging] The above exception was the direct cause of the following exception:
102.71 s
[rscls-0.2.3-vendor-staging]
102.71 s
[rscls-0.2.3-vendor-staging] Traceback (most recent call last):
102.71 s
[rscls-0.2.3-vendor-staging] File "/nix/store/rpickx0wnl28rz29529irv9s97w7fdk6-fetch-cargo-vendor-util/bin/fetch-cargo-vendor-util" , line 414 , in <module>
102.71 s
[rscls-0.2.3-vendor-staging] main ()
102.71 s
[rscls-0.2.3-vendor-staging] ~~~~ ^^
102.71 s
[rscls-0.2.3-vendor-staging] File "/nix/store/rpickx0wnl28rz29529irv9s97w7fdk6-fetch-cargo-vendor-util/bin/fetch-cargo-vendor-util" , line 410 , in main
102.71 s
[rscls-0.2.3-vendor-staging] subcommand_func ()
102.71 s
Downloading cached pyright from https://cache.nix-ci.com
102.71 s
[clinnet-0.1.8-vendor-staging] File "/nix/store/rpickx0wnl28rz29529irv9s97w7fdk6-fetch-cargo-vendor-util/bin/fetch-cargo-vendor-util" , line 401 , in <lambda>
102.71 s
[clinnet-0.1.8-vendor-staging] "create-vendor-staging": lambda: create_vendor_staging (lockfile_path=Path(sys.argv[2]), out_dir=Path(sys.argv[3])) ,
102.71 s
[clinnet-0.1.8-vendor-staging] ~~~~~~~~~~~~~~~~~~~~~ ^^^^^^^^^^^^^^^^^^^^^^^^^^^^^^^^^^^^^^^^^^^^^^^^^^^^^^^^^^^^
102.71 s
[clinnet-0.1.8-vendor-staging] File "/nix/store/rpickx0wnl28rz29529irv9s97w7fdk6-fetch-cargo-vendor-util/bin/fetch-cargo-vendor-util" , line 168 , in create_vendor_staging
102.71 s
[clinnet-0.1.8-vendor-staging] pool.starmap (download_tarball, tarball_args_gen)
102.71 s
[clinnet-0.1.8-vendor-staging] ~~~~~~~~~~~~ ^^^^^^^^^^^^^^^^^^^^^^^^^^^^^^^^^^^^
102.71 s
[clinnet-0.1.8-vendor-staging] File "/nix/store/rfh8283cg3amd71cmhq2ypr98p7036k7-python3-3.13.12-env/lib/python3.13/multiprocessing/pool.py" , line 375 , in starmap
102.71 s
[clinnet-0.1.8-vendor-staging] return self._map_async(func, iterable, starmapstar, chunksize).get ()
102.71 s
[clinnet-0.1.8-vendor-staging] ~~~~~~~~~~~~~~~~~~~~~~~~~~~~~~~~~~~~~~~~~~~~~~~~~~~~~~~~~~~ ^^
102.71 s
[clinnet-0.1.8-vendor-staging] File "/nix/store/rfh8283cg3amd71cmhq2ypr98p7036k7-python3-3.13.12-env/lib/python3.13/multiprocessing/pool.py" , line 774 , in get
102.71 s
[clinnet-0.1.8-vendor-staging] raise self._value
102.71 s
[clinnet-0.1.8-vendor-staging] Exception : Failed to fetch file from https://crates.io/api/v1/crates/arrayref/0.3.9/download. Status code: 403
102.71 s
[rscls-0.2.3-vendor-staging] ~~~~~~~~~~~~~~~ ^^
102.71 s
[rscls-0.2.3-vendor-staging] File "/nix/store/rpickx0wnl28rz29529irv9s97w7fdk6-fetch-cargo-vendor-util/bin/fetch-cargo-vendor-util" , line 401 , in <lambda>
102.71 s
[rscls-0.2.3-vendor-staging] "create-vendor-staging": lambda: create_vendor_staging (lockfile_path=Path(sys.argv[2]), out_dir=Path(sys.argv[3])) ,
102.71 s
[rscls-0.2.3-vendor-staging] ~~~~~~~~~~~~~~~~~~~~~ ^^^^^^^^^^^^^^^^^^^^^^^^^^^^^^^^^^^^^^^^^^^^^^^^^^^^^^^^^^^^
102.71 s
[rscls-0.2.3-vendor-staging] File "/nix/store/rpickx0wnl28rz29529irv9s97w7fdk6-fetch-cargo-vendor-util/bin/fetch-cargo-vendor-util" , line 168 , in create_vendor_staging
102.71 s
[rscls-0.2.3-vendor-staging] pool.starmap (download_tarball, tarball_args_gen)
102.71 s
[rscls-0.2.3-vendor-staging] ~~~~~~~~~~~~ ^^^^^^^^^^^^^^^^^^^^^^^^^^^^^^^^^^^^
102.71 s
[rscls-0.2.3-vendor-staging] File "/nix/store/rfh8283cg3amd71cmhq2ypr98p7036k7-python3-3.13.12-env/lib/python3.13/multiprocessing/pool.py" , line 375 , in starmap
102.71 s
[rscls-0.2.3-vendor-staging] return self._map_async(func, iterable, starmapstar, chunksize).get ()
102.71 s
[rscls-0.2.3-vendor-staging] ~~~~~~~~~~~~~~~~~~~~~~~~~~~~~~~~~~~~~~~~~~~~~~~~~~~~~~~~~~~ ^^
102.71 s
[rscls-0.2.3-vendor-staging] File "/nix/store/rfh8283cg3amd71cmhq2ypr98p7036k7-python3-3.13.12-env/lib/python3.13/multiprocessing/pool.py" , line 774 , in get
102.71 s
[rscls-0.2.3-vendor-staging] raise self._value
102.71 s
[rscls-0.2.3-vendor-staging] Exception : Failed to fetch file from https://crates.io/api/v1/crates/futures-executor/0.3.31/download. Status code: 403
102.71 s
Downloading cached auditable-cargo from https://cache.nix-ci.com
102.73 s
Progress: 11 of 20 built (1 building, 1 failed), 244 of 246 downloaded from cache (2 downloading)
102.73 s
Failed to build clinnet-0.1.8-vendor-staging after 1.9s
102.74 s
Progress: 11 of 20 built (2 failed), 244 of 246 downloaded from cache (2 downloading)
102.74 s
Failed to build rscls-0.2.3-vendor-staging after 1.8s
102.74 s
error: Cannot build '/nix/store/yjiiziqs3wdx3szv6j8mp3m8z043pgil-clinnet-0.1.8-vendor-staging.drv '.
102.74 s
Reason: builder failed with exit code 1 .
102.74 s
Output paths:
102.74 s
/nix/store/43izv4h82lj0nmnqwjg6j8spdkwa6hs5-clinnet-0.1.8-vendor-staging
102.74 s
Last 62 log lines:
102.74 s
> Running phase: unpackPhase
102.74 s
> unpacking source archive /nix/store/2i132kj3rylcpf3q5yy61794w9j2mg0v-clinnet-0.1.8.tar.gz
102.74 s
> source root is clinnet-0.1.8.tar.gz
102.74 s
> Running phase: patchPhase
102.74 s
> Running phase: updateAutotoolsGnuConfigScriptsPhase
102.74 s
> Running phase: buildPhase
102.74 s
> Skipping local dependency: clinnet
102.74 s
> Fetching https://crates.io/api/v1/crates/anstream/0.6.21/download -> tarballs/anstream-0.6.21.tar.gz
102.74 s
> Fetching https://crates.io/api/v1/crates/arrayref/0.3.9/download -> tarballs/arrayref-0.3.9.tar.gz
102.74 s
> Fetching https://crates.io/api/v1/crates/cc/1.2.45/download -> tarballs/cc-1.2.45.tar.gz
102.74 s
> Fetching https://crates.io/api/v1/crates/colorchoice/1.0.4/download -> tarballs/colorchoice-1.0.4.tar.gz
102.74 s
> Fetching https://crates.io/api/v1/crates/crossbeam-utils/0.8.21/download -> tarballs/crossbeam-utils-0.8.21.tar.gz
102.74 s
> Fetching https://crates.io/api/v1/crates/encode_unicode/1.0.0/download -> tarballs/encode_unicode-1.0.0.tar.gz
102.74 s
> Fetching https://crates.io/api/v1/crates/is_terminal_polyfill/1.70.2/download -> tarballs/is_terminal_polyfill-1.70.2.tar.gz
102.74 s
> Fetching https://crates.io/api/v1/crates/memchr/2.7.4/download -> tarballs/memchr-2.7.4.tar.gz
102.74 s
> Fetching https://crates.io/api/v1/crates/parking_lot_core/0.9.12/download -> tarballs/parking_lot_core-0.9.12.tar.gz
102.74 s
> Fetching https://crates.io/api/v1/crates/rayon-core/1.12.1/download -> tarballs/rayon-core-1.12.1.tar.gz
102.74 s
> Fetching https://crates.io/api/v1/crates/rustversion/1.0.22/download -> tarballs/rustversion-1.0.22.tar.gz
102.74 s
> Fetching https://crates.io/api/v1/crates/serde_derive/1.0.225/download -> tarballs/serde_derive-1.0.225.tar.gz
102.74 s
> Fetching https://crates.io/api/v1/crates/strsim/0.11.1/download -> tarballs/strsim-0.11.1.tar.gz
102.74 s
> Fetching https://crates.io/api/v1/crates/unicode-width/0.2.2/download -> tarballs/unicode-width-0.2.2.tar.gz
102.74 s
> Fetching https://crates.io/api/v1/crates/wasm-bindgen-macro/0.2.105/download -> tarballs/wasm-bindgen-macro-0.2.105.tar.gz
102.74 s
> Fetching https://crates.io/api/v1/crates/windows-sys/0.59.0/download -> tarballs/windows-sys-0.59.0.tar.gz
102.74 s
> Fetching https://crates.io/api/v1/crates/windows_aarch64_msvc/0.52.6/download -> tarballs/windows_aarch64_msvc-0.52.6.tar.gz
102.74 s
> Fetching https://crates.io/api/v1/crates/windows_i686_msvc/0.52.6/download -> tarballs/windows_i686_msvc-0.52.6.tar.gz
102.74 s
> Fetching https://crates.io/api/v1/crates/windows_x86_64_msvc/0.52.6/download -> tarballs/windows_x86_64_msvc-0.52.6.tar.gz
102.74 s
> multiprocessing.pool.RemoteTraceback :
102.74 s
> """
102.74 s
> Traceback (most recent call last):
102.74 s
> File "/nix/store/rfh8283cg3amd71cmhq2ypr98p7036k7-python3-3.13.12-env/lib/python3.13/multiprocessing/pool.py", line 125, in worker
102.74 s
> result = (True, func(*args, **kwds))
102.74 s
> ~~~~^^^^^^^^^^^^^^^
102.74 s
> File "/nix/store/rfh8283cg3amd71cmhq2ypr98p7036k7-python3-3.13.12-env/lib/python3.13/multiprocessing/pool.py", line 51, in starmapstar
102.74 s
> return list(itertools.starmap(args[0], args[1]))
102.74 s
> File "/nix/store/rpickx0wnl28rz29529irv9s97w7fdk6-fetch-cargo-vendor-util/bin/fetch-cargo-vendor-util", line 87, in download_tarball
102.74 s
> calculated_checksum = download_file_with_checksum(session, url, tarball_out_dir)
102.74 s
> File "/nix/store/rpickx0wnl28rz29529irv9s97w7fdk6-fetch-cargo-vendor-util/bin/fetch-cargo-vendor-util", line 53, in download_file_with_checksum
102.74 s
> raise Exception(f"Failed to fetch file from {url}. Status code: {response.status_code}")
102.74 s
> Exception: Failed to fetch file from https://crates.io/api/v1/crates/arrayref/0.3.9/download. Status code: 403
102.74 s
> """
102.74 s
>
102.74 s
> The above exception was the direct cause of the following exception:
102.74 s
>
102.74 s
> Traceback (most recent call last):
102.74 s
> File "/nix/store/rpickx0wnl28rz29529irv9s97w7fdk6-fetch-cargo-vendor-util/bin/fetch-cargo-vendor-util" , line 414 , in <module>
102.74 s
> main ()
102.74 s
> ~~~~ ^^
102.74 s
> File "/nix/store/rpickx0wnl28rz29529irv9s97w7fdk6-fetch-cargo-vendor-util/bin/fetch-cargo-vendor-util" , line 410 , in main
102.74 s
> subcommand_func ()
102.74 s
> ~~~~~~~~~~~~~~~ ^^
102.74 s
> File "/nix/store/rpickx0wnl28rz29529irv9s97w7fdk6-fetch-cargo-vendor-util/bin/fetch-cargo-vendor-util" , line 401 , in <lambda>
102.74 s
> "create-vendor-staging": lambda: create_vendor_staging (lockfile_path=Path(sys.argv[2]), out_dir=Path(sys.argv[3])) ,
102.74 s
> ~~~~~~~~~~~~~~~~~~~~~ ^^^^^^^^^^^^^^^^^^^^^^^^^^^^^^^^^^^^^^^^^^^^^^^^^^^^^^^^^^^^
102.74 s
> File "/nix/store/rpickx0wnl28rz29529irv9s97w7fdk6-fetch-cargo-vendor-util/bin/fetch-cargo-vendor-util" , line 168 , in create_vendor_staging
102.74 s
> pool.starmap (download_tarball, tarball_args_gen)
102.74 s
> ~~~~~~~~~~~~ ^^^^^^^^^^^^^^^^^^^^^^^^^^^^^^^^^^^^
102.74 s
> File "/nix/store/rfh8283cg3amd71cmhq2ypr98p7036k7-python3-3.13.12-env/lib/python3.13/multiprocessing/pool.py" , line 375 , in starmap
102.74 s
> return self._map_async(func, iterable, starmapstar, chunksize).get ()
102.74 s
> ~~~~~~~~~~~~~~~~~~~~~~~~~~~~~~~~~~~~~~~~~~~~~~~~~~~~~~~~~~~ ^^
102.74 s
> File "/nix/store/rfh8283cg3amd71cmhq2ypr98p7036k7-python3-3.13.12-env/lib/python3.13/multiprocessing/pool.py" , line 774 , in get
102.74 s
> raise self._value
102.74 s
> Exception : Failed to fetch file from https://crates.io/api/v1/crates/arrayref/0.3.9/download. Status code: 403
102.74 s
For full logs, run:
102.74 s
nix log /nix/store/yjiiziqs3wdx3szv6j8mp3m8z043pgil-clinnet-0.1.8-vendor-staging.drv
102.74 s
error: Cannot build '/nix/store/kgw08xi5rq1i8xs7pp2zqg9hzdsm0lzr-rscls-0.2.3-vendor-staging.drv '.
102.74 s
Reason: builder failed with exit code 1 .
102.74 s
Output paths:
102.74 s
/nix/store/mw51pll1fmkfz4hb5gpgjsa7g972sxsa-rscls-0.2.3-vendor-staging
102.74 s
Last 62 log lines:
102.74 s
> Running phase: unpackPhase
102.74 s
> unpacking source archive /nix/store/mmsbv6swhwgf8lppwapxb1zcnvcjdqhq-rscls-0.2.3.tar.gz
102.74 s
> source root is rscls-0.2.3.tar.gz
102.74 s
> Running phase: patchPhase
102.74 s
> Running phase: updateAutotoolsGnuConfigScriptsPhase
102.74 s
> Running phase: buildPhase
102.74 s
> Skipping local dependency: rscls
102.74 s
> Fetching https://crates.io/api/v1/crates/anstream/0.6.21/download -> tarballs/anstream-0.6.21.tar.gz
102.74 s
> Fetching https://crates.io/api/v1/crates/bitflags/2.11.0/download -> tarballs/bitflags-2.11.0.tar.gz
102.74 s
> Fetching https://crates.io/api/v1/crates/clap_derive/4.5.55/download -> tarballs/clap_derive-4.5.55.tar.gz
102.74 s
> Fetching https://crates.io/api/v1/crates/errno/0.3.14/download -> tarballs/errno-0.3.14.tar.gz
102.74 s
> Fetching https://crates.io/api/v1/crates/futures-executor/0.3.31/download -> tarballs/futures-executor-0.3.31.tar.gz
102.74 s
> Fetching https://crates.io/api/v1/crates/heck/0.5.0/download -> tarballs/heck-0.5.0.tar.gz
102.74 s
> Fetching https://crates.io/api/v1/crates/icu_properties_data/2.1.2/download -> tarballs/icu_properties_data-2.1.2.tar.gz
102.74 s
> Fetching https://crates.io/api/v1/crates/itoa/1.0.17/download -> tarballs/itoa-1.0.17.tar.gz
102.74 s
> Fetching https://crates.io/api/v1/crates/lsp-server/0.7.9/download -> tarballs/lsp-server-0.7.9.tar.gz
102.74 s
> Fetching https://crates.io/api/v1/crates/once_cell_polyfill/1.70.2/download -> tarballs/once_cell_polyfill-1.70.2.tar.gz
102.74 s
> Fetching https://crates.io/api/v1/crates/pin-project-lite/0.2.16/download -> tarballs/pin-project-lite-0.2.16.tar.gz
102.74 s
> Fetching https://crates.io/api/v1/crates/scopeguard/1.2.0/download -> tarballs/scopeguard-1.2.0.tar.gz
102.74 s
> Fetching https://crates.io/api/v1/crates/sharded-slab/0.1.7/download -> tarballs/sharded-slab-0.1.7.tar.gz
102.74 s
> Fetching https://crates.io/api/v1/crates/syn/2.0.115/download -> tarballs/syn-2.0.115.tar.gz
102.74 s
> Fetching https://crates.io/api/v1/crates/tokio/1.49.0/download -> tarballs/tokio-1.49.0.tar.gz
102.74 s
> Fetching https://crates.io/api/v1/crates/tracing-log/0.2.0/download -> tarballs/tracing-log-0.2.0.tar.gz
102.74 s
> Fetching https://crates.io/api/v1/crates/valuable/0.1.1/download -> tarballs/valuable-0.1.1.tar.gz
102.74 s
> Fetching https://crates.io/api/v1/crates/yoke-derive/0.8.1/download -> tarballs/yoke-derive-0.8.1.tar.gz
102.74 s
> Fetching https://crates.io/api/v1/crates/zmij/1.0.21/download -> tarballs/zmij-1.0.21.tar.gz
102.74 s
> multiprocessing.pool.RemoteTraceback :
102.74 s
> """
102.74 s
> Traceback (most recent call last):
102.74 s
> File "/nix/store/rfh8283cg3amd71cmhq2ypr98p7036k7-python3-3.13.12-env/lib/python3.13/multiprocessing/pool.py", line 125, in worker
102.74 s
> result = (True, func(*args, **kwds))
102.74 s
> ~~~~^^^^^^^^^^^^^^^
102.74 s
> File "/nix/store/rfh8283cg3amd71cmhq2ypr98p7036k7-python3-3.13.12-env/lib/python3.13/multiprocessing/pool.py", line 51, in starmapstar
102.74 s
> return list(itertools.starmap(args[0], args[1]))
102.74 s
> File "/nix/store/rpickx0wnl28rz29529irv9s97w7fdk6-fetch-cargo-vendor-util/bin/fetch-cargo-vendor-util", line 87, in download_tarball
102.74 s
> calculated_checksum = download_file_with_checksum(session, url, tarball_out_dir)
102.74 s
> File "/nix/store/rpickx0wnl28rz29529irv9s97w7fdk6-fetch-cargo-vendor-util/bin/fetch-cargo-vendor-util", line 53, in download_file_with_checksum
102.74 s
> raise Exception(f"Failed to fetch file from {url}. Status code: {response.status_code}")
102.74 s
> Exception: Failed to fetch file from https://crates.io/api/v1/crates/futures-executor/0.3.31/download. Status code: 403
102.74 s
> """
102.74 s
>
102.74 s
> The above exception was the direct cause of the following exception:
102.74 s
>
102.74 s
> Traceback (most recent call last):
102.74 s
> File "/nix/store/rpickx0wnl28rz29529irv9s97w7fdk6-fetch-cargo-vendor-util/bin/fetch-cargo-vendor-util" , line 414 , in <module>
102.74 s
> main ()
102.74 s
> ~~~~ ^^
102.74 s
> File "/nix/store/rpickx0wnl28rz29529irv9s97w7fdk6-fetch-cargo-vendor-util/bin/fetch-cargo-vendor-util" , line 410 , in main
102.74 s
> subcommand_func ()
102.74 s
> ~~~~~~~~~~~~~~~ ^^
102.74 s
> File "/nix/store/rpickx0wnl28rz29529irv9s97w7fdk6-fetch-cargo-vendor-util/bin/fetch-cargo-vendor-util" , line 401 , in <lambda>
102.74 s
> "create-vendor-staging": lambda: create_vendor_staging (lockfile_path=Path(sys.argv[2]), out_dir=Path(sys.argv[3])) ,
102.74 s
> ~~~~~~~~~~~~~~~~~~~~~ ^^^^^^^^^^^^^^^^^^^^^^^^^^^^^^^^^^^^^^^^^^^^^^^^^^^^^^^^^^^^
102.74 s
> File "/nix/store/rpickx0wnl28rz29529irv9s97w7fdk6-fetch-cargo-vendor-util/bin/fetch-cargo-vendor-util" , line 168 , in create_vendor_staging
102.74 s
> pool.starmap (download_tarball, tarball_args_gen)
102.74 s
> ~~~~~~~~~~~~ ^^^^^^^^^^^^^^^^^^^^^^^^^^^^^^^^^^^^
102.74 s
> File "/nix/store/rfh8283cg3amd71cmhq2ypr98p7036k7-python3-3.13.12-env/lib/python3.13/multiprocessing/pool.py" , line 375 , in starmap
102.74 s
> return self._map_async(func, iterable, starmapstar, chunksize).get ()
102.74 s
> ~~~~~~~~~~~~~~~~~~~~~~~~~~~~~~~~~~~~~~~~~~~~~~~~~~~~~~~~~~~ ^^
102.74 s
> File "/nix/store/rfh8283cg3amd71cmhq2ypr98p7036k7-python3-3.13.12-env/lib/python3.13/multiprocessing/pool.py" , line 774 , in get
102.74 s
> raise self._value
102.74 s
> Exception : Failed to fetch file from https://crates.io/api/v1/crates/futures-executor/0.3.31/download. Status code: 403
102.74 s
For full logs, run:
102.74 s
nix log /nix/store/kgw08xi5rq1i8xs7pp2zqg9hzdsm0lzr-rscls-0.2.3-vendor-staging.drv
102.74 s
error: Cannot build '/nix/store/qwkphxq9znm8bqqjzfvwnmvg6lf38rw7-clinnet-0.1.8-vendor.drv '.
102.74 s
Reason: 1 dependency failed .
102.74 s
Output paths:
102.74 s
/nix/store/8mlkw00kiyz47yfgzh7cy2gmin0j8709-clinnet-0.1.8-vendor
102.74 s
error: Cannot build '/nix/store/w8ay1a2bcj97lnz283pg9fq55wqha9qx-rscls-0.2.3-vendor.drv '.
102.74 s
Reason: 1 dependency failed .
102.74 s
Output paths:
102.74 s
/nix/store/xjddmzd1ry904d9kwbrp8g6ph7zdk3jm-rscls-0.2.3-vendor
102.74 s
error: Build failed due to failed dependency
102.74 s
error: Build failed due to failed dependency
102.74 s
error: Cannot build '/nix/store/nl6fa55hbndmhw1mi0kphl8h8cfrnbfn-clinnet-0.1.8.drv '.
102.74 s
Reason: 1 dependency failed .
102.74 s
Output paths:
102.74 s
/nix/store/nmngd9sd2ly9g924rqp1h66h61hbzbwf-clinnet-0.1.8
102.74 s
error: Cannot build '/nix/store/hwyhkcw9fs6xr9d8jj1jxl2y1l2i7dgn-rscls-0.2.3.drv '.
102.74 s
Reason: 1 dependency failed .
102.74 s
Output paths:
102.74 s
/nix/store/5vpd33kblz0nbzwn4w453w1sj0900cr3-rscls-0.2.3
102.79 s
Downloaded cached auditable-cargo (16 KiB) in 70ms
102.79 s
error: Build failed due to failed dependency
102.79 s
error: Cannot build '/nix/store/llk4227dg86wbplm5k6mk4fyhs0rxmw0-nix-shell.drv '.
102.79 s
Reason: 1 dependency failed .
102.79 s
Output paths:
102.79 s
/nix/store/viw85i6gpprindjj8j8861x043bgrlym-nix-shell
103.24 s
Downloaded cached pyright (19.2 MiB) in 530ms
103.39 s
Build failed due to failed dependency
103.39 s
Build failed.