build devShells.x86_64-linux.default

Reproduce this run
Retry Run
  1. 0.16 s $ /nix/store/9ypz3flqsrl5xl495mm8h645gadjsxi1-coreutils-9.11/bin/timeout --kill-after=15s 7200s /nix/store/23zk8sgzamrbmj1fday15szf7f2279s8-nix-2.34.7/bin/nix --extra-experimental-features nix-command --extra-experimental-features flakes --log-format internal-json build --no-link --print-out-paths git+https://github.com/alphal00p/gammaloop?ref=finite_T_and_mu_pre_rebase&rev=da7b4c22f8a72cca8ddcc8537d642827d66b54b5&shallow=1#devShells.x86_64-linux.default --print-build-logs
  2. 0.48 s error (ignored): SQLite database '/var/cache/nix-ci-worker/eval-cache-v6/ae15fc417c888f8cf3c462d71827e7e1f7d0e16733c57714a5c14e082060e9d4.sqlite' is busy
  3. 2.50 s
  4. 3.68 s Downloading cached rust-lib-src from https://cache.nix-ci.com
  5. 3.69 s Downloading cached bacon from https://cache.nix-ci.com
  6. 3.69 s Downloading cached cargo-deny from https://cache.nix-ci.com
  7. 3.69 s Downloading cached cargo-edit from https://cache.nix-ci.com
  8. 3.69 s Downloading cached cargo-insta from https://cache.nix-ci.com
  9. 3.69 s Downloading cached cargo-machete from https://cache.nix-ci.com
  10. 3.69 s Downloading cached cargo-nextest from https://cache.nix-ci.com
  11. 3.69 s Downloading cached cargo-udeps from https://cache.nix-ci.com
  12. 3.69 s Downloading cached cargo-watch from https://cache.nix-ci.com
  13. 3.69 s Downloading cached curl-8.18.0-man from https://cache.nix-ci.com
  14. 3.69 s Downloading cached d3-flame-graph-templates from https://cache.nix-ci.com
  15. 3.69 s Downloading cached dejavu-fonts-minimal from https://cache.nix-ci.com
  16. 3.69 s Downloading cached form from https://cache.nix-ci.com
  17. 3.69 s Downloading cached gfortran-15.2.0-libgcc from https://cache.nix-ci.com
  18. 3.71 s Downloading cached just from https://cache.nix-ci.com
  19. 3.71 s Downloading cached maturin from https://cache.nix-ci.com
  20. 3.85 s Downloaded cached curl-8.18.0-man (78 KiB) in 164ms
  21. 3.86 s Downloaded cached d3-flame-graph-templates (66 KiB) in 170ms
  22. 3.87 s Downloaded cached gfortran-15.2.0-libgcc (193 KiB) in 179ms
  23. 3.88 s Downloaded cached dejavu-fonts-minimal (742 KiB) in 188ms
  24. 3.97 s Downloaded cached just (5 MiB) in 265ms
  25. 4.18 s Downloaded cached rust-lib-src (43.4 MiB) in 501ms
  26. 4.57 s Downloaded cached cargo-insta (6.2 MiB) in 881ms
  27. 4.59 s Downloaded cached cargo-watch (4.5 MiB) in 904ms
  28. 4.67 s Downloaded cached form (3.8 MiB) in 978ms
  29. 4.70 s Downloaded cached cargo-machete (6.6 MiB) in 1.0s
  30. 4.78 s Downloaded cached cargo-nextest (25.4 MiB) in 1.0s
  31. 4.79 s Downloaded cached bacon (6.8 MiB) in 1.1s
  32. 4.88 s Downloaded cached cargo-edit (9.6 MiB) in 1.1s
  33. 5.05 s Downloaded cached cargo-deny (8.7 MiB) in 1.3s
  34. 5.19 s Downloaded cached cargo-udeps (18.4 MiB) in 1.4s
  35. 5.21 s Downloaded cached maturin (25 MiB) in 1.5s
  36. 5.97 s Building /nix/store/ql6d13l85rdmwi8zldx8nhamfywfys85-cargo-stable-2026-04-16.drv
  37. 6.00 s Building /nix/store/npz4fmndvz4gv04nbdcg5kn66zf1463p-llvm-tools-preview-stable-2026-04-16.drv
  38. 6.02 s Building /nix/store/h6mm3q1vx7gbr6nigssx52c0vly8j2bx-rust-std-stable-2026-04-16.drv
  39. 6.06 s Building /nix/store/2gi9dvwbmsq6mc01w98zagxksda6wmxm-clippy-preview-stable-2026-04-16.drv
  40. 6.09 s Building /nix/store/qi7infc6y0bf5sdf14n4vq99fxp12hgc-rustc-stable-2026-04-16.drv
  41. 6.13 s Building /nix/store/189gy3760f09dic2wc8l0my4a7ckz0qi-builder.pl.drv
  42. 6.13 s Progress: 0 of 73 built (6 building), 1 of 196 downloaded from cache (15 downloading)
  43. 6.13 s Progress: 0 of 73 built (6 building), 2 of 196 downloaded from cache (14 downloading)
  44. 6.13 s Progress: 0 of 73 built (6 building), 3 of 196 downloaded from cache (13 downloading)
  45. 6.13 s Progress: 0 of 73 built (6 building), 4 of 196 downloaded from cache (12 downloading)
  46. 6.13 s Progress: 0 of 73 built (6 building), 5 of 196 downloaded from cache (11 downloading)
  47. 6.13 s Progress: 0 of 73 built (6 building), 6 of 196 downloaded from cache (10 downloading)
  48. 6.13 s Progress: 0 of 73 built (6 building), 7 of 196 downloaded from cache (9 downloading)
  49. 6.13 s Progress: 0 of 73 built (6 building), 8 of 196 downloaded from cache (8 downloading)
  50. 6.13 s Progress: 0 of 73 built (6 building), 9 of 196 downloaded from cache (7 downloading)
  51. 6.13 s Progress: 0 of 73 built (6 building), 10 of 196 downloaded from cache (6 downloading)
  52. 6.13 s Progress: 0 of 73 built (6 building), 11 of 196 downloaded from cache (5 downloading)
  53. 6.13 s Progress: 0 of 73 built (6 building), 12 of 196 downloaded from cache (4 downloading)
  54. 6.13 s Progress: 0 of 73 built (6 building), 13 of 196 downloaded from cache (3 downloading)
  55. 6.13 s Progress: 0 of 73 built (6 building), 14 of 196 downloaded from cache (2 downloading)
  56. 6.13 s Progress: 0 of 73 built (6 building), 15 of 196 downloaded from cache (1 downloading)
  57. 6.13 s Progress: 0 of 73 built (6 building), 16 of 196 downloaded from cache
  58. 6.13 s [cargo-stable-2026-04] Phase: unpackPhase
  59. 6.13 s [cargo-stable-2026-04] unpacking source archive /nix/store/4vl3g92byqysva62839wialijaxipqn6-cargo-1.95.0-x86_64-unknown-linux-gnu.tar.gz
  60. 6.13 s [clippy-preview-stable-2026-04] Phase: unpackPhase
  61. 6.13 s [clippy-preview-stable-2026-04] unpacking source archive /nix/store/phkv8h9n9nnbwgkacn30sdqbixcfqg1z-clippy-1.95.0-x86_64-unknown-linux-gnu.tar.gz
  62. 6.13 s [llvm-tools-preview-stable-2026-04] Phase: unpackPhase
  63. 6.13 s [llvm-tools-preview-stable-2026-04] unpacking source archive /nix/store/bjy28rb6g94imvql2a97j4ndbvpdskry-llvm-tools-1.95.0-x86_64-unknown-linux-gnu.tar.gz
  64. 6.13 s [rust-std-stable-2026-04] Phase: unpackPhase
  65. 6.13 s [rust-std-stable-2026-04] unpacking source archive /nix/store/zjmgjj73r15spm04rig7cfnqh0n4wk9w-rust-std-1.95.0-x86_64-unknown-linux-gnu.tar.gz
  66. 6.13 s Downloading cached bin from https://cache.nix-ci.com
  67. 6.13 s Downloading cached binutils-wrapper from https://cache.nix-ci.com
  68. 6.13 s Downloading cached brotli from https://cache.nix-ci.com
  69. 6.13 s Downloading cached bzip2-1.0.8-dev from https://cache.nix-ci.com
  70. 6.13 s Downloading cached c-ares from https://cache.nix-ci.com
  71. 6.13 s Downloading cached c-ares from https://cache.nix-ci.com
  72. 6.13 s Downloading cached curl-8.18.0-bin from https://cache.nix-ci.com
  73. 6.13 s Downloading cached dav1d from https://cache.nix-ci.com
  74. 6.13 s Downloading cached die-hook from https://cache.nix-ci.com
  75. 6.13 s Downloading cached fribidi from https://cache.nix-ci.com
  76. 6.13 s Downloading cached gettext from https://cache.nix-ci.com
  77. 6.13 s Downloading cached giflib from https://cache.nix-ci.com
  78. 6.13 s Downloading cached glibc-iconv from https://cache.nix-ci.com
  79. 6.13 s Downloading cached glibc-locales-2.42 from https://cache.nix-ci.com
  80. 6.13 s Downloading cached graphite2 from https://cache.nix-ci.com
  81. 6.13 s Downloading cached gumbo from https://cache.nix-ci.com
  82. 6.15 s [rustc-stable-2026-04] Phase: unpackPhase
  83. 6.15 s [rustc-stable-2026-04] unpacking source archive /nix/store/2ks0pzvx70xg3kyfpqzs0apfzqp8aa5h-rustc-1.95.0-x86_64-unknown-linux-gnu.tar.gz
  84. 6.15 s Downloaded cached bin (264 B) in 25ms
  85. 6.15 s Progress: 0 of 61 built (6 building), 17 of 196 downloaded from cache (15 downloading)
  86. 6.15 s Downloading cached fontconfig from https://cache.nix-ci.com
  87. 6.16 s Downloaded cached die-hook (928 B) in 34ms
  88. 6.16 s Downloaded cached c-ares (276 KiB) in 35ms
  89. 6.16 s Progress: 0 of 60 built (6 building), 18 of 196 downloaded from cache (15 downloading)
  90. 6.16 s Downloading cached gfortran-15.2.0-lib from https://cache.nix-ci.com
  91. 6.16 s Progress: 0 of 60 built (6 building), 19 of 196 downloaded from cache (15 downloading)
  92. 6.16 s Downloading cached icu4c from https://cache.nix-ci.com
  93. 6.17 s [builder.pl] Phase: patchPhase
  94. 6.17 s Downloaded cached bzip2-1.0.8-dev (8168 B) in 40ms
  95. 6.17 s Progress: 0 of 60 built (6 building), 20 of 196 downloaded from cache (15 downloading)
  96. 6.17 s Downloading cached jbig2dec from https://cache.nix-ci.com
  97. 6.17 s [builder.pl] Phase: updateAutotoolsGnuConfigScriptsPhase
  98. 6.18 s Downloaded cached gumbo (425 KiB) in 46ms
  99. 6.18 s Progress: 0 of 60 built (6 building), 21 of 196 downloaded from cache (15 downloading)
  100. 6.18 s Downloaded cached fribidi (162 KiB) in 48ms
  101. 6.18 s Downloading cached jemalloc-5.3.0-unstable-2025-09 from https://cache.nix-ci.com
  102. 6.18 s Progress: 0 of 60 built (6 building), 22 of 196 downloaded from cache (15 downloading)
  103. 6.18 s Downloading cached lcms2 from https://cache.nix-ci.com
  104. 6.18 s Downloaded cached brotli (53 KiB) in 50ms
  105. 6.18 s Progress: 0 of 60 built (6 building), 23 of 196 downloaded from cache (15 downloading)
  106. 6.18 s Downloading cached lerc from https://cache.nix-ci.com
  107. 6.18 s Downloaded cached c-ares (382 KiB) in 51ms
  108. 6.18 s Progress: 0 of 60 built (6 building), 24 of 196 downloaded from cache (15 downloading)
  109. 6.18 s Downloading cached brotli-1.2.0-dev from https://cache.nix-ci.com
  110. 6.18 s [builder.pl] Phase: configurePhase
  111. 6.19 s Downloaded cached glibc-iconv (528 B) in 56ms
  112. 6.19 s Progress: 0 of 60 built (6 building), 25 of 196 downloaded from cache (15 downloading)
  113. 6.19 s Downloading cached c-ares-1.34.6-dev from https://cache.nix-ci.com
  114. 6.19 s [builder.pl] no configure script, doing nothing
  115. 6.19 s Downloaded cached graphite2 (227 KiB) in 60ms
  116. 6.19 s Progress: 0 of 60 built (6 building), 26 of 196 downloaded from cache (15 downloading)
  117. 6.19 s Downloaded cached binutils-wrapper (55 KiB) in 62ms
  118. 6.19 s Downloading cached libdatrie-2019-12-20-lib from https://cache.nix-ci.com
  119. 6.19 s Progress: 0 of 60 built (6 building), 27 of 196 downloaded from cache (15 downloading)
  120. 6.19 s Downloading cached libdeflate from https://cache.nix-ci.com
  121. 6.19 s [builder.pl] Phase: buildPhase
  122. 6.20 s Downloaded cached dav1d (2.5 MiB) in 67ms
  123. 6.20 s Progress: 0 of 60 built (6 building), 28 of 196 downloaded from cache (15 downloading)
  124. 6.20 s Downloading cached libedit-20251016 from https://cache.nix-ci.com
  125. 6.20 s [builder.pl] Phase: checkPhase
  126. 6.20 s [cargo-stable-2026-04] source root is cargo-1.95.0-x86_64-unknown-linux-gnu
  127. 6.20 s [clippy-preview-stable-2026-04] source root is clippy-1.95.0-x86_64-unknown-linux-gnu
  128. 6.20 s Downloaded cached glibc-locales-2.42 (2.9 MiB) in 74ms
  129. 6.20 s Progress: 0 of 60 built (6 building), 29 of 196 downloaded from cache (15 downloading)
  130. 6.21 s Downloading cached libev from https://cache.nix-ci.com
  131. 6.21 s [builder.pl] Phase: installPhase
  132. 6.21 s [cargo-stable-2026-04] setting SOURCE_DATE_EPOCH to timestamp 1776196532 of file "cargo-1.95.0-x86_64-unknown-linux-gnu/version"
  133. 6.21 s [builder.pl] no Makefile or custom installPhase, doing nothing
  134. 6.21 s [clippy-preview-stable-2026-04] setting SOURCE_DATE_EPOCH to timestamp 1776196532 of file "clippy-1.95.0-x86_64-unknown-linux-gnu/version"
  135. 6.21 s [builder.pl] Phase: fixupPhase
  136. 6.21 s [cargo-stable-2026-04] Phase: patchPhase
  137. 6.21 s Downloaded cached giflib (407 KiB) in 84ms
  138. 6.21 s Progress: 0 of 59 built (6 building), 30 of 196 downloaded from cache (15 downloading)
  139. 6.21 s Downloading cached libffi-3.5.2-dev from https://cache.nix-ci.com
  140. 6.22 s [clippy-preview-stable-2026-04] Phase: patchPhase
  141. 6.22 s [cargo-stable-2026-04] Phase: updateAutotoolsGnuConfigScriptsPhase
  142. 6.22 s Downloaded cached jbig2dec (383 KiB) in 52ms
  143. 6.22 s Progress: 0 of 59 built (6 building), 31 of 196 downloaded from cache (15 downloading)
  144. 6.22 s Downloading cached libice from https://cache.nix-ci.com
  145. 6.22 s [clippy-preview-stable-2026-04] Phase: updateAutotoolsGnuConfigScriptsPhase
  146. 6.22 s Downloaded cached curl-8.18.0-bin (369 KiB) in 95ms
  147. 6.22 s Progress: 0 of 59 built (6 building), 32 of 196 downloaded from cache (15 downloading)
  148. 6.22 s Downloading cached libidn2-2.3.8-bin from https://cache.nix-ci.com
  149. 6.23 s [builder.pl] shrinking RPATHs of ELF executables and libraries in /nix/store/fcqldgczpc2v9w9fg5nkibc6km2d2k70-builder.pl
  150. 6.23 s [cargo-stable-2026-04] Phase: configurePhase
  151. 6.23 s [builder.pl] checking for references to /build/ in /nix/store/fcqldgczpc2v9w9fg5nkibc6km2d2k70-builder.pl...
  152. 6.23 s [clippy-preview-stable-2026-04] Phase: configurePhase
  153. 6.24 s Downloaded cached brotli-1.2.0-dev (57 KiB) in 55ms
  154. 6.24 s Progress: 0 of 59 built (6 building), 33 of 196 downloaded from cache (15 downloading)
  155. 6.24 s Downloading cached libjpeg-turbo from https://cache.nix-ci.com
  156. 6.24 s [builder.pl] patching script interpreter paths in /nix/store/fcqldgczpc2v9w9fg5nkibc6km2d2k70-builder.pl
  157. 6.24 s [cargo-stable-2026-04] no configure script, doing nothing
  158. 6.24 s Downloaded cached fontconfig (1.2 MiB) in 85ms
  159. 6.24 s Progress: 0 of 59 built (6 building), 34 of 196 downloaded from cache (15 downloading)
  160. 6.24 s [clippy-preview-stable-2026-04] no configure script, doing nothing
  161. 6.24 s [clippy-preview-stable-2026-04] Phase: buildPhase
  162. 6.24 s Downloading cached libpfm from https://cache.nix-ci.com
  163. 6.24 s [cargo-stable-2026-04] Phase: buildPhase
  164. 6.24 s [cargo-stable-2026-04] no Makefile or custom buildPhase, doing nothing
  165. 6.24 s [cargo-stable-2026-04] Phase: installPhase
  166. 6.24 s [clippy-preview-stable-2026-04] no Makefile or custom buildPhase, doing nothing
  167. 6.24 s Downloaded cached lerc (850 KiB) in 66ms
  168. 6.24 s Progress: 0 of 59 built (6 building), 35 of 196 downloaded from cache (15 downloading)
  169. 6.25 s Downloading cached libpng-apng from https://cache.nix-ci.com
  170. 6.25 s [cargo-stable-2026-04] patching script interpreter paths in install.sh
  171. 6.25 s [clippy-preview-stable-2026-04] Phase: installPhase
  172. 6.26 s Downloaded cached c-ares-1.34.6-dev (128 KiB) in 70ms
  173. 6.27 s Downloaded cached libdeflate (458 KiB) in 79ms
  174. 6.27 s Downloaded cached libedit-20251016 (261 KiB) in 75ms
  175. 6.28 s Downloaded cached libev (225 KiB) in 77ms
  176. 6.29 s Downloaded cached libffi-3.5.2-dev (21 KiB) in 72ms
  177. 6.29 s Downloaded cached libidn2-2.3.8-bin (37 KiB) in 63ms
  178. 6.29 s Downloaded cached libice (125 KiB) in 66ms
  179. 6.29 s [builder.pl:post-build] Uploading to the NixCI cache: /nix/store/fcqldgczpc2v9w9fg5nkibc6km2d2k70-builder.pl
  180. 6.30 s Downloaded cached libpng-apng (269 KiB) in 51ms
  181. 6.31 s Downloaded cached jemalloc-5.3.0-unstable-2025-09 (3.7 MiB) in 128ms
  182. 6.31 s Downloaded cached libjpeg-turbo (2 MiB) in 73ms
  183. 6.34 s Downloaded cached libdatrie-2019-12-20-lib (42 KiB) in 144ms
  184. 6.34 s Downloaded cached libpfm (6.4 MiB) in 100ms
  185. 6.35 s Downloaded cached lcms2 (484 KiB) in 168ms
  186. 6.35 s Downloaded cached gettext (18.6 MiB) in 222ms
  187. 6.37 s [builder.pl:post-build] warning: 'warn-short-path-literals' is deprecated, use 'lint-short-path-literals = ignore' instead
  188. 6.38 s Downloaded cached gfortran-15.2.0-lib (13.3 MiB) in 216ms
  189. 6.42 s [builder.pl:post-build] copying 0 paths...
  190. 6.49 s [builder.pl:post-build] warning: 'warn-short-path-literals' is deprecated, use 'lint-short-path-literals = ignore' instead
  191. 6.65 s Downloaded cached icu4c (38.2 MiB) in 488ms
  192. 6.66 s [builder.pl:post-build] copying 0 paths...
  193. 6.68 s Uploaded builder.pl in 419ms
  194. 6.68 s Progress: 1 of 60 built (5 building), 35 of 196 downloaded from cache (16 downloading)
  195. 6.68 s Built builder.pl in 552ms
  196. 6.68 s Progress: 1 of 59 built (5 building), 36 of 196 downloaded from cache (15 downloading)
  197. 6.68 s Progress: 1 of 59 built (5 building), 37 of 196 downloaded from cache (14 downloading)
  198. 6.68 s Progress: 1 of 59 built (5 building), 38 of 196 downloaded from cache (13 downloading)
  199. 6.68 s Progress: 1 of 59 built (5 building), 39 of 196 downloaded from cache (12 downloading)
  200. 6.68 s Progress: 1 of 59 built (5 building), 40 of 196 downloaded from cache (11 downloading)
  201. 6.68 s Progress: 1 of 59 built (5 building), 41 of 196 downloaded from cache (10 downloading)
  202. 6.68 s Progress: 1 of 59 built (5 building), 42 of 196 downloaded from cache (9 downloading)
  203. 6.68 s Progress: 1 of 59 built (5 building), 43 of 196 downloaded from cache (8 downloading)
  204. 6.68 s Progress: 1 of 59 built (5 building), 44 of 196 downloaded from cache (7 downloading)
  205. 6.68 s Progress: 1 of 59 built (5 building), 45 of 196 downloaded from cache (6 downloading)
  206. 6.68 s Progress: 1 of 59 built (5 building), 46 of 196 downloaded from cache (5 downloading)
  207. 6.68 s Progress: 1 of 59 built (5 building), 47 of 196 downloaded from cache (4 downloading)
  208. 6.68 s Progress: 1 of 59 built (5 building), 48 of 196 downloaded from cache (3 downloading)
  209. 6.68 s Progress: 1 of 59 built (5 building), 49 of 196 downloaded from cache (2 downloading)
  210. 6.68 s Progress: 1 of 59 built (5 building), 50 of 196 downloaded from cache (1 downloading)
  211. 6.68 s Progress: 1 of 59 built (5 building), 51 of 196 downloaded from cache
  212. 6.68 s [cargo-stable-2026-04] install.sh: interpreter directive changed from "#!/usr/bin/env bash" to "/nix/store/v8sa6r6q037ihghxfbwzjj4p59v2x0pv-bash-5.3p9/bin/bash"
  213. 6.68 s [cargo-stable-2026-04] install: creating uninstall script at /nix/store/3wrl5dpd4vcfhqb6112ib5kmm3mqfm8h-cargo-stable-2026-04-16/lib/rustlib/uninstall.sh
  214. 6.68 s [cargo-stable-2026-04] install: installing component 'cargo'
  215. 6.68 s [clippy-preview-stable-2026-04] patching script interpreter paths in install.sh
  216. 6.68 s [clippy-preview-stable-2026-04] install.sh: interpreter directive changed from "#!/usr/bin/env bash" to "/nix/store/v8sa6r6q037ihghxfbwzjj4p59v2x0pv-bash-5.3p9/bin/bash"
  217. 6.68 s [clippy-preview-stable-2026-04] install: creating uninstall script at /nix/store/f7bch0my1kay984lcjd60hiry8zaxm2d-clippy-preview-stable-2026-04-16/lib/rustlib/uninstall.sh
  218. 6.68 s [clippy-preview-stable-2026-04] install: installing component 'clippy-preview'
  219. 6.68 s [clippy-preview-stable-2026-04]
  220. 6.68 s [clippy-preview-stable-2026-04] clippy installed.
  221. 6.68 s [clippy-preview-stable-2026-04]
  222. 6.68 s [clippy-preview-stable-2026-04] Phase: fixupPhase
  223. 6.68 s [clippy-preview-stable-2026-04] shrinking RPATHs of ELF executables and libraries in /nix/store/f7bch0my1kay984lcjd60hiry8zaxm2d-clippy-preview-stable-2026-04-16
  224. 6.68 s [clippy-preview-stable-2026-04] shrinking /nix/store/f7bch0my1kay984lcjd60hiry8zaxm2d-clippy-preview-stable-2026-04-16/bin/cargo-clippy
  225. 6.68 s [clippy-preview-stable-2026-04] shrinking /nix/store/f7bch0my1kay984lcjd60hiry8zaxm2d-clippy-preview-stable-2026-04-16/bin/clippy-driver
  226. 6.68 s [clippy-preview-stable-2026-04] checking for references to /build/ in /nix/store/f7bch0my1kay984lcjd60hiry8zaxm2d-clippy-preview-stable-2026-04-16...
  227. 6.68 s [clippy-preview-stable-2026-04] patching script interpreter paths in /nix/store/f7bch0my1kay984lcjd60hiry8zaxm2d-clippy-preview-stable-2026-04-16
  228. 6.68 s [rust-std-stable-2026-04] source root is rust-std-1.95.0-x86_64-unknown-linux-gnu
  229. 6.68 s [rust-std-stable-2026-04] setting SOURCE_DATE_EPOCH to timestamp 1776196532 of file "rust-std-1.95.0-x86_64-unknown-linux-gnu/version"
  230. 6.68 s [rust-std-stable-2026-04] Phase: patchPhase
  231. 6.68 s [rust-std-stable-2026-04] Phase: updateAutotoolsGnuConfigScriptsPhase
  232. 6.68 s [rust-std-stable-2026-04] Phase: configurePhase
  233. 6.68 s [rust-std-stable-2026-04] no configure script, doing nothing
  234. 6.68 s [rust-std-stable-2026-04] Phase: buildPhase
  235. 6.68 s [rust-std-stable-2026-04] no Makefile or custom buildPhase, doing nothing
  236. 6.68 s [rust-std-stable-2026-04] Phase: installPhase
  237. 6.68 s [rust-std-stable-2026-04] patching script interpreter paths in install.sh
  238. 6.68 s [rust-std-stable-2026-04] install.sh: interpreter directive changed from "#!/usr/bin/env bash" to "/nix/store/v8sa6r6q037ihghxfbwzjj4p59v2x0pv-bash-5.3p9/bin/bash"
  239. 6.68 s Downloading cached libpsl-0.21.5-dev from https://cache.nix-ci.com
  240. 6.68 s Downloading cached libselinux from https://cache.nix-ci.com
  241. 6.68 s Downloading cached libssh2-1.11.1-dev from https://cache.nix-ci.com
  242. 6.68 s Downloading cached libtasn1 from https://cache.nix-ci.com
  243. 6.68 s Downloading cached libtool-2.5.4-lib from https://cache.nix-ci.com
  244. 6.68 s Downloading cached libtraceevent from https://cache.nix-ci.com
  245. 6.68 s Downloading cached libuv from https://cache.nix-ci.com
  246. 6.68 s Downloading cached libvmaf from https://cache.nix-ci.com
  247. 6.68 s Downloading cached libxau from https://cache.nix-ci.com
  248. 6.68 s Downloading cached libxdmcp from https://cache.nix-ci.com
  249. 6.68 s Downloading cached llhttp from https://cache.nix-ci.com
  250. 6.68 s Downloading cached lzo from https://cache.nix-ci.com
  251. 6.68 s Downloading cached make-binary-wrapper-hook from https://cache.nix-ci.com
  252. 6.68 s Downloading cached ncompress from https://cache.nix-ci.com
  253. 6.68 s Downloading cached libxcrypt from https://cache.nix-ci.com
  254. 6.68 s Downloading cached nghttp2-1.67.1-lib from https://cache.nix-ci.com
  255. 6.70 s Downloaded cached libpsl-0.21.5-dev (7800 B) in 20ms
  256. 6.70 s Downloaded cached llhttp (89 KiB) in 19ms
  257. 6.70 s Downloaded cached libssh2-1.11.1-dev (83 KiB) in 22ms
  258. 6.71 s Downloaded cached libxau (27 KiB) in 25ms
  259. 6.71 s Downloaded cached libtasn1 (95 KiB) in 29ms
  260. 6.71 s Downloaded cached make-binary-wrapper-hook (18 KiB) in 29ms
  261. 6.71 s Downloaded cached libxdmcp (31 KiB) in 32ms
  262. 6.72 s Downloaded cached libselinux (690 KiB) in 33ms
  263. 6.72 s Downloaded cached lzo (159 KiB) in 33ms
  264. 6.72 s Downloaded cached libuv (271 KiB) in 34ms
  265. 6.72 s Downloaded cached ncompress (74 KiB) in 33ms
  266. 6.72 s Downloaded cached nghttp2-1.67.1-lib (225 KiB) in 34ms
  267. 6.72 s Downloaded cached libtool-2.5.4-lib (56 KiB) in 35ms
  268. 6.72 s Downloaded cached libxcrypt (141 KiB) in 34ms
  269. 6.72 s Downloaded cached libvmaf (2.7 MiB) in 38ms
  270. 6.74 s [clippy-preview-stable-2026-04:post-build] Uploading to the NixCI cache: /nix/store/f7bch0my1kay984lcjd60hiry8zaxm2d-clippy-preview-stable-2026-04-16
  271. 6.79 s [clippy-preview-stable-2026-04:post-build] warning: 'warn-short-path-literals' is deprecated, use 'lint-short-path-literals = ignore' instead
  272. 6.80 s [clippy-preview-stable-2026-04:post-build] copying 1 paths...
  273. 6.80 s [clippy-preview-stable-2026-04:post-build] copying path '/nix/store/f7bch0my1kay984lcjd60hiry8zaxm2d-clippy-preview-stable-2026-04-16' to 'https://cache.nix-ci.com'...
  274. 6.81 s Downloaded cached libtraceevent (609 KiB) in 127ms
  275. 13.99 s [clippy-preview-stable-2026-04:post-build] warning: 'warn-short-path-literals' is deprecated, use 'lint-short-path-literals = ignore' instead
  276. 14.04 s [clippy-preview-stable-2026-04:post-build] copying 0 paths...
  277. 14.06 s Uploaded clippy-preview-stable-2026-04 in 7.3s
  278. 14.06 s Progress: 2 of 60 built (4 building), 51 of 196 downloaded from cache (16 downloading)
  279. 14.06 s Built clippy-preview-stable-2026-04 in 7.9s
  280. 14.06 s Progress: 2 of 59 built (4 building), 52 of 196 downloaded from cache (15 downloading)
  281. 14.06 s Progress: 2 of 59 built (4 building), 53 of 196 downloaded from cache (14 downloading)
  282. 14.06 s Progress: 2 of 59 built (4 building), 54 of 196 downloaded from cache (13 downloading)
  283. 14.06 s Progress: 2 of 59 built (4 building), 55 of 196 downloaded from cache (12 downloading)
  284. 14.06 s Progress: 2 of 59 built (4 building), 56 of 196 downloaded from cache (11 downloading)
  285. 14.06 s Progress: 2 of 59 built (4 building), 57 of 196 downloaded from cache (10 downloading)
  286. 14.06 s Progress: 2 of 59 built (4 building), 58 of 196 downloaded from cache (9 downloading)
  287. 14.06 s Progress: 2 of 59 built (4 building), 59 of 196 downloaded from cache (8 downloading)
  288. 14.06 s Progress: 2 of 59 built (4 building), 60 of 196 downloaded from cache (7 downloading)
  289. 14.06 s Progress: 2 of 59 built (4 building), 61 of 196 downloaded from cache (6 downloading)
  290. 14.06 s Progress: 2 of 59 built (4 building), 62 of 196 downloaded from cache (5 downloading)
  291. 14.06 s Progress: 2 of 59 built (4 building), 63 of 196 downloaded from cache (4 downloading)
  292. 14.06 s Progress: 2 of 59 built (4 building), 64 of 196 downloaded from cache (3 downloading)
  293. 14.06 s Progress: 2 of 59 built (4 building), 65 of 196 downloaded from cache (2 downloading)
  294. 14.06 s Progress: 2 of 59 built (4 building), 66 of 196 downloaded from cache (1 downloading)
  295. 14.06 s Progress: 2 of 59 built (4 building), 67 of 196 downloaded from cache
  296. 14.06 s [cargo-stable-2026-04]
  297. 14.06 s [cargo-stable-2026-04] cargo installed.
  298. 14.06 s [cargo-stable-2026-04]
  299. 14.06 s [cargo-stable-2026-04] Phase: fixupPhase
  300. 14.06 s [cargo-stable-2026-04] shrinking RPATHs of ELF executables and libraries in /nix/store/3wrl5dpd4vcfhqb6112ib5kmm3mqfm8h-cargo-stable-2026-04-16
  301. 14.06 s [cargo-stable-2026-04] shrinking /nix/store/3wrl5dpd4vcfhqb6112ib5kmm3mqfm8h-cargo-stable-2026-04-16/bin/cargo
  302. 14.06 s [cargo-stable-2026-04] checking for references to /build/ in /nix/store/3wrl5dpd4vcfhqb6112ib5kmm3mqfm8h-cargo-stable-2026-04-16...
  303. 14.06 s [cargo-stable-2026-04] gzipping man pages under /nix/store/3wrl5dpd4vcfhqb6112ib5kmm3mqfm8h-cargo-stable-2026-04-16/share/man/
  304. 14.06 s [cargo-stable-2026-04] patching script interpreter paths in /nix/store/3wrl5dpd4vcfhqb6112ib5kmm3mqfm8h-cargo-stable-2026-04-16
  305. 14.06 s [llvm-tools-preview-stable-2026-04] source root is llvm-tools-1.95.0-x86_64-unknown-linux-gnu
  306. 14.06 s [llvm-tools-preview-stable-2026-04] setting SOURCE_DATE_EPOCH to timestamp 1776196532 of file "llvm-tools-1.95.0-x86_64-unknown-linux-gnu/version"
  307. 14.06 s [llvm-tools-preview-stable-2026-04] Phase: patchPhase
  308. 14.06 s [llvm-tools-preview-stable-2026-04] Phase: updateAutotoolsGnuConfigScriptsPhase
  309. 14.06 s [llvm-tools-preview-stable-2026-04] Phase: configurePhase
  310. 14.06 s [llvm-tools-preview-stable-2026-04] no configure script, doing nothing
  311. 14.06 s [llvm-tools-preview-stable-2026-04] Phase: buildPhase
  312. 14.06 s [llvm-tools-preview-stable-2026-04] no Makefile or custom buildPhase, doing nothing
  313. 14.06 s [llvm-tools-preview-stable-2026-04] Phase: installPhase
  314. 14.06 s [llvm-tools-preview-stable-2026-04] patching script interpreter paths in install.sh
  315. 14.06 s [llvm-tools-preview-stable-2026-04] install.sh: interpreter directive changed from "#!/usr/bin/env bash" to "/nix/store/v8sa6r6q037ihghxfbwzjj4p59v2x0pv-bash-5.3p9/bin/bash"
  316. 14.06 s [llvm-tools-preview-stable-2026-04] install: creating uninstall script at /nix/store/hpnm48pzf77gpk22y6xwwsj1xxa280f8-llvm-tools-preview-stable-2026-04-16/lib/rustlib/uninstall.sh
  317. 14.06 s [llvm-tools-preview-stable-2026-04] install: installing component 'llvm-tools-preview'
  318. 14.06 s [llvm-tools-preview-stable-2026-04]
  319. 14.06 s [llvm-tools-preview-stable-2026-04] llvm tools installed.
  320. 14.06 s [llvm-tools-preview-stable-2026-04]
  321. 14.06 s [llvm-tools-preview-stable-2026-04] Phase: fixupPhase
  322. 14.06 s [llvm-tools-preview-stable-2026-04] shrinking RPATHs of ELF executables and libraries in /nix/store/hpnm48pzf77gpk22y6xwwsj1xxa280f8-llvm-tools-preview-stable-2026-04-16
  323. 14.06 s [llvm-tools-preview-stable-2026-04] shrinking /nix/store/hpnm48pzf77gpk22y6xwwsj1xxa280f8-llvm-tools-preview-stable-2026-04-16/lib/rustlib/x86_64-unknown-linux-gnu/bin/llvm-as
  324. 14.06 s [llvm-tools-preview-stable-2026-04] shrinking /nix/store/hpnm48pzf77gpk22y6xwwsj1xxa280f8-llvm-tools-preview-stable-2026-04-16/lib/rustlib/x86_64-unknown-linux-gnu/bin/llvm-ar
  325. 14.06 s [llvm-tools-preview-stable-2026-04] shrinking /nix/store/hpnm48pzf77gpk22y6xwwsj1xxa280f8-llvm-tools-preview-stable-2026-04-16/lib/rustlib/x86_64-unknown-linux-gnu/bin/llvm-dis
  326. 14.06 s [llvm-tools-preview-stable-2026-04] shrinking /nix/store/hpnm48pzf77gpk22y6xwwsj1xxa280f8-llvm-tools-preview-stable-2026-04-16/lib/rustlib/x86_64-unknown-linux-gnu/bin/llvm-profdata
  327. 14.06 s [llvm-tools-preview-stable-2026-04] shrinking /nix/store/hpnm48pzf77gpk22y6xwwsj1xxa280f8-llvm-tools-preview-stable-2026-04-16/lib/rustlib/x86_64-unknown-linux-gnu/bin/llvm-nm
  328. 14.06 s [llvm-tools-preview-stable-2026-04] shrinking /nix/store/hpnm48pzf77gpk22y6xwwsj1xxa280f8-llvm-tools-preview-stable-2026-04-16/lib/rustlib/x86_64-unknown-linux-gnu/bin/llvm-objdump
  329. 14.06 s [llvm-tools-preview-stable-2026-04] shrinking /nix/store/hpnm48pzf77gpk22y6xwwsj1xxa280f8-llvm-tools-preview-stable-2026-04-16/lib/rustlib/x86_64-unknown-linux-gnu/bin/opt
  330. 14.06 s [llvm-tools-preview-stable-2026-04] shrinking /nix/store/hpnm48pzf77gpk22y6xwwsj1xxa280f8-llvm-tools-preview-stable-2026-04-16/lib/rustlib/x86_64-unknown-linux-gnu/bin/llc
  331. 14.06 s [llvm-tools-preview-stable-2026-04] shrinking /nix/store/hpnm48pzf77gpk22y6xwwsj1xxa280f8-llvm-tools-preview-stable-2026-04-16/lib/rustlib/x86_64-unknown-linux-gnu/bin/llvm-link
  332. 14.06 s [llvm-tools-preview-stable-2026-04] shrinking /nix/store/hpnm48pzf77gpk22y6xwwsj1xxa280f8-llvm-tools-preview-stable-2026-04-16/lib/rustlib/x86_64-unknown-linux-gnu/bin/llvm-size
  333. 14.06 s [llvm-tools-preview-stable-2026-04] shrinking /nix/store/hpnm48pzf77gpk22y6xwwsj1xxa280f8-llvm-tools-preview-stable-2026-04-16/lib/rustlib/x86_64-unknown-linux-gnu/bin/llvm-strip
  334. 14.06 s [llvm-tools-preview-stable-2026-04] shrinking /nix/store/hpnm48pzf77gpk22y6xwwsj1xxa280f8-llvm-tools-preview-stable-2026-04-16/lib/rustlib/x86_64-unknown-linux-gnu/bin/llvm-readobj
  335. 14.06 s [llvm-tools-preview-stable-2026-04] shrinking /nix/store/hpnm48pzf77gpk22y6xwwsj1xxa280f8-llvm-tools-preview-stable-2026-04-16/lib/rustlib/x86_64-unknown-linux-gnu/bin/llvm-objcopy
  336. 14.06 s [llvm-tools-preview-stable-2026-04] shrinking /nix/store/hpnm48pzf77gpk22y6xwwsj1xxa280f8-llvm-tools-preview-stable-2026-04-16/lib/rustlib/x86_64-unknown-linux-gnu/bin/llvm-cov
  337. 14.06 s [llvm-tools-preview-stable-2026-04] shrinking /nix/store/hpnm48pzf77gpk22y6xwwsj1xxa280f8-llvm-tools-preview-stable-2026-04-16/lib/rustlib/x86_64-unknown-linux-gnu/lib/libLLVM.so.22.1-rust-1.95.0-stable
  338. 14.06 s [llvm-tools-preview-stable-2026-04] checking for references to /build/ in /nix/store/hpnm48pzf77gpk22y6xwwsj1xxa280f8-llvm-tools-preview-stable-2026-04-16...
  339. 14.06 s [llvm-tools-preview-stable-2026-04] patching script interpreter paths in /nix/store/hpnm48pzf77gpk22y6xwwsj1xxa280f8-llvm-tools-preview-stable-2026-04-16
  340. 14.06 s [rust-std-stable-2026-04] install: creating uninstall script at /nix/store/dbjcar4i1mb1mcm6a3fq9yr37sf7rii8-rust-std-stable-2026-04-16/lib/rustlib/uninstall.sh
  341. 14.06 s [rust-std-stable-2026-04] install: installing component 'rust-std-x86_64-unknown-linux-gnu'
  342. 14.06 s [rust-std-stable-2026-04]
  343. 14.06 s [rust-std-stable-2026-04] rust std installed.
  344. 14.06 s [rust-std-stable-2026-04]
  345. 14.06 s [rust-std-stable-2026-04] Phase: fixupPhase
  346. 14.06 s [rust-std-stable-2026-04] shrinking RPATHs of ELF executables and libraries in /nix/store/dbjcar4i1mb1mcm6a3fq9yr37sf7rii8-rust-std-stable-2026-04-16
  347. 14.06 s [rust-std-stable-2026-04] shrinking /nix/store/dbjcar4i1mb1mcm6a3fq9yr37sf7rii8-rust-std-stable-2026-04-16/lib/rustlib/x86_64-unknown-linux-gnu/lib/libstd-d1237ef7159db0a2.so
  348. 14.06 s [rust-std-stable-2026-04] checking for references to /build/ in /nix/store/dbjcar4i1mb1mcm6a3fq9yr37sf7rii8-rust-std-stable-2026-04-16...
  349. 14.06 s [rust-std-stable-2026-04] patching script interpreter paths in /nix/store/dbjcar4i1mb1mcm6a3fq9yr37sf7rii8-rust-std-stable-2026-04-16
  350. 14.06 s [rustc-stable-2026-04] source root is rustc-1.95.0-x86_64-unknown-linux-gnu
  351. 14.06 s [rustc-stable-2026-04] setting SOURCE_DATE_EPOCH to timestamp 1776196532 of file "rustc-1.95.0-x86_64-unknown-linux-gnu/version"
  352. 14.06 s [rustc-stable-2026-04] Phase: patchPhase
  353. 14.06 s [rustc-stable-2026-04] Phase: updateAutotoolsGnuConfigScriptsPhase
  354. 14.06 s [rustc-stable-2026-04] Phase: configurePhase
  355. 14.06 s [rustc-stable-2026-04] no configure script, doing nothing
  356. 14.06 s [rustc-stable-2026-04] Phase: buildPhase
  357. 14.06 s [rustc-stable-2026-04] no Makefile or custom buildPhase, doing nothing
  358. 14.06 s [rustc-stable-2026-04] Phase: installPhase
  359. 14.06 s [rustc-stable-2026-04] patching script interpreter paths in install.sh
  360. 14.06 s [rustc-stable-2026-04] install.sh: interpreter directive changed from "#!/usr/bin/env bash" to "/nix/store/v8sa6r6q037ihghxfbwzjj4p59v2x0pv-bash-5.3p9/bin/bash"
  361. 14.06 s [rustc-stable-2026-04] install: creating uninstall script at /nix/store/ml0235aw40x9zqz4lkymns40cy1i6j2m-rustc-stable-2026-04-16/lib/rustlib/uninstall.sh
  362. 14.06 s [rustc-stable-2026-04] install: installing component 'rustc'
  363. 14.06 s [rustc-stable-2026-04]
  364. 14.06 s [rustc-stable-2026-04] rustc installed.
  365. 14.06 s [rustc-stable-2026-04]
  366. 14.06 s [rustc-stable-2026-04] warning: entry 48 in symbol table refers to a non-existent section, skipping
  367. 14.06 s [rustc-stable-2026-04] Phase: fixupPhase
  368. 14.06 s [rustc-stable-2026-04] shrinking RPATHs of ELF executables and libraries in /nix/store/ml0235aw40x9zqz4lkymns40cy1i6j2m-rustc-stable-2026-04-16
  369. 14.06 s [rustc-stable-2026-04] shrinking /nix/store/ml0235aw40x9zqz4lkymns40cy1i6j2m-rustc-stable-2026-04-16/bin/rustdoc
  370. 14.06 s [rustc-stable-2026-04] shrinking /nix/store/ml0235aw40x9zqz4lkymns40cy1i6j2m-rustc-stable-2026-04-16/bin/rustc
  371. 14.06 s [rustc-stable-2026-04] shrinking /nix/store/ml0235aw40x9zqz4lkymns40cy1i6j2m-rustc-stable-2026-04-16/lib/libLLVM.so.22.1-rust-1.95.0-stable
  372. 14.06 s [rustc-stable-2026-04] shrinking /nix/store/ml0235aw40x9zqz4lkymns40cy1i6j2m-rustc-stable-2026-04-16/lib/librustc_driver-6108105cd7e839cf.so
  373. 14.06 s [rustc-stable-2026-04] shrinking /nix/store/ml0235aw40x9zqz4lkymns40cy1i6j2m-rustc-stable-2026-04-16/lib/rustlib/x86_64-unknown-linux-gnu/bin/rust-objcopy
  374. 14.06 s [rustc-stable-2026-04] shrinking /nix/store/ml0235aw40x9zqz4lkymns40cy1i6j2m-rustc-stable-2026-04-16/lib/rustlib/x86_64-unknown-linux-gnu/bin/wasm-component-ld
  375. 14.06 s [rustc-stable-2026-04] shrinking /nix/store/ml0235aw40x9zqz4lkymns40cy1i6j2m-rustc-stable-2026-04-16/lib/rustlib/x86_64-unknown-linux-gnu/bin/gcc-ld/wasm-ld
  376. 14.06 s [rustc-stable-2026-04] shrinking /nix/store/ml0235aw40x9zqz4lkymns40cy1i6j2m-rustc-stable-2026-04-16/lib/rustlib/x86_64-unknown-linux-gnu/bin/gcc-ld/ld64.lld
  377. 14.06 s [rustc-stable-2026-04] shrinking /nix/store/ml0235aw40x9zqz4lkymns40cy1i6j2m-rustc-stable-2026-04-16/lib/rustlib/x86_64-unknown-linux-gnu/bin/gcc-ld/ld.lld
  378. 14.06 s [rustc-stable-2026-04] shrinking /nix/store/ml0235aw40x9zqz4lkymns40cy1i6j2m-rustc-stable-2026-04-16/lib/rustlib/x86_64-unknown-linux-gnu/bin/gcc-ld/lld-link
  379. 14.06 s [rustc-stable-2026-04] shrinking /nix/store/ml0235aw40x9zqz4lkymns40cy1i6j2m-rustc-stable-2026-04-16/lib/rustlib/x86_64-unknown-linux-gnu/bin/rust-lld
  380. 14.06 s [rustc-stable-2026-04] shrinking /nix/store/ml0235aw40x9zqz4lkymns40cy1i6j2m-rustc-stable-2026-04-16/libexec/rust-analyzer-proc-macro-srv
  381. 14.06 s [rustc-stable-2026-04] checking for references to /build/ in /nix/store/ml0235aw40x9zqz4lkymns40cy1i6j2m-rustc-stable-2026-04-16...
  382. 14.06 s [rustc-stable-2026-04] gzipping man pages under /nix/store/ml0235aw40x9zqz4lkymns40cy1i6j2m-rustc-stable-2026-04-16/share/man/
  383. 14.06 s [rustc-stable-2026-04] patching script interpreter paths in /nix/store/ml0235aw40x9zqz4lkymns40cy1i6j2m-rustc-stable-2026-04-16
  384. 14.06 s [rustc-stable-2026-04] /nix/store/ml0235aw40x9zqz4lkymns40cy1i6j2m-rustc-stable-2026-04-16/bin/rust-gdb: interpreter directive changed from "#!/bin/sh" to "/nix/store/v8sa6r6q037ihghxfbwzjj4p59v2x0pv-bash-5.3p9/bin/sh"
  385. 14.06 s [rustc-stable-2026-04] /nix/store/ml0235aw40x9zqz4lkymns40cy1i6j2m-rustc-stable-2026-04-16/bin/rust-lldb: interpreter directive changed from "#!/bin/sh" to "/nix/store/v8sa6r6q037ihghxfbwzjj4p59v2x0pv-bash-5.3p9/bin/sh"
  386. 14.06 s [rustc-stable-2026-04] /nix/store/ml0235aw40x9zqz4lkymns40cy1i6j2m-rustc-stable-2026-04-16/bin/rust-gdbgui: interpreter directive changed from "#!/bin/sh" to "/nix/store/v8sa6r6q037ihghxfbwzjj4p59v2x0pv-bash-5.3p9/bin/sh"
  387. 14.06 s Downloading cached dash from https://cache.nix-ci.com
  388. 14.06 s Downloading cached freetype from https://cache.nix-ci.com
  389. 14.06 s Downloading cached gfortran from https://cache.nix-ci.com
  390. 14.06 s Downloading cached icu4c-76.1-dev from https://cache.nix-ci.com
  391. 14.06 s Downloading cached krb5 from https://cache.nix-ci.com
  392. 14.06 s Downloading cached libidn2-2.3.8-dev from https://cache.nix-ci.com
  393. 14.06 s Downloading cached libjpeg-turbo-3.1.3-bin from https://cache.nix-ci.com
  394. 14.06 s Downloading cached libpng-apng-1.6.55-dev from https://cache.nix-ci.com
  395. 14.06 s Downloading cached libthai from https://cache.nix-ci.com
  396. 14.06 s Downloading cached libwebp from https://cache.nix-ci.com
  397. 14.06 s Downloading cached libyuv from https://cache.nix-ci.com
  398. 14.06 s Downloading cached nghttp2 from https://cache.nix-ci.com
  399. 14.06 s Downloading cached nghttp3-1.14.0-dev from https://cache.nix-ci.com
  400. 14.06 s Downloading cached ngtcp2-1.19.0-dev from https://cache.nix-ci.com
  401. 14.06 s Downloading cached nickel from https://cache.nix-ci.com
  402. 14.06 s Downloading cached nickel-1.16.0-nls from https://cache.nix-ci.com
  403. 14.09 s Downloaded cached libidn2-2.3.8-dev (15 KiB) in 22ms
  404. 14.09 s Downloaded cached libjpeg-turbo-3.1.3-bin (340 KiB) in 31ms
  405. 14.10 s Downloaded cached dash (189 KiB) in 37ms
  406. 14.10 s Downloaded cached ngtcp2-1.19.0-dev (271 KiB) in 38ms
  407. 14.11 s Downloaded cached freetype (2.1 MiB) in 50ms
  408. 14.11 s Downloaded cached krb5 (1.3 MiB) in 51ms
  409. 14.11 s Downloaded cached nghttp2 (2.5 MiB) in 51ms
  410. 14.12 s Downloaded cached nghttp3-1.14.0-dev (118 KiB) in 53ms
  411. 14.12 s Downloaded cached libwebp (1.7 MiB) in 56ms
  412. 14.12 s Downloaded cached libthai (637 KiB) in 59ms
  413. 14.13 s Downloaded cached libyuv (3.9 MiB) in 62ms
  414. 14.14 s Downloaded cached libpng-apng-1.6.55-dev (265 KiB) in 77ms
  415. 14.14 s [cargo-stable-2026-04:post-build] Uploading to the NixCI cache: /nix/store/3wrl5dpd4vcfhqb6112ib5kmm3mqfm8h-cargo-stable-2026-04-16
  416. 14.19 s Downloaded cached icu4c-76.1-dev (5.8 MiB) in 130ms
  417. 14.19 s [cargo-stable-2026-04:post-build] warning: 'warn-short-path-literals' is deprecated, use 'lint-short-path-literals = ignore' instead
  418. 14.20 s [cargo-stable-2026-04:post-build] copying 1 paths...
  419. 14.20 s [cargo-stable-2026-04:post-build] copying path '/nix/store/3wrl5dpd4vcfhqb6112ib5kmm3mqfm8h-cargo-stable-2026-04-16' to 'https://cache.nix-ci.com'...
  420. 14.82 s Downloaded cached nickel (29.9 MiB) in 753ms
  421. 15.05 s Downloaded cached nickel-1.16.0-nls (18.3 MiB) in 990ms
  422. 17.00 s Downloaded cached gfortran (315.5 MiB) in 2.9s
  423. 26.31 s [cargo-stable-2026-04:post-build] warning: 'warn-short-path-literals' is deprecated, use 'lint-short-path-literals = ignore' instead
  424. 26.45 s [cargo-stable-2026-04:post-build] copying 0 paths...
  425. 26.71 s Uploaded cargo-stable-2026-04 in 12.5s
  426. 26.71 s Progress: 3 of 59 built (3 building), 67 of 196 downloaded from cache (16 downloading)
  427. 26.71 s Built cargo-stable-2026-04 in 20.7s
  428. 27.03 s [llvm-tools-preview-stable-2026-04:post-build] Uploading to the NixCI cache: /nix/store/hpnm48pzf77gpk22y6xwwsj1xxa280f8-llvm-tools-preview-stable-2026-04-16
  429. 27.58 s [llvm-tools-preview-stable-2026-04:post-build] warning: 'warn-short-path-literals' is deprecated, use 'lint-short-path-literals = ignore' instead
  430. 27.62 s [llvm-tools-preview-stable-2026-04:post-build] copying 1 paths...
  431. 27.62 s [llvm-tools-preview-stable-2026-04:post-build] copying path '/nix/store/hpnm48pzf77gpk22y6xwwsj1xxa280f8-llvm-tools-preview-stable-2026-04-16' to 'https://cache.nix-ci.com'...
  432. 45.75 s [llvm-tools-preview-stable-2026-04:post-build] warning: 'warn-short-path-literals' is deprecated, use 'lint-short-path-literals = ignore' instead
  433. 45.93 s [llvm-tools-preview-stable-2026-04:post-build] copying 0 paths...
  434. 46.14 s Uploaded llvm-tools-preview-stable-2026-04 in 19.2s
  435. 46.14 s Progress: 4 of 60 built (2 building), 67 of 196 downloaded from cache (16 downloading)
  436. 46.14 s Built llvm-tools-preview-stable-2026-04 in 40.1s
  437. 46.40 s [rust-std-stable-2026-04:post-build] Uploading to the NixCI cache: /nix/store/dbjcar4i1mb1mcm6a3fq9yr37sf7rii8-rust-std-stable-2026-04-16
  438. 46.81 s [rust-std-stable-2026-04:post-build] warning: 'warn-short-path-literals' is deprecated, use 'lint-short-path-literals = ignore' instead
  439. 46.83 s [rust-std-stable-2026-04:post-build] copying 1 paths...
  440. 46.83 s [rust-std-stable-2026-04:post-build] copying path '/nix/store/dbjcar4i1mb1mcm6a3fq9yr37sf7rii8-rust-std-stable-2026-04-16' to 'https://cache.nix-ci.com'...
  441. 79.18 s [rust-std-stable-2026-04:post-build] warning: 'warn-short-path-literals' is deprecated, use 'lint-short-path-literals = ignore' instead
  442. 79.66 s [rust-std-stable-2026-04:post-build] copying 0 paths...
  443. 79.82 s Uploaded rust-std-stable-2026-04 in 33.4s
  444. 79.82 s Progress: 5 of 61 built (1 building), 67 of 196 downloaded from cache (16 downloading)
  445. 79.82 s Built rust-std-stable-2026-04 in 1m13s
  446. 80.40 s [rustc-stable-2026-04:post-build] Uploading to the NixCI cache: /nix/store/ml0235aw40x9zqz4lkymns40cy1i6j2m-rustc-stable-2026-04-16
  447. 80.54 s [rustc-stable-2026-04:post-build] warning: 'warn-short-path-literals' is deprecated, use 'lint-short-path-literals = ignore' instead
  448. 80.57 s [rustc-stable-2026-04:post-build] copying 1 paths...
  449. 80.57 s [rustc-stable-2026-04:post-build] copying path '/nix/store/ml0235aw40x9zqz4lkymns40cy1i6j2m-rustc-stable-2026-04-16' to 'https://cache.nix-ci.com'...
  450. 191.83 s [rustc-stable-2026-04:post-build] warning: 'warn-short-path-literals' is deprecated, use 'lint-short-path-literals = ignore' instead
  451. 192.04 s [rustc-stable-2026-04:post-build] copying 0 paths...
  452. 192.30 s Uploaded rustc-stable-2026-04 in 1m51s
  453. 192.31 s Progress: 6 of 62 built, 67 of 196 downloaded from cache (16 downloading)
  454. 192.31 s Built rustc-stable-2026-04 in 3m06s
  455. 192.41 s Building /nix/store/3xjwbp6zzdm40n100w1impxhc3gjx875-clippy-stable-with-std-2026-04-16.drv
  456. 192.48 s Building /nix/store/rsavhzfm11z2rwj5r7slqd13gzj54q55-rust-stable-with-std-2026-04-16.drv
  457. 192.60 s Building /nix/store/fdcly8l996mcdvzzn5rcndl0x9418ys7-rustfmt-preview-stable-2026-04-16.drv
  458. 192.60 s Progress: 6 of 58 built (3 building), 68 of 196 downloaded from cache (15 downloading)
  459. 192.60 s Progress: 6 of 58 built (3 building), 69 of 196 downloaded from cache (14 downloading)
  460. 192.60 s Progress: 6 of 58 built (3 building), 70 of 196 downloaded from cache (13 downloading)
  461. 192.60 s Progress: 6 of 58 built (3 building), 71 of 196 downloaded from cache (12 downloading)
  462. 192.60 s Progress: 6 of 58 built (3 building), 72 of 196 downloaded from cache (11 downloading)
  463. 192.60 s Progress: 6 of 58 built (3 building), 73 of 196 downloaded from cache (10 downloading)
  464. 192.60 s Progress: 6 of 58 built (3 building), 74 of 196 downloaded from cache (9 downloading)
  465. 192.60 s Progress: 6 of 58 built (3 building), 75 of 196 downloaded from cache (8 downloading)
  466. 192.60 s Progress: 6 of 58 built (3 building), 76 of 196 downloaded from cache (7 downloading)
  467. 192.60 s Progress: 6 of 58 built (3 building), 77 of 196 downloaded from cache (6 downloading)
  468. 192.60 s Progress: 6 of 58 built (3 building), 78 of 196 downloaded from cache (5 downloading)
  469. 192.60 s Progress: 6 of 58 built (3 building), 79 of 196 downloaded from cache (4 downloading)
  470. 192.60 s Progress: 6 of 58 built (3 building), 80 of 196 downloaded from cache (3 downloading)
  471. 192.60 s Progress: 6 of 58 built (3 building), 81 of 196 downloaded from cache (2 downloading)
  472. 192.60 s Progress: 6 of 58 built (3 building), 82 of 196 downloaded from cache (1 downloading)
  473. 192.60 s Progress: 6 of 58 built (3 building), 83 of 196 downloaded from cache
  474. 192.61 s Downloading cached glib from https://cache.nix-ci.com
  475. 192.61 s Downloading cached libaom from https://cache.nix-ci.com
  476. 192.61 s Downloading cached libuv-1.52.0-dev from https://cache.nix-ci.com
  477. 192.61 s Downloading cached libxcb from https://cache.nix-ci.com
  478. 192.61 s Downloading cached nspr from https://cache.nix-ci.com
  479. 192.61 s Downloading cached poppler-data from https://cache.nix-ci.com
  480. 192.61 s Downloading cached python3.13-idna from https://cache.nix-ci.com
  481. 192.61 s Downloading cached python3.13-charset-normalizer from https://cache.nix-ci.com
  482. 192.61 s Downloading cached nghttp2 from https://cache.nix-ci.com
  483. 192.61 s Downloading cached python3.13-filelock from https://cache.nix-ci.com
  484. 192.61 s Downloading cached llhttp-9.3.1-dev from https://cache.nix-ci.com
  485. 192.62 s Downloading cached nss-cacert from https://cache.nix-ci.com
  486. 192.62 s Downloading cached perl from https://cache.nix-ci.com
  487. 192.62 s Downloading cached pixman from https://cache.nix-ci.com
  488. 192.62 s Downloading cached p11-kit from https://cache.nix-ci.com
  489. 192.62 s Downloading cached python3.13-distlib from https://cache.nix-ci.com
  490. 192.68 s Downloaded cached libuv-1.52.0-dev (109 KiB) in 71ms
  491. 192.70 s Downloaded cached python3.13-idna (919 KiB) in 90ms
  492. 192.72 s Downloaded cached nspr (349 KiB) in 109ms
  493. 192.72 s Downloaded cached llhttp-9.3.1-dev (37 KiB) in 110ms
  494. 192.73 s Downloaded cached libxcb (1.4 MiB) in 120ms
  495. 192.73 s Downloaded cached nss-cacert (732 KiB) in 115ms
  496. 192.74 s Downloaded cached python3.13-charset-normalizer (800 KiB) in 123ms
  497. 192.74 s Downloaded cached pixman (858 KiB) in 121ms
  498. 192.75 s Downloaded cached python3.13-distlib (1.3 MiB) in 132ms
  499. 192.78 s Downloaded cached python3.13-filelock (148 KiB) in 166ms
  500. 192.82 s Building /nix/store/v2bggyh4x9dllhrb6anc5xlh707bv74w-nls-1.16.0.drv
  501. 192.82 s Progress: 6 of 55 built (4 building), 84 of 196 downloaded from cache (15 downloading)
  502. 192.82 s Progress: 6 of 55 built (4 building), 85 of 196 downloaded from cache (14 downloading)
  503. 192.82 s Progress: 6 of 55 built (4 building), 86 of 196 downloaded from cache (13 downloading)
  504. 192.82 s Progress: 6 of 55 built (4 building), 87 of 196 downloaded from cache (12 downloading)
  505. 192.82 s Progress: 6 of 55 built (4 building), 88 of 196 downloaded from cache (11 downloading)
  506. 192.82 s Progress: 6 of 55 built (4 building), 89 of 196 downloaded from cache (10 downloading)
  507. 192.82 s Progress: 6 of 55 built (4 building), 90 of 196 downloaded from cache (9 downloading)
  508. 192.82 s Progress: 6 of 55 built (4 building), 91 of 196 downloaded from cache (8 downloading)
  509. 192.82 s Progress: 6 of 55 built (4 building), 92 of 196 downloaded from cache (7 downloading)
  510. 192.82 s Progress: 6 of 55 built (4 building), 93 of 196 downloaded from cache (6 downloading)
  511. 192.86 s Downloaded cached nghttp2 (2.5 MiB) in 244ms
  512. 193.03 s Downloaded cached libaom (8.4 MiB) in 416ms
  513. 193.03 s Downloaded cached p11-kit (5.7 MiB) in 408ms
  514. 193.07 s [clippy-stable-with-std-2026-04:post-build] Uploading to the NixCI cache: /nix/store/db9w6h5vy5q54h5zlf9lgcml4rqr87zx-clippy-stable-with-std-2026-04-16
  515. 193.07 s Downloaded cached glib (15.1 MiB) in 460ms
  516. 193.10 s Downloaded cached poppler-data (12.4 MiB) in 489ms
  517. 193.36 s [clippy-stable-with-std-2026-04:post-build] warning: 'warn-short-path-literals' is deprecated, use 'lint-short-path-literals = ignore' instead
  518. 193.59 s [clippy-stable-with-std-2026-04:post-build] copying 1 paths...
  519. 193.59 s [clippy-stable-with-std-2026-04:post-build] copying path '/nix/store/db9w6h5vy5q54h5zlf9lgcml4rqr87zx-clippy-stable-with-std-2026-04-16' to 'https://cache.nix-ci.com'...
  520. 193.62 s Downloaded cached perl (55 MiB) in 1.0s
  521. 234.99 s [clippy-stable-with-std-2026-04:post-build] warning: 'warn-short-path-literals' is deprecated, use 'lint-short-path-literals = ignore' instead
  522. 237.36 s [clippy-stable-with-std-2026-04:post-build] copying 1 paths...
  523. 237.36 s [clippy-stable-with-std-2026-04:post-build] copying path '/nix/store/3xjwbp6zzdm40n100w1impxhc3gjx875-clippy-stable-with-std-2026-04-16.drv' to 'https://cache.nix-ci.com'...
  524. 241.11 s Uploaded clippy-stable-with-std-2026-04 in 48.0s
  525. 241.13 s Progress: 7 of 56 built (3 building), 93 of 196 downloaded from cache (6 downloading)
  526. 241.13 s Built clippy-stable-with-std-2026-04 in 48.7s
  527. 241.30 s [rust-stable-with-std-2026-04:post-build] Uploading to the NixCI cache: /nix/store/0hvff0g2yddi0054ccrvzf3zypjpdq2g-rust-stable-with-std-2026-04-16
  528. 241.34 s [rust-stable-with-std-2026-04:post-build] warning: 'warn-short-path-literals' is deprecated, use 'lint-short-path-literals = ignore' instead
  529. 241.36 s [rust-stable-with-std-2026-04:post-build] copying 0 paths...
  530. 241.41 s [rust-stable-with-std-2026-04:post-build] warning: 'warn-short-path-literals' is deprecated, use 'lint-short-path-literals = ignore' instead
  531. 241.48 s [rust-stable-with-std-2026-04:post-build] copying 0 paths...
  532. 241.50 s Uploaded rust-stable-with-std-2026-04 in 215ms
  533. 241.50 s Progress: 8 of 57 built (2 building), 93 of 196 downloaded from cache (6 downloading)
  534. 241.50 s Built rust-stable-with-std-2026-04 in 49.0s
  535. 241.50 s [rustfmt-preview-stable-2026-04] Phase: unpackPhase
  536. 241.50 s [rustfmt-preview-stable-2026-04] unpacking source archive /nix/store/1rp58nbb2w3cxikdzg7rsk91535i2xql-rustfmt-1.95.0-x86_64-unknown-linux-gnu.tar.gz
  537. 241.50 s [rustfmt-preview-stable-2026-04] source root is rustfmt-1.95.0-x86_64-unknown-linux-gnu
  538. 241.50 s [rustfmt-preview-stable-2026-04] setting SOURCE_DATE_EPOCH to timestamp 1776196532 of file "rustfmt-1.95.0-x86_64-unknown-linux-gnu/version"
  539. 241.50 s [rustfmt-preview-stable-2026-04] Phase: patchPhase
  540. 241.50 s [rustfmt-preview-stable-2026-04] Phase: updateAutotoolsGnuConfigScriptsPhase
  541. 241.50 s [rustfmt-preview-stable-2026-04] Phase: configurePhase
  542. 241.50 s [rustfmt-preview-stable-2026-04] no configure script, doing nothing
  543. 241.50 s [rustfmt-preview-stable-2026-04] Phase: buildPhase
  544. 241.50 s [rustfmt-preview-stable-2026-04] no Makefile or custom buildPhase, doing nothing
  545. 241.50 s [rustfmt-preview-stable-2026-04] Phase: installPhase
  546. 241.50 s [rustfmt-preview-stable-2026-04] patching script interpreter paths in install.sh
  547. 241.50 s [rustfmt-preview-stable-2026-04] install.sh: interpreter directive changed from "#!/usr/bin/env bash" to "/nix/store/v8sa6r6q037ihghxfbwzjj4p59v2x0pv-bash-5.3p9/bin/bash"
  548. 241.50 s Downloading cached fontconfig-2.17.1-lib from https://cache.nix-ci.com
  549. 241.50 s Downloading cached freetype-2.13.3-dev from https://cache.nix-ci.com
  550. 241.50 s Downloading cached gfortran-wrapper from https://cache.nix-ci.com
  551. 241.50 s Downloading cached krb5-1.22.1-dev from https://cache.nix-ci.com
  552. 241.50 s Downloading cached libjpeg-turbo-3.1.3-dev from https://cache.nix-ci.com
  553. 241.50 s Downloading cached libtiff from https://cache.nix-ci.com
  554. 241.50 s Downloading cached nghttp2-1.67.1-dev from https://cache.nix-ci.com
  555. 241.50 s Downloading cached python3.13-mccabe from https://cache.nix-ci.com
  556. 241.50 s Downloading cached python3.13-packaging from https://cache.nix-ci.com
  557. 241.50 s Downloading cached python3.13-platformdirs from https://cache.nix-ci.com
  558. 241.50 s Progress: 8 of 52 built (2 building), 94 of 196 downloaded from cache (15 downloading)
  559. 241.50 s Progress: 8 of 52 built (2 building), 95 of 196 downloaded from cache (14 downloading)
  560. 241.50 s Progress: 8 of 52 built (2 building), 96 of 196 downloaded from cache (13 downloading)
  561. 241.50 s Progress: 8 of 52 built (2 building), 97 of 196 downloaded from cache (12 downloading)
  562. 241.50 s Progress: 8 of 52 built (2 building), 98 of 196 downloaded from cache (11 downloading)
  563. 241.50 s Progress: 8 of 52 built (2 building), 99 of 196 downloaded from cache (10 downloading)
  564. 241.53 s Downloaded cached libjpeg-turbo-3.1.3-dev (216 KiB) in 28ms
  565. 241.53 s [nls:post-build] Uploading to the NixCI cache: /nix/store/nd5wyzd5mhfpdmn8j451bmrmfhgmip5h-nls-1.16.0
  566. 241.53 s Downloaded cached gfortran-wrapper (74 KiB) in 30ms
  567. 241.53 s Downloaded cached python3.13-mccabe (56 KiB) in 30ms
  568. 241.53 s Downloaded cached fontconfig-2.17.1-lib (414 KiB) in 32ms
  569. 241.53 s Downloaded cached krb5-1.22.1-dev (748 KiB) in 35ms
  570. 241.53 s Downloaded cached freetype-2.13.3-dev (879 KiB) in 35ms
  571. 241.54 s Downloaded cached libtiff (739 KiB) in 36ms
  572. 241.54 s Downloaded cached python3.13-platformdirs (254 KiB) in 44ms
  573. 241.55 s Downloaded cached nghttp2-1.67.1-dev (241 KiB) in 47ms
  574. 241.55 s Downloaded cached python3.13-packaging (698 KiB) in 53ms
  575. 241.57 s [nls:post-build] warning: 'warn-short-path-literals' is deprecated, use 'lint-short-path-literals = ignore' instead
  576. 241.90 s [nls:post-build] copying 0 paths...
  577. 241.95 s [nls:post-build] warning: 'warn-short-path-literals' is deprecated, use 'lint-short-path-literals = ignore' instead
  578. 242.57 s [nls:post-build] copying 5 paths...
  579. 242.57 s [nls:post-build] copying path '/nix/store/faqqgn7irvcwkh08sbxw8ygfafpg9rz6-source.drv' to 'https://cache.nix-ci.com'...
  580. 243.79 s [nls:post-build] copying path '/nix/store/sd1db5qhi8y4xbn2l4pram7v0gssyf9d-nickel-1.16.0-vendor-staging.drv' to 'https://cache.nix-ci.com'...
  581. 245.25 s [nls:post-build] copying path '/nix/store/m0mvd88anflk1fg5ljh78c5rdyx52xq3-nickel-1.16.0-vendor.drv' to 'https://cache.nix-ci.com'...
  582. 246.93 s [nls:post-build] copying path '/nix/store/jhha9mml0rq57y2sffq50rj3ifcbxy50-nickel-1.16.0.drv' to 'https://cache.nix-ci.com'...
  583. 248.67 s [nls:post-build] copying path '/nix/store/v2bggyh4x9dllhrb6anc5xlh707bv74w-nls-1.16.0.drv' to 'https://cache.nix-ci.com'...
  584. 250.28 s Uploaded nls in 8.7s
  585. 250.28 s Progress: 9 of 53 built (1 building), 99 of 196 downloaded from cache (10 downloading)
  586. 250.28 s Built nls in 57.4s
  587. 250.28 s [rustfmt-preview-stable-2026-04] install: creating uninstall script at /nix/store/arnrhrc4q754k7fb16v0f0pf2g138w2i-rustfmt-preview-stable-2026-04-16/lib/rustlib/uninstall.sh
  588. 250.28 s [rustfmt-preview-stable-2026-04] install: installing component 'rustfmt-preview'
  589. 250.28 s [rustfmt-preview-stable-2026-04]
  590. 250.28 s [rustfmt-preview-stable-2026-04] rustfmt installed.
  591. 250.28 s [rustfmt-preview-stable-2026-04]
  592. 250.28 s [rustfmt-preview-stable-2026-04] Phase: fixupPhase
  593. 250.28 s [rustfmt-preview-stable-2026-04] shrinking RPATHs of ELF executables and libraries in /nix/store/arnrhrc4q754k7fb16v0f0pf2g138w2i-rustfmt-preview-stable-2026-04-16
  594. 250.28 s [rustfmt-preview-stable-2026-04] shrinking /nix/store/arnrhrc4q754k7fb16v0f0pf2g138w2i-rustfmt-preview-stable-2026-04-16/bin/cargo-fmt
  595. 250.28 s [rustfmt-preview-stable-2026-04] shrinking /nix/store/arnrhrc4q754k7fb16v0f0pf2g138w2i-rustfmt-preview-stable-2026-04-16/bin/rustfmt
  596. 250.28 s [rustfmt-preview-stable-2026-04] checking for references to /build/ in /nix/store/arnrhrc4q754k7fb16v0f0pf2g138w2i-rustfmt-preview-stable-2026-04-16...
  597. 250.28 s [rustfmt-preview-stable-2026-04] patching script interpreter paths in /nix/store/arnrhrc4q754k7fb16v0f0pf2g138w2i-rustfmt-preview-stable-2026-04-16
  598. 250.28 s Downloading cached libx11 from https://cache.nix-ci.com
  599. 250.28 s Downloading cached libxcb-1.17.0-dev from https://cache.nix-ci.com
  600. 250.29 s Progress: 9 of 51 built (1 building), 100 of 196 downloaded from cache (15 downloading)
  601. 250.29 s Progress: 9 of 51 built (1 building), 101 of 196 downloaded from cache (14 downloading)
  602. 250.29 s Progress: 9 of 51 built (1 building), 102 of 196 downloaded from cache (13 downloading)
  603. 250.29 s Progress: 9 of 51 built (1 building), 103 of 196 downloaded from cache (12 downloading)
  604. 250.29 s Progress: 9 of 51 built (1 building), 104 of 196 downloaded from cache (11 downloading)
  605. 250.29 s Progress: 9 of 51 built (1 building), 105 of 196 downloaded from cache (10 downloading)
  606. 250.29 s Progress: 9 of 51 built (1 building), 106 of 196 downloaded from cache (9 downloading)
  607. 250.29 s Progress: 9 of 51 built (1 building), 107 of 196 downloaded from cache (8 downloading)
  608. 250.29 s Downloading cached python3.13-pyflakes from https://cache.nix-ci.com
  609. 250.29 s Progress: 9 of 51 built (1 building), 108 of 196 downloaded from cache (7 downloading)
  610. 250.29 s Progress: 9 of 51 built (1 building), 109 of 196 downloaded from cache (6 downloading)
  611. 250.29 s Downloading cached python3.13-certifi from https://cache.nix-ci.com
  612. 250.29 s Downloading cached nspr-4.38.2-dev from https://cache.nix-ci.com
  613. 250.29 s Downloading cached python3.13-pycodestyle from https://cache.nix-ci.com
  614. 250.36 s Downloaded cached python3.13-pycodestyle (324 KiB) in 70ms
  615. 250.37 s Downloaded cached python3.13-certifi (529 KiB) in 82ms
  616. 250.37 s [rustfmt-preview-stable-2026-04:post-build] Uploading to the NixCI cache: /nix/store/arnrhrc4q754k7fb16v0f0pf2g138w2i-rustfmt-preview-stable-2026-04-16
  617. 250.37 s Downloaded cached nspr-4.38.2-dev (576 KiB) in 84ms
  618. 250.37 s Downloaded cached python3.13-pyflakes (1.1 MiB) in 88ms
  619. 250.38 s Downloaded cached libxcb-1.17.0-dev (2.1 MiB) in 90ms
  620. 250.40 s Downloaded cached libx11 (2.6 MiB) in 115ms
  621. 250.79 s [rustfmt-preview-stable-2026-04:post-build] warning: 'warn-short-path-literals' is deprecated, use 'lint-short-path-literals = ignore' instead
  622. 250.85 s [rustfmt-preview-stable-2026-04:post-build] copying 1 paths...
  623. 250.85 s [rustfmt-preview-stable-2026-04:post-build] copying path '/nix/store/arnrhrc4q754k7fb16v0f0pf2g138w2i-rustfmt-preview-stable-2026-04-16' to 'https://cache.nix-ci.com'...
  624. 254.98 s [rustfmt-preview-stable-2026-04:post-build] warning: 'warn-short-path-literals' is deprecated, use 'lint-short-path-literals = ignore' instead
  625. 255.24 s [rustfmt-preview-stable-2026-04:post-build] copying 1 paths...
  626. 255.24 s [rustfmt-preview-stable-2026-04:post-build] copying path '/nix/store/fdcly8l996mcdvzzn5rcndl0x9418ys7-rustfmt-preview-stable-2026-04-16.drv' to 'https://cache.nix-ci.com'...
  627. 255.68 s Uploaded rustfmt-preview-stable-2026-04 in 5.3s
  628. 255.68 s Progress: 10 of 52 built, 109 of 196 downloaded from cache (6 downloading)
  629. 255.68 s Built rustfmt-preview-stable-2026-04 in 1m03s
  630. 255.68 s Downloading cached babeltrace from https://cache.nix-ci.com
  631. 255.68 s Downloading cached gts from https://cache.nix-ci.com
  632. 255.68 s Downloading cached python3.13-pysocks from https://cache.nix-ci.com
  633. 255.68 s Downloading cached python3.13-tomli-w from https://cache.nix-ci.com
  634. 255.68 s Downloading cached glib-2.86.3-bin from https://cache.nix-ci.com
  635. 255.68 s Downloading cached nss from https://cache.nix-ci.com
  636. 255.68 s Downloading cached harfbuzz from https://cache.nix-ci.com
  637. 255.69 s Downloading cached python3.13-tomli from https://cache.nix-ci.com
  638. 255.69 s Downloading cached python3.13-urllib3 from https://cache.nix-ci.com
  639. 255.69 s Downloading cached nghttp2-1.67.1-dev from https://cache.nix-ci.com
  640. 255.75 s Downloaded cached python3.13-pysocks (134 KiB) in 72ms
  641. 255.76 s Downloaded cached gts (440 KiB) in 77ms
  642. 255.79 s Building /nix/store/7ra9z7n7f0mhpwdawfybbl2z1kmmxsb6-rust-stable-with-components-2026-04-16.drv
  643. 255.79 s Progress: 10 of 50 built (1 building), 110 of 196 downloaded from cache (15 downloading)
  644. 255.79 s Progress: 10 of 50 built (1 building), 111 of 196 downloaded from cache (14 downloading)
  645. 255.79 s Progress: 10 of 50 built (1 building), 112 of 196 downloaded from cache (13 downloading)
  646. 255.79 s Progress: 10 of 50 built (1 building), 113 of 196 downloaded from cache (12 downloading)
  647. 255.79 s Progress: 10 of 50 built (1 building), 114 of 196 downloaded from cache (11 downloading)
  648. 255.79 s Progress: 10 of 50 built (1 building), 115 of 196 downloaded from cache (10 downloading)
  649. 255.79 s Progress: 10 of 50 built (1 building), 116 of 196 downloaded from cache (9 downloading)
  650. 255.79 s Progress: 10 of 50 built (1 building), 117 of 196 downloaded from cache (8 downloading)
  651. 255.79 s Downloading cached curl-8.18.0-dev from https://cache.nix-ci.com
  652. 255.79 s Downloading cached fontconfig-2.17.1-bin from https://cache.nix-ci.com
  653. 255.79 s Downloading cached libwebp from https://cache.nix-ci.com
  654. 255.79 s Downloading cached libtiff-4.7.1-bin from https://cache.nix-ci.com
  655. 255.79 s Downloading cached lcms2-2.18-bin from https://cache.nix-ci.com
  656. 255.79 s Downloading cached gdk-pixbuf from https://cache.nix-ci.com
  657. 255.79 s Downloading cached openjpeg from https://cache.nix-ci.com
  658. 255.79 s Downloading cached python3.13-virtualenv from https://cache.nix-ci.com
  659. 255.85 s [rust-stable-with-components-2026-04] /nix/store/0hvff0g2yddi0054ccrvzf3zypjpdq2g-rust-stable-with-std-2026-04-16/bin:
  660. 255.85 s [rust-stable-with-components-2026-04] rustdoc: Keeping existing link to /nix/store/db9w6h5vy5q54h5zlf9lgcml4rqr87zx-clippy-stable-with-std-2026-04-16/bin/rustdoc
  661. 255.85 s [rust-stable-with-components-2026-04] rustc: Keeping existing link to /nix/store/db9w6h5vy5q54h5zlf9lgcml4rqr87zx-clippy-stable-with-std-2026-04-16/bin/rustc
  662. 255.85 s [rust-stable-with-components-2026-04] rust-gdb: Keeping existing link to /nix/store/db9w6h5vy5q54h5zlf9lgcml4rqr87zx-clippy-stable-with-std-2026-04-16/bin/rust-gdb
  663. 255.85 s [rust-stable-with-components-2026-04] rust-lldb: Keeping existing link to /nix/store/db9w6h5vy5q54h5zlf9lgcml4rqr87zx-clippy-stable-with-std-2026-04-16/bin/rust-lldb
  664. 255.85 s [rust-stable-with-components-2026-04] rust-gdbgui: Keeping existing link to /nix/store/db9w6h5vy5q54h5zlf9lgcml4rqr87zx-clippy-stable-with-std-2026-04-16/bin/rust-gdbgui
  665. 255.85 s [rust-stable-with-components-2026-04] /nix/store/0hvff0g2yddi0054ccrvzf3zypjpdq2g-rust-stable-with-std-2026-04-16/lib:
  666. 255.85 s [rust-stable-with-components-2026-04] librustc_driver-6108105cd7e839cf.so: Keeping existing link to /nix/store/db9w6h5vy5q54h5zlf9lgcml4rqr87zx-clippy-stable-with-std-2026-04-16/lib/librustc_driver-6108105cd7e839cf.so
  667. 256.23 s Downloaded cached nghttp2-1.67.1-dev (241 KiB) in 546ms
  668. 256.24 s Downloaded cached python3.13-tomli-w (39 KiB) in 563ms
  669. 256.25 s Downloaded cached glib-2.86.3-bin (582 KiB) in 569ms
  670. 256.26 s Downloaded cached python3.13-tomli (114 KiB) in 571ms
  671. 256.26 s Downloaded cached babeltrace (885 KiB) in 578ms
  672. 256.26 s Downloaded cached lcms2-2.18-bin (205 KiB) in 467ms
  673. 256.26 s Downloaded cached curl-8.18.0-dev (274 KiB) in 472ms
  674. 256.26 s Downloaded cached fontconfig-2.17.1-bin (201 KiB) in 472ms
  675. 256.26 s Downloaded cached libtiff-4.7.1-bin (734 KiB) in 474ms
  676. 256.29 s Downloaded cached python3.13-urllib3 (1.3 MiB) in 598ms
  677. 256.30 s Downloaded cached openjpeg (1.6 MiB) in 509ms
  678. 256.31 s Downloaded cached libwebp (1.7 MiB) in 521ms
  679. 256.34 s Downloaded cached gdk-pixbuf (2.8 MiB) in 547ms
  680. 256.35 s Downloaded cached harfbuzz (3.6 MiB) in 668ms
  681. 256.44 s Downloaded cached nss (4 MiB) in 751ms
  682. 256.45 s Downloaded cached python3.13-virtualenv (7 MiB) in 654ms
  683. 256.61 s [rust-stable-with-components-2026-04:post-build] Uploading to the NixCI cache: /nix/store/qqq8y0xm1n3y9wy8a7hb05clyr9dbcb9-rust-stable-with-components-2026-04-16
  684. 257.03 s [rust-stable-with-components-2026-04:post-build] warning: 'warn-short-path-literals' is deprecated, use 'lint-short-path-literals = ignore' instead
  685. 257.44 s [rust-stable-with-components-2026-04:post-build] copying 1 paths...
  686. 257.44 s [rust-stable-with-components-2026-04:post-build] copying path '/nix/store/qqq8y0xm1n3y9wy8a7hb05clyr9dbcb9-rust-stable-with-components-2026-04-16' to 'https://cache.nix-ci.com'...
  687. 280.05 s [rust-stable-with-components-2026-04:post-build] warning: 'warn-short-path-literals' is deprecated, use 'lint-short-path-literals = ignore' instead
  688. 280.30 s [rust-stable-with-components-2026-04:post-build] copying 1 paths...
  689. 280.30 s [rust-stable-with-components-2026-04:post-build] copying path '/nix/store/7ra9z7n7f0mhpwdawfybbl2z1kmmxsb6-rust-stable-with-components-2026-04-16.drv' to 'https://cache.nix-ci.com'...
  690. 280.60 s Uploaded rust-stable-with-components-2026-04 in 24.1s
  691. 280.60 s Progress: 11 of 49 built, 117 of 196 downloaded from cache (16 downloading)
  692. 280.60 s Built rust-stable-with-components-2026-04 in 24.8s
  693. 280.60 s Progress: 11 of 48 built, 118 of 196 downloaded from cache (15 downloading)
  694. 280.60 s Progress: 11 of 48 built, 119 of 196 downloaded from cache (14 downloading)
  695. 280.60 s Progress: 11 of 48 built, 120 of 196 downloaded from cache (13 downloading)
  696. 280.60 s Progress: 11 of 48 built, 121 of 196 downloaded from cache (12 downloading)
  697. 280.60 s Progress: 11 of 48 built, 122 of 196 downloaded from cache (11 downloading)
  698. 280.60 s Progress: 11 of 48 built, 123 of 196 downloaded from cache (10 downloading)
  699. 280.60 s Progress: 11 of 48 built, 124 of 196 downloaded from cache (9 downloading)
  700. 280.60 s Progress: 11 of 48 built, 125 of 196 downloaded from cache (8 downloading)
  701. 280.60 s Progress: 11 of 48 built, 126 of 196 downloaded from cache (7 downloading)
  702. 280.60 s Progress: 11 of 48 built, 127 of 196 downloaded from cache (6 downloading)
  703. 280.60 s Progress: 11 of 48 built, 128 of 196 downloaded from cache (5 downloading)
  704. 280.60 s Progress: 11 of 48 built, 129 of 196 downloaded from cache (4 downloading)
  705. 280.60 s Progress: 11 of 48 built, 130 of 196 downloaded from cache (3 downloading)
  706. 280.60 s Progress: 11 of 48 built, 131 of 196 downloaded from cache (2 downloading)
  707. 280.60 s Progress: 11 of 48 built, 132 of 196 downloaded from cache (1 downloading)
  708. 280.60 s Progress: 11 of 48 built, 133 of 196 downloaded from cache
  709. 280.60 s Downloading cached libxext from https://cache.nix-ci.com
  710. 280.60 s Downloading cached libxpm from https://cache.nix-ci.com
  711. 280.60 s Downloading cached libxrender from https://cache.nix-ci.com
  712. 280.60 s Downloading cached python3.13-flake8 from https://cache.nix-ci.com
  713. 280.60 s Downloading cached rust-analyzer-unwrapped-2026-04 from https://cache.nix-ci.com
  714. 280.60 s Downloading cached rust-script from https://cache.nix-ci.com
  715. 280.60 s Downloading cached simdjson from https://cache.nix-ci.com
  716. 280.60 s Downloading cached simdutf from https://cache.nix-ci.com
  717. 280.60 s Downloading cached simdutf from https://cache.nix-ci.com
  718. 280.60 s Downloading cached slang from https://cache.nix-ci.com
  719. 280.60 s Downloading cached sqlite-3.51.2-bin from https://cache.nix-ci.com
  720. 280.60 s Downloading cached tdf from https://cache.nix-ci.com
  721. 280.60 s Downloading cached tinymist from https://cache.nix-ci.com
  722. 280.60 s Downloading cached typst from https://cache.nix-ci.com
  723. 280.60 s Downloading cached typstyle from https://cache.nix-ci.com
  724. 280.60 s Downloading cached unzip from https://cache.nix-ci.com
  725. 280.64 s Building /nix/store/yk80nm71i5w6mwbs9ns7xiqx6b2l7gpm-python3-3.13.12-env.drv
  726. 280.71 s [python3-3.13.12-env] created 219 symlinks in user environment
  727. 280.81 s Downloaded cached libxrender (53 KiB) in 209ms
  728. 280.81 s Progress: 11 of 44 built (1 building), 134 of 196 downloaded from cache (15 downloading)
  729. 280.81 s Downloading cached fontconfig-2.17.1-dev from https://cache.nix-ci.com
  730. 280.81 s Downloaded cached libxext (93 KiB) in 210ms
  731. 280.81 s Progress: 11 of 44 built (1 building), 135 of 196 downloaded from cache (15 downloading)
  732. 280.81 s Downloaded cached libxpm (87 KiB) in 210ms
  733. 280.81 s Downloading cached glib-2.86.3-dev from https://cache.nix-ci.com
  734. 280.81 s Progress: 11 of 44 built (1 building), 136 of 196 downloaded from cache (15 downloading)
  735. 280.81 s Downloading cached cairo from https://cache.nix-ci.com
  736. 280.82 s Downloaded cached python3.13-flake8 (584 KiB) in 220ms
  737. 280.82 s Progress: 11 of 44 built (1 building), 137 of 196 downloaded from cache (15 downloading)
  738. 280.82 s Downloading cached lcms2-2.18-dev from https://cache.nix-ci.com
  739. 280.83 s Downloaded cached simdutf (977 KiB) in 224ms
  740. 280.83 s Downloaded cached unzip (522 KiB) in 225ms
  741. 280.83 s Downloaded cached fontconfig-2.17.1-dev (41 KiB) in 18ms
  742. 280.84 s Downloaded cached simdjson (7.5 MiB) in 235ms
  743. 280.86 s Building /nix/store/19zchzyn7wdgg4qzv3kyviinysn1bfv5-pythoncheck.sh.drv
  744. 280.89 s Downloaded cached simdutf (1.3 MiB) in 282ms
  745. 280.90 s Downloaded cached sqlite-3.51.2-bin (2.1 MiB) in 293ms
  746. 280.90 s Building /nix/store/j85bbhxgp0p728kjmx83l4p8xkkkww3d-pythoncheck.sh.drv
  747. 280.90 s Progress: 11 of 43 built (3 building), 138 of 196 downloaded from cache (15 downloading)
  748. 280.90 s Progress: 11 of 43 built (3 building), 139 of 196 downloaded from cache (14 downloading)
  749. 280.90 s Progress: 11 of 43 built (3 building), 140 of 196 downloaded from cache (13 downloading)
  750. 280.90 s Progress: 11 of 43 built (3 building), 141 of 196 downloaded from cache (12 downloading)
  751. 280.90 s Progress: 11 of 43 built (3 building), 142 of 196 downloaded from cache (11 downloading)
  752. 280.90 s Progress: 11 of 43 built (3 building), 143 of 196 downloaded from cache (10 downloading)
  753. 280.90 s Downloading cached libavif from https://cache.nix-ci.com
  754. 280.90 s Downloading cached libglvnd from https://cache.nix-ci.com
  755. 280.90 s Downloading cached libtiff-4.7.1-dev from https://cache.nix-ci.com
  756. 280.90 s Downloading cached libxft from https://cache.nix-ci.com
  757. 280.90 s Downloading cached libxrandr from https://cache.nix-ci.com
  758. 280.90 s Downloading cached libxi from https://cache.nix-ci.com
  759. 280.91 s Downloaded cached cairo (2.1 MiB) in 98ms
  760. 280.95 s Building /nix/store/bmm67vlw4cskrzndim01vlg7mnzv45qx-clinnet-0.1.8.tar.gz.drv
  761. 280.95 s Progress: 11 of 42 built (4 building), 144 of 196 downloaded from cache (15 downloading)
  762. 280.98 s Downloaded cached typstyle (2.2 MiB) in 374ms
  763. 280.98 s Downloaded cached slang (2.7 MiB) in 378ms
  764. 280.98 s [pythoncheck.sh:post-build] Uploading to the NixCI cache: /nix/store/dnvwgdyw359bs0915q7rvz1m2pfwpl4i-pythoncheck.sh
  765. 281.01 s Downloaded cached glib-2.86.3-dev (15 MiB) in 193ms
  766. 281.04 s [pythoncheck.sh:post-build] warning: 'warn-short-path-literals' is deprecated, use 'lint-short-path-literals = ignore' instead
  767. 281.05 s Downloaded cached rust-script (3.3 MiB) in 448ms
  768. 281.06 s Downloaded cached lcms2-2.18-dev (137 KiB) in 238ms
  769. 281.07 s Downloaded cached libxi (87 KiB) in 169ms
  770. 281.07 s Downloaded cached libtiff-4.7.1-dev (106 KiB) in 170ms
  771. 281.07 s Downloaded cached libxrandr (62 KiB) in 170ms
  772. 281.08 s Downloaded cached libxft (151 KiB) in 173ms
  773. 281.08 s Downloaded cached libavif (1011 KiB) in 175ms
  774. 281.08 s Downloaded cached libglvnd (2.5 MiB) in 183ms
  775. 281.39 s [pythoncheck.sh:post-build] copying 0 paths...
  776. 281.45 s [pythoncheck.sh:post-build] warning: 'warn-short-path-literals' is deprecated, use 'lint-short-path-literals = ignore' instead
  777. 281.50 s Downloaded cached tdf (13.4 MiB) in 894ms
  778. 281.52 s [pythoncheck.sh:post-build] copying 0 paths...
  779. 281.54 s Uploaded pythoncheck.sh in 575ms
  780. 281.54 s Progress: 12 of 43 built (3 building), 144 of 196 downloaded from cache (15 downloading)
  781. 281.54 s Built pythoncheck.sh in 675ms
  782. 281.54 s Downloading cached ada from https://cache.nix-ci.com
  783. 281.58 s Building /nix/store/32b99pzvd3ql22i43zdrhij0m6sf2y7j-pythoncheck.sh.drv
  784. 281.58 s Progress: 12 of 42 built (4 building), 145 of 196 downloaded from cache (15 downloading)
  785. 281.58 s Progress: 12 of 42 built (4 building), 146 of 196 downloaded from cache (14 downloading)
  786. 281.58 s Progress: 12 of 42 built (4 building), 147 of 196 downloaded from cache (13 downloading)
  787. 281.58 s Progress: 12 of 42 built (4 building), 148 of 196 downloaded from cache (12 downloading)
  788. 281.58 s Progress: 12 of 42 built (4 building), 149 of 196 downloaded from cache (11 downloading)
  789. 281.58 s Progress: 12 of 42 built (4 building), 150 of 196 downloaded from cache (10 downloading)
  790. 281.58 s Progress: 12 of 42 built (4 building), 151 of 196 downloaded from cache (9 downloading)
  791. 281.58 s Progress: 12 of 42 built (4 building), 152 of 196 downloaded from cache (8 downloading)
  792. 281.58 s Progress: 12 of 42 built (4 building), 153 of 196 downloaded from cache (7 downloading)
  793. 281.58 s Progress: 12 of 42 built (4 building), 154 of 196 downloaded from cache (6 downloading)
  794. 281.58 s Progress: 12 of 42 built (4 building), 155 of 196 downloaded from cache (5 downloading)
  795. 281.58 s Progress: 12 of 42 built (4 building), 156 of 196 downloaded from cache (4 downloading)
  796. 281.58 s [clinnet] structuredAttrs is enabled
  797. 281.58 s [clinnet]
  798. 281.58 s [clinnet] trying https://crates.io/api/v1/crates/clinnet/0.1.8/download
  799. 281.58 s [clinnet] % Total % Received % Xferd Average Speed Time Time Time Current
  800. 281.58 s [clinnet] Dload Upload Total Spent Left Speed
  801. 281.58 s [clinnet] 0 0 0 0 0 0 0 0 0
  802. 281.58 s [clinnet] 100 220.2k 100 220.2k 0 0 925.7k 0 0
  803. 281.58 s [clinnet] unpacking source archive /build/download.tar.gz
  804. 281.63 s [python3-3.13.12-env:post-build] Uploading to the NixCI cache: /nix/store/bs39qcqk1wkfsclss94xcc8zv0iqjszi-python3-3.13.12-env
  805. 281.69 s [python3-3.13.12-env:post-build] warning: 'warn-short-path-literals' is deprecated, use 'lint-short-path-literals = ignore' instead
  806. 281.75 s Downloaded cached ada (1.3 MiB) in 210ms
  807. 281.94 s Downloaded cached rust-analyzer-unwrapped-2026-04 (48.6 MiB) in 1.3s
  808. 282.04 s [python3-3.13.12-env:post-build] copying 0 paths...
  809. 282.20 s Downloaded cached typst (42.4 MiB) in 1.5s
  810. 282.81 s [python3-3.13.12-env:post-build] warning: 'warn-short-path-literals' is deprecated, use 'lint-short-path-literals = ignore' instead
  811. 282.95 s [python3-3.13.12-env:post-build] copying 0 paths...
  812. 283.09 s Uploaded python3-3.13.12-env in 1.4s
  813. 283.09 s Progress: 13 of 43 built (3 building), 156 of 196 downloaded from cache (4 downloading)
  814. 283.09 s Built python3-3.13.12-env in 2.4s
  815. 283.22 s [pythoncheck.sh:post-build] Uploading to the NixCI cache: /nix/store/q10f0fqrld4bvqnlq5l2dblplvi9d8pg-pythoncheck.sh
  816. 283.87 s [pythoncheck.sh:post-build] warning: 'warn-short-path-literals' is deprecated, use 'lint-short-path-literals = ignore' instead
  817. 284.36 s [pythoncheck.sh:post-build] copying 0 paths...
  818. 285.12 s [pythoncheck.sh:post-build] warning: 'warn-short-path-literals' is deprecated, use 'lint-short-path-literals = ignore' instead
  819. 285.27 s [pythoncheck.sh:post-build] copying 0 paths...
  820. 285.55 s Uploaded pythoncheck.sh in 2.4s
  821. 285.55 s Progress: 14 of 44 built (2 building), 156 of 196 downloaded from cache (4 downloading)
  822. 285.55 s Built pythoncheck.sh in 4.6s
  823. 285.55 s Downloading cached openjpeg-2.5.4-dev from https://cache.nix-ci.com
  824. 285.55 s Downloading cached zlib-ng from https://cache.nix-ci.com
  825. 285.55 s Downloading cached uvwasi from https://cache.nix-ci.com
  826. 285.55 s Downloading cached mupdf from https://cache.nix-ci.com
  827. 285.55 s Downloading cached gd from https://cache.nix-ci.com
  828. 285.55 s Downloading cached xorgproto from https://cache.nix-ci.com
  829. 285.55 s Downloading cached sqlite-3.51.2-dev from https://cache.nix-ci.com
  830. 285.55 s Downloading cached poppler-utils from https://cache.nix-ci.com
  831. 285.55 s Downloading cached uv from https://cache.nix-ci.com
  832. 285.55 s Downloading cached libxxf86vm from https://cache.nix-ci.com
  833. 285.55 s Downloading cached nss-3.112.3-dev from https://cache.nix-ci.com
  834. 285.55 s Downloading cached python3.13-requests from https://cache.nix-ci.com
  835. 285.63 s Downloaded cached libxxf86vm (40 KiB) in 77ms
  836. 285.63 s Downloaded cached zlib-ng (192 KiB) in 85ms
  837. 285.64 s Downloaded cached gd (545 KiB) in 89ms
  838. 285.64 s Downloaded cached openjpeg-2.5.4-dev (79 KiB) in 92ms
  839. 285.67 s Building /nix/store/vima4rg4yl2aqm1bbfzwpj71ivg612pw-pythoncheck.sh.drv
  840. 285.67 s Progress: 14 of 39 built (3 building), 157 of 196 downloaded from cache (15 downloading)
  841. 285.67 s Progress: 14 of 39 built (3 building), 158 of 196 downloaded from cache (14 downloading)
  842. 285.67 s Progress: 14 of 39 built (3 building), 159 of 196 downloaded from cache (13 downloading)
  843. 285.67 s Progress: 14 of 39 built (3 building), 160 of 196 downloaded from cache (12 downloading)
  844. 285.67 s Progress: 14 of 39 built (3 building), 161 of 196 downloaded from cache (11 downloading)
  845. 285.67 s Progress: 14 of 39 built (3 building), 162 of 196 downloaded from cache (10 downloading)
  846. 285.67 s Progress: 14 of 39 built (3 building), 163 of 196 downloaded from cache (9 downloading)
  847. 285.71 s Downloaded cached nss-3.112.3-dev (1.4 MiB) in 162ms
  848. 285.72 s Downloaded cached xorgproto (1.6 MiB) in 164ms
  849. 285.74 s [clinnet:post-build] Uploading to the NixCI cache: /nix/store/2i132kj3rylcpf3q5yy61794w9j2mg0v-clinnet-0.1.8.tar.gz
  850. 285.90 s Downloaded cached uvwasi (238 KiB) in 352ms
  851. 285.90 s Downloaded cached sqlite-3.51.2-dev (695 KiB) in 352ms
  852. 285.91 s Downloaded cached python3.13-requests (623 KiB) in 361ms
  853. 286.09 s Downloaded cached poppler-utils (6.3 MiB) in 542ms
  854. 286.28 s [clinnet:post-build] warning: 'warn-short-path-literals' is deprecated, use 'lint-short-path-literals = ignore' instead
  855. 286.33 s [clinnet:post-build] copying 1 paths...
  856. 286.33 s [clinnet:post-build] copying path '/nix/store/2i132kj3rylcpf3q5yy61794w9j2mg0v-clinnet-0.1.8.tar.gz' to 'https://cache.nix-ci.com'...
  857. 286.86 s Downloaded cached tinymist (170.2 MiB) in 6.2s
  858. 287.35 s [clinnet:post-build] warning: 'warn-short-path-literals' is deprecated, use 'lint-short-path-literals = ignore' instead
  859. 287.37 s Downloaded cached mupdf (51.4 MiB) in 1.8s
  860. 287.40 s Downloaded cached uv (64.6 MiB) in 1.8s
  861. 287.80 s [clinnet:post-build] copying 1 paths...
  862. 287.80 s [clinnet:post-build] copying path '/nix/store/bmm67vlw4cskrzndim01vlg7mnzv45qx-clinnet-0.1.8.tar.gz.drv' to 'https://cache.nix-ci.com'...
  863. 288.45 s Uploaded clinnet in 2.7s
  864. 288.45 s Progress: 15 of 40 built (2 building), 163 of 196 downloaded from cache (9 downloading)
  865. 288.45 s Built clinnet in 7.5s
  866. 288.57 s [pythoncheck.sh:post-build] Uploading to the NixCI cache: /nix/store/mghfpkj4kp134ivyfmqi8px0cvzv6i4v-pythoncheck.sh
  867. 288.85 s [pythoncheck.sh:post-build] warning: 'warn-short-path-literals' is deprecated, use 'lint-short-path-literals = ignore' instead
  868. 289.10 s [pythoncheck.sh:post-build] copying 0 paths...
  869. 289.83 s [pythoncheck.sh:post-build] warning: 'warn-short-path-literals' is deprecated, use 'lint-short-path-literals = ignore' instead
  870. 290.03 s [pythoncheck.sh:post-build] copying 0 paths...
  871. 290.29 s Uploaded pythoncheck.sh in 1.8s
  872. 290.31 s Progress: 16 of 41 built (1 building), 163 of 196 downloaded from cache (9 downloading)
  873. 290.31 s Built pythoncheck.sh in 8.7s
  874. 290.31 s Downloading cached perf-linux from https://cache.nix-ci.com
  875. 290.31 s Downloading cached rust-analyzer-2026-04 from https://cache.nix-ci.com
  876. 290.31 s Downloading cached pango from https://cache.nix-ci.com
  877. 290.31 s Progress: 16 of 38 built (1 building), 164 of 196 downloaded from cache (13 downloading)
  878. 290.31 s Progress: 16 of 38 built (1 building), 165 of 196 downloaded from cache (12 downloading)
  879. 290.31 s Progress: 16 of 38 built (1 building), 166 of 196 downloaded from cache (11 downloading)
  880. 290.31 s Progress: 16 of 38 built (1 building), 167 of 196 downloaded from cache (10 downloading)
  881. 290.31 s Progress: 16 of 38 built (1 building), 168 of 196 downloaded from cache (9 downloading)
  882. 290.31 s Progress: 16 of 38 built (1 building), 169 of 196 downloaded from cache (8 downloading)
  883. 290.31 s Progress: 16 of 38 built (1 building), 170 of 196 downloaded from cache (7 downloading)
  884. 290.31 s Progress: 16 of 38 built (1 building), 171 of 196 downloaded from cache (6 downloading)
  885. 290.31 s Progress: 16 of 38 built (1 building), 172 of 196 downloaded from cache (5 downloading)
  886. 290.31 s Downloading cached git-minimal from https://cache.nix-ci.com
  887. 290.31 s Downloading cached freeglut-mupdf-3.0.0-r13ae6aa2c2f9a7b4266fc2e6116c876237f40477 from https://cache.nix-ci.com
  888. 290.45 s [pythoncheck.sh:post-build] Uploading to the NixCI cache: /nix/store/v0z6h8wypyfgp1c9nrdn3kj1mrggcld0-pythoncheck.sh
  889. 290.62 s Downloaded cached pango (907 KiB) in 308ms
  890. 290.62 s Downloaded cached freeglut-mupdf-3.0.0-r13ae6aa2c2f9a7b4266fc2e6116c876237f40477 (1.1 MiB) in 308ms
  891. 290.75 s Downloaded cached rust-analyzer-2026-04 (768 B) in 439ms
  892. 290.76 s Downloaded cached perf-linux (11.8 MiB) in 456ms
  893. 290.84 s [pythoncheck.sh:post-build] warning: 'warn-short-path-literals' is deprecated, use 'lint-short-path-literals = ignore' instead
  894. 291.06 s [pythoncheck.sh:post-build] copying 0 paths...
  895. 291.07 s Downloaded cached git-minimal (51.5 MiB) in 758ms
  896. 291.84 s [pythoncheck.sh:post-build] warning: 'warn-short-path-literals' is deprecated, use 'lint-short-path-literals = ignore' instead
  897. 291.95 s [pythoncheck.sh:post-build] copying 0 paths...
  898. 292.17 s Uploaded pythoncheck.sh in 1.8s
  899. 292.17 s Progress: 17 of 39 built, 172 of 196 downloaded from cache (5 downloading)
  900. 292.17 s Built pythoncheck.sh in 6.5s
  901. 292.17 s Downloading cached libx11-1.8.13-dev from https://cache.nix-ci.com
  902. 292.18 s Downloading cached libxau-1.0.12-dev from https://cache.nix-ci.com
  903. 292.18 s Downloading cached nodejs-slim from https://cache.nix-ci.com
  904. 292.25 s Building /nix/store/0kbyqb7gpywcm8rbdni3iydmr057wqyb-python3-3.13.12-env.drv
  905. 292.28 s Downloaded cached libxau-1.0.12-dev (7000 B) in 104ms
  906. 292.28 s Downloaded cached libx11-1.8.13-dev (250 KiB) in 109ms
  907. 292.31 s Building /nix/store/8cxsihcvxack3k922snf9g88lql7plba-replace-workspace-values.drv
  908. 292.31 s Progress: 17 of 35 built (2 building), 173 of 196 downloaded from cache (7 downloading)
  909. 292.31 s Progress: 17 of 35 built (2 building), 174 of 196 downloaded from cache (6 downloading)
  910. 292.31 s Progress: 17 of 35 built (2 building), 175 of 196 downloaded from cache (5 downloading)
  911. 292.31 s Progress: 17 of 35 built (2 building), 176 of 196 downloaded from cache (4 downloading)
  912. 292.31 s Progress: 17 of 35 built (2 building), 177 of 196 downloaded from cache (3 downloading)
  913. 292.31 s Progress: 17 of 35 built (2 building), 178 of 196 downloaded from cache (2 downloading)
  914. 292.31 s Progress: 17 of 35 built (2 building), 179 of 196 downloaded from cache (1 downloading)
  915. 292.31 s Downloading cached nix-prefetch-git from https://cache.nix-ci.com
  916. 292.31 s Downloading cached mupdf-1.27.2-bin from https://cache.nix-ci.com
  917. 292.32 s Downloading cached libxrender-0.9.12-dev from https://cache.nix-ci.com
  918. 292.32 s Downloading cached libxext-1.3.7-dev from https://cache.nix-ci.com
  919. 292.34 s [python3-3.13.12-env] created 241 symlinks in user environment
  920. 292.34 s Downloading cached cargo-flamegraph from https://cache.nix-ci.com
  921. 292.36 s Downloading cached graphviz from https://cache.nix-ci.com
  922. 292.67 s Downloaded cached libxrender-0.9.12-dev (35 KiB) in 350ms
  923. 292.67 s Progress: 17 of 34 built (2 building), 180 of 196 downloaded from cache (6 downloading)
  924. 292.67 s Downloaded cached libxext-1.3.7-dev (58 KiB) in 351ms
  925. 292.67 s Progress: 17 of 34 built (2 building), 181 of 196 downloaded from cache (5 downloading)
  926. 292.68 s Downloading cached cairo-1.18.4-dev from https://cache.nix-ci.com
  927. 292.71 s Downloaded cached mupdf-1.27.2-bin (833 KiB) in 399ms
  928. 292.71 s Progress: 17 of 34 built (2 building), 182 of 196 downloaded from cache (5 downloading)
  929. 292.71 s Downloading cached mupdf-1.27.2-dev from https://cache.nix-ci.com
  930. 292.72 s Downloaded cached nix-prefetch-git (19 KiB) in 404ms
  931. 292.72 s Progress: 17 of 34 built (2 building), 183 of 196 downloaded from cache (5 downloading)
  932. 292.88 s Downloaded cached graphviz (7.2 MiB) in 521ms
  933. 292.89 s Progress: 17 of 33 built (2 building), 184 of 196 downloaded from cache (4 downloading)
  934. 292.95 s Downloaded cached cargo-flamegraph (5.4 MiB) in 607ms
  935. 292.95 s Progress: 17 of 32 built (2 building), 185 of 196 downloaded from cache (3 downloading)
  936. 292.98 s Downloaded cached cairo-1.18.4-dev (184 KiB) in 299ms
  937. 292.98 s Progress: 17 of 31 built (2 building), 186 of 196 downloaded from cache (2 downloading)
  938. 292.98 s Downloading cached poppler-utils-25.10.0-dev from https://cache.nix-ci.com
  939. 292.99 s Downloaded cached mupdf-1.27.2-dev (758 KiB) in 273ms
  940. 292.99 s Progress: 17 of 31 built (2 building), 187 of 196 downloaded from cache (2 downloading)
  941. 293.23 s [replace-workspace-values:post-build] Uploading to the NixCI cache: /nix/store/nal4dxi3l18hz19ld26di9n37ixr0afh-replace-workspace-values
  942. 293.27 s Downloaded cached poppler-utils-25.10.0-dev (1.7 MiB) in 283ms
  943. 293.57 s Downloaded cached nodejs-slim (81.2 MiB) in 1.3s
  944. 293.60 s [replace-workspace-values:post-build] warning: 'warn-short-path-literals' is deprecated, use 'lint-short-path-literals = ignore' instead
  945. 294.04 s [replace-workspace-values:post-build] copying 0 paths...
  946. 294.60 s [replace-workspace-values:post-build] warning: 'warn-short-path-literals' is deprecated, use 'lint-short-path-literals = ignore' instead
  947. 294.69 s [replace-workspace-values:post-build] copying 0 paths...
  948. 294.95 s Uploaded replace-workspace-values in 1.8s
  949. 294.95 s Progress: 18 of 31 built (1 building), 187 of 196 downloaded from cache (2 downloading)
  950. 294.95 s Built replace-workspace-values in 2.6s
  951. 294.95 s Progress: 18 of 30 built (1 building), 188 of 196 downloaded from cache (1 downloading)
  952. 294.95 s Progress: 18 of 30 built (1 building), 189 of 196 downloaded from cache
  953. 295.10 s [python3-3.13.12-env:post-build] Uploading to the NixCI cache: /nix/store/rfh8283cg3amd71cmhq2ypr98p7036k7-python3-3.13.12-env
  954. 295.71 s [python3-3.13.12-env:post-build] warning: 'warn-short-path-literals' is deprecated, use 'lint-short-path-literals = ignore' instead
  955. 296.67 s [python3-3.13.12-env:post-build] copying 0 paths...
  956. 297.03 s [python3-3.13.12-env:post-build] warning: 'warn-short-path-literals' is deprecated, use 'lint-short-path-literals = ignore' instead
  957. 297.24 s [python3-3.13.12-env:post-build] copying 0 paths...
  958. 297.48 s Uploaded python3-3.13.12-env in 2.4s
  959. 297.49 s Progress: 19 of 31 built, 189 of 196 downloaded from cache
  960. 297.49 s Built python3-3.13.12-env in 5.2s
  961. 297.49 s Downloading cached nodejs-slim-24.14.0-corepack from https://cache.nix-ci.com
  962. 297.49 s Downloading cached nodejs-slim-24.14.0-npm from https://cache.nix-ci.com
  963. 297.55 s Building /nix/store/bhi611ynwipaff55yy429jp3f3z4a296-fetch-cargo-vendor-util.drv
  964. 297.77 s Downloaded cached nodejs-slim-24.14.0-corepack (1 MiB) in 287ms
  965. 297.77 s Progress: 19 of 29 built (1 building), 190 of 196 downloaded from cache (1 downloading)
  966. 297.96 s [fetch-cargo-vendor-util:post-build] Uploading to the NixCI cache: /nix/store/rpickx0wnl28rz29529irv9s97w7fdk6-fetch-cargo-vendor-util
  967. 298.01 s Downloaded cached nodejs-slim-24.14.0-npm (9.8 MiB) in 523ms
  968. 298.36 s [fetch-cargo-vendor-util:post-build] warning: 'warn-short-path-literals' is deprecated, use 'lint-short-path-literals = ignore' instead
  969. 298.85 s [fetch-cargo-vendor-util:post-build] copying 0 paths...
  970. 299.21 s [fetch-cargo-vendor-util:post-build] warning: 'warn-short-path-literals' is deprecated, use 'lint-short-path-literals = ignore' instead
  971. 299.37 s [fetch-cargo-vendor-util:post-build] copying 0 paths...
  972. 299.56 s Uploaded fetch-cargo-vendor-util in 1.6s
  973. 299.57 s Progress: 20 of 30 built, 190 of 196 downloaded from cache (1 downloading)
  974. 299.57 s Built fetch-cargo-vendor-util in 2.0s
  975. 299.97 s Building /nix/store/yjiiziqs3wdx3szv6j8mp3m8z043pgil-clinnet-0.1.8-vendor-staging.drv
  976. 300.06 s Building /nix/store/w8ay1a2bcj97lnz283pg9fq55wqha9qx-rscls-0.2.3-vendor.drv
  977. 300.06 s Progress: 20 of 29 built (2 building), 191 of 196 downloaded from cache
  978. 300.06 s [clinnet-0.1.8-vendor-staging] Phase: unpackPhase
  979. 300.06 s [clinnet-0.1.8-vendor-staging] unpacking source archive /nix/store/2i132kj3rylcpf3q5yy61794w9j2mg0v-clinnet-0.1.8.tar.gz
  980. 300.06 s [clinnet-0.1.8-vendor-staging] source root is clinnet-0.1.8.tar.gz
  981. 300.06 s [clinnet-0.1.8-vendor-staging] Phase: patchPhase
  982. 300.06 s [clinnet-0.1.8-vendor-staging] Phase: updateAutotoolsGnuConfigScriptsPhase
  983. 300.06 s [clinnet-0.1.8-vendor-staging] Phase: buildPhase
  984. 300.06 s Downloading cached nodejs from https://cache.nix-ci.com
  985. 300.32 s [clinnet-0.1.8-vendor-staging] Skipping local dependency: clinnet
  986. 300.33 s [rscls-0.2.3-vendor] Unpacking to /nix/store/xjddmzd1ry904d9kwbrp8g6ph7zdk3jm-rscls-0.2.3-vendor/source-registry-0/anstream-0.6.21
  987. 300.34 s [rscls-0.2.3-vendor] Unpacking to /nix/store/xjddmzd1ry904d9kwbrp8g6ph7zdk3jm-rscls-0.2.3-vendor/source-registry-0/anstyle-1.0.13
  988. 300.35 s [rscls-0.2.3-vendor] Unpacking to /nix/store/xjddmzd1ry904d9kwbrp8g6ph7zdk3jm-rscls-0.2.3-vendor/source-registry-0/anstyle-parse-0.2.7
  989. 300.36 s [clinnet-0.1.8-vendor-staging] Fetching https://crates.io/api/v1/crates/anstream/0.6.21/download -> tarballs/anstream-0.6.21.tar.gz
  990. 300.36 s [clinnet-0.1.8-vendor-staging] Fetching https://crates.io/api/v1/crates/arrayref/0.3.9/download -> tarballs/arrayref-0.3.9.tar.gz
  991. 300.36 s [clinnet-0.1.8-vendor-staging] Fetching https://crates.io/api/v1/crates/colorchoice/1.0.4/download -> tarballs/colorchoice-1.0.4.tar.gz
  992. 300.36 s [clinnet-0.1.8-vendor-staging] Fetching https://crates.io/api/v1/crates/cc/1.2.45/download -> tarballs/cc-1.2.45.tar.gz
  993. 300.36 s [clinnet-0.1.8-vendor-staging] Fetching https://crates.io/api/v1/crates/crossbeam-utils/0.8.21/download -> tarballs/crossbeam-utils-0.8.21.tar.gz
  994. 300.36 s [rscls-0.2.3-vendor] Unpacking to /nix/store/xjddmzd1ry904d9kwbrp8g6ph7zdk3jm-rscls-0.2.3-vendor/source-registry-0/anstyle-query-1.1.5
  995. 300.37 s [rscls-0.2.3-vendor] Unpacking to /nix/store/xjddmzd1ry904d9kwbrp8g6ph7zdk3jm-rscls-0.2.3-vendor/source-registry-0/anstyle-wincon-3.0.11
  996. 300.38 s Downloaded cached nodejs (772 KiB) in 315ms
  997. 300.38 s [rscls-0.2.3-vendor] Unpacking to /nix/store/xjddmzd1ry904d9kwbrp8g6ph7zdk3jm-rscls-0.2.3-vendor/source-registry-0/bitflags-1.3.2
  998. 300.38 s Progress: 20 of 29 built (2 building), 192 of 196 downloaded from cache
  999. 300.38 s Downloading cached yaml-language-server from https://cache.nix-ci.com
  1000. 300.38 s Downloading cached pyright-internal from https://cache.nix-ci.com
  1001. 300.38 s Downloading cached dot-language-server from https://cache.nix-ci.com
  1002. 300.39 s [rscls-0.2.3-vendor] Unpacking to /nix/store/xjddmzd1ry904d9kwbrp8g6ph7zdk3jm-rscls-0.2.3-vendor/source-registry-0/bitflags-2.11.0
  1003. 300.42 s [rscls-0.2.3-vendor] Unpacking to /nix/store/xjddmzd1ry904d9kwbrp8g6ph7zdk3jm-rscls-0.2.3-vendor/source-registry-0/bytes-1.11.1
  1004. 300.45 s [rscls-0.2.3-vendor] Unpacking to /nix/store/xjddmzd1ry904d9kwbrp8g6ph7zdk3jm-rscls-0.2.3-vendor/source-registry-0/cfg-if-1.0.4
  1005. 300.46 s [rscls-0.2.3-vendor] Unpacking to /nix/store/xjddmzd1ry904d9kwbrp8g6ph7zdk3jm-rscls-0.2.3-vendor/source-registry-0/clap-4.5.58
  1006. 300.49 s [rscls-0.2.3-vendor] Unpacking to /nix/store/xjddmzd1ry904d9kwbrp8g6ph7zdk3jm-rscls-0.2.3-vendor/source-registry-0/clap-verbosity-flag-2.2.3
  1007. 300.50 s [rscls-0.2.3-vendor] Unpacking to /nix/store/xjddmzd1ry904d9kwbrp8g6ph7zdk3jm-rscls-0.2.3-vendor/source-registry-0/clap_builder-4.5.58
  1008. 300.56 s [rscls-0.2.3-vendor] Unpacking to /nix/store/xjddmzd1ry904d9kwbrp8g6ph7zdk3jm-rscls-0.2.3-vendor/source-registry-0/clap_derive-4.5.55
  1009. 300.57 s [rscls-0.2.3-vendor] Unpacking to /nix/store/xjddmzd1ry904d9kwbrp8g6ph7zdk3jm-rscls-0.2.3-vendor/source-registry-0/clap_lex-1.0.0
  1010. 300.58 s [clinnet-0.1.8-vendor-staging] Fetching https://crates.io/api/v1/crates/encode_unicode/1.0.0/download -> tarballs/encode_unicode-1.0.0.tar.gz
  1011. 300.59 s [rscls-0.2.3-vendor] Unpacking to /nix/store/xjddmzd1ry904d9kwbrp8g6ph7zdk3jm-rscls-0.2.3-vendor/source-registry-0/colorchoice-1.0.4
  1012. 300.61 s [rscls-0.2.3-vendor] Unpacking to /nix/store/xjddmzd1ry904d9kwbrp8g6ph7zdk3jm-rscls-0.2.3-vendor/source-registry-0/crossbeam-channel-0.5.15
  1013. 300.61 s [clinnet-0.1.8-vendor-staging] Fetching https://crates.io/api/v1/crates/is_terminal_polyfill/1.70.2/download -> tarballs/is_terminal_polyfill-1.70.2.tar.gz
  1014. 300.62 s [rscls-0.2.3-vendor] Unpacking to /nix/store/xjddmzd1ry904d9kwbrp8g6ph7zdk3jm-rscls-0.2.3-vendor/source-registry-0/crossbeam-utils-0.8.21
  1015. 300.64 s [rscls-0.2.3-vendor] Unpacking to /nix/store/xjddmzd1ry904d9kwbrp8g6ph7zdk3jm-rscls-0.2.3-vendor/source-registry-0/displaydoc-0.2.5
  1016. 300.65 s Downloaded cached dot-language-server (3.2 MiB) in 270ms
  1017. 300.65 s Progress: 20 of 29 built (2 building), 193 of 196 downloaded from cache (2 downloading)
  1018. 300.65 s [rscls-0.2.3-vendor] Unpacking to /nix/store/xjddmzd1ry904d9kwbrp8g6ph7zdk3jm-rscls-0.2.3-vendor/source-registry-0/errno-0.3.14
  1019. 300.66 s [clinnet-0.1.8-vendor-staging] Fetching https://crates.io/api/v1/crates/memchr/2.7.4/download -> tarballs/memchr-2.7.4.tar.gz
  1020. 300.66 s [rscls-0.2.3-vendor] Unpacking to /nix/store/xjddmzd1ry904d9kwbrp8g6ph7zdk3jm-rscls-0.2.3-vendor/source-registry-0/eyre-0.6.12
  1021. 300.66 s [clinnet-0.1.8-vendor-staging] Fetching https://crates.io/api/v1/crates/parking_lot_core/0.9.12/download -> tarballs/parking_lot_core-0.9.12.tar.gz
  1022. 300.67 s [rscls-0.2.3-vendor] Unpacking to /nix/store/xjddmzd1ry904d9kwbrp8g6ph7zdk3jm-rscls-0.2.3-vendor/source-registry-0/form_urlencoded-1.2.2
  1023. 300.70 s [rscls-0.2.3-vendor] Unpacking to /nix/store/xjddmzd1ry904d9kwbrp8g6ph7zdk3jm-rscls-0.2.3-vendor/source-registry-0/futures-0.3.31
  1024. 300.72 s [rscls-0.2.3-vendor] Unpacking to /nix/store/xjddmzd1ry904d9kwbrp8g6ph7zdk3jm-rscls-0.2.3-vendor/source-registry-0/futures-channel-0.3.31
  1025. 300.74 s [rscls-0.2.3-vendor] Unpacking to /nix/store/xjddmzd1ry904d9kwbrp8g6ph7zdk3jm-rscls-0.2.3-vendor/source-registry-0/futures-core-0.3.31
  1026. 300.74 s [rscls-0.2.3-vendor] Unpacking to /nix/store/xjddmzd1ry904d9kwbrp8g6ph7zdk3jm-rscls-0.2.3-vendor/source-registry-0/futures-executor-0.3.31
  1027. 300.76 s [rscls-0.2.3-vendor] Unpacking to /nix/store/xjddmzd1ry904d9kwbrp8g6ph7zdk3jm-rscls-0.2.3-vendor/source-registry-0/futures-io-0.3.31
  1028. 300.77 s [rscls-0.2.3-vendor] Unpacking to /nix/store/xjddmzd1ry904d9kwbrp8g6ph7zdk3jm-rscls-0.2.3-vendor/source-registry-0/futures-macro-0.3.31
  1029. 300.78 s [rscls-0.2.3-vendor] Unpacking to /nix/store/xjddmzd1ry904d9kwbrp8g6ph7zdk3jm-rscls-0.2.3-vendor/source-registry-0/futures-sink-0.3.31
  1030. 300.78 s [rscls-0.2.3-vendor] Unpacking to /nix/store/xjddmzd1ry904d9kwbrp8g6ph7zdk3jm-rscls-0.2.3-vendor/source-registry-0/futures-task-0.3.31
  1031. 300.79 s [clinnet-0.1.8-vendor-staging] Fetching https://crates.io/api/v1/crates/rayon-core/1.12.1/download -> tarballs/rayon-core-1.12.1.tar.gz
  1032. 300.79 s Downloaded cached yaml-language-server (17.2 MiB) in 417ms
  1033. 300.79 s Progress: 20 of 28 built (2 building), 194 of 196 downloaded from cache (1 downloading)
  1034. 300.79 s [rscls-0.2.3-vendor] Unpacking to /nix/store/xjddmzd1ry904d9kwbrp8g6ph7zdk3jm-rscls-0.2.3-vendor/source-registry-0/futures-util-0.3.31
  1035. 300.80 s [clinnet-0.1.8-vendor-staging] Fetching https://crates.io/api/v1/crates/rustversion/1.0.22/download -> tarballs/rustversion-1.0.22.tar.gz
  1036. 300.82 s [rscls-0.2.3-vendor] Unpacking to /nix/store/xjddmzd1ry904d9kwbrp8g6ph7zdk3jm-rscls-0.2.3-vendor/source-registry-0/heck-0.5.0
  1037. 300.82 s [rscls-0.2.3-vendor] Unpacking to /nix/store/xjddmzd1ry904d9kwbrp8g6ph7zdk3jm-rscls-0.2.3-vendor/source-registry-0/icu_collections-2.1.1
  1038. 300.83 s [clinnet-0.1.8-vendor-staging] Fetching https://crates.io/api/v1/crates/serde_derive/1.0.225/download -> tarballs/serde_derive-1.0.225.tar.gz
  1039. 300.84 s [clinnet-0.1.8-vendor-staging] Fetching https://crates.io/api/v1/crates/strsim/0.11.1/download -> tarballs/strsim-0.11.1.tar.gz
  1040. 300.84 s [rscls-0.2.3-vendor] Unpacking to /nix/store/xjddmzd1ry904d9kwbrp8g6ph7zdk3jm-rscls-0.2.3-vendor/source-registry-0/icu_locale_core-2.1.1
  1041. 300.85 s [rscls-0.2.3-vendor] Unpacking to /nix/store/xjddmzd1ry904d9kwbrp8g6ph7zdk3jm-rscls-0.2.3-vendor/source-registry-0/icu_normalizer-2.1.1
  1042. 300.86 s [clinnet-0.1.8-vendor-staging] Fetching https://crates.io/api/v1/crates/unicode-width/0.2.2/download -> tarballs/unicode-width-0.2.2.tar.gz
  1043. 300.86 s [rscls-0.2.3-vendor] Unpacking to /nix/store/xjddmzd1ry904d9kwbrp8g6ph7zdk3jm-rscls-0.2.3-vendor/source-registry-0/icu_normalizer_data-2.1.1
  1044. 300.87 s [rscls-0.2.3-vendor] Unpacking to /nix/store/xjddmzd1ry904d9kwbrp8g6ph7zdk3jm-rscls-0.2.3-vendor/source-registry-0/icu_properties-2.1.2
  1045. 300.91 s [rscls-0.2.3-vendor] Unpacking to /nix/store/xjddmzd1ry904d9kwbrp8g6ph7zdk3jm-rscls-0.2.3-vendor/source-registry-0/icu_properties_data-2.1.2
  1046. 300.99 s [clinnet-0.1.8-vendor-staging] Fetching https://crates.io/api/v1/crates/wasm-bindgen-macro/0.2.105/download -> tarballs/wasm-bindgen-macro-0.2.105.tar.gz
  1047. 301.01 s [clinnet-0.1.8-vendor-staging] Fetching https://crates.io/api/v1/crates/windows-sys/0.59.0/download -> tarballs/windows-sys-0.59.0.tar.gz
  1048. 301.02 s [clinnet-0.1.8-vendor-staging] Fetching https://crates.io/api/v1/crates/windows_aarch64_msvc/0.52.6/download -> tarballs/windows_aarch64_msvc-0.52.6.tar.gz
  1049. 301.02 s [rscls-0.2.3-vendor] Unpacking to /nix/store/xjddmzd1ry904d9kwbrp8g6ph7zdk3jm-rscls-0.2.3-vendor/source-registry-0/icu_provider-2.1.1
  1050. 301.03 s [rscls-0.2.3-vendor] Unpacking to /nix/store/xjddmzd1ry904d9kwbrp8g6ph7zdk3jm-rscls-0.2.3-vendor/source-registry-0/idna-1.1.0
  1051. 301.04 s [clinnet-0.1.8-vendor-staging] Fetching https://crates.io/api/v1/crates/windows_i686_msvc/0.52.6/download -> tarballs/windows_i686_msvc-0.52.6.tar.gz
  1052. 301.04 s [clinnet-0.1.8-vendor-staging] Fetching https://crates.io/api/v1/crates/windows_x86_64_msvc/0.52.6/download -> tarballs/windows_x86_64_msvc-0.52.6.tar.gz
  1053. 301.05 s [rscls-0.2.3-vendor] Unpacking to /nix/store/xjddmzd1ry904d9kwbrp8g6ph7zdk3jm-rscls-0.2.3-vendor/source-registry-0/idna_adapter-1.2.1
  1054. 301.05 s [rscls-0.2.3-vendor] Unpacking to /nix/store/xjddmzd1ry904d9kwbrp8g6ph7zdk3jm-rscls-0.2.3-vendor/source-registry-0/indenter-0.3.4
  1055. 301.06 s [rscls-0.2.3-vendor] Unpacking to /nix/store/xjddmzd1ry904d9kwbrp8g6ph7zdk3jm-rscls-0.2.3-vendor/source-registry-0/is_terminal_polyfill-1.70.2
  1056. 301.07 s [rscls-0.2.3-vendor] Unpacking to /nix/store/xjddmzd1ry904d9kwbrp8g6ph7zdk3jm-rscls-0.2.3-vendor/source-registry-0/itoa-1.0.17
  1057. 301.08 s [rscls-0.2.3-vendor] Unpacking to /nix/store/xjddmzd1ry904d9kwbrp8g6ph7zdk3jm-rscls-0.2.3-vendor/source-registry-0/lazy_static-1.5.0
  1058. 301.09 s [rscls-0.2.3-vendor] Unpacking to /nix/store/xjddmzd1ry904d9kwbrp8g6ph7zdk3jm-rscls-0.2.3-vendor/source-registry-0/libc-0.2.182
  1059. 301.14 s [rscls-0.2.3-vendor] Unpacking to /nix/store/xjddmzd1ry904d9kwbrp8g6ph7zdk3jm-rscls-0.2.3-vendor/source-registry-0/litemap-0.8.1
  1060. 301.15 s [rscls-0.2.3-vendor] Unpacking to /nix/store/xjddmzd1ry904d9kwbrp8g6ph7zdk3jm-rscls-0.2.3-vendor/source-registry-0/lock_api-0.4.14
  1061. 301.15 s [rscls-0.2.3-vendor] Unpacking to /nix/store/xjddmzd1ry904d9kwbrp8g6ph7zdk3jm-rscls-0.2.3-vendor/source-registry-0/log-0.4.29
  1062. 301.16 s [rscls-0.2.3-vendor] Unpacking to /nix/store/xjddmzd1ry904d9kwbrp8g6ph7zdk3jm-rscls-0.2.3-vendor/source-registry-0/lsp-server-0.7.9
  1063. 301.17 s [rscls-0.2.3-vendor] Unpacking to /nix/store/xjddmzd1ry904d9kwbrp8g6ph7zdk3jm-rscls-0.2.3-vendor/source-registry-0/lsp-types-0.94.1
  1064. 301.18 s [rscls-0.2.3-vendor] Unpacking to /nix/store/xjddmzd1ry904d9kwbrp8g6ph7zdk3jm-rscls-0.2.3-vendor/source-registry-0/memchr-2.8.0
  1065. 301.20 s [rscls-0.2.3-vendor] Unpacking to /nix/store/xjddmzd1ry904d9kwbrp8g6ph7zdk3jm-rscls-0.2.3-vendor/source-registry-0/mio-1.1.1
  1066. 301.21 s [rscls-0.2.3-vendor] Unpacking to /nix/store/xjddmzd1ry904d9kwbrp8g6ph7zdk3jm-rscls-0.2.3-vendor/source-registry-0/nu-ansi-term-0.50.3
  1067. 301.23 s [rscls-0.2.3-vendor] Unpacking to /nix/store/xjddmzd1ry904d9kwbrp8g6ph7zdk3jm-rscls-0.2.3-vendor/source-registry-0/once_cell-1.21.3
  1068. 301.25 s [rscls-0.2.3-vendor] Unpacking to /nix/store/xjddmzd1ry904d9kwbrp8g6ph7zdk3jm-rscls-0.2.3-vendor/source-registry-0/once_cell_polyfill-1.70.2
  1069. 301.27 s [rscls-0.2.3-vendor] Unpacking to /nix/store/xjddmzd1ry904d9kwbrp8g6ph7zdk3jm-rscls-0.2.3-vendor/source-registry-0/parking_lot-0.12.5
  1070. 301.29 s [rscls-0.2.3-vendor] Unpacking to /nix/store/xjddmzd1ry904d9kwbrp8g6ph7zdk3jm-rscls-0.2.3-vendor/source-registry-0/parking_lot_core-0.9.12
  1071. 301.32 s [rscls-0.2.3-vendor] Unpacking to /nix/store/xjddmzd1ry904d9kwbrp8g6ph7zdk3jm-rscls-0.2.3-vendor/source-registry-0/path-absolutize-3.1.1
  1072. 301.34 s [rscls-0.2.3-vendor] Unpacking to /nix/store/xjddmzd1ry904d9kwbrp8g6ph7zdk3jm-rscls-0.2.3-vendor/source-registry-0/path-dedot-3.1.1
  1073. 301.35 s [rscls-0.2.3-vendor] Unpacking to /nix/store/xjddmzd1ry904d9kwbrp8g6ph7zdk3jm-rscls-0.2.3-vendor/source-registry-0/percent-encoding-2.3.2
  1074. 301.36 s [rscls-0.2.3-vendor] Unpacking to /nix/store/xjddmzd1ry904d9kwbrp8g6ph7zdk3jm-rscls-0.2.3-vendor/source-registry-0/pin-project-lite-0.2.16
  1075. 301.39 s [rscls-0.2.3-vendor] Unpacking to /nix/store/xjddmzd1ry904d9kwbrp8g6ph7zdk3jm-rscls-0.2.3-vendor/source-registry-0/pin-utils-0.1.0
  1076. 301.40 s [clinnet-0.1.8-vendor-staging] multiprocessing.pool.RemoteTraceback:
  1077. 301.40 s [clinnet-0.1.8-vendor-staging] """
  1078. 301.40 s [clinnet-0.1.8-vendor-staging] Traceback (most recent call last):
  1079. 301.40 s [clinnet-0.1.8-vendor-staging] File "/nix/store/rfh8283cg3amd71cmhq2ypr98p7036k7-python3-3.13.12-env/lib/python3.13/multiprocessing/pool.py", line 125, in worker
  1080. 301.40 s [clinnet-0.1.8-vendor-staging] result = (True, func(*args, **kwds))
  1081. 301.40 s [clinnet-0.1.8-vendor-staging] ~~~~^^^^^^^^^^^^^^^
  1082. 301.40 s [clinnet-0.1.8-vendor-staging] File "/nix/store/rfh8283cg3amd71cmhq2ypr98p7036k7-python3-3.13.12-env/lib/python3.13/multiprocessing/pool.py", line 51, in starmapstar
  1083. 301.40 s [clinnet-0.1.8-vendor-staging] return list(itertools.starmap(args[0], args[1]))
  1084. 301.40 s [clinnet-0.1.8-vendor-staging] File "/nix/store/rpickx0wnl28rz29529irv9s97w7fdk6-fetch-cargo-vendor-util/bin/fetch-cargo-vendor-util", line 87, in download_tarball
  1085. 301.40 s [clinnet-0.1.8-vendor-staging] calculated_checksum = download_file_with_checksum(session, url, tarball_out_dir)
  1086. 301.40 s [clinnet-0.1.8-vendor-staging] File "/nix/store/rpickx0wnl28rz29529irv9s97w7fdk6-fetch-cargo-vendor-util/bin/fetch-cargo-vendor-util", line 53, in download_file_with_checksum
  1087. 301.40 s [clinnet-0.1.8-vendor-staging] raise Exception(f"Failed to fetch file from {url}. Status code: {response.status_code}")
  1088. 301.40 s [clinnet-0.1.8-vendor-staging] Exception: Failed to fetch file from https://crates.io/api/v1/crates/colorchoice/1.0.4/download. Status code: 403
  1089. 301.40 s [clinnet-0.1.8-vendor-staging] """
  1090. 301.40 s [clinnet-0.1.8-vendor-staging]
  1091. 301.40 s [clinnet-0.1.8-vendor-staging] The above exception was the direct cause of the following exception:
  1092. 301.40 s [clinnet-0.1.8-vendor-staging]
  1093. 301.40 s [clinnet-0.1.8-vendor-staging] Traceback (most recent call last):
  1094. 301.40 s [clinnet-0.1.8-vendor-staging] File "/nix/store/rpickx0wnl28rz29529irv9s97w7fdk6-fetch-cargo-vendor-util/bin/fetch-cargo-vendor-util", line 414, in <module>
  1095. 301.40 s [clinnet-0.1.8-vendor-staging] main()
  1096. 301.40 s [clinnet-0.1.8-vendor-staging] ~~~~^^
  1097. 301.40 s [clinnet-0.1.8-vendor-staging] File "/nix/store/rpickx0wnl28rz29529irv9s97w7fdk6-fetch-cargo-vendor-util/bin/fetch-cargo-vendor-util", line 410, in main
  1098. 301.40 s [clinnet-0.1.8-vendor-staging] subcommand_func()
  1099. 301.40 s [clinnet-0.1.8-vendor-staging] ~~~~~~~~~~~~~~~^^
  1100. 301.40 s [clinnet-0.1.8-vendor-staging] File "/nix/store/rpickx0wnl28rz29529irv9s97w7fdk6-fetch-cargo-vendor-util/bin/fetch-cargo-vendor-util", line 401, in <lambda>
  1101. 301.40 s [clinnet-0.1.8-vendor-staging] "create-vendor-staging": lambda: create_vendor_staging(lockfile_path=Path(sys.argv[2]), out_dir=Path(sys.argv[3])),
  1102. 301.40 s [clinnet-0.1.8-vendor-staging] ~~~~~~~~~~~~~~~~~~~~~^^^^^^^^^^^^^^^^^^^^^^^^^^^^^^^^^^^^^^^^^^^^^^^^^^^^^^^^^^^^
  1103. 301.40 s [clinnet-0.1.8-vendor-staging] File "/nix/store/rpickx0wnl28rz29529irv9s97w7fdk6-fetch-cargo-vendor-util/bin/fetch-cargo-vendor-util", line 168, in create_vendor_staging
  1104. 301.40 s [clinnet-0.1.8-vendor-staging] pool.starmap(download_tarball, tarball_args_gen)
  1105. 301.40 s [clinnet-0.1.8-vendor-staging] ~~~~~~~~~~~~^^^^^^^^^^^^^^^^^^^^^^^^^^^^^^^^^^^^
  1106. 301.40 s [clinnet-0.1.8-vendor-staging] File "/nix/store/rfh8283cg3amd71cmhq2ypr98p7036k7-python3-3.13.12-env/lib/python3.13/multiprocessing/pool.py", line 375, in starmap
  1107. 301.40 s [clinnet-0.1.8-vendor-staging] return self._map_async(func, iterable, starmapstar, chunksize).get()
  1108. 301.40 s [clinnet-0.1.8-vendor-staging] ~~~~~~~~~~~~~~~~~~~~~~~~~~~~~~~~~~~~~~~~~~~~~~~~~~~~~~~~~~~^^
  1109. 301.40 s [clinnet-0.1.8-vendor-staging] File "/nix/store/rfh8283cg3amd71cmhq2ypr98p7036k7-python3-3.13.12-env/lib/python3.13/multiprocessing/pool.py", line 774, in get
  1110. 301.40 s [clinnet-0.1.8-vendor-staging] raise self._value
  1111. 301.40 s [clinnet-0.1.8-vendor-staging] Exception: Failed to fetch file from https://crates.io/api/v1/crates/colorchoice/1.0.4/download. Status code: 403
  1112. 301.41 s [rscls-0.2.3-vendor] Unpacking to /nix/store/xjddmzd1ry904d9kwbrp8g6ph7zdk3jm-rscls-0.2.3-vendor/source-registry-0/potential_utf-0.1.4
  1113. 301.42 s [rscls-0.2.3-vendor] Unpacking to /nix/store/xjddmzd1ry904d9kwbrp8g6ph7zdk3jm-rscls-0.2.3-vendor/source-registry-0/proc-macro2-1.0.106
  1114. 301.44 s Progress: 20 of 27 built (1 building, 1 failed), 194 of 196 downloaded from cache (1 downloading)
  1115. 301.44 s Failed to build clinnet-0.1.8-vendor-staging after 1.4s
  1116. 301.44 s error: Cannot build '/nix/store/yjiiziqs3wdx3szv6j8mp3m8z043pgil-clinnet-0.1.8-vendor-staging.drv'.
  1117. 301.44 s Reason: builder failed with exit code 1.
  1118. 301.44 s Output paths:
  1119. 301.44 s /nix/store/43izv4h82lj0nmnqwjg6j8spdkwa6hs5-clinnet-0.1.8-vendor-staging
  1120. 301.44 s Last 62 log lines:
  1121. 301.44 s > Running phase: unpackPhase
  1122. 301.44 s > unpacking source archive /nix/store/2i132kj3rylcpf3q5yy61794w9j2mg0v-clinnet-0.1.8.tar.gz
  1123. 301.44 s > source root is clinnet-0.1.8.tar.gz
  1124. 301.44 s > Running phase: patchPhase
  1125. 301.44 s > Running phase: updateAutotoolsGnuConfigScriptsPhase
  1126. 301.44 s > Running phase: buildPhase
  1127. 301.44 s > Skipping local dependency: clinnet
  1128. 301.44 s > Fetching https://crates.io/api/v1/crates/anstream/0.6.21/download -> tarballs/anstream-0.6.21.tar.gz
  1129. 301.44 s > Fetching https://crates.io/api/v1/crates/arrayref/0.3.9/download -> tarballs/arrayref-0.3.9.tar.gz
  1130. 301.44 s > Fetching https://crates.io/api/v1/crates/colorchoice/1.0.4/download -> tarballs/colorchoice-1.0.4.tar.gz
  1131. 301.44 s > Fetching https://crates.io/api/v1/crates/cc/1.2.45/download -> tarballs/cc-1.2.45.tar.gz
  1132. 301.44 s > Fetching https://crates.io/api/v1/crates/crossbeam-utils/0.8.21/download -> tarballs/crossbeam-utils-0.8.21.tar.gz
  1133. 301.44 s > Fetching https://crates.io/api/v1/crates/encode_unicode/1.0.0/download -> tarballs/encode_unicode-1.0.0.tar.gz
  1134. 301.44 s > Fetching https://crates.io/api/v1/crates/is_terminal_polyfill/1.70.2/download -> tarballs/is_terminal_polyfill-1.70.2.tar.gz
  1135. 301.44 s > Fetching https://crates.io/api/v1/crates/memchr/2.7.4/download -> tarballs/memchr-2.7.4.tar.gz
  1136. 301.44 s > Fetching https://crates.io/api/v1/crates/parking_lot_core/0.9.12/download -> tarballs/parking_lot_core-0.9.12.tar.gz
  1137. 301.44 s > Fetching https://crates.io/api/v1/crates/rayon-core/1.12.1/download -> tarballs/rayon-core-1.12.1.tar.gz
  1138. 301.44 s > Fetching https://crates.io/api/v1/crates/rustversion/1.0.22/download -> tarballs/rustversion-1.0.22.tar.gz
  1139. 301.44 s > Fetching https://crates.io/api/v1/crates/serde_derive/1.0.225/download -> tarballs/serde_derive-1.0.225.tar.gz
  1140. 301.44 s > Fetching https://crates.io/api/v1/crates/strsim/0.11.1/download -> tarballs/strsim-0.11.1.tar.gz
  1141. 301.44 s > Fetching https://crates.io/api/v1/crates/unicode-width/0.2.2/download -> tarballs/unicode-width-0.2.2.tar.gz
  1142. 301.44 s > Fetching https://crates.io/api/v1/crates/wasm-bindgen-macro/0.2.105/download -> tarballs/wasm-bindgen-macro-0.2.105.tar.gz
  1143. 301.44 s > Fetching https://crates.io/api/v1/crates/windows-sys/0.59.0/download -> tarballs/windows-sys-0.59.0.tar.gz
  1144. 301.44 s > Fetching https://crates.io/api/v1/crates/windows_aarch64_msvc/0.52.6/download -> tarballs/windows_aarch64_msvc-0.52.6.tar.gz
  1145. 301.44 s > Fetching https://crates.io/api/v1/crates/windows_i686_msvc/0.52.6/download -> tarballs/windows_i686_msvc-0.52.6.tar.gz
  1146. 301.44 s > Fetching https://crates.io/api/v1/crates/windows_x86_64_msvc/0.52.6/download -> tarballs/windows_x86_64_msvc-0.52.6.tar.gz
  1147. 301.44 s > multiprocessing.pool.RemoteTraceback:
  1148. 301.44 s > """
  1149. 301.44 s > Traceback (most recent call last):
  1150. 301.44 s > File "/nix/store/rfh8283cg3amd71cmhq2ypr98p7036k7-python3-3.13.12-env/lib/python3.13/multiprocessing/pool.py", line 125, in worker
  1151. 301.44 s > result = (True, func(*args, **kwds))
  1152. 301.44 s > ~~~~^^^^^^^^^^^^^^^
  1153. 301.44 s > File "/nix/store/rfh8283cg3amd71cmhq2ypr98p7036k7-python3-3.13.12-env/lib/python3.13/multiprocessing/pool.py", line 51, in starmapstar
  1154. 301.44 s > return list(itertools.starmap(args[0], args[1]))
  1155. 301.44 s > File "/nix/store/rpickx0wnl28rz29529irv9s97w7fdk6-fetch-cargo-vendor-util/bin/fetch-cargo-vendor-util", line 87, in download_tarball
  1156. 301.44 s > calculated_checksum = download_file_with_checksum(session, url, tarball_out_dir)
  1157. 301.44 s > File "/nix/store/rpickx0wnl28rz29529irv9s97w7fdk6-fetch-cargo-vendor-util/bin/fetch-cargo-vendor-util", line 53, in download_file_with_checksum
  1158. 301.44 s > raise Exception(f"Failed to fetch file from {url}. Status code: {response.status_code}")
  1159. 301.44 s > Exception: Failed to fetch file from https://crates.io/api/v1/crates/colorchoice/1.0.4/download. Status code: 403
  1160. 301.44 s > """
  1161. 301.44 s >
  1162. 301.44 s > The above exception was the direct cause of the following exception:
  1163. 301.44 s >
  1164. 301.44 s > Traceback (most recent call last):
  1165. 301.44 s > File "/nix/store/rpickx0wnl28rz29529irv9s97w7fdk6-fetch-cargo-vendor-util/bin/fetch-cargo-vendor-util", line 414, in <module>
  1166. 301.44 s > main()
  1167. 301.44 s > ~~~~^^
  1168. 301.44 s > File "/nix/store/rpickx0wnl28rz29529irv9s97w7fdk6-fetch-cargo-vendor-util/bin/fetch-cargo-vendor-util", line 410, in main
  1169. 301.44 s > subcommand_func()
  1170. 301.44 s > ~~~~~~~~~~~~~~~^^
  1171. 301.44 s > File "/nix/store/rpickx0wnl28rz29529irv9s97w7fdk6-fetch-cargo-vendor-util/bin/fetch-cargo-vendor-util", line 401, in <lambda>
  1172. 301.44 s > "create-vendor-staging": lambda: create_vendor_staging(lockfile_path=Path(sys.argv[2]), out_dir=Path(sys.argv[3])),
  1173. 301.44 s > ~~~~~~~~~~~~~~~~~~~~~^^^^^^^^^^^^^^^^^^^^^^^^^^^^^^^^^^^^^^^^^^^^^^^^^^^^^^^^^^^^
  1174. 301.44 s > File "/nix/store/rpickx0wnl28rz29529irv9s97w7fdk6-fetch-cargo-vendor-util/bin/fetch-cargo-vendor-util", line 168, in create_vendor_staging
  1175. 301.44 s > pool.starmap(download_tarball, tarball_args_gen)
  1176. 301.44 s > ~~~~~~~~~~~~^^^^^^^^^^^^^^^^^^^^^^^^^^^^^^^^^^^^
  1177. 301.44 s > File "/nix/store/rfh8283cg3amd71cmhq2ypr98p7036k7-python3-3.13.12-env/lib/python3.13/multiprocessing/pool.py", line 375, in starmap
  1178. 301.44 s > return self._map_async(func, iterable, starmapstar, chunksize).get()
  1179. 301.44 s > ~~~~~~~~~~~~~~~~~~~~~~~~~~~~~~~~~~~~~~~~~~~~~~~~~~~~~~~~~~~^^
  1180. 301.44 s > File "/nix/store/rfh8283cg3amd71cmhq2ypr98p7036k7-python3-3.13.12-env/lib/python3.13/multiprocessing/pool.py", line 774, in get
  1181. 301.44 s > raise self._value
  1182. 301.44 s > Exception: Failed to fetch file from https://crates.io/api/v1/crates/colorchoice/1.0.4/download. Status code: 403
  1183. 301.44 s For full logs, run:
  1184. 301.44 s nix log /nix/store/yjiiziqs3wdx3szv6j8mp3m8z043pgil-clinnet-0.1.8-vendor-staging.drv
  1185. 301.44 s error: Cannot build '/nix/store/qwkphxq9znm8bqqjzfvwnmvg6lf38rw7-clinnet-0.1.8-vendor.drv'.
  1186. 301.44 s Reason: 1 dependency failed.
  1187. 301.44 s Output paths:
  1188. 301.44 s /nix/store/8mlkw00kiyz47yfgzh7cy2gmin0j8709-clinnet-0.1.8-vendor
  1189. 301.44 s error: Build failed due to failed dependency
  1190. 301.44 s error: Cannot build '/nix/store/nl6fa55hbndmhw1mi0kphl8h8cfrnbfn-clinnet-0.1.8.drv'.
  1191. 301.44 s Reason: 1 dependency failed.
  1192. 301.44 s Output paths:
  1193. 301.44 s /nix/store/nmngd9sd2ly9g924rqp1h66h61hbzbwf-clinnet-0.1.8
  1194. 301.44 s error: Build failed due to failed dependency
  1195. 301.44 s error: Cannot build '/nix/store/llk4227dg86wbplm5k6mk4fyhs0rxmw0-nix-shell.drv'.
  1196. 301.44 s Reason: 1 dependency failed.
  1197. 301.44 s Output paths:
  1198. 301.44 s /nix/store/viw85i6gpprindjj8j8861x043bgrlym-nix-shell
  1199. 301.44 s warning: killing stray builder process 291582 (bash -e /nix/store/l622p70vy8k5sh7y5wizi5f2mic6ynpg-source-stdenv.sh /nix/store/shkw4qm9qcw5sc5n1k5jznc83ny02r39-default-builder.sh)...
  1200. 301.44 s warning: killing stray builder process 291596 (/nix/store/rfh8283cg3amd71cmhq2ypr98p7036k7-python3-3.13.12-env/bin/python3.13 /nix/store/rpickx0wnl28rz29529irv9s97w7fdk6-fetch-cargo-vendor-util/bin/fetch-cargo-vendor-util create-vendor /nix/store/mw51pll1fmkfz4hb5gpgjsa7g972sxsa-rscls-0.2.3-vendor-staging /nix/store/xjddmzd1ry904d9kwbrp8g6ph7zdk3jm-rscls-0.2.3-vendor)...
  1201. 301.44 s warning: killing stray builder process 291737 ()...
  1202. 301.44 s warning: killing stray builder process 291738 (/nix/store/pnxiz967z73a45f4x7c1icldjaaqmlcp-gzip-1.14/bin/gzip -n -d)...
  1203. 301.58 s Built rscls-0.2.3-vendor in 1.5s
  1204. 304.48 s Downloaded cached pyright-internal (183.5 MiB) in 4.0s
  1205. 304.49 s Build failed due to failed dependency
  1206. 304.60 s Build failed.