0.16 s
$ /nix/store/9ypz3flqsrl5xl495mm8h645gadjsxi1-coreutils-9.11/bin/timeout --kill-after=15s 7200s /nix/store/23zk8sgzamrbmj1fday15szf7f2279s8-nix-2.34.7/bin/nix --extra-experimental-features nix-command --extra-experimental-features flakes --log-format internal-json build --no-link --print-out-paths git+https://github.com/alphal00p/gammaloop?ref=finite_T_and_mu_pre_rebase&rev=da7b4c22f8a72cca8ddcc8537d642827d66b54b5&shallow=1#devShells.x86_64-linux.default --print-build-logs
0.48 s
error (ignored): SQLite database '/var/cache/nix-ci-worker/eval-cache-v6/ae15fc417c888f8cf3c462d71827e7e1f7d0e16733c57714a5c14e082060e9d4.sqlite ' is busy
2.50 s
3.68 s
Downloading cached rust-lib-src from https://cache.nix-ci.com
3.69 s
Downloading cached bacon from https://cache.nix-ci.com
3.69 s
Downloading cached cargo-deny from https://cache.nix-ci.com
3.69 s
Downloading cached cargo-edit from https://cache.nix-ci.com
3.69 s
Downloading cached cargo-insta from https://cache.nix-ci.com
3.69 s
Downloading cached cargo-machete from https://cache.nix-ci.com
3.69 s
Downloading cached cargo-nextest from https://cache.nix-ci.com
3.69 s
Downloading cached cargo-udeps from https://cache.nix-ci.com
3.69 s
Downloading cached cargo-watch from https://cache.nix-ci.com
3.69 s
Downloading cached curl-8.18.0-man from https://cache.nix-ci.com
3.69 s
Downloading cached d3-flame-graph-templates from https://cache.nix-ci.com
3.69 s
Downloading cached dejavu-fonts-minimal from https://cache.nix-ci.com
3.69 s
Downloading cached form from https://cache.nix-ci.com
3.69 s
Downloading cached gfortran-15.2.0-libgcc from https://cache.nix-ci.com
3.71 s
Downloading cached just from https://cache.nix-ci.com
3.71 s
Downloading cached maturin from https://cache.nix-ci.com
3.85 s
Downloaded cached curl-8.18.0-man (78 KiB) in 164ms
3.86 s
Downloaded cached d3-flame-graph-templates (66 KiB) in 170ms
3.87 s
Downloaded cached gfortran-15.2.0-libgcc (193 KiB) in 179ms
3.88 s
Downloaded cached dejavu-fonts-minimal (742 KiB) in 188ms
3.97 s
Downloaded cached just (5 MiB) in 265ms
4.18 s
Downloaded cached rust-lib-src (43.4 MiB) in 501ms
4.57 s
Downloaded cached cargo-insta (6.2 MiB) in 881ms
4.59 s
Downloaded cached cargo-watch (4.5 MiB) in 904ms
4.67 s
Downloaded cached form (3.8 MiB) in 978ms
4.70 s
Downloaded cached cargo-machete (6.6 MiB) in 1.0s
4.78 s
Downloaded cached cargo-nextest (25.4 MiB) in 1.0s
4.79 s
Downloaded cached bacon (6.8 MiB) in 1.1s
4.88 s
Downloaded cached cargo-edit (9.6 MiB) in 1.1s
5.05 s
Downloaded cached cargo-deny (8.7 MiB) in 1.3s
5.19 s
Downloaded cached cargo-udeps (18.4 MiB) in 1.4s
5.21 s
Downloaded cached maturin (25 MiB) in 1.5s
5.97 s
Building /nix/store/ql6d13l85rdmwi8zldx8nhamfywfys85-cargo-stable-2026-04-16.drv
6.00 s
Building /nix/store/npz4fmndvz4gv04nbdcg5kn66zf1463p-llvm-tools-preview-stable-2026-04-16.drv
6.02 s
Building /nix/store/h6mm3q1vx7gbr6nigssx52c0vly8j2bx-rust-std-stable-2026-04-16.drv
6.06 s
Building /nix/store/2gi9dvwbmsq6mc01w98zagxksda6wmxm-clippy-preview-stable-2026-04-16.drv
6.09 s
Building /nix/store/qi7infc6y0bf5sdf14n4vq99fxp12hgc-rustc-stable-2026-04-16.drv
6.13 s
Building /nix/store/189gy3760f09dic2wc8l0my4a7ckz0qi-builder.pl.drv
6.13 s
Progress: 0 of 73 built (6 building), 1 of 196 downloaded from cache (15 downloading)
6.13 s
Progress: 0 of 73 built (6 building), 2 of 196 downloaded from cache (14 downloading)
6.13 s
Progress: 0 of 73 built (6 building), 3 of 196 downloaded from cache (13 downloading)
6.13 s
Progress: 0 of 73 built (6 building), 4 of 196 downloaded from cache (12 downloading)
6.13 s
Progress: 0 of 73 built (6 building), 5 of 196 downloaded from cache (11 downloading)
6.13 s
Progress: 0 of 73 built (6 building), 6 of 196 downloaded from cache (10 downloading)
6.13 s
Progress: 0 of 73 built (6 building), 7 of 196 downloaded from cache (9 downloading)
6.13 s
Progress: 0 of 73 built (6 building), 8 of 196 downloaded from cache (8 downloading)
6.13 s
Progress: 0 of 73 built (6 building), 9 of 196 downloaded from cache (7 downloading)
6.13 s
Progress: 0 of 73 built (6 building), 10 of 196 downloaded from cache (6 downloading)
6.13 s
Progress: 0 of 73 built (6 building), 11 of 196 downloaded from cache (5 downloading)
6.13 s
Progress: 0 of 73 built (6 building), 12 of 196 downloaded from cache (4 downloading)
6.13 s
Progress: 0 of 73 built (6 building), 13 of 196 downloaded from cache (3 downloading)
6.13 s
Progress: 0 of 73 built (6 building), 14 of 196 downloaded from cache (2 downloading)
6.13 s
Progress: 0 of 73 built (6 building), 15 of 196 downloaded from cache (1 downloading)
6.13 s
Progress: 0 of 73 built (6 building), 16 of 196 downloaded from cache
6.13 s
[cargo-stable-2026-04] Phase: unpackPhase
6.13 s
[cargo-stable-2026-04] unpacking source archive /nix/store/4vl3g92byqysva62839wialijaxipqn6-cargo-1.95.0-x86_64-unknown-linux-gnu.tar.gz
6.13 s
[clippy-preview-stable-2026-04] Phase: unpackPhase
6.13 s
[clippy-preview-stable-2026-04] unpacking source archive /nix/store/phkv8h9n9nnbwgkacn30sdqbixcfqg1z-clippy-1.95.0-x86_64-unknown-linux-gnu.tar.gz
6.13 s
[llvm-tools-preview-stable-2026-04] Phase: unpackPhase
6.13 s
[llvm-tools-preview-stable-2026-04] unpacking source archive /nix/store/bjy28rb6g94imvql2a97j4ndbvpdskry-llvm-tools-1.95.0-x86_64-unknown-linux-gnu.tar.gz
6.13 s
[rust-std-stable-2026-04] Phase: unpackPhase
6.13 s
[rust-std-stable-2026-04] unpacking source archive /nix/store/zjmgjj73r15spm04rig7cfnqh0n4wk9w-rust-std-1.95.0-x86_64-unknown-linux-gnu.tar.gz
6.13 s
Downloading cached bin from https://cache.nix-ci.com
6.13 s
Downloading cached binutils-wrapper from https://cache.nix-ci.com
6.13 s
Downloading cached brotli from https://cache.nix-ci.com
6.13 s
Downloading cached bzip2-1.0.8-dev from https://cache.nix-ci.com
6.13 s
Downloading cached c-ares from https://cache.nix-ci.com
6.13 s
Downloading cached c-ares from https://cache.nix-ci.com
6.13 s
Downloading cached curl-8.18.0-bin from https://cache.nix-ci.com
6.13 s
Downloading cached dav1d from https://cache.nix-ci.com
6.13 s
Downloading cached die-hook from https://cache.nix-ci.com
6.13 s
Downloading cached fribidi from https://cache.nix-ci.com
6.13 s
Downloading cached gettext from https://cache.nix-ci.com
6.13 s
Downloading cached giflib from https://cache.nix-ci.com
6.13 s
Downloading cached glibc-iconv from https://cache.nix-ci.com
6.13 s
Downloading cached glibc-locales-2.42 from https://cache.nix-ci.com
6.13 s
Downloading cached graphite2 from https://cache.nix-ci.com
6.13 s
Downloading cached gumbo from https://cache.nix-ci.com
6.15 s
[rustc-stable-2026-04] Phase: unpackPhase
6.15 s
[rustc-stable-2026-04] unpacking source archive /nix/store/2ks0pzvx70xg3kyfpqzs0apfzqp8aa5h-rustc-1.95.0-x86_64-unknown-linux-gnu.tar.gz
6.15 s
Downloaded cached bin (264 B) in 25ms
6.15 s
Progress: 0 of 61 built (6 building), 17 of 196 downloaded from cache (15 downloading)
6.15 s
Downloading cached fontconfig from https://cache.nix-ci.com
6.16 s
Downloaded cached die-hook (928 B) in 34ms
6.16 s
Downloaded cached c-ares (276 KiB) in 35ms
6.16 s
Progress: 0 of 60 built (6 building), 18 of 196 downloaded from cache (15 downloading)
6.16 s
Downloading cached gfortran-15.2.0-lib from https://cache.nix-ci.com
6.16 s
Progress: 0 of 60 built (6 building), 19 of 196 downloaded from cache (15 downloading)
6.16 s
Downloading cached icu4c from https://cache.nix-ci.com
6.17 s
[builder.pl] Phase: patchPhase
6.17 s
Downloaded cached bzip2-1.0.8-dev (8168 B) in 40ms
6.17 s
Progress: 0 of 60 built (6 building), 20 of 196 downloaded from cache (15 downloading)
6.17 s
Downloading cached jbig2dec from https://cache.nix-ci.com
6.17 s
[builder.pl] Phase: updateAutotoolsGnuConfigScriptsPhase
6.18 s
Downloaded cached gumbo (425 KiB) in 46ms
6.18 s
Progress: 0 of 60 built (6 building), 21 of 196 downloaded from cache (15 downloading)
6.18 s
Downloaded cached fribidi (162 KiB) in 48ms
6.18 s
Downloading cached jemalloc-5.3.0-unstable-2025-09 from https://cache.nix-ci.com
6.18 s
Progress: 0 of 60 built (6 building), 22 of 196 downloaded from cache (15 downloading)
6.18 s
Downloading cached lcms2 from https://cache.nix-ci.com
6.18 s
Downloaded cached brotli (53 KiB) in 50ms
6.18 s
Progress: 0 of 60 built (6 building), 23 of 196 downloaded from cache (15 downloading)
6.18 s
Downloading cached lerc from https://cache.nix-ci.com
6.18 s
Downloaded cached c-ares (382 KiB) in 51ms
6.18 s
Progress: 0 of 60 built (6 building), 24 of 196 downloaded from cache (15 downloading)
6.18 s
Downloading cached brotli-1.2.0-dev from https://cache.nix-ci.com
6.18 s
[builder.pl] Phase: configurePhase
6.19 s
Downloaded cached glibc-iconv (528 B) in 56ms
6.19 s
Progress: 0 of 60 built (6 building), 25 of 196 downloaded from cache (15 downloading)
6.19 s
Downloading cached c-ares-1.34.6-dev from https://cache.nix-ci.com
6.19 s
[builder.pl] no configure script, doing nothing
6.19 s
Downloaded cached graphite2 (227 KiB) in 60ms
6.19 s
Progress: 0 of 60 built (6 building), 26 of 196 downloaded from cache (15 downloading)
6.19 s
Downloaded cached binutils-wrapper (55 KiB) in 62ms
6.19 s
Downloading cached libdatrie-2019-12-20-lib from https://cache.nix-ci.com
6.19 s
Progress: 0 of 60 built (6 building), 27 of 196 downloaded from cache (15 downloading)
6.19 s
Downloading cached libdeflate from https://cache.nix-ci.com
6.19 s
[builder.pl] Phase: buildPhase
6.20 s
Downloaded cached dav1d (2.5 MiB) in 67ms
6.20 s
Progress: 0 of 60 built (6 building), 28 of 196 downloaded from cache (15 downloading)
6.20 s
Downloading cached libedit-20251016 from https://cache.nix-ci.com
6.20 s
[builder.pl] Phase: checkPhase
6.20 s
[cargo-stable-2026-04] source root is cargo-1.95.0-x86_64-unknown-linux-gnu
6.20 s
[clippy-preview-stable-2026-04] source root is clippy-1.95.0-x86_64-unknown-linux-gnu
6.20 s
Downloaded cached glibc-locales-2.42 (2.9 MiB) in 74ms
6.20 s
Progress: 0 of 60 built (6 building), 29 of 196 downloaded from cache (15 downloading)
6.21 s
Downloading cached libev from https://cache.nix-ci.com
6.21 s
[builder.pl] Phase: installPhase
6.21 s
[cargo-stable-2026-04] setting SOURCE_DATE_EPOCH to timestamp 1776196532 of file "cargo-1.95.0-x86_64-unknown-linux-gnu/version"
6.21 s
[builder.pl] no Makefile or custom installPhase, doing nothing
6.21 s
[clippy-preview-stable-2026-04] setting SOURCE_DATE_EPOCH to timestamp 1776196532 of file "clippy-1.95.0-x86_64-unknown-linux-gnu/version"
6.21 s
[builder.pl] Phase: fixupPhase
6.21 s
[cargo-stable-2026-04] Phase: patchPhase
6.21 s
Downloaded cached giflib (407 KiB) in 84ms
6.21 s
Progress: 0 of 59 built (6 building), 30 of 196 downloaded from cache (15 downloading)
6.21 s
Downloading cached libffi-3.5.2-dev from https://cache.nix-ci.com
6.22 s
[clippy-preview-stable-2026-04] Phase: patchPhase
6.22 s
[cargo-stable-2026-04] Phase: updateAutotoolsGnuConfigScriptsPhase
6.22 s
Downloaded cached jbig2dec (383 KiB) in 52ms
6.22 s
Progress: 0 of 59 built (6 building), 31 of 196 downloaded from cache (15 downloading)
6.22 s
Downloading cached libice from https://cache.nix-ci.com
6.22 s
[clippy-preview-stable-2026-04] Phase: updateAutotoolsGnuConfigScriptsPhase
6.22 s
Downloaded cached curl-8.18.0-bin (369 KiB) in 95ms
6.22 s
Progress: 0 of 59 built (6 building), 32 of 196 downloaded from cache (15 downloading)
6.22 s
Downloading cached libidn2-2.3.8-bin from https://cache.nix-ci.com
6.23 s
[builder.pl] shrinking RPATHs of ELF executables and libraries in /nix/store/fcqldgczpc2v9w9fg5nkibc6km2d2k70-builder.pl
6.23 s
[cargo-stable-2026-04] Phase: configurePhase
6.23 s
[builder.pl] checking for references to /build/ in /nix/store/fcqldgczpc2v9w9fg5nkibc6km2d2k70-builder.pl...
6.23 s
[clippy-preview-stable-2026-04] Phase: configurePhase
6.24 s
Downloaded cached brotli-1.2.0-dev (57 KiB) in 55ms
6.24 s
Progress: 0 of 59 built (6 building), 33 of 196 downloaded from cache (15 downloading)
6.24 s
Downloading cached libjpeg-turbo from https://cache.nix-ci.com
6.24 s
[builder.pl] patching script interpreter paths in /nix/store/fcqldgczpc2v9w9fg5nkibc6km2d2k70-builder.pl
6.24 s
[cargo-stable-2026-04] no configure script, doing nothing
6.24 s
Downloaded cached fontconfig (1.2 MiB) in 85ms
6.24 s
Progress: 0 of 59 built (6 building), 34 of 196 downloaded from cache (15 downloading)
6.24 s
[clippy-preview-stable-2026-04] no configure script, doing nothing
6.24 s
[clippy-preview-stable-2026-04] Phase: buildPhase
6.24 s
Downloading cached libpfm from https://cache.nix-ci.com
6.24 s
[cargo-stable-2026-04] Phase: buildPhase
6.24 s
[cargo-stable-2026-04] no Makefile or custom buildPhase, doing nothing
6.24 s
[cargo-stable-2026-04] Phase: installPhase
6.24 s
[clippy-preview-stable-2026-04] no Makefile or custom buildPhase, doing nothing
6.24 s
Downloaded cached lerc (850 KiB) in 66ms
6.24 s
Progress: 0 of 59 built (6 building), 35 of 196 downloaded from cache (15 downloading)
6.25 s
Downloading cached libpng-apng from https://cache.nix-ci.com
6.25 s
[cargo-stable-2026-04] patching script interpreter paths in install.sh
6.25 s
[clippy-preview-stable-2026-04] Phase: installPhase
6.26 s
Downloaded cached c-ares-1.34.6-dev (128 KiB) in 70ms
6.27 s
Downloaded cached libdeflate (458 KiB) in 79ms
6.27 s
Downloaded cached libedit-20251016 (261 KiB) in 75ms
6.28 s
Downloaded cached libev (225 KiB) in 77ms
6.29 s
Downloaded cached libffi-3.5.2-dev (21 KiB) in 72ms
6.29 s
Downloaded cached libidn2-2.3.8-bin (37 KiB) in 63ms
6.29 s
Downloaded cached libice (125 KiB) in 66ms
6.29 s
[builder.pl:post-build] Uploading to the NixCI cache: /nix/store/fcqldgczpc2v9w9fg5nkibc6km2d2k70-builder.pl
6.30 s
Downloaded cached libpng-apng (269 KiB) in 51ms
6.31 s
Downloaded cached jemalloc-5.3.0-unstable-2025-09 (3.7 MiB) in 128ms
6.31 s
Downloaded cached libjpeg-turbo (2 MiB) in 73ms
6.34 s
Downloaded cached libdatrie-2019-12-20-lib (42 KiB) in 144ms
6.34 s
Downloaded cached libpfm (6.4 MiB) in 100ms
6.35 s
Downloaded cached lcms2 (484 KiB) in 168ms
6.35 s
Downloaded cached gettext (18.6 MiB) in 222ms
6.37 s
[builder.pl:post-build] warning: 'warn-short-path-literals' is deprecated, use 'lint-short-path-literals = ignore' instead
6.38 s
Downloaded cached gfortran-15.2.0-lib (13.3 MiB) in 216ms
6.42 s
[builder.pl:post-build] copying 0 paths...
6.49 s
[builder.pl:post-build] warning: 'warn-short-path-literals' is deprecated, use 'lint-short-path-literals = ignore' instead
6.65 s
Downloaded cached icu4c (38.2 MiB) in 488ms
6.66 s
[builder.pl:post-build] copying 0 paths...
6.68 s
Uploaded builder.pl in 419ms
6.68 s
Progress: 1 of 60 built (5 building), 35 of 196 downloaded from cache (16 downloading)
6.68 s
Built builder.pl in 552ms
6.68 s
Progress: 1 of 59 built (5 building), 36 of 196 downloaded from cache (15 downloading)
6.68 s
Progress: 1 of 59 built (5 building), 37 of 196 downloaded from cache (14 downloading)
6.68 s
Progress: 1 of 59 built (5 building), 38 of 196 downloaded from cache (13 downloading)
6.68 s
Progress: 1 of 59 built (5 building), 39 of 196 downloaded from cache (12 downloading)
6.68 s
Progress: 1 of 59 built (5 building), 40 of 196 downloaded from cache (11 downloading)
6.68 s
Progress: 1 of 59 built (5 building), 41 of 196 downloaded from cache (10 downloading)
6.68 s
Progress: 1 of 59 built (5 building), 42 of 196 downloaded from cache (9 downloading)
6.68 s
Progress: 1 of 59 built (5 building), 43 of 196 downloaded from cache (8 downloading)
6.68 s
Progress: 1 of 59 built (5 building), 44 of 196 downloaded from cache (7 downloading)
6.68 s
Progress: 1 of 59 built (5 building), 45 of 196 downloaded from cache (6 downloading)
6.68 s
Progress: 1 of 59 built (5 building), 46 of 196 downloaded from cache (5 downloading)
6.68 s
Progress: 1 of 59 built (5 building), 47 of 196 downloaded from cache (4 downloading)
6.68 s
Progress: 1 of 59 built (5 building), 48 of 196 downloaded from cache (3 downloading)
6.68 s
Progress: 1 of 59 built (5 building), 49 of 196 downloaded from cache (2 downloading)
6.68 s
Progress: 1 of 59 built (5 building), 50 of 196 downloaded from cache (1 downloading)
6.68 s
Progress: 1 of 59 built (5 building), 51 of 196 downloaded from cache
6.68 s
[cargo-stable-2026-04] install.sh: interpreter directive changed from "#!/usr/bin/env bash" to "/nix/store/v8sa6r6q037ihghxfbwzjj4p59v2x0pv-bash-5.3p9/bin/bash"
6.68 s
[cargo-stable-2026-04] install: creating uninstall script at /nix/store/3wrl5dpd4vcfhqb6112ib5kmm3mqfm8h-cargo-stable-2026-04-16/lib/rustlib/uninstall.sh
6.68 s
[cargo-stable-2026-04] install: installing component 'cargo'
6.68 s
[clippy-preview-stable-2026-04] patching script interpreter paths in install.sh
6.68 s
[clippy-preview-stable-2026-04] install.sh: interpreter directive changed from "#!/usr/bin/env bash" to "/nix/store/v8sa6r6q037ihghxfbwzjj4p59v2x0pv-bash-5.3p9/bin/bash"
6.68 s
[clippy-preview-stable-2026-04] install: creating uninstall script at /nix/store/f7bch0my1kay984lcjd60hiry8zaxm2d-clippy-preview-stable-2026-04-16/lib/rustlib/uninstall.sh
6.68 s
[clippy-preview-stable-2026-04] install: installing component 'clippy-preview'
6.68 s
[clippy-preview-stable-2026-04]
6.68 s
[clippy-preview-stable-2026-04] clippy installed.
6.68 s
[clippy-preview-stable-2026-04]
6.68 s
[clippy-preview-stable-2026-04] Phase: fixupPhase
6.68 s
[clippy-preview-stable-2026-04] shrinking RPATHs of ELF executables and libraries in /nix/store/f7bch0my1kay984lcjd60hiry8zaxm2d-clippy-preview-stable-2026-04-16
6.68 s
[clippy-preview-stable-2026-04] shrinking /nix/store/f7bch0my1kay984lcjd60hiry8zaxm2d-clippy-preview-stable-2026-04-16/bin/cargo-clippy
6.68 s
[clippy-preview-stable-2026-04] shrinking /nix/store/f7bch0my1kay984lcjd60hiry8zaxm2d-clippy-preview-stable-2026-04-16/bin/clippy-driver
6.68 s
[clippy-preview-stable-2026-04] checking for references to /build/ in /nix/store/f7bch0my1kay984lcjd60hiry8zaxm2d-clippy-preview-stable-2026-04-16...
6.68 s
[clippy-preview-stable-2026-04] patching script interpreter paths in /nix/store/f7bch0my1kay984lcjd60hiry8zaxm2d-clippy-preview-stable-2026-04-16
6.68 s
[rust-std-stable-2026-04] source root is rust-std-1.95.0-x86_64-unknown-linux-gnu
6.68 s
[rust-std-stable-2026-04] setting SOURCE_DATE_EPOCH to timestamp 1776196532 of file "rust-std-1.95.0-x86_64-unknown-linux-gnu/version"
6.68 s
[rust-std-stable-2026-04] Phase: patchPhase
6.68 s
[rust-std-stable-2026-04] Phase: updateAutotoolsGnuConfigScriptsPhase
6.68 s
[rust-std-stable-2026-04] Phase: configurePhase
6.68 s
[rust-std-stable-2026-04] no configure script, doing nothing
6.68 s
[rust-std-stable-2026-04] Phase: buildPhase
6.68 s
[rust-std-stable-2026-04] no Makefile or custom buildPhase, doing nothing
6.68 s
[rust-std-stable-2026-04] Phase: installPhase
6.68 s
[rust-std-stable-2026-04] patching script interpreter paths in install.sh
6.68 s
[rust-std-stable-2026-04] install.sh: interpreter directive changed from "#!/usr/bin/env bash" to "/nix/store/v8sa6r6q037ihghxfbwzjj4p59v2x0pv-bash-5.3p9/bin/bash"
6.68 s
Downloading cached libpsl-0.21.5-dev from https://cache.nix-ci.com
6.68 s
Downloading cached libselinux from https://cache.nix-ci.com
6.68 s
Downloading cached libssh2-1.11.1-dev from https://cache.nix-ci.com
6.68 s
Downloading cached libtasn1 from https://cache.nix-ci.com
6.68 s
Downloading cached libtool-2.5.4-lib from https://cache.nix-ci.com
6.68 s
Downloading cached libtraceevent from https://cache.nix-ci.com
6.68 s
Downloading cached libuv from https://cache.nix-ci.com
6.68 s
Downloading cached libvmaf from https://cache.nix-ci.com
6.68 s
Downloading cached libxau from https://cache.nix-ci.com
6.68 s
Downloading cached libxdmcp from https://cache.nix-ci.com
6.68 s
Downloading cached llhttp from https://cache.nix-ci.com
6.68 s
Downloading cached lzo from https://cache.nix-ci.com
6.68 s
Downloading cached make-binary-wrapper-hook from https://cache.nix-ci.com
6.68 s
Downloading cached ncompress from https://cache.nix-ci.com
6.68 s
Downloading cached libxcrypt from https://cache.nix-ci.com
6.68 s
Downloading cached nghttp2-1.67.1-lib from https://cache.nix-ci.com
6.70 s
Downloaded cached libpsl-0.21.5-dev (7800 B) in 20ms
6.70 s
Downloaded cached llhttp (89 KiB) in 19ms
6.70 s
Downloaded cached libssh2-1.11.1-dev (83 KiB) in 22ms
6.71 s
Downloaded cached libxau (27 KiB) in 25ms
6.71 s
Downloaded cached libtasn1 (95 KiB) in 29ms
6.71 s
Downloaded cached make-binary-wrapper-hook (18 KiB) in 29ms
6.71 s
Downloaded cached libxdmcp (31 KiB) in 32ms
6.72 s
Downloaded cached libselinux (690 KiB) in 33ms
6.72 s
Downloaded cached lzo (159 KiB) in 33ms
6.72 s
Downloaded cached libuv (271 KiB) in 34ms
6.72 s
Downloaded cached ncompress (74 KiB) in 33ms
6.72 s
Downloaded cached nghttp2-1.67.1-lib (225 KiB) in 34ms
6.72 s
Downloaded cached libtool-2.5.4-lib (56 KiB) in 35ms
6.72 s
Downloaded cached libxcrypt (141 KiB) in 34ms
6.72 s
Downloaded cached libvmaf (2.7 MiB) in 38ms
6.74 s
[clippy-preview-stable-2026-04:post-build] Uploading to the NixCI cache: /nix/store/f7bch0my1kay984lcjd60hiry8zaxm2d-clippy-preview-stable-2026-04-16
6.79 s
[clippy-preview-stable-2026-04:post-build] warning: 'warn-short-path-literals' is deprecated, use 'lint-short-path-literals = ignore' instead
6.80 s
[clippy-preview-stable-2026-04:post-build] copying 1 paths...
6.80 s
[clippy-preview-stable-2026-04:post-build] copying path '/nix/store/f7bch0my1kay984lcjd60hiry8zaxm2d-clippy-preview-stable-2026-04-16' to 'https://cache.nix-ci.com'...
6.81 s
Downloaded cached libtraceevent (609 KiB) in 127ms
13.99 s
[clippy-preview-stable-2026-04:post-build] warning: 'warn-short-path-literals' is deprecated, use 'lint-short-path-literals = ignore' instead
14.04 s
[clippy-preview-stable-2026-04:post-build] copying 0 paths...
14.06 s
Uploaded clippy-preview-stable-2026-04 in 7.3s
14.06 s
Progress: 2 of 60 built (4 building), 51 of 196 downloaded from cache (16 downloading)
14.06 s
Built clippy-preview-stable-2026-04 in 7.9s
14.06 s
Progress: 2 of 59 built (4 building), 52 of 196 downloaded from cache (15 downloading)
14.06 s
Progress: 2 of 59 built (4 building), 53 of 196 downloaded from cache (14 downloading)
14.06 s
Progress: 2 of 59 built (4 building), 54 of 196 downloaded from cache (13 downloading)
14.06 s
Progress: 2 of 59 built (4 building), 55 of 196 downloaded from cache (12 downloading)
14.06 s
Progress: 2 of 59 built (4 building), 56 of 196 downloaded from cache (11 downloading)
14.06 s
Progress: 2 of 59 built (4 building), 57 of 196 downloaded from cache (10 downloading)
14.06 s
Progress: 2 of 59 built (4 building), 58 of 196 downloaded from cache (9 downloading)
14.06 s
Progress: 2 of 59 built (4 building), 59 of 196 downloaded from cache (8 downloading)
14.06 s
Progress: 2 of 59 built (4 building), 60 of 196 downloaded from cache (7 downloading)
14.06 s
Progress: 2 of 59 built (4 building), 61 of 196 downloaded from cache (6 downloading)
14.06 s
Progress: 2 of 59 built (4 building), 62 of 196 downloaded from cache (5 downloading)
14.06 s
Progress: 2 of 59 built (4 building), 63 of 196 downloaded from cache (4 downloading)
14.06 s
Progress: 2 of 59 built (4 building), 64 of 196 downloaded from cache (3 downloading)
14.06 s
Progress: 2 of 59 built (4 building), 65 of 196 downloaded from cache (2 downloading)
14.06 s
Progress: 2 of 59 built (4 building), 66 of 196 downloaded from cache (1 downloading)
14.06 s
Progress: 2 of 59 built (4 building), 67 of 196 downloaded from cache
14.06 s
[cargo-stable-2026-04]
14.06 s
[cargo-stable-2026-04] cargo installed.
14.06 s
[cargo-stable-2026-04]
14.06 s
[cargo-stable-2026-04] Phase: fixupPhase
14.06 s
[cargo-stable-2026-04] shrinking RPATHs of ELF executables and libraries in /nix/store/3wrl5dpd4vcfhqb6112ib5kmm3mqfm8h-cargo-stable-2026-04-16
14.06 s
[cargo-stable-2026-04] shrinking /nix/store/3wrl5dpd4vcfhqb6112ib5kmm3mqfm8h-cargo-stable-2026-04-16/bin/cargo
14.06 s
[cargo-stable-2026-04] checking for references to /build/ in /nix/store/3wrl5dpd4vcfhqb6112ib5kmm3mqfm8h-cargo-stable-2026-04-16...
14.06 s
[cargo-stable-2026-04] gzipping man pages under /nix/store/3wrl5dpd4vcfhqb6112ib5kmm3mqfm8h-cargo-stable-2026-04-16/share/man/
14.06 s
[cargo-stable-2026-04] patching script interpreter paths in /nix/store/3wrl5dpd4vcfhqb6112ib5kmm3mqfm8h-cargo-stable-2026-04-16
14.06 s
[llvm-tools-preview-stable-2026-04] source root is llvm-tools-1.95.0-x86_64-unknown-linux-gnu
14.06 s
[llvm-tools-preview-stable-2026-04] setting SOURCE_DATE_EPOCH to timestamp 1776196532 of file "llvm-tools-1.95.0-x86_64-unknown-linux-gnu/version"
14.06 s
[llvm-tools-preview-stable-2026-04] Phase: patchPhase
14.06 s
[llvm-tools-preview-stable-2026-04] Phase: updateAutotoolsGnuConfigScriptsPhase
14.06 s
[llvm-tools-preview-stable-2026-04] Phase: configurePhase
14.06 s
[llvm-tools-preview-stable-2026-04] no configure script, doing nothing
14.06 s
[llvm-tools-preview-stable-2026-04] Phase: buildPhase
14.06 s
[llvm-tools-preview-stable-2026-04] no Makefile or custom buildPhase, doing nothing
14.06 s
[llvm-tools-preview-stable-2026-04] Phase: installPhase
14.06 s
[llvm-tools-preview-stable-2026-04] patching script interpreter paths in install.sh
14.06 s
[llvm-tools-preview-stable-2026-04] install.sh: interpreter directive changed from "#!/usr/bin/env bash" to "/nix/store/v8sa6r6q037ihghxfbwzjj4p59v2x0pv-bash-5.3p9/bin/bash"
14.06 s
[llvm-tools-preview-stable-2026-04] install: creating uninstall script at /nix/store/hpnm48pzf77gpk22y6xwwsj1xxa280f8-llvm-tools-preview-stable-2026-04-16/lib/rustlib/uninstall.sh
14.06 s
[llvm-tools-preview-stable-2026-04] install: installing component 'llvm-tools-preview'
14.06 s
[llvm-tools-preview-stable-2026-04]
14.06 s
[llvm-tools-preview-stable-2026-04] llvm tools installed.
14.06 s
[llvm-tools-preview-stable-2026-04]
14.06 s
[llvm-tools-preview-stable-2026-04] Phase: fixupPhase
14.06 s
[llvm-tools-preview-stable-2026-04] shrinking RPATHs of ELF executables and libraries in /nix/store/hpnm48pzf77gpk22y6xwwsj1xxa280f8-llvm-tools-preview-stable-2026-04-16
14.06 s
[llvm-tools-preview-stable-2026-04] shrinking /nix/store/hpnm48pzf77gpk22y6xwwsj1xxa280f8-llvm-tools-preview-stable-2026-04-16/lib/rustlib/x86_64-unknown-linux-gnu/bin/llvm-as
14.06 s
[llvm-tools-preview-stable-2026-04] shrinking /nix/store/hpnm48pzf77gpk22y6xwwsj1xxa280f8-llvm-tools-preview-stable-2026-04-16/lib/rustlib/x86_64-unknown-linux-gnu/bin/llvm-ar
14.06 s
[llvm-tools-preview-stable-2026-04] shrinking /nix/store/hpnm48pzf77gpk22y6xwwsj1xxa280f8-llvm-tools-preview-stable-2026-04-16/lib/rustlib/x86_64-unknown-linux-gnu/bin/llvm-dis
14.06 s
[llvm-tools-preview-stable-2026-04] shrinking /nix/store/hpnm48pzf77gpk22y6xwwsj1xxa280f8-llvm-tools-preview-stable-2026-04-16/lib/rustlib/x86_64-unknown-linux-gnu/bin/llvm-profdata
14.06 s
[llvm-tools-preview-stable-2026-04] shrinking /nix/store/hpnm48pzf77gpk22y6xwwsj1xxa280f8-llvm-tools-preview-stable-2026-04-16/lib/rustlib/x86_64-unknown-linux-gnu/bin/llvm-nm
14.06 s
[llvm-tools-preview-stable-2026-04] shrinking /nix/store/hpnm48pzf77gpk22y6xwwsj1xxa280f8-llvm-tools-preview-stable-2026-04-16/lib/rustlib/x86_64-unknown-linux-gnu/bin/llvm-objdump
14.06 s
[llvm-tools-preview-stable-2026-04] shrinking /nix/store/hpnm48pzf77gpk22y6xwwsj1xxa280f8-llvm-tools-preview-stable-2026-04-16/lib/rustlib/x86_64-unknown-linux-gnu/bin/opt
14.06 s
[llvm-tools-preview-stable-2026-04] shrinking /nix/store/hpnm48pzf77gpk22y6xwwsj1xxa280f8-llvm-tools-preview-stable-2026-04-16/lib/rustlib/x86_64-unknown-linux-gnu/bin/llc
14.06 s
[llvm-tools-preview-stable-2026-04] shrinking /nix/store/hpnm48pzf77gpk22y6xwwsj1xxa280f8-llvm-tools-preview-stable-2026-04-16/lib/rustlib/x86_64-unknown-linux-gnu/bin/llvm-link
14.06 s
[llvm-tools-preview-stable-2026-04] shrinking /nix/store/hpnm48pzf77gpk22y6xwwsj1xxa280f8-llvm-tools-preview-stable-2026-04-16/lib/rustlib/x86_64-unknown-linux-gnu/bin/llvm-size
14.06 s
[llvm-tools-preview-stable-2026-04] shrinking /nix/store/hpnm48pzf77gpk22y6xwwsj1xxa280f8-llvm-tools-preview-stable-2026-04-16/lib/rustlib/x86_64-unknown-linux-gnu/bin/llvm-strip
14.06 s
[llvm-tools-preview-stable-2026-04] shrinking /nix/store/hpnm48pzf77gpk22y6xwwsj1xxa280f8-llvm-tools-preview-stable-2026-04-16/lib/rustlib/x86_64-unknown-linux-gnu/bin/llvm-readobj
14.06 s
[llvm-tools-preview-stable-2026-04] shrinking /nix/store/hpnm48pzf77gpk22y6xwwsj1xxa280f8-llvm-tools-preview-stable-2026-04-16/lib/rustlib/x86_64-unknown-linux-gnu/bin/llvm-objcopy
14.06 s
[llvm-tools-preview-stable-2026-04] shrinking /nix/store/hpnm48pzf77gpk22y6xwwsj1xxa280f8-llvm-tools-preview-stable-2026-04-16/lib/rustlib/x86_64-unknown-linux-gnu/bin/llvm-cov
14.06 s
[llvm-tools-preview-stable-2026-04] shrinking /nix/store/hpnm48pzf77gpk22y6xwwsj1xxa280f8-llvm-tools-preview-stable-2026-04-16/lib/rustlib/x86_64-unknown-linux-gnu/lib/libLLVM.so.22.1-rust-1.95.0-stable
14.06 s
[llvm-tools-preview-stable-2026-04] checking for references to /build/ in /nix/store/hpnm48pzf77gpk22y6xwwsj1xxa280f8-llvm-tools-preview-stable-2026-04-16...
14.06 s
[llvm-tools-preview-stable-2026-04] patching script interpreter paths in /nix/store/hpnm48pzf77gpk22y6xwwsj1xxa280f8-llvm-tools-preview-stable-2026-04-16
14.06 s
[rust-std-stable-2026-04] install: creating uninstall script at /nix/store/dbjcar4i1mb1mcm6a3fq9yr37sf7rii8-rust-std-stable-2026-04-16/lib/rustlib/uninstall.sh
14.06 s
[rust-std-stable-2026-04] install: installing component 'rust-std-x86_64-unknown-linux-gnu'
14.06 s
[rust-std-stable-2026-04]
14.06 s
[rust-std-stable-2026-04] rust std installed.
14.06 s
[rust-std-stable-2026-04]
14.06 s
[rust-std-stable-2026-04] Phase: fixupPhase
14.06 s
[rust-std-stable-2026-04] shrinking RPATHs of ELF executables and libraries in /nix/store/dbjcar4i1mb1mcm6a3fq9yr37sf7rii8-rust-std-stable-2026-04-16
14.06 s
[rust-std-stable-2026-04] shrinking /nix/store/dbjcar4i1mb1mcm6a3fq9yr37sf7rii8-rust-std-stable-2026-04-16/lib/rustlib/x86_64-unknown-linux-gnu/lib/libstd-d1237ef7159db0a2.so
14.06 s
[rust-std-stable-2026-04] checking for references to /build/ in /nix/store/dbjcar4i1mb1mcm6a3fq9yr37sf7rii8-rust-std-stable-2026-04-16...
14.06 s
[rust-std-stable-2026-04] patching script interpreter paths in /nix/store/dbjcar4i1mb1mcm6a3fq9yr37sf7rii8-rust-std-stable-2026-04-16
14.06 s
[rustc-stable-2026-04] source root is rustc-1.95.0-x86_64-unknown-linux-gnu
14.06 s
[rustc-stable-2026-04] setting SOURCE_DATE_EPOCH to timestamp 1776196532 of file "rustc-1.95.0-x86_64-unknown-linux-gnu/version"
14.06 s
[rustc-stable-2026-04] Phase: patchPhase
14.06 s
[rustc-stable-2026-04] Phase: updateAutotoolsGnuConfigScriptsPhase
14.06 s
[rustc-stable-2026-04] Phase: configurePhase
14.06 s
[rustc-stable-2026-04] no configure script, doing nothing
14.06 s
[rustc-stable-2026-04] Phase: buildPhase
14.06 s
[rustc-stable-2026-04] no Makefile or custom buildPhase, doing nothing
14.06 s
[rustc-stable-2026-04] Phase: installPhase
14.06 s
[rustc-stable-2026-04] patching script interpreter paths in install.sh
14.06 s
[rustc-stable-2026-04] install.sh: interpreter directive changed from "#!/usr/bin/env bash" to "/nix/store/v8sa6r6q037ihghxfbwzjj4p59v2x0pv-bash-5.3p9/bin/bash"
14.06 s
[rustc-stable-2026-04] install: creating uninstall script at /nix/store/ml0235aw40x9zqz4lkymns40cy1i6j2m-rustc-stable-2026-04-16/lib/rustlib/uninstall.sh
14.06 s
[rustc-stable-2026-04] install: installing component 'rustc'
14.06 s
[rustc-stable-2026-04]
14.06 s
[rustc-stable-2026-04] rustc installed.
14.06 s
[rustc-stable-2026-04]
14.06 s
[rustc-stable-2026-04] warning: entry 48 in symbol table refers to a non-existent section, skipping
14.06 s
[rustc-stable-2026-04] Phase: fixupPhase
14.06 s
[rustc-stable-2026-04] shrinking RPATHs of ELF executables and libraries in /nix/store/ml0235aw40x9zqz4lkymns40cy1i6j2m-rustc-stable-2026-04-16
14.06 s
[rustc-stable-2026-04] shrinking /nix/store/ml0235aw40x9zqz4lkymns40cy1i6j2m-rustc-stable-2026-04-16/bin/rustdoc
14.06 s
[rustc-stable-2026-04] shrinking /nix/store/ml0235aw40x9zqz4lkymns40cy1i6j2m-rustc-stable-2026-04-16/bin/rustc
14.06 s
[rustc-stable-2026-04] shrinking /nix/store/ml0235aw40x9zqz4lkymns40cy1i6j2m-rustc-stable-2026-04-16/lib/libLLVM.so.22.1-rust-1.95.0-stable
14.06 s
[rustc-stable-2026-04] shrinking /nix/store/ml0235aw40x9zqz4lkymns40cy1i6j2m-rustc-stable-2026-04-16/lib/librustc_driver-6108105cd7e839cf.so
14.06 s
[rustc-stable-2026-04] shrinking /nix/store/ml0235aw40x9zqz4lkymns40cy1i6j2m-rustc-stable-2026-04-16/lib/rustlib/x86_64-unknown-linux-gnu/bin/rust-objcopy
14.06 s
[rustc-stable-2026-04] shrinking /nix/store/ml0235aw40x9zqz4lkymns40cy1i6j2m-rustc-stable-2026-04-16/lib/rustlib/x86_64-unknown-linux-gnu/bin/wasm-component-ld
14.06 s
[rustc-stable-2026-04] shrinking /nix/store/ml0235aw40x9zqz4lkymns40cy1i6j2m-rustc-stable-2026-04-16/lib/rustlib/x86_64-unknown-linux-gnu/bin/gcc-ld/wasm-ld
14.06 s
[rustc-stable-2026-04] shrinking /nix/store/ml0235aw40x9zqz4lkymns40cy1i6j2m-rustc-stable-2026-04-16/lib/rustlib/x86_64-unknown-linux-gnu/bin/gcc-ld/ld64.lld
14.06 s
[rustc-stable-2026-04] shrinking /nix/store/ml0235aw40x9zqz4lkymns40cy1i6j2m-rustc-stable-2026-04-16/lib/rustlib/x86_64-unknown-linux-gnu/bin/gcc-ld/ld.lld
14.06 s
[rustc-stable-2026-04] shrinking /nix/store/ml0235aw40x9zqz4lkymns40cy1i6j2m-rustc-stable-2026-04-16/lib/rustlib/x86_64-unknown-linux-gnu/bin/gcc-ld/lld-link
14.06 s
[rustc-stable-2026-04] shrinking /nix/store/ml0235aw40x9zqz4lkymns40cy1i6j2m-rustc-stable-2026-04-16/lib/rustlib/x86_64-unknown-linux-gnu/bin/rust-lld
14.06 s
[rustc-stable-2026-04] shrinking /nix/store/ml0235aw40x9zqz4lkymns40cy1i6j2m-rustc-stable-2026-04-16/libexec/rust-analyzer-proc-macro-srv
14.06 s
[rustc-stable-2026-04] checking for references to /build/ in /nix/store/ml0235aw40x9zqz4lkymns40cy1i6j2m-rustc-stable-2026-04-16...
14.06 s
[rustc-stable-2026-04] gzipping man pages under /nix/store/ml0235aw40x9zqz4lkymns40cy1i6j2m-rustc-stable-2026-04-16/share/man/
14.06 s
[rustc-stable-2026-04] patching script interpreter paths in /nix/store/ml0235aw40x9zqz4lkymns40cy1i6j2m-rustc-stable-2026-04-16
14.06 s
[rustc-stable-2026-04] /nix/store/ml0235aw40x9zqz4lkymns40cy1i6j2m-rustc-stable-2026-04-16/bin/rust-gdb: interpreter directive changed from "#!/bin/sh" to "/nix/store/v8sa6r6q037ihghxfbwzjj4p59v2x0pv-bash-5.3p9/bin/sh"
14.06 s
[rustc-stable-2026-04] /nix/store/ml0235aw40x9zqz4lkymns40cy1i6j2m-rustc-stable-2026-04-16/bin/rust-lldb: interpreter directive changed from "#!/bin/sh" to "/nix/store/v8sa6r6q037ihghxfbwzjj4p59v2x0pv-bash-5.3p9/bin/sh"
14.06 s
[rustc-stable-2026-04] /nix/store/ml0235aw40x9zqz4lkymns40cy1i6j2m-rustc-stable-2026-04-16/bin/rust-gdbgui: interpreter directive changed from "#!/bin/sh" to "/nix/store/v8sa6r6q037ihghxfbwzjj4p59v2x0pv-bash-5.3p9/bin/sh"
14.06 s
Downloading cached dash from https://cache.nix-ci.com
14.06 s
Downloading cached freetype from https://cache.nix-ci.com
14.06 s
Downloading cached gfortran from https://cache.nix-ci.com
14.06 s
Downloading cached icu4c-76.1-dev from https://cache.nix-ci.com
14.06 s
Downloading cached krb5 from https://cache.nix-ci.com
14.06 s
Downloading cached libidn2-2.3.8-dev from https://cache.nix-ci.com
14.06 s
Downloading cached libjpeg-turbo-3.1.3-bin from https://cache.nix-ci.com
14.06 s
Downloading cached libpng-apng-1.6.55-dev from https://cache.nix-ci.com
14.06 s
Downloading cached libthai from https://cache.nix-ci.com
14.06 s
Downloading cached libwebp from https://cache.nix-ci.com
14.06 s
Downloading cached libyuv from https://cache.nix-ci.com
14.06 s
Downloading cached nghttp2 from https://cache.nix-ci.com
14.06 s
Downloading cached nghttp3-1.14.0-dev from https://cache.nix-ci.com
14.06 s
Downloading cached ngtcp2-1.19.0-dev from https://cache.nix-ci.com
14.06 s
Downloading cached nickel from https://cache.nix-ci.com
14.06 s
Downloading cached nickel-1.16.0-nls from https://cache.nix-ci.com
14.09 s
Downloaded cached libidn2-2.3.8-dev (15 KiB) in 22ms
14.09 s
Downloaded cached libjpeg-turbo-3.1.3-bin (340 KiB) in 31ms
14.10 s
Downloaded cached dash (189 KiB) in 37ms
14.10 s
Downloaded cached ngtcp2-1.19.0-dev (271 KiB) in 38ms
14.11 s
Downloaded cached freetype (2.1 MiB) in 50ms
14.11 s
Downloaded cached krb5 (1.3 MiB) in 51ms
14.11 s
Downloaded cached nghttp2 (2.5 MiB) in 51ms
14.12 s
Downloaded cached nghttp3-1.14.0-dev (118 KiB) in 53ms
14.12 s
Downloaded cached libwebp (1.7 MiB) in 56ms
14.12 s
Downloaded cached libthai (637 KiB) in 59ms
14.13 s
Downloaded cached libyuv (3.9 MiB) in 62ms
14.14 s
Downloaded cached libpng-apng-1.6.55-dev (265 KiB) in 77ms
14.14 s
[cargo-stable-2026-04:post-build] Uploading to the NixCI cache: /nix/store/3wrl5dpd4vcfhqb6112ib5kmm3mqfm8h-cargo-stable-2026-04-16
14.19 s
Downloaded cached icu4c-76.1-dev (5.8 MiB) in 130ms
14.19 s
[cargo-stable-2026-04:post-build] warning: 'warn-short-path-literals' is deprecated, use 'lint-short-path-literals = ignore' instead
14.20 s
[cargo-stable-2026-04:post-build] copying 1 paths...
14.20 s
[cargo-stable-2026-04:post-build] copying path '/nix/store/3wrl5dpd4vcfhqb6112ib5kmm3mqfm8h-cargo-stable-2026-04-16' to 'https://cache.nix-ci.com'...
14.82 s
Downloaded cached nickel (29.9 MiB) in 753ms
15.05 s
Downloaded cached nickel-1.16.0-nls (18.3 MiB) in 990ms
17.00 s
Downloaded cached gfortran (315.5 MiB) in 2.9s
26.31 s
[cargo-stable-2026-04:post-build] warning: 'warn-short-path-literals' is deprecated, use 'lint-short-path-literals = ignore' instead
26.45 s
[cargo-stable-2026-04:post-build] copying 0 paths...
26.71 s
Uploaded cargo-stable-2026-04 in 12.5s
26.71 s
Progress: 3 of 59 built (3 building), 67 of 196 downloaded from cache (16 downloading)
26.71 s
Built cargo-stable-2026-04 in 20.7s
27.03 s
[llvm-tools-preview-stable-2026-04:post-build] Uploading to the NixCI cache: /nix/store/hpnm48pzf77gpk22y6xwwsj1xxa280f8-llvm-tools-preview-stable-2026-04-16
27.58 s
[llvm-tools-preview-stable-2026-04:post-build] warning: 'warn-short-path-literals' is deprecated, use 'lint-short-path-literals = ignore' instead
27.62 s
[llvm-tools-preview-stable-2026-04:post-build] copying 1 paths...
27.62 s
[llvm-tools-preview-stable-2026-04:post-build] copying path '/nix/store/hpnm48pzf77gpk22y6xwwsj1xxa280f8-llvm-tools-preview-stable-2026-04-16' to 'https://cache.nix-ci.com'...
45.75 s
[llvm-tools-preview-stable-2026-04:post-build] warning: 'warn-short-path-literals' is deprecated, use 'lint-short-path-literals = ignore' instead
45.93 s
[llvm-tools-preview-stable-2026-04:post-build] copying 0 paths...
46.14 s
Uploaded llvm-tools-preview-stable-2026-04 in 19.2s
46.14 s
Progress: 4 of 60 built (2 building), 67 of 196 downloaded from cache (16 downloading)
46.14 s
Built llvm-tools-preview-stable-2026-04 in 40.1s
46.40 s
[rust-std-stable-2026-04:post-build] Uploading to the NixCI cache: /nix/store/dbjcar4i1mb1mcm6a3fq9yr37sf7rii8-rust-std-stable-2026-04-16
46.81 s
[rust-std-stable-2026-04:post-build] warning: 'warn-short-path-literals' is deprecated, use 'lint-short-path-literals = ignore' instead
46.83 s
[rust-std-stable-2026-04:post-build] copying 1 paths...
46.83 s
[rust-std-stable-2026-04:post-build] copying path '/nix/store/dbjcar4i1mb1mcm6a3fq9yr37sf7rii8-rust-std-stable-2026-04-16' to 'https://cache.nix-ci.com'...
79.18 s
[rust-std-stable-2026-04:post-build] warning: 'warn-short-path-literals' is deprecated, use 'lint-short-path-literals = ignore' instead
79.66 s
[rust-std-stable-2026-04:post-build] copying 0 paths...
79.82 s
Uploaded rust-std-stable-2026-04 in 33.4s
79.82 s
Progress: 5 of 61 built (1 building), 67 of 196 downloaded from cache (16 downloading)
79.82 s
Built rust-std-stable-2026-04 in 1m13s
80.40 s
[rustc-stable-2026-04:post-build] Uploading to the NixCI cache: /nix/store/ml0235aw40x9zqz4lkymns40cy1i6j2m-rustc-stable-2026-04-16
80.54 s
[rustc-stable-2026-04:post-build] warning: 'warn-short-path-literals' is deprecated, use 'lint-short-path-literals = ignore' instead
80.57 s
[rustc-stable-2026-04:post-build] copying 1 paths...
80.57 s
[rustc-stable-2026-04:post-build] copying path '/nix/store/ml0235aw40x9zqz4lkymns40cy1i6j2m-rustc-stable-2026-04-16' to 'https://cache.nix-ci.com'...
191.83 s
[rustc-stable-2026-04:post-build] warning: 'warn-short-path-literals' is deprecated, use 'lint-short-path-literals = ignore' instead
192.04 s
[rustc-stable-2026-04:post-build] copying 0 paths...
192.30 s
Uploaded rustc-stable-2026-04 in 1m51s
192.31 s
Progress: 6 of 62 built, 67 of 196 downloaded from cache (16 downloading)
192.31 s
Built rustc-stable-2026-04 in 3m06s
192.41 s
Building /nix/store/3xjwbp6zzdm40n100w1impxhc3gjx875-clippy-stable-with-std-2026-04-16.drv
192.48 s
Building /nix/store/rsavhzfm11z2rwj5r7slqd13gzj54q55-rust-stable-with-std-2026-04-16.drv
192.60 s
Building /nix/store/fdcly8l996mcdvzzn5rcndl0x9418ys7-rustfmt-preview-stable-2026-04-16.drv
192.60 s
Progress: 6 of 58 built (3 building), 68 of 196 downloaded from cache (15 downloading)
192.60 s
Progress: 6 of 58 built (3 building), 69 of 196 downloaded from cache (14 downloading)
192.60 s
Progress: 6 of 58 built (3 building), 70 of 196 downloaded from cache (13 downloading)
192.60 s
Progress: 6 of 58 built (3 building), 71 of 196 downloaded from cache (12 downloading)
192.60 s
Progress: 6 of 58 built (3 building), 72 of 196 downloaded from cache (11 downloading)
192.60 s
Progress: 6 of 58 built (3 building), 73 of 196 downloaded from cache (10 downloading)
192.60 s
Progress: 6 of 58 built (3 building), 74 of 196 downloaded from cache (9 downloading)
192.60 s
Progress: 6 of 58 built (3 building), 75 of 196 downloaded from cache (8 downloading)
192.60 s
Progress: 6 of 58 built (3 building), 76 of 196 downloaded from cache (7 downloading)
192.60 s
Progress: 6 of 58 built (3 building), 77 of 196 downloaded from cache (6 downloading)
192.60 s
Progress: 6 of 58 built (3 building), 78 of 196 downloaded from cache (5 downloading)
192.60 s
Progress: 6 of 58 built (3 building), 79 of 196 downloaded from cache (4 downloading)
192.60 s
Progress: 6 of 58 built (3 building), 80 of 196 downloaded from cache (3 downloading)
192.60 s
Progress: 6 of 58 built (3 building), 81 of 196 downloaded from cache (2 downloading)
192.60 s
Progress: 6 of 58 built (3 building), 82 of 196 downloaded from cache (1 downloading)
192.60 s
Progress: 6 of 58 built (3 building), 83 of 196 downloaded from cache
192.61 s
Downloading cached glib from https://cache.nix-ci.com
192.61 s
Downloading cached libaom from https://cache.nix-ci.com
192.61 s
Downloading cached libuv-1.52.0-dev from https://cache.nix-ci.com
192.61 s
Downloading cached libxcb from https://cache.nix-ci.com
192.61 s
Downloading cached nspr from https://cache.nix-ci.com
192.61 s
Downloading cached poppler-data from https://cache.nix-ci.com
192.61 s
Downloading cached python3.13-idna from https://cache.nix-ci.com
192.61 s
Downloading cached python3.13-charset-normalizer from https://cache.nix-ci.com
192.61 s
Downloading cached nghttp2 from https://cache.nix-ci.com
192.61 s
Downloading cached python3.13-filelock from https://cache.nix-ci.com
192.61 s
Downloading cached llhttp-9.3.1-dev from https://cache.nix-ci.com
192.62 s
Downloading cached nss-cacert from https://cache.nix-ci.com
192.62 s
Downloading cached perl from https://cache.nix-ci.com
192.62 s
Downloading cached pixman from https://cache.nix-ci.com
192.62 s
Downloading cached p11-kit from https://cache.nix-ci.com
192.62 s
Downloading cached python3.13-distlib from https://cache.nix-ci.com
192.68 s
Downloaded cached libuv-1.52.0-dev (109 KiB) in 71ms
192.70 s
Downloaded cached python3.13-idna (919 KiB) in 90ms
192.72 s
Downloaded cached nspr (349 KiB) in 109ms
192.72 s
Downloaded cached llhttp-9.3.1-dev (37 KiB) in 110ms
192.73 s
Downloaded cached libxcb (1.4 MiB) in 120ms
192.73 s
Downloaded cached nss-cacert (732 KiB) in 115ms
192.74 s
Downloaded cached python3.13-charset-normalizer (800 KiB) in 123ms
192.74 s
Downloaded cached pixman (858 KiB) in 121ms
192.75 s
Downloaded cached python3.13-distlib (1.3 MiB) in 132ms
192.78 s
Downloaded cached python3.13-filelock (148 KiB) in 166ms
192.82 s
Building /nix/store/v2bggyh4x9dllhrb6anc5xlh707bv74w-nls-1.16.0.drv
192.82 s
Progress: 6 of 55 built (4 building), 84 of 196 downloaded from cache (15 downloading)
192.82 s
Progress: 6 of 55 built (4 building), 85 of 196 downloaded from cache (14 downloading)
192.82 s
Progress: 6 of 55 built (4 building), 86 of 196 downloaded from cache (13 downloading)
192.82 s
Progress: 6 of 55 built (4 building), 87 of 196 downloaded from cache (12 downloading)
192.82 s
Progress: 6 of 55 built (4 building), 88 of 196 downloaded from cache (11 downloading)
192.82 s
Progress: 6 of 55 built (4 building), 89 of 196 downloaded from cache (10 downloading)
192.82 s
Progress: 6 of 55 built (4 building), 90 of 196 downloaded from cache (9 downloading)
192.82 s
Progress: 6 of 55 built (4 building), 91 of 196 downloaded from cache (8 downloading)
192.82 s
Progress: 6 of 55 built (4 building), 92 of 196 downloaded from cache (7 downloading)
192.82 s
Progress: 6 of 55 built (4 building), 93 of 196 downloaded from cache (6 downloading)
192.86 s
Downloaded cached nghttp2 (2.5 MiB) in 244ms
193.03 s
Downloaded cached libaom (8.4 MiB) in 416ms
193.03 s
Downloaded cached p11-kit (5.7 MiB) in 408ms
193.07 s
[clippy-stable-with-std-2026-04:post-build] Uploading to the NixCI cache: /nix/store/db9w6h5vy5q54h5zlf9lgcml4rqr87zx-clippy-stable-with-std-2026-04-16
193.07 s
Downloaded cached glib (15.1 MiB) in 460ms
193.10 s
Downloaded cached poppler-data (12.4 MiB) in 489ms
193.36 s
[clippy-stable-with-std-2026-04:post-build] warning: 'warn-short-path-literals' is deprecated, use 'lint-short-path-literals = ignore' instead
193.59 s
[clippy-stable-with-std-2026-04:post-build] copying 1 paths...
193.59 s
[clippy-stable-with-std-2026-04:post-build] copying path '/nix/store/db9w6h5vy5q54h5zlf9lgcml4rqr87zx-clippy-stable-with-std-2026-04-16' to 'https://cache.nix-ci.com'...
193.62 s
Downloaded cached perl (55 MiB) in 1.0s
234.99 s
[clippy-stable-with-std-2026-04:post-build] warning: 'warn-short-path-literals' is deprecated, use 'lint-short-path-literals = ignore' instead
237.36 s
[clippy-stable-with-std-2026-04:post-build] copying 1 paths...
237.36 s
[clippy-stable-with-std-2026-04:post-build] copying path '/nix/store/3xjwbp6zzdm40n100w1impxhc3gjx875-clippy-stable-with-std-2026-04-16.drv' to 'https://cache.nix-ci.com'...
241.11 s
Uploaded clippy-stable-with-std-2026-04 in 48.0s
241.13 s
Progress: 7 of 56 built (3 building), 93 of 196 downloaded from cache (6 downloading)
241.13 s
Built clippy-stable-with-std-2026-04 in 48.7s
241.30 s
[rust-stable-with-std-2026-04:post-build] Uploading to the NixCI cache: /nix/store/0hvff0g2yddi0054ccrvzf3zypjpdq2g-rust-stable-with-std-2026-04-16
241.34 s
[rust-stable-with-std-2026-04:post-build] warning: 'warn-short-path-literals' is deprecated, use 'lint-short-path-literals = ignore' instead
241.36 s
[rust-stable-with-std-2026-04:post-build] copying 0 paths...
241.41 s
[rust-stable-with-std-2026-04:post-build] warning: 'warn-short-path-literals' is deprecated, use 'lint-short-path-literals = ignore' instead
241.48 s
[rust-stable-with-std-2026-04:post-build] copying 0 paths...
241.50 s
Uploaded rust-stable-with-std-2026-04 in 215ms
241.50 s
Progress: 8 of 57 built (2 building), 93 of 196 downloaded from cache (6 downloading)
241.50 s
Built rust-stable-with-std-2026-04 in 49.0s
241.50 s
[rustfmt-preview-stable-2026-04] Phase: unpackPhase
241.50 s
[rustfmt-preview-stable-2026-04] unpacking source archive /nix/store/1rp58nbb2w3cxikdzg7rsk91535i2xql-rustfmt-1.95.0-x86_64-unknown-linux-gnu.tar.gz
241.50 s
[rustfmt-preview-stable-2026-04] source root is rustfmt-1.95.0-x86_64-unknown-linux-gnu
241.50 s
[rustfmt-preview-stable-2026-04] setting SOURCE_DATE_EPOCH to timestamp 1776196532 of file "rustfmt-1.95.0-x86_64-unknown-linux-gnu/version"
241.50 s
[rustfmt-preview-stable-2026-04] Phase: patchPhase
241.50 s
[rustfmt-preview-stable-2026-04] Phase: updateAutotoolsGnuConfigScriptsPhase
241.50 s
[rustfmt-preview-stable-2026-04] Phase: configurePhase
241.50 s
[rustfmt-preview-stable-2026-04] no configure script, doing nothing
241.50 s
[rustfmt-preview-stable-2026-04] Phase: buildPhase
241.50 s
[rustfmt-preview-stable-2026-04] no Makefile or custom buildPhase, doing nothing
241.50 s
[rustfmt-preview-stable-2026-04] Phase: installPhase
241.50 s
[rustfmt-preview-stable-2026-04] patching script interpreter paths in install.sh
241.50 s
[rustfmt-preview-stable-2026-04] install.sh: interpreter directive changed from "#!/usr/bin/env bash" to "/nix/store/v8sa6r6q037ihghxfbwzjj4p59v2x0pv-bash-5.3p9/bin/bash"
241.50 s
Downloading cached fontconfig-2.17.1-lib from https://cache.nix-ci.com
241.50 s
Downloading cached freetype-2.13.3-dev from https://cache.nix-ci.com
241.50 s
Downloading cached gfortran-wrapper from https://cache.nix-ci.com
241.50 s
Downloading cached krb5-1.22.1-dev from https://cache.nix-ci.com
241.50 s
Downloading cached libjpeg-turbo-3.1.3-dev from https://cache.nix-ci.com
241.50 s
Downloading cached libtiff from https://cache.nix-ci.com
241.50 s
Downloading cached nghttp2-1.67.1-dev from https://cache.nix-ci.com
241.50 s
Downloading cached python3.13-mccabe from https://cache.nix-ci.com
241.50 s
Downloading cached python3.13-packaging from https://cache.nix-ci.com
241.50 s
Downloading cached python3.13-platformdirs from https://cache.nix-ci.com
241.50 s
Progress: 8 of 52 built (2 building), 94 of 196 downloaded from cache (15 downloading)
241.50 s
Progress: 8 of 52 built (2 building), 95 of 196 downloaded from cache (14 downloading)
241.50 s
Progress: 8 of 52 built (2 building), 96 of 196 downloaded from cache (13 downloading)
241.50 s
Progress: 8 of 52 built (2 building), 97 of 196 downloaded from cache (12 downloading)
241.50 s
Progress: 8 of 52 built (2 building), 98 of 196 downloaded from cache (11 downloading)
241.50 s
Progress: 8 of 52 built (2 building), 99 of 196 downloaded from cache (10 downloading)
241.53 s
Downloaded cached libjpeg-turbo-3.1.3-dev (216 KiB) in 28ms
241.53 s
[nls:post-build] Uploading to the NixCI cache: /nix/store/nd5wyzd5mhfpdmn8j451bmrmfhgmip5h-nls-1.16.0
241.53 s
Downloaded cached gfortran-wrapper (74 KiB) in 30ms
241.53 s
Downloaded cached python3.13-mccabe (56 KiB) in 30ms
241.53 s
Downloaded cached fontconfig-2.17.1-lib (414 KiB) in 32ms
241.53 s
Downloaded cached krb5-1.22.1-dev (748 KiB) in 35ms
241.53 s
Downloaded cached freetype-2.13.3-dev (879 KiB) in 35ms
241.54 s
Downloaded cached libtiff (739 KiB) in 36ms
241.54 s
Downloaded cached python3.13-platformdirs (254 KiB) in 44ms
241.55 s
Downloaded cached nghttp2-1.67.1-dev (241 KiB) in 47ms
241.55 s
Downloaded cached python3.13-packaging (698 KiB) in 53ms
241.57 s
[nls:post-build] warning: 'warn-short-path-literals' is deprecated, use 'lint-short-path-literals = ignore' instead
241.90 s
[nls:post-build] copying 0 paths...
241.95 s
[nls:post-build] warning: 'warn-short-path-literals' is deprecated, use 'lint-short-path-literals = ignore' instead
242.57 s
[nls:post-build] copying 5 paths...
242.57 s
[nls:post-build] copying path '/nix/store/faqqgn7irvcwkh08sbxw8ygfafpg9rz6-source.drv' to 'https://cache.nix-ci.com'...
243.79 s
[nls:post-build] copying path '/nix/store/sd1db5qhi8y4xbn2l4pram7v0gssyf9d-nickel-1.16.0-vendor-staging.drv' to 'https://cache.nix-ci.com'...
245.25 s
[nls:post-build] copying path '/nix/store/m0mvd88anflk1fg5ljh78c5rdyx52xq3-nickel-1.16.0-vendor.drv' to 'https://cache.nix-ci.com'...
246.93 s
[nls:post-build] copying path '/nix/store/jhha9mml0rq57y2sffq50rj3ifcbxy50-nickel-1.16.0.drv' to 'https://cache.nix-ci.com'...
248.67 s
[nls:post-build] copying path '/nix/store/v2bggyh4x9dllhrb6anc5xlh707bv74w-nls-1.16.0.drv' to 'https://cache.nix-ci.com'...
250.28 s
Uploaded nls in 8.7s
250.28 s
Progress: 9 of 53 built (1 building), 99 of 196 downloaded from cache (10 downloading)
250.28 s
Built nls in 57.4s
250.28 s
[rustfmt-preview-stable-2026-04] install: creating uninstall script at /nix/store/arnrhrc4q754k7fb16v0f0pf2g138w2i-rustfmt-preview-stable-2026-04-16/lib/rustlib/uninstall.sh
250.28 s
[rustfmt-preview-stable-2026-04] install: installing component 'rustfmt-preview'
250.28 s
[rustfmt-preview-stable-2026-04]
250.28 s
[rustfmt-preview-stable-2026-04] rustfmt installed.
250.28 s
[rustfmt-preview-stable-2026-04]
250.28 s
[rustfmt-preview-stable-2026-04] Phase: fixupPhase
250.28 s
[rustfmt-preview-stable-2026-04] shrinking RPATHs of ELF executables and libraries in /nix/store/arnrhrc4q754k7fb16v0f0pf2g138w2i-rustfmt-preview-stable-2026-04-16
250.28 s
[rustfmt-preview-stable-2026-04] shrinking /nix/store/arnrhrc4q754k7fb16v0f0pf2g138w2i-rustfmt-preview-stable-2026-04-16/bin/cargo-fmt
250.28 s
[rustfmt-preview-stable-2026-04] shrinking /nix/store/arnrhrc4q754k7fb16v0f0pf2g138w2i-rustfmt-preview-stable-2026-04-16/bin/rustfmt
250.28 s
[rustfmt-preview-stable-2026-04] checking for references to /build/ in /nix/store/arnrhrc4q754k7fb16v0f0pf2g138w2i-rustfmt-preview-stable-2026-04-16...
250.28 s
[rustfmt-preview-stable-2026-04] patching script interpreter paths in /nix/store/arnrhrc4q754k7fb16v0f0pf2g138w2i-rustfmt-preview-stable-2026-04-16
250.28 s
Downloading cached libx11 from https://cache.nix-ci.com
250.28 s
Downloading cached libxcb-1.17.0-dev from https://cache.nix-ci.com
250.29 s
Progress: 9 of 51 built (1 building), 100 of 196 downloaded from cache (15 downloading)
250.29 s
Progress: 9 of 51 built (1 building), 101 of 196 downloaded from cache (14 downloading)
250.29 s
Progress: 9 of 51 built (1 building), 102 of 196 downloaded from cache (13 downloading)
250.29 s
Progress: 9 of 51 built (1 building), 103 of 196 downloaded from cache (12 downloading)
250.29 s
Progress: 9 of 51 built (1 building), 104 of 196 downloaded from cache (11 downloading)
250.29 s
Progress: 9 of 51 built (1 building), 105 of 196 downloaded from cache (10 downloading)
250.29 s
Progress: 9 of 51 built (1 building), 106 of 196 downloaded from cache (9 downloading)
250.29 s
Progress: 9 of 51 built (1 building), 107 of 196 downloaded from cache (8 downloading)
250.29 s
Downloading cached python3.13-pyflakes from https://cache.nix-ci.com
250.29 s
Progress: 9 of 51 built (1 building), 108 of 196 downloaded from cache (7 downloading)
250.29 s
Progress: 9 of 51 built (1 building), 109 of 196 downloaded from cache (6 downloading)
250.29 s
Downloading cached python3.13-certifi from https://cache.nix-ci.com
250.29 s
Downloading cached nspr-4.38.2-dev from https://cache.nix-ci.com
250.29 s
Downloading cached python3.13-pycodestyle from https://cache.nix-ci.com
250.36 s
Downloaded cached python3.13-pycodestyle (324 KiB) in 70ms
250.37 s
Downloaded cached python3.13-certifi (529 KiB) in 82ms
250.37 s
[rustfmt-preview-stable-2026-04:post-build] Uploading to the NixCI cache: /nix/store/arnrhrc4q754k7fb16v0f0pf2g138w2i-rustfmt-preview-stable-2026-04-16
250.37 s
Downloaded cached nspr-4.38.2-dev (576 KiB) in 84ms
250.37 s
Downloaded cached python3.13-pyflakes (1.1 MiB) in 88ms
250.38 s
Downloaded cached libxcb-1.17.0-dev (2.1 MiB) in 90ms
250.40 s
Downloaded cached libx11 (2.6 MiB) in 115ms
250.79 s
[rustfmt-preview-stable-2026-04:post-build] warning: 'warn-short-path-literals' is deprecated, use 'lint-short-path-literals = ignore' instead
250.85 s
[rustfmt-preview-stable-2026-04:post-build] copying 1 paths...
250.85 s
[rustfmt-preview-stable-2026-04:post-build] copying path '/nix/store/arnrhrc4q754k7fb16v0f0pf2g138w2i-rustfmt-preview-stable-2026-04-16' to 'https://cache.nix-ci.com'...
254.98 s
[rustfmt-preview-stable-2026-04:post-build] warning: 'warn-short-path-literals' is deprecated, use 'lint-short-path-literals = ignore' instead
255.24 s
[rustfmt-preview-stable-2026-04:post-build] copying 1 paths...
255.24 s
[rustfmt-preview-stable-2026-04:post-build] copying path '/nix/store/fdcly8l996mcdvzzn5rcndl0x9418ys7-rustfmt-preview-stable-2026-04-16.drv' to 'https://cache.nix-ci.com'...
255.68 s
Uploaded rustfmt-preview-stable-2026-04 in 5.3s
255.68 s
Progress: 10 of 52 built, 109 of 196 downloaded from cache (6 downloading)
255.68 s
Built rustfmt-preview-stable-2026-04 in 1m03s
255.68 s
Downloading cached babeltrace from https://cache.nix-ci.com
255.68 s
Downloading cached gts from https://cache.nix-ci.com
255.68 s
Downloading cached python3.13-pysocks from https://cache.nix-ci.com
255.68 s
Downloading cached python3.13-tomli-w from https://cache.nix-ci.com
255.68 s
Downloading cached glib-2.86.3-bin from https://cache.nix-ci.com
255.68 s
Downloading cached nss from https://cache.nix-ci.com
255.68 s
Downloading cached harfbuzz from https://cache.nix-ci.com
255.69 s
Downloading cached python3.13-tomli from https://cache.nix-ci.com
255.69 s
Downloading cached python3.13-urllib3 from https://cache.nix-ci.com
255.69 s
Downloading cached nghttp2-1.67.1-dev from https://cache.nix-ci.com
255.75 s
Downloaded cached python3.13-pysocks (134 KiB) in 72ms
255.76 s
Downloaded cached gts (440 KiB) in 77ms
255.79 s
Building /nix/store/7ra9z7n7f0mhpwdawfybbl2z1kmmxsb6-rust-stable-with-components-2026-04-16.drv
255.79 s
Progress: 10 of 50 built (1 building), 110 of 196 downloaded from cache (15 downloading)
255.79 s
Progress: 10 of 50 built (1 building), 111 of 196 downloaded from cache (14 downloading)
255.79 s
Progress: 10 of 50 built (1 building), 112 of 196 downloaded from cache (13 downloading)
255.79 s
Progress: 10 of 50 built (1 building), 113 of 196 downloaded from cache (12 downloading)
255.79 s
Progress: 10 of 50 built (1 building), 114 of 196 downloaded from cache (11 downloading)
255.79 s
Progress: 10 of 50 built (1 building), 115 of 196 downloaded from cache (10 downloading)
255.79 s
Progress: 10 of 50 built (1 building), 116 of 196 downloaded from cache (9 downloading)
255.79 s
Progress: 10 of 50 built (1 building), 117 of 196 downloaded from cache (8 downloading)
255.79 s
Downloading cached curl-8.18.0-dev from https://cache.nix-ci.com
255.79 s
Downloading cached fontconfig-2.17.1-bin from https://cache.nix-ci.com
255.79 s
Downloading cached libwebp from https://cache.nix-ci.com
255.79 s
Downloading cached libtiff-4.7.1-bin from https://cache.nix-ci.com
255.79 s
Downloading cached lcms2-2.18-bin from https://cache.nix-ci.com
255.79 s
Downloading cached gdk-pixbuf from https://cache.nix-ci.com
255.79 s
Downloading cached openjpeg from https://cache.nix-ci.com
255.79 s
Downloading cached python3.13-virtualenv from https://cache.nix-ci.com
255.85 s
[rust-stable-with-components-2026-04] /nix/store/0hvff0g2yddi0054ccrvzf3zypjpdq2g-rust-stable-with-std-2026-04-16/bin:
255.85 s
[rust-stable-with-components-2026-04] rustdoc: Keeping existing link to /nix/store/db9w6h5vy5q54h5zlf9lgcml4rqr87zx-clippy-stable-with-std-2026-04-16/bin/rustdoc
255.85 s
[rust-stable-with-components-2026-04] rustc: Keeping existing link to /nix/store/db9w6h5vy5q54h5zlf9lgcml4rqr87zx-clippy-stable-with-std-2026-04-16/bin/rustc
255.85 s
[rust-stable-with-components-2026-04] rust-gdb: Keeping existing link to /nix/store/db9w6h5vy5q54h5zlf9lgcml4rqr87zx-clippy-stable-with-std-2026-04-16/bin/rust-gdb
255.85 s
[rust-stable-with-components-2026-04] rust-lldb: Keeping existing link to /nix/store/db9w6h5vy5q54h5zlf9lgcml4rqr87zx-clippy-stable-with-std-2026-04-16/bin/rust-lldb
255.85 s
[rust-stable-with-components-2026-04] rust-gdbgui: Keeping existing link to /nix/store/db9w6h5vy5q54h5zlf9lgcml4rqr87zx-clippy-stable-with-std-2026-04-16/bin/rust-gdbgui
255.85 s
[rust-stable-with-components-2026-04] /nix/store/0hvff0g2yddi0054ccrvzf3zypjpdq2g-rust-stable-with-std-2026-04-16/lib:
255.85 s
[rust-stable-with-components-2026-04] librustc_driver-6108105cd7e839cf.so: Keeping existing link to /nix/store/db9w6h5vy5q54h5zlf9lgcml4rqr87zx-clippy-stable-with-std-2026-04-16/lib/librustc_driver-6108105cd7e839cf.so
256.23 s
Downloaded cached nghttp2-1.67.1-dev (241 KiB) in 546ms
256.24 s
Downloaded cached python3.13-tomli-w (39 KiB) in 563ms
256.25 s
Downloaded cached glib-2.86.3-bin (582 KiB) in 569ms
256.26 s
Downloaded cached python3.13-tomli (114 KiB) in 571ms
256.26 s
Downloaded cached babeltrace (885 KiB) in 578ms
256.26 s
Downloaded cached lcms2-2.18-bin (205 KiB) in 467ms
256.26 s
Downloaded cached curl-8.18.0-dev (274 KiB) in 472ms
256.26 s
Downloaded cached fontconfig-2.17.1-bin (201 KiB) in 472ms
256.26 s
Downloaded cached libtiff-4.7.1-bin (734 KiB) in 474ms
256.29 s
Downloaded cached python3.13-urllib3 (1.3 MiB) in 598ms
256.30 s
Downloaded cached openjpeg (1.6 MiB) in 509ms
256.31 s
Downloaded cached libwebp (1.7 MiB) in 521ms
256.34 s
Downloaded cached gdk-pixbuf (2.8 MiB) in 547ms
256.35 s
Downloaded cached harfbuzz (3.6 MiB) in 668ms
256.44 s
Downloaded cached nss (4 MiB) in 751ms
256.45 s
Downloaded cached python3.13-virtualenv (7 MiB) in 654ms
256.61 s
[rust-stable-with-components-2026-04:post-build] Uploading to the NixCI cache: /nix/store/qqq8y0xm1n3y9wy8a7hb05clyr9dbcb9-rust-stable-with-components-2026-04-16
257.03 s
[rust-stable-with-components-2026-04:post-build] warning: 'warn-short-path-literals' is deprecated, use 'lint-short-path-literals = ignore' instead
257.44 s
[rust-stable-with-components-2026-04:post-build] copying 1 paths...
257.44 s
[rust-stable-with-components-2026-04:post-build] copying path '/nix/store/qqq8y0xm1n3y9wy8a7hb05clyr9dbcb9-rust-stable-with-components-2026-04-16' to 'https://cache.nix-ci.com'...
280.05 s
[rust-stable-with-components-2026-04:post-build] warning: 'warn-short-path-literals' is deprecated, use 'lint-short-path-literals = ignore' instead
280.30 s
[rust-stable-with-components-2026-04:post-build] copying 1 paths...
280.30 s
[rust-stable-with-components-2026-04:post-build] copying path '/nix/store/7ra9z7n7f0mhpwdawfybbl2z1kmmxsb6-rust-stable-with-components-2026-04-16.drv' to 'https://cache.nix-ci.com'...
280.60 s
Uploaded rust-stable-with-components-2026-04 in 24.1s
280.60 s
Progress: 11 of 49 built, 117 of 196 downloaded from cache (16 downloading)
280.60 s
Built rust-stable-with-components-2026-04 in 24.8s
280.60 s
Progress: 11 of 48 built, 118 of 196 downloaded from cache (15 downloading)
280.60 s
Progress: 11 of 48 built, 119 of 196 downloaded from cache (14 downloading)
280.60 s
Progress: 11 of 48 built, 120 of 196 downloaded from cache (13 downloading)
280.60 s
Progress: 11 of 48 built, 121 of 196 downloaded from cache (12 downloading)
280.60 s
Progress: 11 of 48 built, 122 of 196 downloaded from cache (11 downloading)
280.60 s
Progress: 11 of 48 built, 123 of 196 downloaded from cache (10 downloading)
280.60 s
Progress: 11 of 48 built, 124 of 196 downloaded from cache (9 downloading)
280.60 s
Progress: 11 of 48 built, 125 of 196 downloaded from cache (8 downloading)
280.60 s
Progress: 11 of 48 built, 126 of 196 downloaded from cache (7 downloading)
280.60 s
Progress: 11 of 48 built, 127 of 196 downloaded from cache (6 downloading)
280.60 s
Progress: 11 of 48 built, 128 of 196 downloaded from cache (5 downloading)
280.60 s
Progress: 11 of 48 built, 129 of 196 downloaded from cache (4 downloading)
280.60 s
Progress: 11 of 48 built, 130 of 196 downloaded from cache (3 downloading)
280.60 s
Progress: 11 of 48 built, 131 of 196 downloaded from cache (2 downloading)
280.60 s
Progress: 11 of 48 built, 132 of 196 downloaded from cache (1 downloading)
280.60 s
Progress: 11 of 48 built, 133 of 196 downloaded from cache
280.60 s
Downloading cached libxext from https://cache.nix-ci.com
280.60 s
Downloading cached libxpm from https://cache.nix-ci.com
280.60 s
Downloading cached libxrender from https://cache.nix-ci.com
280.60 s
Downloading cached python3.13-flake8 from https://cache.nix-ci.com
280.60 s
Downloading cached rust-analyzer-unwrapped-2026-04 from https://cache.nix-ci.com
280.60 s
Downloading cached rust-script from https://cache.nix-ci.com
280.60 s
Downloading cached simdjson from https://cache.nix-ci.com
280.60 s
Downloading cached simdutf from https://cache.nix-ci.com
280.60 s
Downloading cached simdutf from https://cache.nix-ci.com
280.60 s
Downloading cached slang from https://cache.nix-ci.com
280.60 s
Downloading cached sqlite-3.51.2-bin from https://cache.nix-ci.com
280.60 s
Downloading cached tdf from https://cache.nix-ci.com
280.60 s
Downloading cached tinymist from https://cache.nix-ci.com
280.60 s
Downloading cached typst from https://cache.nix-ci.com
280.60 s
Downloading cached typstyle from https://cache.nix-ci.com
280.60 s
Downloading cached unzip from https://cache.nix-ci.com
280.64 s
Building /nix/store/yk80nm71i5w6mwbs9ns7xiqx6b2l7gpm-python3-3.13.12-env.drv
280.71 s
[python3-3.13.12-env] created 219 symlinks in user environment
280.81 s
Downloaded cached libxrender (53 KiB) in 209ms
280.81 s
Progress: 11 of 44 built (1 building), 134 of 196 downloaded from cache (15 downloading)
280.81 s
Downloading cached fontconfig-2.17.1-dev from https://cache.nix-ci.com
280.81 s
Downloaded cached libxext (93 KiB) in 210ms
280.81 s
Progress: 11 of 44 built (1 building), 135 of 196 downloaded from cache (15 downloading)
280.81 s
Downloaded cached libxpm (87 KiB) in 210ms
280.81 s
Downloading cached glib-2.86.3-dev from https://cache.nix-ci.com
280.81 s
Progress: 11 of 44 built (1 building), 136 of 196 downloaded from cache (15 downloading)
280.81 s
Downloading cached cairo from https://cache.nix-ci.com
280.82 s
Downloaded cached python3.13-flake8 (584 KiB) in 220ms
280.82 s
Progress: 11 of 44 built (1 building), 137 of 196 downloaded from cache (15 downloading)
280.82 s
Downloading cached lcms2-2.18-dev from https://cache.nix-ci.com
280.83 s
Downloaded cached simdutf (977 KiB) in 224ms
280.83 s
Downloaded cached unzip (522 KiB) in 225ms
280.83 s
Downloaded cached fontconfig-2.17.1-dev (41 KiB) in 18ms
280.84 s
Downloaded cached simdjson (7.5 MiB) in 235ms
280.86 s
Building /nix/store/19zchzyn7wdgg4qzv3kyviinysn1bfv5-pythoncheck.sh.drv
280.89 s
Downloaded cached simdutf (1.3 MiB) in 282ms
280.90 s
Downloaded cached sqlite-3.51.2-bin (2.1 MiB) in 293ms
280.90 s
Building /nix/store/j85bbhxgp0p728kjmx83l4p8xkkkww3d-pythoncheck.sh.drv
280.90 s
Progress: 11 of 43 built (3 building), 138 of 196 downloaded from cache (15 downloading)
280.90 s
Progress: 11 of 43 built (3 building), 139 of 196 downloaded from cache (14 downloading)
280.90 s
Progress: 11 of 43 built (3 building), 140 of 196 downloaded from cache (13 downloading)
280.90 s
Progress: 11 of 43 built (3 building), 141 of 196 downloaded from cache (12 downloading)
280.90 s
Progress: 11 of 43 built (3 building), 142 of 196 downloaded from cache (11 downloading)
280.90 s
Progress: 11 of 43 built (3 building), 143 of 196 downloaded from cache (10 downloading)
280.90 s
Downloading cached libavif from https://cache.nix-ci.com
280.90 s
Downloading cached libglvnd from https://cache.nix-ci.com
280.90 s
Downloading cached libtiff-4.7.1-dev from https://cache.nix-ci.com
280.90 s
Downloading cached libxft from https://cache.nix-ci.com
280.90 s
Downloading cached libxrandr from https://cache.nix-ci.com
280.90 s
Downloading cached libxi from https://cache.nix-ci.com
280.91 s
Downloaded cached cairo (2.1 MiB) in 98ms
280.95 s
Building /nix/store/bmm67vlw4cskrzndim01vlg7mnzv45qx-clinnet-0.1.8.tar.gz.drv
280.95 s
Progress: 11 of 42 built (4 building), 144 of 196 downloaded from cache (15 downloading)
280.98 s
Downloaded cached typstyle (2.2 MiB) in 374ms
280.98 s
Downloaded cached slang (2.7 MiB) in 378ms
280.98 s
[pythoncheck.sh:post-build] Uploading to the NixCI cache: /nix/store/dnvwgdyw359bs0915q7rvz1m2pfwpl4i-pythoncheck.sh
281.01 s
Downloaded cached glib-2.86.3-dev (15 MiB) in 193ms
281.04 s
[pythoncheck.sh:post-build] warning: 'warn-short-path-literals' is deprecated, use 'lint-short-path-literals = ignore' instead
281.05 s
Downloaded cached rust-script (3.3 MiB) in 448ms
281.06 s
Downloaded cached lcms2-2.18-dev (137 KiB) in 238ms
281.07 s
Downloaded cached libxi (87 KiB) in 169ms
281.07 s
Downloaded cached libtiff-4.7.1-dev (106 KiB) in 170ms
281.07 s
Downloaded cached libxrandr (62 KiB) in 170ms
281.08 s
Downloaded cached libxft (151 KiB) in 173ms
281.08 s
Downloaded cached libavif (1011 KiB) in 175ms
281.08 s
Downloaded cached libglvnd (2.5 MiB) in 183ms
281.39 s
[pythoncheck.sh:post-build] copying 0 paths...
281.45 s
[pythoncheck.sh:post-build] warning: 'warn-short-path-literals' is deprecated, use 'lint-short-path-literals = ignore' instead
281.50 s
Downloaded cached tdf (13.4 MiB) in 894ms
281.52 s
[pythoncheck.sh:post-build] copying 0 paths...
281.54 s
Uploaded pythoncheck.sh in 575ms
281.54 s
Progress: 12 of 43 built (3 building), 144 of 196 downloaded from cache (15 downloading)
281.54 s
Built pythoncheck.sh in 675ms
281.54 s
Downloading cached ada from https://cache.nix-ci.com
281.58 s
Building /nix/store/32b99pzvd3ql22i43zdrhij0m6sf2y7j-pythoncheck.sh.drv
281.58 s
Progress: 12 of 42 built (4 building), 145 of 196 downloaded from cache (15 downloading)
281.58 s
Progress: 12 of 42 built (4 building), 146 of 196 downloaded from cache (14 downloading)
281.58 s
Progress: 12 of 42 built (4 building), 147 of 196 downloaded from cache (13 downloading)
281.58 s
Progress: 12 of 42 built (4 building), 148 of 196 downloaded from cache (12 downloading)
281.58 s
Progress: 12 of 42 built (4 building), 149 of 196 downloaded from cache (11 downloading)
281.58 s
Progress: 12 of 42 built (4 building), 150 of 196 downloaded from cache (10 downloading)
281.58 s
Progress: 12 of 42 built (4 building), 151 of 196 downloaded from cache (9 downloading)
281.58 s
Progress: 12 of 42 built (4 building), 152 of 196 downloaded from cache (8 downloading)
281.58 s
Progress: 12 of 42 built (4 building), 153 of 196 downloaded from cache (7 downloading)
281.58 s
Progress: 12 of 42 built (4 building), 154 of 196 downloaded from cache (6 downloading)
281.58 s
Progress: 12 of 42 built (4 building), 155 of 196 downloaded from cache (5 downloading)
281.58 s
Progress: 12 of 42 built (4 building), 156 of 196 downloaded from cache (4 downloading)
281.58 s
[clinnet] structuredAttrs is enabled
281.58 s
[clinnet]
281.58 s
[clinnet] trying https://crates.io/api/v1/crates/clinnet/0.1.8/download
281.58 s
[clinnet] % Total % Received % Xferd Average Speed Time Time Time Current
281.58 s
[clinnet] Dload Upload Total Spent Left Speed
281.58 s
[clinnet] 0 0 0 0 0 0 0 0 0
281.58 s
[clinnet] 100 220.2k 100 220.2k 0 0 925.7k 0 0
281.58 s
[clinnet] unpacking source archive /build/download.tar.gz
281.63 s
[python3-3.13.12-env:post-build] Uploading to the NixCI cache: /nix/store/bs39qcqk1wkfsclss94xcc8zv0iqjszi-python3-3.13.12-env
281.69 s
[python3-3.13.12-env:post-build] warning: 'warn-short-path-literals' is deprecated, use 'lint-short-path-literals = ignore' instead
281.75 s
Downloaded cached ada (1.3 MiB) in 210ms
281.94 s
Downloaded cached rust-analyzer-unwrapped-2026-04 (48.6 MiB) in 1.3s
282.04 s
[python3-3.13.12-env:post-build] copying 0 paths...
282.20 s
Downloaded cached typst (42.4 MiB) in 1.5s
282.81 s
[python3-3.13.12-env:post-build] warning: 'warn-short-path-literals' is deprecated, use 'lint-short-path-literals = ignore' instead
282.95 s
[python3-3.13.12-env:post-build] copying 0 paths...
283.09 s
Uploaded python3-3.13.12-env in 1.4s
283.09 s
Progress: 13 of 43 built (3 building), 156 of 196 downloaded from cache (4 downloading)
283.09 s
Built python3-3.13.12-env in 2.4s
283.22 s
[pythoncheck.sh:post-build] Uploading to the NixCI cache: /nix/store/q10f0fqrld4bvqnlq5l2dblplvi9d8pg-pythoncheck.sh
283.87 s
[pythoncheck.sh:post-build] warning: 'warn-short-path-literals' is deprecated, use 'lint-short-path-literals = ignore' instead
284.36 s
[pythoncheck.sh:post-build] copying 0 paths...
285.12 s
[pythoncheck.sh:post-build] warning: 'warn-short-path-literals' is deprecated, use 'lint-short-path-literals = ignore' instead
285.27 s
[pythoncheck.sh:post-build] copying 0 paths...
285.55 s
Uploaded pythoncheck.sh in 2.4s
285.55 s
Progress: 14 of 44 built (2 building), 156 of 196 downloaded from cache (4 downloading)
285.55 s
Built pythoncheck.sh in 4.6s
285.55 s
Downloading cached openjpeg-2.5.4-dev from https://cache.nix-ci.com
285.55 s
Downloading cached zlib-ng from https://cache.nix-ci.com
285.55 s
Downloading cached uvwasi from https://cache.nix-ci.com
285.55 s
Downloading cached mupdf from https://cache.nix-ci.com
285.55 s
Downloading cached gd from https://cache.nix-ci.com
285.55 s
Downloading cached xorgproto from https://cache.nix-ci.com
285.55 s
Downloading cached sqlite-3.51.2-dev from https://cache.nix-ci.com
285.55 s
Downloading cached poppler-utils from https://cache.nix-ci.com
285.55 s
Downloading cached uv from https://cache.nix-ci.com
285.55 s
Downloading cached libxxf86vm from https://cache.nix-ci.com
285.55 s
Downloading cached nss-3.112.3-dev from https://cache.nix-ci.com
285.55 s
Downloading cached python3.13-requests from https://cache.nix-ci.com
285.63 s
Downloaded cached libxxf86vm (40 KiB) in 77ms
285.63 s
Downloaded cached zlib-ng (192 KiB) in 85ms
285.64 s
Downloaded cached gd (545 KiB) in 89ms
285.64 s
Downloaded cached openjpeg-2.5.4-dev (79 KiB) in 92ms
285.67 s
Building /nix/store/vima4rg4yl2aqm1bbfzwpj71ivg612pw-pythoncheck.sh.drv
285.67 s
Progress: 14 of 39 built (3 building), 157 of 196 downloaded from cache (15 downloading)
285.67 s
Progress: 14 of 39 built (3 building), 158 of 196 downloaded from cache (14 downloading)
285.67 s
Progress: 14 of 39 built (3 building), 159 of 196 downloaded from cache (13 downloading)
285.67 s
Progress: 14 of 39 built (3 building), 160 of 196 downloaded from cache (12 downloading)
285.67 s
Progress: 14 of 39 built (3 building), 161 of 196 downloaded from cache (11 downloading)
285.67 s
Progress: 14 of 39 built (3 building), 162 of 196 downloaded from cache (10 downloading)
285.67 s
Progress: 14 of 39 built (3 building), 163 of 196 downloaded from cache (9 downloading)
285.71 s
Downloaded cached nss-3.112.3-dev (1.4 MiB) in 162ms
285.72 s
Downloaded cached xorgproto (1.6 MiB) in 164ms
285.74 s
[clinnet:post-build] Uploading to the NixCI cache: /nix/store/2i132kj3rylcpf3q5yy61794w9j2mg0v-clinnet-0.1.8.tar.gz
285.90 s
Downloaded cached uvwasi (238 KiB) in 352ms
285.90 s
Downloaded cached sqlite-3.51.2-dev (695 KiB) in 352ms
285.91 s
Downloaded cached python3.13-requests (623 KiB) in 361ms
286.09 s
Downloaded cached poppler-utils (6.3 MiB) in 542ms
286.28 s
[clinnet:post-build] warning: 'warn-short-path-literals' is deprecated, use 'lint-short-path-literals = ignore' instead
286.33 s
[clinnet:post-build] copying 1 paths...
286.33 s
[clinnet:post-build] copying path '/nix/store/2i132kj3rylcpf3q5yy61794w9j2mg0v-clinnet-0.1.8.tar.gz' to 'https://cache.nix-ci.com'...
286.86 s
Downloaded cached tinymist (170.2 MiB) in 6.2s
287.35 s
[clinnet:post-build] warning: 'warn-short-path-literals' is deprecated, use 'lint-short-path-literals = ignore' instead
287.37 s
Downloaded cached mupdf (51.4 MiB) in 1.8s
287.40 s
Downloaded cached uv (64.6 MiB) in 1.8s
287.80 s
[clinnet:post-build] copying 1 paths...
287.80 s
[clinnet:post-build] copying path '/nix/store/bmm67vlw4cskrzndim01vlg7mnzv45qx-clinnet-0.1.8.tar.gz.drv' to 'https://cache.nix-ci.com'...
288.45 s
Uploaded clinnet in 2.7s
288.45 s
Progress: 15 of 40 built (2 building), 163 of 196 downloaded from cache (9 downloading)
288.45 s
Built clinnet in 7.5s
288.57 s
[pythoncheck.sh:post-build] Uploading to the NixCI cache: /nix/store/mghfpkj4kp134ivyfmqi8px0cvzv6i4v-pythoncheck.sh
288.85 s
[pythoncheck.sh:post-build] warning: 'warn-short-path-literals' is deprecated, use 'lint-short-path-literals = ignore' instead
289.10 s
[pythoncheck.sh:post-build] copying 0 paths...
289.83 s
[pythoncheck.sh:post-build] warning: 'warn-short-path-literals' is deprecated, use 'lint-short-path-literals = ignore' instead
290.03 s
[pythoncheck.sh:post-build] copying 0 paths...
290.29 s
Uploaded pythoncheck.sh in 1.8s
290.31 s
Progress: 16 of 41 built (1 building), 163 of 196 downloaded from cache (9 downloading)
290.31 s
Built pythoncheck.sh in 8.7s
290.31 s
Downloading cached perf-linux from https://cache.nix-ci.com
290.31 s
Downloading cached rust-analyzer-2026-04 from https://cache.nix-ci.com
290.31 s
Downloading cached pango from https://cache.nix-ci.com
290.31 s
Progress: 16 of 38 built (1 building), 164 of 196 downloaded from cache (13 downloading)
290.31 s
Progress: 16 of 38 built (1 building), 165 of 196 downloaded from cache (12 downloading)
290.31 s
Progress: 16 of 38 built (1 building), 166 of 196 downloaded from cache (11 downloading)
290.31 s
Progress: 16 of 38 built (1 building), 167 of 196 downloaded from cache (10 downloading)
290.31 s
Progress: 16 of 38 built (1 building), 168 of 196 downloaded from cache (9 downloading)
290.31 s
Progress: 16 of 38 built (1 building), 169 of 196 downloaded from cache (8 downloading)
290.31 s
Progress: 16 of 38 built (1 building), 170 of 196 downloaded from cache (7 downloading)
290.31 s
Progress: 16 of 38 built (1 building), 171 of 196 downloaded from cache (6 downloading)
290.31 s
Progress: 16 of 38 built (1 building), 172 of 196 downloaded from cache (5 downloading)
290.31 s
Downloading cached git-minimal from https://cache.nix-ci.com
290.31 s
Downloading cached freeglut-mupdf-3.0.0-r13ae6aa2c2f9a7b4266fc2e6116c876237f40477 from https://cache.nix-ci.com
290.45 s
[pythoncheck.sh:post-build] Uploading to the NixCI cache: /nix/store/v0z6h8wypyfgp1c9nrdn3kj1mrggcld0-pythoncheck.sh
290.62 s
Downloaded cached pango (907 KiB) in 308ms
290.62 s
Downloaded cached freeglut-mupdf-3.0.0-r13ae6aa2c2f9a7b4266fc2e6116c876237f40477 (1.1 MiB) in 308ms
290.75 s
Downloaded cached rust-analyzer-2026-04 (768 B) in 439ms
290.76 s
Downloaded cached perf-linux (11.8 MiB) in 456ms
290.84 s
[pythoncheck.sh:post-build] warning: 'warn-short-path-literals' is deprecated, use 'lint-short-path-literals = ignore' instead
291.06 s
[pythoncheck.sh:post-build] copying 0 paths...
291.07 s
Downloaded cached git-minimal (51.5 MiB) in 758ms
291.84 s
[pythoncheck.sh:post-build] warning: 'warn-short-path-literals' is deprecated, use 'lint-short-path-literals = ignore' instead
291.95 s
[pythoncheck.sh:post-build] copying 0 paths...
292.17 s
Uploaded pythoncheck.sh in 1.8s
292.17 s
Progress: 17 of 39 built, 172 of 196 downloaded from cache (5 downloading)
292.17 s
Built pythoncheck.sh in 6.5s
292.17 s
Downloading cached libx11-1.8.13-dev from https://cache.nix-ci.com
292.18 s
Downloading cached libxau-1.0.12-dev from https://cache.nix-ci.com
292.18 s
Downloading cached nodejs-slim from https://cache.nix-ci.com
292.25 s
Building /nix/store/0kbyqb7gpywcm8rbdni3iydmr057wqyb-python3-3.13.12-env.drv
292.28 s
Downloaded cached libxau-1.0.12-dev (7000 B) in 104ms
292.28 s
Downloaded cached libx11-1.8.13-dev (250 KiB) in 109ms
292.31 s
Building /nix/store/8cxsihcvxack3k922snf9g88lql7plba-replace-workspace-values.drv
292.31 s
Progress: 17 of 35 built (2 building), 173 of 196 downloaded from cache (7 downloading)
292.31 s
Progress: 17 of 35 built (2 building), 174 of 196 downloaded from cache (6 downloading)
292.31 s
Progress: 17 of 35 built (2 building), 175 of 196 downloaded from cache (5 downloading)
292.31 s
Progress: 17 of 35 built (2 building), 176 of 196 downloaded from cache (4 downloading)
292.31 s
Progress: 17 of 35 built (2 building), 177 of 196 downloaded from cache (3 downloading)
292.31 s
Progress: 17 of 35 built (2 building), 178 of 196 downloaded from cache (2 downloading)
292.31 s
Progress: 17 of 35 built (2 building), 179 of 196 downloaded from cache (1 downloading)
292.31 s
Downloading cached nix-prefetch-git from https://cache.nix-ci.com
292.31 s
Downloading cached mupdf-1.27.2-bin from https://cache.nix-ci.com
292.32 s
Downloading cached libxrender-0.9.12-dev from https://cache.nix-ci.com
292.32 s
Downloading cached libxext-1.3.7-dev from https://cache.nix-ci.com
292.34 s
[python3-3.13.12-env] created 241 symlinks in user environment
292.34 s
Downloading cached cargo-flamegraph from https://cache.nix-ci.com
292.36 s
Downloading cached graphviz from https://cache.nix-ci.com
292.67 s
Downloaded cached libxrender-0.9.12-dev (35 KiB) in 350ms
292.67 s
Progress: 17 of 34 built (2 building), 180 of 196 downloaded from cache (6 downloading)
292.67 s
Downloaded cached libxext-1.3.7-dev (58 KiB) in 351ms
292.67 s
Progress: 17 of 34 built (2 building), 181 of 196 downloaded from cache (5 downloading)
292.68 s
Downloading cached cairo-1.18.4-dev from https://cache.nix-ci.com
292.71 s
Downloaded cached mupdf-1.27.2-bin (833 KiB) in 399ms
292.71 s
Progress: 17 of 34 built (2 building), 182 of 196 downloaded from cache (5 downloading)
292.71 s
Downloading cached mupdf-1.27.2-dev from https://cache.nix-ci.com
292.72 s
Downloaded cached nix-prefetch-git (19 KiB) in 404ms
292.72 s
Progress: 17 of 34 built (2 building), 183 of 196 downloaded from cache (5 downloading)
292.88 s
Downloaded cached graphviz (7.2 MiB) in 521ms
292.89 s
Progress: 17 of 33 built (2 building), 184 of 196 downloaded from cache (4 downloading)
292.95 s
Downloaded cached cargo-flamegraph (5.4 MiB) in 607ms
292.95 s
Progress: 17 of 32 built (2 building), 185 of 196 downloaded from cache (3 downloading)
292.98 s
Downloaded cached cairo-1.18.4-dev (184 KiB) in 299ms
292.98 s
Progress: 17 of 31 built (2 building), 186 of 196 downloaded from cache (2 downloading)
292.98 s
Downloading cached poppler-utils-25.10.0-dev from https://cache.nix-ci.com
292.99 s
Downloaded cached mupdf-1.27.2-dev (758 KiB) in 273ms
292.99 s
Progress: 17 of 31 built (2 building), 187 of 196 downloaded from cache (2 downloading)
293.23 s
[replace-workspace-values:post-build] Uploading to the NixCI cache: /nix/store/nal4dxi3l18hz19ld26di9n37ixr0afh-replace-workspace-values
293.27 s
Downloaded cached poppler-utils-25.10.0-dev (1.7 MiB) in 283ms
293.57 s
Downloaded cached nodejs-slim (81.2 MiB) in 1.3s
293.60 s
[replace-workspace-values:post-build] warning: 'warn-short-path-literals' is deprecated, use 'lint-short-path-literals = ignore' instead
294.04 s
[replace-workspace-values:post-build] copying 0 paths...
294.60 s
[replace-workspace-values:post-build] warning: 'warn-short-path-literals' is deprecated, use 'lint-short-path-literals = ignore' instead
294.69 s
[replace-workspace-values:post-build] copying 0 paths...
294.95 s
Uploaded replace-workspace-values in 1.8s
294.95 s
Progress: 18 of 31 built (1 building), 187 of 196 downloaded from cache (2 downloading)
294.95 s
Built replace-workspace-values in 2.6s
294.95 s
Progress: 18 of 30 built (1 building), 188 of 196 downloaded from cache (1 downloading)
294.95 s
Progress: 18 of 30 built (1 building), 189 of 196 downloaded from cache
295.10 s
[python3-3.13.12-env:post-build] Uploading to the NixCI cache: /nix/store/rfh8283cg3amd71cmhq2ypr98p7036k7-python3-3.13.12-env
295.71 s
[python3-3.13.12-env:post-build] warning: 'warn-short-path-literals' is deprecated, use 'lint-short-path-literals = ignore' instead
296.67 s
[python3-3.13.12-env:post-build] copying 0 paths...
297.03 s
[python3-3.13.12-env:post-build] warning: 'warn-short-path-literals' is deprecated, use 'lint-short-path-literals = ignore' instead
297.24 s
[python3-3.13.12-env:post-build] copying 0 paths...
297.48 s
Uploaded python3-3.13.12-env in 2.4s
297.49 s
Progress: 19 of 31 built, 189 of 196 downloaded from cache
297.49 s
Built python3-3.13.12-env in 5.2s
297.49 s
Downloading cached nodejs-slim-24.14.0-corepack from https://cache.nix-ci.com
297.49 s
Downloading cached nodejs-slim-24.14.0-npm from https://cache.nix-ci.com
297.55 s
Building /nix/store/bhi611ynwipaff55yy429jp3f3z4a296-fetch-cargo-vendor-util.drv
297.77 s
Downloaded cached nodejs-slim-24.14.0-corepack (1 MiB) in 287ms
297.77 s
Progress: 19 of 29 built (1 building), 190 of 196 downloaded from cache (1 downloading)
297.96 s
[fetch-cargo-vendor-util:post-build] Uploading to the NixCI cache: /nix/store/rpickx0wnl28rz29529irv9s97w7fdk6-fetch-cargo-vendor-util
298.01 s
Downloaded cached nodejs-slim-24.14.0-npm (9.8 MiB) in 523ms
298.36 s
[fetch-cargo-vendor-util:post-build] warning: 'warn-short-path-literals' is deprecated, use 'lint-short-path-literals = ignore' instead
298.85 s
[fetch-cargo-vendor-util:post-build] copying 0 paths...
299.21 s
[fetch-cargo-vendor-util:post-build] warning: 'warn-short-path-literals' is deprecated, use 'lint-short-path-literals = ignore' instead
299.37 s
[fetch-cargo-vendor-util:post-build] copying 0 paths...
299.56 s
Uploaded fetch-cargo-vendor-util in 1.6s
299.57 s
Progress: 20 of 30 built, 190 of 196 downloaded from cache (1 downloading)
299.57 s
Built fetch-cargo-vendor-util in 2.0s
299.97 s
Building /nix/store/yjiiziqs3wdx3szv6j8mp3m8z043pgil-clinnet-0.1.8-vendor-staging.drv
300.06 s
Building /nix/store/w8ay1a2bcj97lnz283pg9fq55wqha9qx-rscls-0.2.3-vendor.drv
300.06 s
Progress: 20 of 29 built (2 building), 191 of 196 downloaded from cache
300.06 s
[clinnet-0.1.8-vendor-staging] Phase: unpackPhase
300.06 s
[clinnet-0.1.8-vendor-staging] unpacking source archive /nix/store/2i132kj3rylcpf3q5yy61794w9j2mg0v-clinnet-0.1.8.tar.gz
300.06 s
[clinnet-0.1.8-vendor-staging] source root is clinnet-0.1.8.tar.gz
300.06 s
[clinnet-0.1.8-vendor-staging] Phase: patchPhase
300.06 s
[clinnet-0.1.8-vendor-staging] Phase: updateAutotoolsGnuConfigScriptsPhase
300.06 s
[clinnet-0.1.8-vendor-staging] Phase: buildPhase
300.06 s
Downloading cached nodejs from https://cache.nix-ci.com
300.32 s
[clinnet-0.1.8-vendor-staging] Skipping local dependency: clinnet
300.33 s
[rscls-0.2.3-vendor] Unpacking to /nix/store/xjddmzd1ry904d9kwbrp8g6ph7zdk3jm-rscls-0.2.3-vendor/source-registry-0/anstream-0.6.21
300.34 s
[rscls-0.2.3-vendor] Unpacking to /nix/store/xjddmzd1ry904d9kwbrp8g6ph7zdk3jm-rscls-0.2.3-vendor/source-registry-0/anstyle-1.0.13
300.35 s
[rscls-0.2.3-vendor] Unpacking to /nix/store/xjddmzd1ry904d9kwbrp8g6ph7zdk3jm-rscls-0.2.3-vendor/source-registry-0/anstyle-parse-0.2.7
300.36 s
[clinnet-0.1.8-vendor-staging] Fetching https://crates.io/api/v1/crates/anstream/0.6.21/download -> tarballs/anstream-0.6.21.tar.gz
300.36 s
[clinnet-0.1.8-vendor-staging] Fetching https://crates.io/api/v1/crates/arrayref/0.3.9/download -> tarballs/arrayref-0.3.9.tar.gz
300.36 s
[clinnet-0.1.8-vendor-staging] Fetching https://crates.io/api/v1/crates/colorchoice/1.0.4/download -> tarballs/colorchoice-1.0.4.tar.gz
300.36 s
[clinnet-0.1.8-vendor-staging] Fetching https://crates.io/api/v1/crates/cc/1.2.45/download -> tarballs/cc-1.2.45.tar.gz
300.36 s
[clinnet-0.1.8-vendor-staging] Fetching https://crates.io/api/v1/crates/crossbeam-utils/0.8.21/download -> tarballs/crossbeam-utils-0.8.21.tar.gz
300.36 s
[rscls-0.2.3-vendor] Unpacking to /nix/store/xjddmzd1ry904d9kwbrp8g6ph7zdk3jm-rscls-0.2.3-vendor/source-registry-0/anstyle-query-1.1.5
300.37 s
[rscls-0.2.3-vendor] Unpacking to /nix/store/xjddmzd1ry904d9kwbrp8g6ph7zdk3jm-rscls-0.2.3-vendor/source-registry-0/anstyle-wincon-3.0.11
300.38 s
Downloaded cached nodejs (772 KiB) in 315ms
300.38 s
[rscls-0.2.3-vendor] Unpacking to /nix/store/xjddmzd1ry904d9kwbrp8g6ph7zdk3jm-rscls-0.2.3-vendor/source-registry-0/bitflags-1.3.2
300.38 s
Progress: 20 of 29 built (2 building), 192 of 196 downloaded from cache
300.38 s
Downloading cached yaml-language-server from https://cache.nix-ci.com
300.38 s
Downloading cached pyright-internal from https://cache.nix-ci.com
300.38 s
Downloading cached dot-language-server from https://cache.nix-ci.com
300.39 s
[rscls-0.2.3-vendor] Unpacking to /nix/store/xjddmzd1ry904d9kwbrp8g6ph7zdk3jm-rscls-0.2.3-vendor/source-registry-0/bitflags-2.11.0
300.42 s
[rscls-0.2.3-vendor] Unpacking to /nix/store/xjddmzd1ry904d9kwbrp8g6ph7zdk3jm-rscls-0.2.3-vendor/source-registry-0/bytes-1.11.1
300.45 s
[rscls-0.2.3-vendor] Unpacking to /nix/store/xjddmzd1ry904d9kwbrp8g6ph7zdk3jm-rscls-0.2.3-vendor/source-registry-0/cfg-if-1.0.4
300.46 s
[rscls-0.2.3-vendor] Unpacking to /nix/store/xjddmzd1ry904d9kwbrp8g6ph7zdk3jm-rscls-0.2.3-vendor/source-registry-0/clap-4.5.58
300.49 s
[rscls-0.2.3-vendor] Unpacking to /nix/store/xjddmzd1ry904d9kwbrp8g6ph7zdk3jm-rscls-0.2.3-vendor/source-registry-0/clap-verbosity-flag-2.2.3
300.50 s
[rscls-0.2.3-vendor] Unpacking to /nix/store/xjddmzd1ry904d9kwbrp8g6ph7zdk3jm-rscls-0.2.3-vendor/source-registry-0/clap_builder-4.5.58
300.56 s
[rscls-0.2.3-vendor] Unpacking to /nix/store/xjddmzd1ry904d9kwbrp8g6ph7zdk3jm-rscls-0.2.3-vendor/source-registry-0/clap_derive-4.5.55
300.57 s
[rscls-0.2.3-vendor] Unpacking to /nix/store/xjddmzd1ry904d9kwbrp8g6ph7zdk3jm-rscls-0.2.3-vendor/source-registry-0/clap_lex-1.0.0
300.58 s
[clinnet-0.1.8-vendor-staging] Fetching https://crates.io/api/v1/crates/encode_unicode/1.0.0/download -> tarballs/encode_unicode-1.0.0.tar.gz
300.59 s
[rscls-0.2.3-vendor] Unpacking to /nix/store/xjddmzd1ry904d9kwbrp8g6ph7zdk3jm-rscls-0.2.3-vendor/source-registry-0/colorchoice-1.0.4
300.61 s
[rscls-0.2.3-vendor] Unpacking to /nix/store/xjddmzd1ry904d9kwbrp8g6ph7zdk3jm-rscls-0.2.3-vendor/source-registry-0/crossbeam-channel-0.5.15
300.61 s
[clinnet-0.1.8-vendor-staging] Fetching https://crates.io/api/v1/crates/is_terminal_polyfill/1.70.2/download -> tarballs/is_terminal_polyfill-1.70.2.tar.gz
300.62 s
[rscls-0.2.3-vendor] Unpacking to /nix/store/xjddmzd1ry904d9kwbrp8g6ph7zdk3jm-rscls-0.2.3-vendor/source-registry-0/crossbeam-utils-0.8.21
300.64 s
[rscls-0.2.3-vendor] Unpacking to /nix/store/xjddmzd1ry904d9kwbrp8g6ph7zdk3jm-rscls-0.2.3-vendor/source-registry-0/displaydoc-0.2.5
300.65 s
Downloaded cached dot-language-server (3.2 MiB) in 270ms
300.65 s
Progress: 20 of 29 built (2 building), 193 of 196 downloaded from cache (2 downloading)
300.65 s
[rscls-0.2.3-vendor] Unpacking to /nix/store/xjddmzd1ry904d9kwbrp8g6ph7zdk3jm-rscls-0.2.3-vendor/source-registry-0/errno-0.3.14
300.66 s
[clinnet-0.1.8-vendor-staging] Fetching https://crates.io/api/v1/crates/memchr/2.7.4/download -> tarballs/memchr-2.7.4.tar.gz
300.66 s
[rscls-0.2.3-vendor] Unpacking to /nix/store/xjddmzd1ry904d9kwbrp8g6ph7zdk3jm-rscls-0.2.3-vendor/source-registry-0/eyre-0.6.12
300.66 s
[clinnet-0.1.8-vendor-staging] Fetching https://crates.io/api/v1/crates/parking_lot_core/0.9.12/download -> tarballs/parking_lot_core-0.9.12.tar.gz
300.67 s
[rscls-0.2.3-vendor] Unpacking to /nix/store/xjddmzd1ry904d9kwbrp8g6ph7zdk3jm-rscls-0.2.3-vendor/source-registry-0/form_urlencoded-1.2.2
300.70 s
[rscls-0.2.3-vendor] Unpacking to /nix/store/xjddmzd1ry904d9kwbrp8g6ph7zdk3jm-rscls-0.2.3-vendor/source-registry-0/futures-0.3.31
300.72 s
[rscls-0.2.3-vendor] Unpacking to /nix/store/xjddmzd1ry904d9kwbrp8g6ph7zdk3jm-rscls-0.2.3-vendor/source-registry-0/futures-channel-0.3.31
300.74 s
[rscls-0.2.3-vendor] Unpacking to /nix/store/xjddmzd1ry904d9kwbrp8g6ph7zdk3jm-rscls-0.2.3-vendor/source-registry-0/futures-core-0.3.31
300.74 s
[rscls-0.2.3-vendor] Unpacking to /nix/store/xjddmzd1ry904d9kwbrp8g6ph7zdk3jm-rscls-0.2.3-vendor/source-registry-0/futures-executor-0.3.31
300.76 s
[rscls-0.2.3-vendor] Unpacking to /nix/store/xjddmzd1ry904d9kwbrp8g6ph7zdk3jm-rscls-0.2.3-vendor/source-registry-0/futures-io-0.3.31
300.77 s
[rscls-0.2.3-vendor] Unpacking to /nix/store/xjddmzd1ry904d9kwbrp8g6ph7zdk3jm-rscls-0.2.3-vendor/source-registry-0/futures-macro-0.3.31
300.78 s
[rscls-0.2.3-vendor] Unpacking to /nix/store/xjddmzd1ry904d9kwbrp8g6ph7zdk3jm-rscls-0.2.3-vendor/source-registry-0/futures-sink-0.3.31
300.78 s
[rscls-0.2.3-vendor] Unpacking to /nix/store/xjddmzd1ry904d9kwbrp8g6ph7zdk3jm-rscls-0.2.3-vendor/source-registry-0/futures-task-0.3.31
300.79 s
[clinnet-0.1.8-vendor-staging] Fetching https://crates.io/api/v1/crates/rayon-core/1.12.1/download -> tarballs/rayon-core-1.12.1.tar.gz
300.79 s
Downloaded cached yaml-language-server (17.2 MiB) in 417ms
300.79 s
Progress: 20 of 28 built (2 building), 194 of 196 downloaded from cache (1 downloading)
300.79 s
[rscls-0.2.3-vendor] Unpacking to /nix/store/xjddmzd1ry904d9kwbrp8g6ph7zdk3jm-rscls-0.2.3-vendor/source-registry-0/futures-util-0.3.31
300.80 s
[clinnet-0.1.8-vendor-staging] Fetching https://crates.io/api/v1/crates/rustversion/1.0.22/download -> tarballs/rustversion-1.0.22.tar.gz
300.82 s
[rscls-0.2.3-vendor] Unpacking to /nix/store/xjddmzd1ry904d9kwbrp8g6ph7zdk3jm-rscls-0.2.3-vendor/source-registry-0/heck-0.5.0
300.82 s
[rscls-0.2.3-vendor] Unpacking to /nix/store/xjddmzd1ry904d9kwbrp8g6ph7zdk3jm-rscls-0.2.3-vendor/source-registry-0/icu_collections-2.1.1
300.83 s
[clinnet-0.1.8-vendor-staging] Fetching https://crates.io/api/v1/crates/serde_derive/1.0.225/download -> tarballs/serde_derive-1.0.225.tar.gz
300.84 s
[clinnet-0.1.8-vendor-staging] Fetching https://crates.io/api/v1/crates/strsim/0.11.1/download -> tarballs/strsim-0.11.1.tar.gz
300.84 s
[rscls-0.2.3-vendor] Unpacking to /nix/store/xjddmzd1ry904d9kwbrp8g6ph7zdk3jm-rscls-0.2.3-vendor/source-registry-0/icu_locale_core-2.1.1
300.85 s
[rscls-0.2.3-vendor] Unpacking to /nix/store/xjddmzd1ry904d9kwbrp8g6ph7zdk3jm-rscls-0.2.3-vendor/source-registry-0/icu_normalizer-2.1.1
300.86 s
[clinnet-0.1.8-vendor-staging] Fetching https://crates.io/api/v1/crates/unicode-width/0.2.2/download -> tarballs/unicode-width-0.2.2.tar.gz
300.86 s
[rscls-0.2.3-vendor] Unpacking to /nix/store/xjddmzd1ry904d9kwbrp8g6ph7zdk3jm-rscls-0.2.3-vendor/source-registry-0/icu_normalizer_data-2.1.1
300.87 s
[rscls-0.2.3-vendor] Unpacking to /nix/store/xjddmzd1ry904d9kwbrp8g6ph7zdk3jm-rscls-0.2.3-vendor/source-registry-0/icu_properties-2.1.2
300.91 s
[rscls-0.2.3-vendor] Unpacking to /nix/store/xjddmzd1ry904d9kwbrp8g6ph7zdk3jm-rscls-0.2.3-vendor/source-registry-0/icu_properties_data-2.1.2
300.99 s
[clinnet-0.1.8-vendor-staging] Fetching https://crates.io/api/v1/crates/wasm-bindgen-macro/0.2.105/download -> tarballs/wasm-bindgen-macro-0.2.105.tar.gz
301.01 s
[clinnet-0.1.8-vendor-staging] Fetching https://crates.io/api/v1/crates/windows-sys/0.59.0/download -> tarballs/windows-sys-0.59.0.tar.gz
301.02 s
[clinnet-0.1.8-vendor-staging] Fetching https://crates.io/api/v1/crates/windows_aarch64_msvc/0.52.6/download -> tarballs/windows_aarch64_msvc-0.52.6.tar.gz
301.02 s
[rscls-0.2.3-vendor] Unpacking to /nix/store/xjddmzd1ry904d9kwbrp8g6ph7zdk3jm-rscls-0.2.3-vendor/source-registry-0/icu_provider-2.1.1
301.03 s
[rscls-0.2.3-vendor] Unpacking to /nix/store/xjddmzd1ry904d9kwbrp8g6ph7zdk3jm-rscls-0.2.3-vendor/source-registry-0/idna-1.1.0
301.04 s
[clinnet-0.1.8-vendor-staging] Fetching https://crates.io/api/v1/crates/windows_i686_msvc/0.52.6/download -> tarballs/windows_i686_msvc-0.52.6.tar.gz
301.04 s
[clinnet-0.1.8-vendor-staging] Fetching https://crates.io/api/v1/crates/windows_x86_64_msvc/0.52.6/download -> tarballs/windows_x86_64_msvc-0.52.6.tar.gz
301.05 s
[rscls-0.2.3-vendor] Unpacking to /nix/store/xjddmzd1ry904d9kwbrp8g6ph7zdk3jm-rscls-0.2.3-vendor/source-registry-0/idna_adapter-1.2.1
301.05 s
[rscls-0.2.3-vendor] Unpacking to /nix/store/xjddmzd1ry904d9kwbrp8g6ph7zdk3jm-rscls-0.2.3-vendor/source-registry-0/indenter-0.3.4
301.06 s
[rscls-0.2.3-vendor] Unpacking to /nix/store/xjddmzd1ry904d9kwbrp8g6ph7zdk3jm-rscls-0.2.3-vendor/source-registry-0/is_terminal_polyfill-1.70.2
301.07 s
[rscls-0.2.3-vendor] Unpacking to /nix/store/xjddmzd1ry904d9kwbrp8g6ph7zdk3jm-rscls-0.2.3-vendor/source-registry-0/itoa-1.0.17
301.08 s
[rscls-0.2.3-vendor] Unpacking to /nix/store/xjddmzd1ry904d9kwbrp8g6ph7zdk3jm-rscls-0.2.3-vendor/source-registry-0/lazy_static-1.5.0
301.09 s
[rscls-0.2.3-vendor] Unpacking to /nix/store/xjddmzd1ry904d9kwbrp8g6ph7zdk3jm-rscls-0.2.3-vendor/source-registry-0/libc-0.2.182
301.14 s
[rscls-0.2.3-vendor] Unpacking to /nix/store/xjddmzd1ry904d9kwbrp8g6ph7zdk3jm-rscls-0.2.3-vendor/source-registry-0/litemap-0.8.1
301.15 s
[rscls-0.2.3-vendor] Unpacking to /nix/store/xjddmzd1ry904d9kwbrp8g6ph7zdk3jm-rscls-0.2.3-vendor/source-registry-0/lock_api-0.4.14
301.15 s
[rscls-0.2.3-vendor] Unpacking to /nix/store/xjddmzd1ry904d9kwbrp8g6ph7zdk3jm-rscls-0.2.3-vendor/source-registry-0/log-0.4.29
301.16 s
[rscls-0.2.3-vendor] Unpacking to /nix/store/xjddmzd1ry904d9kwbrp8g6ph7zdk3jm-rscls-0.2.3-vendor/source-registry-0/lsp-server-0.7.9
301.17 s
[rscls-0.2.3-vendor] Unpacking to /nix/store/xjddmzd1ry904d9kwbrp8g6ph7zdk3jm-rscls-0.2.3-vendor/source-registry-0/lsp-types-0.94.1
301.18 s
[rscls-0.2.3-vendor] Unpacking to /nix/store/xjddmzd1ry904d9kwbrp8g6ph7zdk3jm-rscls-0.2.3-vendor/source-registry-0/memchr-2.8.0
301.20 s
[rscls-0.2.3-vendor] Unpacking to /nix/store/xjddmzd1ry904d9kwbrp8g6ph7zdk3jm-rscls-0.2.3-vendor/source-registry-0/mio-1.1.1
301.21 s
[rscls-0.2.3-vendor] Unpacking to /nix/store/xjddmzd1ry904d9kwbrp8g6ph7zdk3jm-rscls-0.2.3-vendor/source-registry-0/nu-ansi-term-0.50.3
301.23 s
[rscls-0.2.3-vendor] Unpacking to /nix/store/xjddmzd1ry904d9kwbrp8g6ph7zdk3jm-rscls-0.2.3-vendor/source-registry-0/once_cell-1.21.3
301.25 s
[rscls-0.2.3-vendor] Unpacking to /nix/store/xjddmzd1ry904d9kwbrp8g6ph7zdk3jm-rscls-0.2.3-vendor/source-registry-0/once_cell_polyfill-1.70.2
301.27 s
[rscls-0.2.3-vendor] Unpacking to /nix/store/xjddmzd1ry904d9kwbrp8g6ph7zdk3jm-rscls-0.2.3-vendor/source-registry-0/parking_lot-0.12.5
301.29 s
[rscls-0.2.3-vendor] Unpacking to /nix/store/xjddmzd1ry904d9kwbrp8g6ph7zdk3jm-rscls-0.2.3-vendor/source-registry-0/parking_lot_core-0.9.12
301.32 s
[rscls-0.2.3-vendor] Unpacking to /nix/store/xjddmzd1ry904d9kwbrp8g6ph7zdk3jm-rscls-0.2.3-vendor/source-registry-0/path-absolutize-3.1.1
301.34 s
[rscls-0.2.3-vendor] Unpacking to /nix/store/xjddmzd1ry904d9kwbrp8g6ph7zdk3jm-rscls-0.2.3-vendor/source-registry-0/path-dedot-3.1.1
301.35 s
[rscls-0.2.3-vendor] Unpacking to /nix/store/xjddmzd1ry904d9kwbrp8g6ph7zdk3jm-rscls-0.2.3-vendor/source-registry-0/percent-encoding-2.3.2
301.36 s
[rscls-0.2.3-vendor] Unpacking to /nix/store/xjddmzd1ry904d9kwbrp8g6ph7zdk3jm-rscls-0.2.3-vendor/source-registry-0/pin-project-lite-0.2.16
301.39 s
[rscls-0.2.3-vendor] Unpacking to /nix/store/xjddmzd1ry904d9kwbrp8g6ph7zdk3jm-rscls-0.2.3-vendor/source-registry-0/pin-utils-0.1.0
301.40 s
[clinnet-0.1.8-vendor-staging] multiprocessing.pool.RemoteTraceback :
301.40 s
[clinnet-0.1.8-vendor-staging] """
301.40 s
[clinnet-0.1.8-vendor-staging] Traceback (most recent call last):
301.40 s
[clinnet-0.1.8-vendor-staging] File "/nix/store/rfh8283cg3amd71cmhq2ypr98p7036k7-python3-3.13.12-env/lib/python3.13/multiprocessing/pool.py", line 125, in worker
301.40 s
[clinnet-0.1.8-vendor-staging] result = (True, func(*args, **kwds))
301.40 s
[clinnet-0.1.8-vendor-staging] ~~~~^^^^^^^^^^^^^^^
301.40 s
[clinnet-0.1.8-vendor-staging] File "/nix/store/rfh8283cg3amd71cmhq2ypr98p7036k7-python3-3.13.12-env/lib/python3.13/multiprocessing/pool.py", line 51, in starmapstar
301.40 s
[clinnet-0.1.8-vendor-staging] return list(itertools.starmap(args[0], args[1]))
301.40 s
[clinnet-0.1.8-vendor-staging] File "/nix/store/rpickx0wnl28rz29529irv9s97w7fdk6-fetch-cargo-vendor-util/bin/fetch-cargo-vendor-util", line 87, in download_tarball
301.40 s
[clinnet-0.1.8-vendor-staging] calculated_checksum = download_file_with_checksum(session, url, tarball_out_dir)
301.40 s
[clinnet-0.1.8-vendor-staging] File "/nix/store/rpickx0wnl28rz29529irv9s97w7fdk6-fetch-cargo-vendor-util/bin/fetch-cargo-vendor-util", line 53, in download_file_with_checksum
301.40 s
[clinnet-0.1.8-vendor-staging] raise Exception(f"Failed to fetch file from {url}. Status code: {response.status_code}")
301.40 s
[clinnet-0.1.8-vendor-staging] Exception: Failed to fetch file from https://crates.io/api/v1/crates/colorchoice/1.0.4/download. Status code: 403
301.40 s
[clinnet-0.1.8-vendor-staging] """
301.40 s
[clinnet-0.1.8-vendor-staging]
301.40 s
[clinnet-0.1.8-vendor-staging] The above exception was the direct cause of the following exception:
301.40 s
[clinnet-0.1.8-vendor-staging]
301.40 s
[clinnet-0.1.8-vendor-staging] Traceback (most recent call last):
301.40 s
[clinnet-0.1.8-vendor-staging] File "/nix/store/rpickx0wnl28rz29529irv9s97w7fdk6-fetch-cargo-vendor-util/bin/fetch-cargo-vendor-util" , line 414 , in <module>
301.40 s
[clinnet-0.1.8-vendor-staging] main ()
301.40 s
[clinnet-0.1.8-vendor-staging] ~~~~ ^^
301.40 s
[clinnet-0.1.8-vendor-staging] File "/nix/store/rpickx0wnl28rz29529irv9s97w7fdk6-fetch-cargo-vendor-util/bin/fetch-cargo-vendor-util" , line 410 , in main
301.40 s
[clinnet-0.1.8-vendor-staging] subcommand_func ()
301.40 s
[clinnet-0.1.8-vendor-staging] ~~~~~~~~~~~~~~~ ^^
301.40 s
[clinnet-0.1.8-vendor-staging] File "/nix/store/rpickx0wnl28rz29529irv9s97w7fdk6-fetch-cargo-vendor-util/bin/fetch-cargo-vendor-util" , line 401 , in <lambda>
301.40 s
[clinnet-0.1.8-vendor-staging] "create-vendor-staging": lambda: create_vendor_staging (lockfile_path=Path(sys.argv[2]), out_dir=Path(sys.argv[3])) ,
301.40 s
[clinnet-0.1.8-vendor-staging] ~~~~~~~~~~~~~~~~~~~~~ ^^^^^^^^^^^^^^^^^^^^^^^^^^^^^^^^^^^^^^^^^^^^^^^^^^^^^^^^^^^^
301.40 s
[clinnet-0.1.8-vendor-staging] File "/nix/store/rpickx0wnl28rz29529irv9s97w7fdk6-fetch-cargo-vendor-util/bin/fetch-cargo-vendor-util" , line 168 , in create_vendor_staging
301.40 s
[clinnet-0.1.8-vendor-staging] pool.starmap (download_tarball, tarball_args_gen)
301.40 s
[clinnet-0.1.8-vendor-staging] ~~~~~~~~~~~~ ^^^^^^^^^^^^^^^^^^^^^^^^^^^^^^^^^^^^
301.40 s
[clinnet-0.1.8-vendor-staging] File "/nix/store/rfh8283cg3amd71cmhq2ypr98p7036k7-python3-3.13.12-env/lib/python3.13/multiprocessing/pool.py" , line 375 , in starmap
301.40 s
[clinnet-0.1.8-vendor-staging] return self._map_async(func, iterable, starmapstar, chunksize).get ()
301.40 s
[clinnet-0.1.8-vendor-staging] ~~~~~~~~~~~~~~~~~~~~~~~~~~~~~~~~~~~~~~~~~~~~~~~~~~~~~~~~~~~ ^^
301.40 s
[clinnet-0.1.8-vendor-staging] File "/nix/store/rfh8283cg3amd71cmhq2ypr98p7036k7-python3-3.13.12-env/lib/python3.13/multiprocessing/pool.py" , line 774 , in get
301.40 s
[clinnet-0.1.8-vendor-staging] raise self._value
301.40 s
[clinnet-0.1.8-vendor-staging] Exception : Failed to fetch file from https://crates.io/api/v1/crates/colorchoice/1.0.4/download. Status code: 403
301.41 s
[rscls-0.2.3-vendor] Unpacking to /nix/store/xjddmzd1ry904d9kwbrp8g6ph7zdk3jm-rscls-0.2.3-vendor/source-registry-0/potential_utf-0.1.4
301.42 s
[rscls-0.2.3-vendor] Unpacking to /nix/store/xjddmzd1ry904d9kwbrp8g6ph7zdk3jm-rscls-0.2.3-vendor/source-registry-0/proc-macro2-1.0.106
301.44 s
Progress: 20 of 27 built (1 building, 1 failed), 194 of 196 downloaded from cache (1 downloading)
301.44 s
Failed to build clinnet-0.1.8-vendor-staging after 1.4s
301.44 s
error: Cannot build '/nix/store/yjiiziqs3wdx3szv6j8mp3m8z043pgil-clinnet-0.1.8-vendor-staging.drv '.
301.44 s
Reason: builder failed with exit code 1 .
301.44 s
Output paths:
301.44 s
/nix/store/43izv4h82lj0nmnqwjg6j8spdkwa6hs5-clinnet-0.1.8-vendor-staging
301.44 s
Last 62 log lines:
301.44 s
> Running phase: unpackPhase
301.44 s
> unpacking source archive /nix/store/2i132kj3rylcpf3q5yy61794w9j2mg0v-clinnet-0.1.8.tar.gz
301.44 s
> source root is clinnet-0.1.8.tar.gz
301.44 s
> Running phase: patchPhase
301.44 s
> Running phase: updateAutotoolsGnuConfigScriptsPhase
301.44 s
> Running phase: buildPhase
301.44 s
> Skipping local dependency: clinnet
301.44 s
> Fetching https://crates.io/api/v1/crates/anstream/0.6.21/download -> tarballs/anstream-0.6.21.tar.gz
301.44 s
> Fetching https://crates.io/api/v1/crates/arrayref/0.3.9/download -> tarballs/arrayref-0.3.9.tar.gz
301.44 s
> Fetching https://crates.io/api/v1/crates/colorchoice/1.0.4/download -> tarballs/colorchoice-1.0.4.tar.gz
301.44 s
> Fetching https://crates.io/api/v1/crates/cc/1.2.45/download -> tarballs/cc-1.2.45.tar.gz
301.44 s
> Fetching https://crates.io/api/v1/crates/crossbeam-utils/0.8.21/download -> tarballs/crossbeam-utils-0.8.21.tar.gz
301.44 s
> Fetching https://crates.io/api/v1/crates/encode_unicode/1.0.0/download -> tarballs/encode_unicode-1.0.0.tar.gz
301.44 s
> Fetching https://crates.io/api/v1/crates/is_terminal_polyfill/1.70.2/download -> tarballs/is_terminal_polyfill-1.70.2.tar.gz
301.44 s
> Fetching https://crates.io/api/v1/crates/memchr/2.7.4/download -> tarballs/memchr-2.7.4.tar.gz
301.44 s
> Fetching https://crates.io/api/v1/crates/parking_lot_core/0.9.12/download -> tarballs/parking_lot_core-0.9.12.tar.gz
301.44 s
> Fetching https://crates.io/api/v1/crates/rayon-core/1.12.1/download -> tarballs/rayon-core-1.12.1.tar.gz
301.44 s
> Fetching https://crates.io/api/v1/crates/rustversion/1.0.22/download -> tarballs/rustversion-1.0.22.tar.gz
301.44 s
> Fetching https://crates.io/api/v1/crates/serde_derive/1.0.225/download -> tarballs/serde_derive-1.0.225.tar.gz
301.44 s
> Fetching https://crates.io/api/v1/crates/strsim/0.11.1/download -> tarballs/strsim-0.11.1.tar.gz
301.44 s
> Fetching https://crates.io/api/v1/crates/unicode-width/0.2.2/download -> tarballs/unicode-width-0.2.2.tar.gz
301.44 s
> Fetching https://crates.io/api/v1/crates/wasm-bindgen-macro/0.2.105/download -> tarballs/wasm-bindgen-macro-0.2.105.tar.gz
301.44 s
> Fetching https://crates.io/api/v1/crates/windows-sys/0.59.0/download -> tarballs/windows-sys-0.59.0.tar.gz
301.44 s
> Fetching https://crates.io/api/v1/crates/windows_aarch64_msvc/0.52.6/download -> tarballs/windows_aarch64_msvc-0.52.6.tar.gz
301.44 s
> Fetching https://crates.io/api/v1/crates/windows_i686_msvc/0.52.6/download -> tarballs/windows_i686_msvc-0.52.6.tar.gz
301.44 s
> Fetching https://crates.io/api/v1/crates/windows_x86_64_msvc/0.52.6/download -> tarballs/windows_x86_64_msvc-0.52.6.tar.gz
301.44 s
> multiprocessing.pool.RemoteTraceback :
301.44 s
> """
301.44 s
> Traceback (most recent call last):
301.44 s
> File "/nix/store/rfh8283cg3amd71cmhq2ypr98p7036k7-python3-3.13.12-env/lib/python3.13/multiprocessing/pool.py", line 125, in worker
301.44 s
> result = (True, func(*args, **kwds))
301.44 s
> ~~~~^^^^^^^^^^^^^^^
301.44 s
> File "/nix/store/rfh8283cg3amd71cmhq2ypr98p7036k7-python3-3.13.12-env/lib/python3.13/multiprocessing/pool.py", line 51, in starmapstar
301.44 s
> return list(itertools.starmap(args[0], args[1]))
301.44 s
> File "/nix/store/rpickx0wnl28rz29529irv9s97w7fdk6-fetch-cargo-vendor-util/bin/fetch-cargo-vendor-util", line 87, in download_tarball
301.44 s
> calculated_checksum = download_file_with_checksum(session, url, tarball_out_dir)
301.44 s
> File "/nix/store/rpickx0wnl28rz29529irv9s97w7fdk6-fetch-cargo-vendor-util/bin/fetch-cargo-vendor-util", line 53, in download_file_with_checksum
301.44 s
> raise Exception(f"Failed to fetch file from {url}. Status code: {response.status_code}")
301.44 s
> Exception: Failed to fetch file from https://crates.io/api/v1/crates/colorchoice/1.0.4/download. Status code: 403
301.44 s
> """
301.44 s
>
301.44 s
> The above exception was the direct cause of the following exception:
301.44 s
>
301.44 s
> Traceback (most recent call last):
301.44 s
> File "/nix/store/rpickx0wnl28rz29529irv9s97w7fdk6-fetch-cargo-vendor-util/bin/fetch-cargo-vendor-util" , line 414 , in <module>
301.44 s
> main ()
301.44 s
> ~~~~ ^^
301.44 s
> File "/nix/store/rpickx0wnl28rz29529irv9s97w7fdk6-fetch-cargo-vendor-util/bin/fetch-cargo-vendor-util" , line 410 , in main
301.44 s
> subcommand_func ()
301.44 s
> ~~~~~~~~~~~~~~~ ^^
301.44 s
> File "/nix/store/rpickx0wnl28rz29529irv9s97w7fdk6-fetch-cargo-vendor-util/bin/fetch-cargo-vendor-util" , line 401 , in <lambda>
301.44 s
> "create-vendor-staging": lambda: create_vendor_staging (lockfile_path=Path(sys.argv[2]), out_dir=Path(sys.argv[3])) ,
301.44 s
> ~~~~~~~~~~~~~~~~~~~~~ ^^^^^^^^^^^^^^^^^^^^^^^^^^^^^^^^^^^^^^^^^^^^^^^^^^^^^^^^^^^^
301.44 s
> File "/nix/store/rpickx0wnl28rz29529irv9s97w7fdk6-fetch-cargo-vendor-util/bin/fetch-cargo-vendor-util" , line 168 , in create_vendor_staging
301.44 s
> pool.starmap (download_tarball, tarball_args_gen)
301.44 s
> ~~~~~~~~~~~~ ^^^^^^^^^^^^^^^^^^^^^^^^^^^^^^^^^^^^
301.44 s
> File "/nix/store/rfh8283cg3amd71cmhq2ypr98p7036k7-python3-3.13.12-env/lib/python3.13/multiprocessing/pool.py" , line 375 , in starmap
301.44 s
> return self._map_async(func, iterable, starmapstar, chunksize).get ()
301.44 s
> ~~~~~~~~~~~~~~~~~~~~~~~~~~~~~~~~~~~~~~~~~~~~~~~~~~~~~~~~~~~ ^^
301.44 s
> File "/nix/store/rfh8283cg3amd71cmhq2ypr98p7036k7-python3-3.13.12-env/lib/python3.13/multiprocessing/pool.py" , line 774 , in get
301.44 s
> raise self._value
301.44 s
> Exception : Failed to fetch file from https://crates.io/api/v1/crates/colorchoice/1.0.4/download. Status code: 403
301.44 s
For full logs, run:
301.44 s
nix log /nix/store/yjiiziqs3wdx3szv6j8mp3m8z043pgil-clinnet-0.1.8-vendor-staging.drv
301.44 s
error: Cannot build '/nix/store/qwkphxq9znm8bqqjzfvwnmvg6lf38rw7-clinnet-0.1.8-vendor.drv '.
301.44 s
Reason: 1 dependency failed .
301.44 s
Output paths:
301.44 s
/nix/store/8mlkw00kiyz47yfgzh7cy2gmin0j8709-clinnet-0.1.8-vendor
301.44 s
error: Build failed due to failed dependency
301.44 s
error: Cannot build '/nix/store/nl6fa55hbndmhw1mi0kphl8h8cfrnbfn-clinnet-0.1.8.drv '.
301.44 s
Reason: 1 dependency failed .
301.44 s
Output paths:
301.44 s
/nix/store/nmngd9sd2ly9g924rqp1h66h61hbzbwf-clinnet-0.1.8
301.44 s
error: Build failed due to failed dependency
301.44 s
error: Cannot build '/nix/store/llk4227dg86wbplm5k6mk4fyhs0rxmw0-nix-shell.drv '.
301.44 s
Reason: 1 dependency failed .
301.44 s
Output paths:
301.44 s
/nix/store/viw85i6gpprindjj8j8861x043bgrlym-nix-shell
301.44 s
warning: killing stray builder process 291582 (bash -e /nix/store/l622p70vy8k5sh7y5wizi5f2mic6ynpg-source-stdenv.sh /nix/store/shkw4qm9qcw5sc5n1k5jznc83ny02r39-default-builder.sh)...
301.44 s
warning: killing stray builder process 291596 (/nix/store/rfh8283cg3amd71cmhq2ypr98p7036k7-python3-3.13.12-env/bin/python3.13 /nix/store/rpickx0wnl28rz29529irv9s97w7fdk6-fetch-cargo-vendor-util/bin/fetch-cargo-vendor-util create-vendor /nix/store/mw51pll1fmkfz4hb5gpgjsa7g972sxsa-rscls-0.2.3-vendor-staging /nix/store/xjddmzd1ry904d9kwbrp8g6ph7zdk3jm-rscls-0.2.3-vendor)...
301.44 s
warning: killing stray builder process 291737 ()...
301.44 s
warning: killing stray builder process 291738 (/nix/store/pnxiz967z73a45f4x7c1icldjaaqmlcp-gzip-1.14/bin/gzip -n -d)...
301.58 s
Built rscls-0.2.3-vendor in 1.5s
304.48 s
Downloaded cached pyright-internal (183.5 MiB) in 4.0s
304.49 s
Build failed due to failed dependency
304.60 s
Build failed.