test packages.x86_64-linux.nix-ci-check-gammaloop-nextest-clinnet

Reproduce this run
Retry Run
  1. 0.00 s $ /nix/store/bhv6xyvqw6gjs3j488gi1z6wdv18bdpa-coreutils-9.11/bin/timeout --kill-after=15s 7200s /nix/store/bxgja2ppiqi6w2bgn0r07d7mgnl1k6k2-nix-2.34.8/bin/nix --extra-experimental-features nix-command --extra-experimental-features flakes flake clone git+https://github.com/alphal00p/gammaloop --dest /tmp/nix-ci-worker/stable-pwd/repo/
  2. 0.07 s Cloning into '/tmp/nix-ci-worker/stable-pwd/repo'...
  3. 0.89 s remote: Enumerating objects: 162134, done.
  4. 1.01 s remote: Counting objects: 0% (1/16812) remote: Counting objects: 1% (169/16812) remote: Counting objects: 2% (337/16812) remote: Counting objects: 3% (505/16812) remote: Counting objects: 4% (673/16812) remote: Counting objects: 5% (841/16812) remote: Counting objects: 6% (1009/16812) remote: Counting objects: 7% (1177/16812) remote: Counting objects: 8% (1345/16812) remote: Counting objects: 9% (1514/16812) remote: Counting objects: 10% (1682/16812) remote: Counting objects: 11% (1850/16812) remote: Counting objects: 12% (2018/16812) remote: Counting objects: 13% (2186/16812) remote: Counting objects: 14% (2354/16812) remote: Counting objects: 15% (2522/16812) remote: Counting objects: 16% (2690/16812) remote: Counting objects: 17% (2859/16812) remote: Counting objects: 18% (3027/16812) remote: Counting objects: 19% (3195/16812) remote: Counting objects: 20% (3363/16812) remote: Counting objects: 21% (3531/16812) remote: Counting objects: 22% (3699/16812) remote: Counting objects: 23% (3867/16812) remote: Counting objects: 24% (4035/16812) remote: Counting objects: 25% (4203/16812) remote: Counting objects: 26% (4372/16812) remote: Counting objects: 27% (4540/16812) remote: Counting objects: 28% (4708/16812) remote: Counting objects: 29% (4876/16812) remote: Counting objects: 30% (5044/16812) remote: Counting objects: 31% (5212/16812) remote: Counting objects: 32% (5380/16812) remote: Counting objects: 33% (5548/16812) remote: Counting objects: 34% (5717/16812) remote: Counting objects: 35% (5885/16812) remote: Counting objects: 36% (6053/16812) remote: Counting objects: 37% (6221/16812) remote: Counting objects: 38% (6389/16812) remote: Counting objects: 39% (6557/16812) remote: Counting objects: 40% (6725/16812) remote: Counting objects: 41% (6893/16812) remote: Counting objects: 42% (7062/16812) remote: Counting objects: 43% (7230/16812) remote: Counting objects: 44% (7398/16812) remote: Counting objects: 45% (7566/16812) remote: Counting objects: 46% (7734/16812) remote: Counting objects: 47% (7902/16812) remote: Counting objects: 48% (8070/16812) remote: Counting objects: 49% (8238/16812) remote: Counting objects: 50% (8406/16812) remote: Counting objects: 51% (8575/16812) remote: Counting objects: 52% (8743/16812) remote: Counting objects: 53% (8911/16812) remote: Counting objects: 54% (9079/16812) remote: Counting objects: 55% (9247/16812) remote: Counting objects: 56% (9415/16812) remote: Counting objects: 57% (9583/16812) remote: Counting objects: 58% (9751/16812) remote: Counting objects: 59% (9920/16812) remote: Counting objects: 60% (10088/16812) remote: Counting objects: 61% (10256/16812) remote: Counting objects: 62% (10424/16812) remote: Counting objects: 63% (10592/16812) remote: Counting objects: 64% (10760/16812) remote: Counting objects: 65% (10928/16812) remote: Counting objects: 66% (11096/16812) remote: Counting objects: 67% (11265/16812) remote: Counting objects: 68% (11433/16812) remote: Counting objects: 69% (11601/16812) remote: Counting objects: 70% (11769/16812) remote: Counting objects: 71% (11937/16812) remote: Counting objects: 72% (12105/16812) remote: Counting objects: 73% (12273/16812) remote: Counting objects: 74% (12441/16812) remote: Counting objects: 75% (12609/16812) remote: Counting objects: 76% (12778/16812) remote: Counting objects: 77% (12946/16812) remote: Counting objects: 78% (13114/16812) remote: Counting objects: 79% (13282/16812) remote: Counting objects: 80% (13450/16812) remote: Counting objects: 81% (13618/16812) remote: Counting objects: 82% (13786/16812) remote: Counting objects: 83% (13954/16812) remote: Counting objects: 84% (14123/16812) remote: Counting objects: 85% (14291/16812) remote: Counting objects: 86% (14459/16812) remote: Counting objects: 87% (14627/16812) remote: Counting objects: 88% (14795/16812) remote: Counting objects: 89% (14963/16812) remote: Counting objects: 90% (15131/16812) remote: Counting objects: 91% (15299/16812) remote: Counting objects: 92% (15468/16812) remote: Counting objects: 93% (15636/16812) remote: Counting objects: 94% (15804/16812) remote: Counting objects: 95% (15972/16812) remote: Counting objects: 96% (16140/16812) remote: Counting objects: 97% (16308/16812) remote: Counting objects: 98% (16476/16812) remote: Counting objects: 99% (16644/16812) remote: Counting objects: 100% (16812/16812) remote: Counting objects: 100% (16812/16812), done.
  5. 7.16 s remote: Compressing objects: 0% (1/3844) remote: Compressing objects: 1% (39/3844) remote: Compressing objects: 2% (77/3844) remote: Compressing objects: 3% (116/3844) remote: Compressing objects: 4% (154/3844) remote: Compressing objects: 5% (193/3844) remote: Compressing objects: 6% (231/3844) remote: Compressing objects: 7% (270/3844) remote: Compressing objects: 8% (308/3844) remote: Compressing objects: 9% (346/3844) remote: Compressing objects: 10% (385/3844) remote: Compressing objects: 10% (412/3844) remote: Compressing objects: 11% (423/3844) remote: Compressing objects: 12% (462/3844) remote: Compressing objects: 13% (500/3844) remote: Compressing objects: 13% (528/3844) remote: Compressing objects: 14% (539/3844) remote: Compressing objects: 15% (577/3844) remote: Compressing objects: 15% (597/3844) remote: Compressing objects: 16% (616/3844) remote: Compressing objects: 17% (654/3844) remote: Compressing objects: 18% (692/3844) remote: Compressing objects: 18% (722/3844) remote: Compressing objects: 19% (731/3844) remote: Compressing objects: 20% (769/3844) remote: Compressing objects: 21% (808/3844) remote: Compressing objects: 22% (846/3844) remote: Compressing objects: 23% (885/3844) remote: Compressing objects: 23% (896/3844) remote: Compressing objects: 24% (923/3844) remote: Compressing objects: 25% (961/3844) remote: Compressing objects: 26% (1000/3844) remote: Compressing objects: 27% (1038/3844) remote: Compressing objects: 28% (1077/3844) remote: Compressing objects: 29% (1115/3844) remote: Compressing objects: 30% (1154/3844) remote: Compressing objects: 31% (1192/3844) remote: Compressing objects: 32% (1231/3844) remote: Compressing objects: 33% (1269/3844) remote: Compressing objects: 33% (1302/3844) remote: Compressing objects: 34% (1307/3844) remote: Compressing objects: 35% (1346/3844) remote: Compressing objects: 36% (1384/3844) remote: Compressing objects: 37% (1423/3844) remote: Compressing objects: 38% (1461/3844) remote: Compressing objects: 39% (1500/3844) remote: Compressing objects: 40% (1538/3844) remote: Compressing objects: 41% (1577/3844) remote: Compressing objects: 42% (1615/3844) remote: Compressing objects: 43% (1653/3844) remote: Compressing objects: 44% (1692/3844) remote: Compressing objects: 45% (1730/3844) remote: Compressing objects: 46% (1769/3844) remote: Compressing objects: 47% (1807/3844) remote: Compressing objects: 48% (1846/3844) remote: Compressing objects: 49% (1884/3844) remote: Compressing objects: 50% (1922/3844) remote: Compressing objects: 51% (1961/3844) remote: Compressing objects: 52% (1999/3844) remote: Compressing objects: 53% (2038/3844) remote: Compressing objects: 54% (2076/3844) remote: Compressing objects: 55% (2115/3844) remote: Compressing objects: 56% (2153/3844) remote: Compressing objects: 57% (2192/3844) remote: Compressing objects: 58% (2230/3844) remote: Compressing objects: 59% (2268/3844) remote: Compressing objects: 60% (2307/3844) remote: Compressing objects: 61% (2345/3844) remote: Compressing objects: 62% (2384/3844) remote: Compressing objects: 63% (2422/3844) remote: Compressing objects: 64% (2461/3844) remote: Compressing objects: 65% (2499/3844) remote: Compressing objects: 66% (2538/3844) remote: Compressing objects: 67% (2576/3844) remote: Compressing objects: 68% (2614/3844) remote: Compressing objects: 69% (2653/3844) remote: Compressing objects: 70% (2691/3844) remote: Compressing objects: 71% (2730/3844) remote: Compressing objects: 72% (2768/3844) remote: Compressing objects: 73% (2807/3844) remote: Compressing objects: 74% (2845/3844) remote: Compressing objects: 75% (2883/3844) remote: Compressing objects: 76% (2922/3844) remote: Compressing objects: 77% (2960/3844) remote: Compressing objects: 78% (2999/3844) remote: Compressing objects: 79% (3037/3844) remote: Compressing objects: 80% (3076/3844) remote: Compressing objects: 81% (3114/3844) remote: Compressing objects: 82% (3153/3844) remote: Compressing objects: 83% (3191/3844) remote: Compressing objects: 84% (3229/3844) remote: Compressing objects: 85% (3268/3844) remote: Compressing objects: 86% (3306/3844) remote: Compressing objects: 87% (3345/3844) remote: Compressing objects: 88% (3383/3844) remote: Compressing objects: 89% (3422/3844) remote: Compressing objects: 90% (3460/3844) remote: Compressing objects: 91% (3499/3844) remote: Compressing objects: 92% (3537/3844) remote: Compressing objects: 93% (3575/3844) remote: Compressing objects: 94% (3614/3844) remote: Compressing objects: 95% (3652/3844) remote: Compressing objects: 96% (3691/3844) remote: Compressing objects: 97% (3729/3844) remote: Compressing objects: 98% (3768/3844) remote: Compressing objects: 99% (3806/3844) remote: Compressing objects: 100% (3844/3844) remote: Compressing objects: 100% (3844/3844), done.
  6. 33.19 s Receiving objects: 0% (1/162134) Receiving objects: 1% (1622/162134) Receiving objects: 2% (3243/162134), 11.11 MiB | 22.20 MiB/s Receiving objects: 3% (4865/162134), 11.11 MiB | 22.20 MiB/s Receiving objects: 3% (5907/162134), 26.15 MiB | 26.14 MiB/s Receiving objects: 4% (6486/162134), 26.15 MiB | 26.14 MiB/s Receiving objects: 5% (8107/162134), 26.15 MiB | 26.14 MiB/s Receiving objects: 6% (9729/162134), 36.32 MiB | 24.21 MiB/s Receiving objects: 6% (11286/162134), 46.51 MiB | 23.21 MiB/s Receiving objects: 7% (11350/162134), 46.51 MiB | 23.21 MiB/s Receiving objects: 8% (12971/162134), 57.57 MiB | 22.90 MiB/s Receiving objects: 8% (13607/162134), 57.57 MiB | 22.90 MiB/s Receiving objects: 9% (14593/162134), 69.35 MiB | 23.01 MiB/s Receiving objects: 10% (16214/162134), 69.35 MiB | 23.01 MiB/s Receiving objects: 11% (17835/162134), 69.35 MiB | 23.01 MiB/s Receiving objects: 12% (19457/162134), 76.02 MiB | 21.63 MiB/s Receiving objects: 13% (21078/162134), 76.02 MiB | 21.63 MiB/s Receiving objects: 14% (22699/162134), 76.02 MiB | 21.63 MiB/s Receiving objects: 15% (24321/162134), 76.02 MiB | 21.63 MiB/s Receiving objects: 16% (25942/162134), 76.02 MiB | 21.63 MiB/s Receiving objects: 16% (26991/162134), 76.02 MiB | 21.63 MiB/s Receiving objects: 17% (27563/162134), 76.02 MiB | 21.63 MiB/s Receiving objects: 18% (29185/162134), 86.39 MiB | 21.52 MiB/s Receiving objects: 19% (30806/162134), 86.39 MiB | 21.52 MiB/s Receiving objects: 20% (32427/162134), 86.39 MiB | 21.52 MiB/s Receiving objects: 21% (34049/162134), 86.39 MiB | 21.52 MiB/s Receiving objects: 22% (35670/162134), 86.39 MiB | 21.52 MiB/s Receiving objects: 23% (37291/162134), 86.39 MiB | 21.52 MiB/s Receiving objects: 24% (38913/162134), 86.39 MiB | 21.52 MiB/s Receiving objects: 25% (40534/162134), 86.39 MiB | 21.52 MiB/s Receiving objects: 26% (42155/162134), 86.39 MiB | 21.52 MiB/s Receiving objects: 27% (43777/162134), 92.91 MiB | 20.58 MiB/s Receiving objects: 28% (45398/162134), 92.91 MiB | 20.58 MiB/s Receiving objects: 28% (45588/162134), 92.91 MiB | 20.58 MiB/s Receiving objects: 29% (47019/162134), 99.47 MiB | 19.55 MiB/s Receiving objects: 30% (48641/162134), 99.47 MiB | 19.55 MiB/s Receiving objects: 31% (50262/162134), 106.54 MiB | 17.75 MiB/s Receiving objects: 32% (51883/162134), 106.54 MiB | 17.75 MiB/s Receiving objects: 32% (52095/162134), 106.54 MiB | 17.75 MiB/s Receiving objects: 33% (53505/162134), 113.92 MiB | 17.08 MiB/s Receiving objects: 34% (55126/162134), 113.92 MiB | 17.08 MiB/s Receiving objects: 35% (56747/162134), 113.92 MiB | 17.08 MiB/s Receiving objects: 36% (58369/162134), 121.66 MiB | 16.55 MiB/s Receiving objects: 36% (59925/162134), 129.77 MiB | 15.94 MiB/s Receiving objects: 37% (59990/162134), 129.77 MiB | 15.94 MiB/s Receiving objects: 38% (61611/162134), 129.77 MiB | 15.94 MiB/s Receiving objects: 39% (63233/162134), 138.15 MiB | 15.19 MiB/s Receiving objects: 40% (64854/162134), 138.15 MiB | 15.19 MiB/s Receiving objects: 41% (66475/162134), 138.15 MiB | 15.19 MiB/s Receiving objects: 42% (68097/162134), 138.15 MiB | 15.19 MiB/s Receiving objects: 42% (68203/162134), 146.87 MiB | 15.64 MiB/s Receiving objects: 42% (68220/162134), 164.78 MiB | 15.86 MiB/s Receiving objects: 43% (69718/162134), 164.78 MiB | 15.86 MiB/s Receiving objects: 44% (71339/162134), 164.78 MiB | 15.86 MiB/s Receiving objects: 45% (72961/162134), 164.78 MiB | 15.86 MiB/s Receiving objects: 46% (74582/162134), 164.78 MiB | 15.86 MiB/s Receiving objects: 47% (76203/162134), 174.91 MiB | 16.67 MiB/s Receiving objects: 47% (76303/162134), 174.91 MiB | 16.67 MiB/s Receiving objects: 48% (77825/162134), 184.65 MiB | 17.30 MiB/s Receiving objects: 49% (79446/162134), 184.65 MiB | 17.30 MiB/s Receiving objects: 50% (81067/162134), 184.65 MiB | 17.30 MiB/s Receiving objects: 51% (82689/162134), 184.65 MiB | 17.30 MiB/s Receiving objects: 52% (84310/162134), 191.20 MiB | 16.71 MiB/s Receiving objects: 53% (85932/162134), 191.20 MiB | 16.71 MiB/s Receiving objects: 53% (86181/162134), 191.20 MiB | 16.71 MiB/s Receiving objects: 54% (87553/162134), 199.40 MiB | 16.79 MiB/s Receiving objects: 55% (89174/162134), 199.40 MiB | 16.79 MiB/s Receiving objects: 55% (89768/162134), 210.68 MiB | 15.66 MiB/s Receiving objects: 55% (89771/162134), 223.42 MiB | 14.59 MiB/s Receiving objects: 55% (89802/162134), 237.55 MiB | 13.53 MiB/s Receiving objects: 55% (89807/162134), 253.00 MiB | 13.71 MiB/s Receiving objects: 56% (90796/162134), 253.00 MiB | 13.71 MiB/s Receiving objects: 57% (92417/162134), 261.14 MiB | 13.71 MiB/s Receiving objects: 57% (93134/162134), 261.14 MiB | 13.71 MiB/s Receiving objects: 58% (94038/162134), 269.71 MiB | 14.39 MiB/s Receiving objects: 59% (95660/162134), 278.54 MiB | 15.07 MiB/s Receiving objects: 59% (96785/162134), 278.54 MiB | 15.07 MiB/s Receiving objects: 60% (97281/162134), 278.54 MiB | 15.07 MiB/s Receiving objects: 61% (98902/162134), 287.57 MiB | 15.70 MiB/s Receiving objects: 61% (99756/162134), 297.19 MiB | 16.38 MiB/s Receiving objects: 62% (100524/162134), 307.00 MiB | 17.02 MiB/s Receiving objects: 63% (102145/162134), 307.00 MiB | 17.02 MiB/s Receiving objects: 64% (103766/162134), 316.95 MiB | 17.62 MiB/s Receiving objects: 65% (105388/162134), 316.95 MiB | 17.62 MiB/s Receiving objects: 65% (105764/162134), 316.95 MiB | 17.62 MiB/s Receiving objects: 66% (107009/162134), 327.38 MiB | 18.27 MiB/s Receiving objects: 67% (108630/162134), 327.38 MiB | 18.27 MiB/s Receiving objects: 68% (110252/162134), 327.38 MiB | 18.27 MiB/s Receiving objects: 69% (111873/162134), 327.38 MiB | 18.27 MiB/s Receiving objects: 70% (113494/162134), 327.38 MiB | 18.27 MiB/s Receiving objects: 71% (115116/162134), 327.38 MiB | 18.27 MiB/s Receiving objects: 72% (116737/162134), 327.38 MiB | 18.27 MiB/s Receiving objects: 73% (118358/162134), 338.15 MiB | 18.90 MiB/s Receiving objects: 74% (119980/162134), 338.15 MiB | 18.90 MiB/s Receiving objects: 74% (120516/162134), 338.15 MiB | 18.90 MiB/s Receiving objects: 75% (121601/162134), 338.15 MiB | 18.90 MiB/s Receiving objects: 76% (123222/162134), 349.15 MiB | 19.50 MiB/s Receiving objects: 77% (124844/162134), 360.49 MiB | 20.10 MiB/s Receiving objects: 77% (126124/162134), 360.49 MiB | 20.10 MiB/s Receiving objects: 78% (126465/162134), 360.49 MiB | 20.10 MiB/s Receiving objects: 79% (128086/162134), 360.49 MiB | 20.10 MiB/s Receiving objects: 80% (129708/162134), 372.13 MiB | 20.72 MiB/s Receiving objects: 81% (131329/162134), 372.13 MiB | 20.72 MiB/s Receiving objects: 81% (131979/162134), 395.88 MiB | 21.85 MiB/s Receiving objects: 82% (132950/162134), 408.59 MiB | 22.49 MiB/s Receiving objects: 82% (134110/162134), 408.59 MiB | 22.49 MiB/s Receiving objects: 83% (134572/162134), 421.39 MiB | 23.14 MiB/s Receiving objects: 84% (136193/162134), 421.39 MiB | 23.14 MiB/s Receiving objects: 85% (137814/162134), 434.41 MiB | 23.72 MiB/s Receiving objects: 85% (139047/162134), 434.41 MiB | 23.72 MiB/s Receiving objects: 86% (139436/162134), 434.41 MiB | 23.72 MiB/s Receiving objects: 87% (141057/162134), 462.83 MiB | 25.23 MiB/s Receiving objects: 87% (142470/162134), 462.83 MiB | 25.23 MiB/s Receiving objects: 88% (142678/162134), 462.83 MiB | 25.23 MiB/s Receiving objects: 89% (144300/162134), 462.83 MiB | 25.23 MiB/s Receiving objects: 90% (145921/162134), 478.98 MiB | 26.31 MiB/s Receiving objects: 91% (147542/162134), 478.98 MiB | 26.31 MiB/s Receiving objects: 92% (149164/162134), 478.98 MiB | 26.31 MiB/s Receiving objects: 93% (150785/162134), 478.98 MiB | 26.31 MiB/s Receiving objects: 94% (152406/162134), 478.98 MiB | 26.31 MiB/s Receiving objects: 95% (154028/162134), 478.98 MiB | 26.31 MiB/s Receiving objects: 96% (155649/162134), 478.98 MiB | 26.31 MiB/s Receiving objects: 97% (157270/162134), 478.98 MiB | 26.31 MiB/s Receiving objects: 98% (158892/162134), 478.98 MiB | 26.31 MiB/s Receiving objects: 99% (160513/162134), 493.65 MiB | 26.98 MiB/s Receiving objects: 99% (161886/162134), 493.65 MiB | 26.98 MiB/s remote: Total 162134 (delta 14203), reused 13455 (delta 12950), pack-reused 145322 (from 3)
  7. 33.20 s Receiving objects: 100% (162134/162134), 493.65 MiB | 26.98 MiB/s Receiving objects: 100% (162134/162134), 500.72 MiB | 19.25 MiB/s, done.
  8. 41.81 s Resolving deltas: 0% (0/105841) Resolving deltas: 1% (1059/105841) Resolving deltas: 2% (2117/105841) Resolving deltas: 3% (3176/105841) Resolving deltas: 4% (4234/105841) Resolving deltas: 5% (5293/105841) Resolving deltas: 6% (6351/105841) Resolving deltas: 7% (7409/105841) Resolving deltas: 8% (8468/105841) Resolving deltas: 9% (9526/105841) Resolving deltas: 10% (10585/105841) Resolving deltas: 11% (11643/105841) Resolving deltas: 12% (12701/105841) Resolving deltas: 13% (13760/105841) Resolving deltas: 14% (14818/105841) Resolving deltas: 14% (15818/105841) Resolving deltas: 15% (15878/105841) Resolving deltas: 16% (16935/105841) Resolving deltas: 17% (17993/105841) Resolving deltas: 18% (19052/105841) Resolving deltas: 19% (20110/105841) Resolving deltas: 20% (21169/105841) Resolving deltas: 20% (21706/105841) Resolving deltas: 21% (22227/105841) Resolving deltas: 22% (23286/105841) Resolving deltas: 23% (24344/105841) Resolving deltas: 24% (25402/105841) Resolving deltas: 25% (26461/105841) Resolving deltas: 26% (27519/105841) Resolving deltas: 27% (28578/105841) Resolving deltas: 28% (29636/105841) Resolving deltas: 28% (29799/105841) Resolving deltas: 29% (30694/105841) Resolving deltas: 30% (31753/105841) Resolving deltas: 31% (32811/105841) Resolving deltas: 32% (33870/105841) Resolving deltas: 33% (34928/105841) Resolving deltas: 34% (35986/105841) Resolving deltas: 35% (37045/105841) Resolving deltas: 36% (38103/105841) Resolving deltas: 37% (39162/105841) Resolving deltas: 38% (40220/105841) Resolving deltas: 39% (41278/105841) Resolving deltas: 40% (42337/105841) Resolving deltas: 41% (43395/105841) Resolving deltas: 42% (44454/105841) Resolving deltas: 43% (45512/105841) Resolving deltas: 44% (46571/105841) Resolving deltas: 45% (47629/105841) Resolving deltas: 46% (48687/105841) Resolving deltas: 47% (49746/105841) Resolving deltas: 48% (50804/105841) Resolving deltas: 49% (51863/105841) Resolving deltas: 50% (52921/105841) Resolving deltas: 51% (53979/105841) Resolving deltas: 51% (54251/105841) Resolving deltas: 52% (55038/105841) Resolving deltas: 53% (56096/105841) Resolving deltas: 54% (57155/105841) Resolving deltas: 55% (58213/105841) Resolving deltas: 56% (59271/105841) Resolving deltas: 57% (60330/105841) Resolving deltas: 58% (61388/105841) Resolving deltas: 59% (62447/105841) Resolving deltas: 59% (62790/105841) Resolving deltas: 60% (63505/105841) Resolving deltas: 61% (64564/105841) Resolving deltas: 62% (65622/105841) Resolving deltas: 63% (66680/105841) Resolving deltas: 64% (67739/105841) Resolving deltas: 65% (68797/105841) Resolving deltas: 66% (69856/105841) Resolving deltas: 67% (70914/105841) Resolving deltas: 67% (71394/105841) Resolving deltas: 68% (71972/105841) Resolving deltas: 69% (73031/105841) Resolving deltas: 70% (74089/105841) Resolving deltas: 71% (75148/105841) Resolving deltas: 72% (76206/105841) Resolving deltas: 73% (77264/105841) Resolving deltas: 74% (78323/105841) Resolving deltas: 75% (79381/105841) Resolving deltas: 76% (80440/105841) Resolving deltas: 77% (81498/105841) Resolving deltas: 78% (82556/105841) Resolving deltas: 79% (83615/105841) Resolving deltas: 80% (84673/105841) Resolving deltas: 81% (85732/105841) Resolving deltas: 82% (86790/105841) Resolving deltas: 83% (87849/105841) Resolving deltas: 84% (88908/105841) Resolving deltas: 84% (89344/105841) Resolving deltas: 85% (89965/105841) Resolving deltas: 86% (91024/105841) Resolving deltas: 87% (92082/105841) Resolving deltas: 88% (93141/105841) Resolving deltas: 89% (94199/105841) Resolving deltas: 90% (95257/105841) Resolving deltas: 91% (96316/105841) Resolving deltas: 92% (97374/105841) Resolving deltas: 93% (98433/105841) Resolving deltas: 94% (99491/105841) Resolving deltas: 95% (100549/105841) Resolving deltas: 95% (100645/105841) Resolving deltas: 96% (101609/105841) Resolving deltas: 97% (102666/105841) Resolving deltas: 98% (103725/105841) Resolving deltas: 99% (104783/105841) Resolving deltas: 100% (105841/105841) Resolving deltas: 100% (105841/105841), done.
  9. 42.84 s Fetching commit 30fb0f28cd3eff2e7ac9987fc78de90b6578e688 for idenso-sum-partner-contraction ...
  10. 42.84 s $ /nix/store/b1wn5clix1mz4vpfih7x9cnj9qfh7c6h-git-2.54.0/bin/git fetch origin 30fb0f28cd3eff2e7ac9987fc78de90b6578e688
  11. 43.49 s From https://github.com/alphal00p/gammaloop
  12. 43.49 s * branch 30fb0f28cd3eff2e7ac9987fc78de90b6578e688 -> FETCH_HEAD
  13. 43.55 s $ /nix/store/bhv6xyvqw6gjs3j488gi1z6wdv18bdpa-coreutils-9.11/bin/timeout --kill-after=15s 7200s /nix/store/b1wn5clix1mz4vpfih7x9cnj9qfh7c6h-git-2.54.0/bin/git -c advice.detachedHead=false checkout 30fb0f28cd3eff2e7ac9987fc78de90b6578e688
  14. 44.33 s HEAD is now at 30fb0f28c nix-ci: enable NixCI for final review
  15. 44.36 s $ /nix/store/bhv6xyvqw6gjs3j488gi1z6wdv18bdpa-coreutils-9.11/bin/timeout --kill-after=15s 7200s /nix/store/bxgja2ppiqi6w2bgn0r07d7mgnl1k6k2-nix-2.34.8/bin/nix --extra-experimental-features nix-command --extra-experimental-features flakes --log-format internal-json run .#packages.x86_64-linux.nix-ci-check-gammaloop-nextest-clinnet --print-build-logs
  16. 44.75 s warning: ignoring untrusted flake configuration setting 'extra-substituters'.
  17. 44.75 s Pass '--accept-flake-config' to trust it
  18. 44.75 s warning: ignoring untrusted flake configuration setting 'extra-trusted-public-keys'.
  19. 44.75 s Pass '--accept-flake-config' to trust it
  20. 44.78 s error (ignored): SQLite database '/var/cache/nix-ci-worker/eval-cache-v6/ad1e34681b7cb3f21e06f8868585536794930dc44e483cecd8152fd1b60abc60.sqlite' is busy
  21. 53.09 s
  22. 53.76 s evaluating derivation 'gdo you want to allow configuration setting 'extra-substituters' to be set to 'https://cache.nix-ci.com' (y/N)? do you want to permanently mark this value as untrusted (y/N)? warning: ignoring untrusted flake configuration setting 'extra-substituters'.
  23. 53.76 s Pass '--accept-flake-config' to trust it
  24. 53.76 s do you want to allow configuration setting 'extra-trusted-public-keys' to be set to 'nix-ci:g3xV5BDTLtIBZr/A00IU1x0EtKKlb7YLgBN2SgYgM6A=' (y/N)? do you want to permanently mark this value as untrusted (y/N)? warning: ignoring untrusted flake configuration setting 'extra-trusted-public-keys'.
  25. 53.76 s Pass '--accept-flake-config' to trust it
  26. 62.13 s copying '/nix/store/cis1 evaluating derivation 'g copying '/nix/store/cis1 evaluating derivation 'g copying '/nix/store/cis1 evaluating derivation 'g copying '/nix/store/cis1 evaluating derivation 'g copying '/nix/store/cis1 evaluating derivation 'g copying '/nix/store/cis1 evaluating derivation 'g copying '/nix/store/cis1 evaluating derivation 'g copying '/nix/store/cis1 evaluating derivation 'g
  27. 74.62 s [0/1 built] [1/0/1 built] building ggammaloop-nextest-clinnet> Nextest worker budget: 16
  28. 74.68 s gammaloop-nextest-clinnet> Extracting 4 binaries (including 1 non-test binary), 1 build script output directory, and 1 linked path to /build/source
  29. 74.84 s gammaloop-nextest-clinnet> Extracted 16 files to /build/source in 0.17s
  30. 74.88 s gammaloop-nextest-clinnet> ------------
  31. 74.88 s gammaloop-nextest-clinnet> Nextest run ID 87db954c-e4a2-4974-9730-8a14994d9732 with nextest profile: ci_gammaloop
  32. 74.88 s gammaloop-nextest-clinnet> Starting 38 tests across 3 binaries
  33. 216.69 s gammaloop-nextest-clinnet> FAIL [ 141.742s] (32/38) clinnet::public_typst_behavior public_linnest_arrow_shafts_and_crossing_gaps
  34. 216.69 s gammaloop-nextest-clinnet> stdout ---
  35. 216.69 s gammaloop-nextest-clinnet>
  36. 216.69 s gammaloop-nextest-clinnet> running 1 test
  37. 216.69 s gammaloop-nextest-clinnet> test public_linnest_arrow_shafts_and_crossing_gaps has been running for over 60 seconds
  38. 216.69 s gammaloop-nextest-clinnet> test public_linnest_arrow_shafts_and_crossing_gaps ... FAILED
  39. 216.69 s gammaloop-nextest-clinnet>
  40. 216.69 s gammaloop-nextest-clinnet> failures:
  41. 216.69 s gammaloop-nextest-clinnet>
  42. 216.69 s gammaloop-nextest-clinnet> failures:
  43. 216.69 s gammaloop-nextest-clinnet> public_linnest_arrow_shafts_and_crossing_gaps
  44. 216.69 s gammaloop-nextest-clinnet>
  45. 216.69 s gammaloop-nextest-clinnet> test result: FAILED. 0 passed; 1 failed; 0 ignored; 0 measured; 17 filtered out; finished in 141.69s
  46. 216.69 s gammaloop-nextest-clinnet>
  47. 216.69 s gammaloop-nextest-clinnet> stderr ---
  48. 216.69 s gammaloop-nextest-clinnet>
  49. 216.69 s gammaloop-nextest-clinnet> thread 'public_linnest_arrow_shafts_and_crossing_gaps' (286) panicked at crates/clinnet/tests/public_typst_behavior.rs:81:55:
  50. 216.69 s gammaloop-nextest-clinnet> called `Result::unwrap()` on an `Err` value: typst failed while compiling template /build/.tmpwqjOxv/.clinnet/templates/linnest-public-behavior.svg
  51. 216.69 s gammaloop-nextest-clinnet>
  52. 216.69 s gammaloop-nextest-clinnet> Command executed:
  53. 216.69 s gammaloop-nextest-clinnet> "typst" "c" "/build/.tmpwqjOxv/.clinnet/templates/linnest-public-behavior.typ" "/build/.tmpwqjOxv/.clinnet/templates/linnest-public-behavior.svg" "--root" "/build/.tmpwqjOxv/.clinnet/templates"
  54. 216.69 s gammaloop-nextest-clinnet>
  55. 216.69 s gammaloop-nextest-clinnet> Typst stdout:
  56. 216.69 s gammaloop-nextest-clinnet>
  57. 216.69 s gammaloop-nextest-clinnet>
  58. 216.69 s gammaloop-nextest-clinnet> Typst stderr:
  59. 216.69 s gammaloop-nextest-clinnet>
  60. 216.69 s gammaloop-nextest-clinnet>
  61. 216.69 s gammaloop-nextest-clinnet> Location:
  62. 216.69 s gammaloop-nextest-clinnet> crates/clinnet/src/lib.rs:741:13
  63. 216.69 s gammaloop-nextest-clinnet> stack backtrace:
  64. 216.69 s gammaloop-nextest-clinnet> 0: __rustc::rust_begin_unwind
  65. 216.69 s gammaloop-nextest-clinnet> 1: core::panicking::panic_fmt
  66. 216.69 s gammaloop-nextest-clinnet> 2: core::result::unwrap_failed
  67. 216.69 s gammaloop-nextest-clinnet> 3: public_typst_behavior::render
  68. 216.69 s gammaloop-nextest-clinnet> 4: <std::sync::once::Once>::call_once_force::<<std::sync::once_lock::OnceLock<alloc::string::String>>::initialize<<std::sync::once_lock::OnceLock<alloc::string::String>>::get_or_init<public_typst_behavior::linnest_public_svg::{closure#0}>::{closure#0}, !>::{closure#0}>::{closure#0}
  69. 216.69 s gammaloop-nextest-clinnet> 5: <std::sys::sync::once::futex::Once>::call
  70. 216.69 s gammaloop-nextest-clinnet> 6: <std::sync::once_lock::OnceLock<alloc::string::String>>::initialize::<<std::sync::once_lock::OnceLock<alloc::string::String>>::get_or_init<public_typst_behavior::linnest_public_svg::{closure#0}>::{closure#0}, !>
  71. 216.69 s gammaloop-nextest-clinnet> 7: <public_typst_behavior::public_linnest_arrow_shafts_and_crossing_gaps::{closure#0} as core::ops::function::FnOnce<()>>::call_once
  72. 216.69 s gammaloop-nextest-clinnet> note: Some details are omitted, run with `RUST_BACKTRACE=full` for a verbose backtrace.
  73. 216.69 s gammaloop-nextest-clinnet>
  74. 227.38 s gammaloop-nextest-clinnet> FAIL [ 152.422s] (33/38) clinnet::public_typst_behavior public_linnest_labels_follow_their_carriers
  75. 227.38 s gammaloop-nextest-clinnet> stdout ---
  76. 227.38 s gammaloop-nextest-clinnet>
  77. 227.38 s gammaloop-nextest-clinnet> running 1 test
  78. 227.38 s gammaloop-nextest-clinnet> test public_linnest_labels_follow_their_carriers has been running for over 60 seconds
  79. 227.38 s gammaloop-nextest-clinnet> test public_linnest_labels_follow_their_carriers ... FAILED
  80. 227.38 s gammaloop-nextest-clinnet>
  81. 227.38 s gammaloop-nextest-clinnet> failures:
  82. 227.38 s gammaloop-nextest-clinnet>
  83. 227.38 s gammaloop-nextest-clinnet> failures:
  84. 227.38 s gammaloop-nextest-clinnet> public_linnest_labels_follow_their_carriers
  85. 227.38 s gammaloop-nextest-clinnet>
  86. 227.38 s gammaloop-nextest-clinnet> test result: FAILED. 0 passed; 1 failed; 0 ignored; 0 measured; 17 filtered out; finished in 152.39s
  87. 227.38 s gammaloop-nextest-clinnet>
  88. 227.38 s gammaloop-nextest-clinnet> stderr ---
  89. 227.38 s gammaloop-nextest-clinnet>
  90. 227.38 s gammaloop-nextest-clinnet> thread 'public_linnest_labels_follow_their_carriers' (281) panicked at crates/clinnet/tests/public_typst_behavior.rs:81:55:
  91. 227.38 s gammaloop-nextest-clinnet> called `Result::unwrap()` on an `Err` value: typst failed while compiling template /build/.tmpWkJXOH/.clinnet/templates/linnest-public-behavior.svg
  92. 227.38 s gammaloop-nextest-clinnet>
  93. 227.38 s gammaloop-nextest-clinnet> Command executed:
  94. 227.38 s gammaloop-nextest-clinnet> "typst" "c" "/build/.tmpWkJXOH/.clinnet/templates/linnest-public-behavior.typ" "/build/.tmpWkJXOH/.clinnet/templates/linnest-public-behavior.svg" "--root" "/build/.tmpWkJXOH/.clinnet/templates"
  95. 227.38 s gammaloop-nextest-clinnet>
  96. 227.38 s gammaloop-nextest-clinnet> Typst stdout:
  97. 227.38 s gammaloop-nextest-clinnet>
  98. 227.38 s gammaloop-nextest-clinnet>
  99. 227.38 s gammaloop-nextest-clinnet> Typst stderr:
  100. 227.38 s gammaloop-nextest-clinnet>
  101. 227.38 s gammaloop-nextest-clinnet>
  102. 227.38 s gammaloop-nextest-clinnet> Location:
  103. 227.38 s gammaloop-nextest-clinnet> crates/clinnet/src/lib.rs:741:13
  104. 227.38 s gammaloop-nextest-clinnet> stack backtrace:
  105. 227.38 s gammaloop-nextest-clinnet> 0: __rustc::rust_begin_unwind
  106. 227.38 s gammaloop-nextest-clinnet> 1: core::panicking::panic_fmt
  107. 227.38 s gammaloop-nextest-clinnet> 2: core::result::unwrap_failed
  108. 227.38 s gammaloop-nextest-clinnet> 3: public_typst_behavior::render
  109. 227.38 s gammaloop-nextest-clinnet> 4: <std::sync::once::Once>::call_once_force::<<std::sync::once_lock::OnceLock<alloc::string::String>>::initialize<<std::sync::once_lock::OnceLock<alloc::string::String>>::get_or_init<public_typst_behavior::linnest_public_svg::{closure#0}>::{closure#0}, !>::{closure#0}>::{closure#0}
  110. 227.38 s gammaloop-nextest-clinnet> 5: <std::sys::sync::once::futex::Once>::call
  111. 227.38 s gammaloop-nextest-clinnet> 6: <std::sync::once_lock::OnceLock<alloc::string::String>>::initialize::<<std::sync::once_lock::OnceLock<alloc::string::String>>::get_or_init<public_typst_behavior::linnest_public_svg::{closure#0}>::{closure#0}, !>
  112. 227.38 s gammaloop-nextest-clinnet> 7: <public_typst_behavior::public_linnest_labels_follow_their_carriers::{closure#0} as core::ops::function::FnOnce<()>>::call_once
  113. 227.38 s gammaloop-nextest-clinnet> note: Some details are omitted, run with `RUST_BACKTRACE=full` for a verbose backtrace.
  114. 227.38 s gammaloop-nextest-clinnet>
  115. 303.16 s gammaloop-nextest-clinnet> FAIL [ 228.180s] (34/38) clinnet::public_typst_behavior public_linnest_momentum_layers_place_shafts_and_labels
  116. 303.16 s gammaloop-nextest-clinnet> stdout ---
  117. 303.16 s gammaloop-nextest-clinnet>
  118. 303.16 s gammaloop-nextest-clinnet> running 1 test
  119. 303.16 s gammaloop-nextest-clinnet> test public_linnest_momentum_layers_place_shafts_and_labels has been running for over 60 seconds
  120. 303.16 s gammaloop-nextest-clinnet> test public_linnest_momentum_layers_place_shafts_and_labels ... FAILED
  121. 303.16 s gammaloop-nextest-clinnet>
  122. 303.16 s gammaloop-nextest-clinnet> failures:
  123. 303.16 s gammaloop-nextest-clinnet>
  124. 303.16 s gammaloop-nextest-clinnet> failures:
  125. 303.16 s gammaloop-nextest-clinnet> public_linnest_momentum_layers_place_shafts_and_labels
  126. 303.16 s gammaloop-nextest-clinnet>
  127. 303.16 s gammaloop-nextest-clinnet> test result: FAILED. 0 passed; 1 failed; 0 ignored; 0 measured; 17 filtered out; finished in 228.14s
  128. 303.16 s gammaloop-nextest-clinnet>
  129. 303.16 s gammaloop-nextest-clinnet> stderr ---
  130. 303.16 s gammaloop-nextest-clinnet>
  131. 303.16 s gammaloop-nextest-clinnet> thread 'public_linnest_momentum_layers_place_shafts_and_labels' (305) panicked at crates/clinnet/tests/public_typst_behavior.rs:81:55:
  132. 303.16 s gammaloop-nextest-clinnet> called `Result::unwrap()` on an `Err` value: typst failed while compiling template /build/.tmpmVuaZw/.clinnet/templates/linnest-public-behavior.svg
  133. 303.16 s gammaloop-nextest-clinnet>
  134. 303.16 s gammaloop-nextest-clinnet> Command executed:
  135. 303.16 s gammaloop-nextest-clinnet> "typst" "c" "/build/.tmpmVuaZw/.clinnet/templates/linnest-public-behavior.typ" "/build/.tmpmVuaZw/.clinnet/templates/linnest-public-behavior.svg" "--root" "/build/.tmpmVuaZw/.clinnet/templates"
  136. 303.16 s gammaloop-nextest-clinnet>
  137. 303.16 s gammaloop-nextest-clinnet> Typst stdout:
  138. 303.16 s gammaloop-nextest-clinnet>
  139. 303.16 s gammaloop-nextest-clinnet>
  140. 303.16 s gammaloop-nextest-clinnet> Typst stderr:
  141. 303.16 s gammaloop-nextest-clinnet>
  142. 303.16 s gammaloop-nextest-clinnet>
  143. 303.16 s gammaloop-nextest-clinnet> Location:
  144. 303.16 s gammaloop-nextest-clinnet> crates/clinnet/src/lib.rs:741:13
  145. 303.16 s gammaloop-nextest-clinnet> stack backtrace:
  146. 303.16 s gammaloop-nextest-clinnet> 0: __rustc::rust_begin_unwind
  147. 303.16 s gammaloop-nextest-clinnet> 1: core::panicking::panic_fmt
  148. 303.16 s gammaloop-nextest-clinnet> 2: core::result::unwrap_failed
  149. 303.16 s gammaloop-nextest-clinnet> 3: public_typst_behavior::render
  150. 303.16 s gammaloop-nextest-clinnet> 4: <std::sync::once::Once>::call_once_force::<<std::sync::once_lock::OnceLock<alloc::string::String>>::initialize<<std::sync::once_lock::OnceLock<alloc::string::String>>::get_or_init<public_typst_behavior::linnest_public_svg::{closure#0}>::{closure#0}, !>::{closure#0}>::{closure#0}
  151. 303.16 s gammaloop-nextest-clinnet> 5: <std::sys::sync::once::futex::Once>::call
  152. 303.16 s gammaloop-nextest-clinnet> 6: <std::sync::once_lock::OnceLock<alloc::string::String>>::initialize::<<std::sync::once_lock::OnceLock<alloc::string::String>>::get_or_init<public_typst_behavior::linnest_public_svg::{closure#0}>::{closure#0}, !>
  153. 303.16 s gammaloop-nextest-clinnet> 7: <public_typst_behavior::public_linnest_momentum_layers_place_shafts_and_labels::{closure#0} as core::ops::function::FnOnce<()>>::call_once
  154. 303.16 s gammaloop-nextest-clinnet> note: Some details are omitted, run with `RUST_BACKTRACE=full` for a verbose backtrace.
  155. 303.16 s gammaloop-nextest-clinnet>
  156. 308.72 s gammaloop-nextest-clinnet> ------------
  157. 308.72 s gammaloop-nextest-clinnet> Summary [ 233.834s] 38 tests run: 35 passed (4 slow), 3 failed, 0 skipped
  158. 308.72 s gammaloop-nextest-clinnet> FAIL [ 141.742s] (32/38) clinnet::public_typst_behavior public_linnest_arrow_shafts_and_crossing_gaps
  159. 308.72 s gammaloop-nextest-clinnet> stdout ---
  160. 308.72 s gammaloop-nextest-clinnet>
  161. 308.72 s gammaloop-nextest-clinnet> running 1 test
  162. 308.72 s gammaloop-nextest-clinnet> test public_linnest_arrow_shafts_and_crossing_gaps has been running for over 60 seconds
  163. 308.72 s gammaloop-nextest-clinnet> test public_linnest_arrow_shafts_and_crossing_gaps ... FAILED
  164. 308.72 s gammaloop-nextest-clinnet>
  165. 308.72 s gammaloop-nextest-clinnet> failures:
  166. 308.72 s gammaloop-nextest-clinnet>
  167. 308.72 s gammaloop-nextest-clinnet> failures:
  168. 308.72 s gammaloop-nextest-clinnet> public_linnest_arrow_shafts_and_crossing_gaps
  169. 308.72 s gammaloop-nextest-clinnet>
  170. 308.72 s gammaloop-nextest-clinnet> test result: FAILED. 0 passed; 1 failed; 0 ignored; 0 measured; 17 filtered out; finished in 141.69s
  171. 308.72 s gammaloop-nextest-clinnet>
  172. 308.72 s gammaloop-nextest-clinnet> stderr ---
  173. 308.72 s gammaloop-nextest-clinnet>
  174. 308.72 s gammaloop-nextest-clinnet> thread 'public_linnest_arrow_shafts_and_crossing_gaps' (286) panicked at crates/clinnet/tests/public_typst_behavior.rs:81:55:
  175. 308.72 s gammaloop-nextest-clinnet> called `Result::unwrap()` on an `Err` value: typst failed while compiling template /build/.tmpwqjOxv/.clinnet/templates/linnest-public-behavior.svg
  176. 308.72 s gammaloop-nextest-clinnet>
  177. 308.72 s gammaloop-nextest-clinnet> Command executed:
  178. 308.72 s gammaloop-nextest-clinnet> "typst" "c" "/build/.tmpwqjOxv/.clinnet/templates/linnest-public-behavior.typ" "/build/.tmpwqjOxv/.clinnet/templates/linnest-public-behavior.svg" "--root" "/build/.tmpwqjOxv/.clinnet/templates"
  179. 308.72 s gammaloop-nextest-clinnet>
  180. 308.72 s gammaloop-nextest-clinnet> Typst stdout:
  181. 308.72 s gammaloop-nextest-clinnet>
  182. 308.72 s gammaloop-nextest-clinnet>
  183. 308.72 s gammaloop-nextest-clinnet> Typst stderr:
  184. 308.72 s gammaloop-nextest-clinnet>
  185. 308.72 s gammaloop-nextest-clinnet>
  186. 308.72 s gammaloop-nextest-clinnet> Location:
  187. 308.72 s gammaloop-nextest-clinnet> crates/clinnet/src/lib.rs:741:13
  188. 308.72 s gammaloop-nextest-clinnet> stack backtrace:
  189. 308.72 s gammaloop-nextest-clinnet> 0: __rustc::rust_begin_unwind
  190. 308.72 s gammaloop-nextest-clinnet> 1: core::panicking::panic_fmt
  191. 308.72 s gammaloop-nextest-clinnet> 2: core::result::unwrap_failed
  192. 308.72 s gammaloop-nextest-clinnet> 3: public_typst_behavior::render
  193. 308.72 s gammaloop-nextest-clinnet> 4: <std::sync::once::Once>::call_once_force::<<std::sync::once_lock::OnceLock<alloc::string::String>>::initialize<<std::sync::once_lock::OnceLock<alloc::string::String>>::get_or_init<public_typst_behavior::linnest_public_svg::{closure#0}>::{closure#0}, !>::{closure#0}>::{closure#0}
  194. 308.72 s gammaloop-nextest-clinnet> 5: <std::sys::sync::once::futex::Once>::call
  195. 308.72 s gammaloop-nextest-clinnet> 6: <std::sync::once_lock::OnceLock<alloc::string::String>>::initialize::<<std::sync::once_lock::OnceLock<alloc::string::String>>::get_or_init<public_typst_behavior::linnest_public_svg::{closure#0}>::{closure#0}, !>
  196. 308.72 s gammaloop-nextest-clinnet> 7: <public_typst_behavior::public_linnest_arrow_shafts_and_crossing_gaps::{closure#0} as core::ops::function::FnOnce<()>>::call_once
  197. 308.72 s gammaloop-nextest-clinnet> note: Some details are omitted, run with `RUST_BACKTRACE=full` for a verbose backtrace.
  198. 308.72 s gammaloop-nextest-clinnet>
  199. 308.72 s gammaloop-nextest-clinnet> FAIL [ 152.422s] (33/38) clinnet::public_typst_behavior public_linnest_labels_follow_their_carriers
  200. 308.72 s gammaloop-nextest-clinnet> stdout ---
  201. 308.72 s gammaloop-nextest-clinnet>
  202. 308.72 s gammaloop-nextest-clinnet> running 1 test
  203. 308.72 s gammaloop-nextest-clinnet> test public_linnest_labels_follow_their_carriers has been running for over 60 seconds
  204. 308.72 s gammaloop-nextest-clinnet> test public_linnest_labels_follow_their_carriers ... FAILED
  205. 308.72 s gammaloop-nextest-clinnet>
  206. 308.72 s gammaloop-nextest-clinnet> failures:
  207. 308.72 s gammaloop-nextest-clinnet>
  208. 308.72 s gammaloop-nextest-clinnet> failures:
  209. 308.72 s gammaloop-nextest-clinnet> public_linnest_labels_follow_their_carriers
  210. 308.72 s gammaloop-nextest-clinnet>
  211. 308.72 s gammaloop-nextest-clinnet> test result: FAILED. 0 passed; 1 failed; 0 ignored; 0 measured; 17 filtered out; finished in 152.39s
  212. 308.72 s gammaloop-nextest-clinnet>
  213. 308.72 s gammaloop-nextest-clinnet> stderr ---
  214. 308.72 s gammaloop-nextest-clinnet>
  215. 308.72 s gammaloop-nextest-clinnet> thread 'public_linnest_labels_follow_their_carriers' (281) panicked at crates/clinnet/tests/public_typst_behavior.rs:81:55:
  216. 308.72 s gammaloop-nextest-clinnet> called `Result::unwrap()` on an `Err` value: typst failed while compiling template /build/.tmpWkJXOH/.clinnet/templates/linnest-public-behavior.svg
  217. 308.72 s gammaloop-nextest-clinnet>
  218. 308.72 s gammaloop-nextest-clinnet> Command executed:
  219. 308.72 s gammaloop-nextest-clinnet> "typst" "c" "/build/.tmpWkJXOH/.clinnet/templates/linnest-public-behavior.typ" "/build/.tmpWkJXOH/.clinnet/templates/linnest-public-behavior.svg" "--root" "/build/.tmpWkJXOH/.clinnet/templates"
  220. 308.72 s gammaloop-nextest-clinnet>
  221. 308.72 s gammaloop-nextest-clinnet> Typst stdout:
  222. 308.72 s gammaloop-nextest-clinnet>
  223. 308.72 s gammaloop-nextest-clinnet>
  224. 308.72 s gammaloop-nextest-clinnet> Typst stderr:
  225. 308.72 s gammaloop-nextest-clinnet>
  226. 308.72 s gammaloop-nextest-clinnet>
  227. 308.72 s gammaloop-nextest-clinnet> Location:
  228. 308.72 s gammaloop-nextest-clinnet> crates/clinnet/src/lib.rs:741:13
  229. 308.72 s gammaloop-nextest-clinnet> stack backtrace:
  230. 308.72 s gammaloop-nextest-clinnet> 0: __rustc::rust_begin_unwind
  231. 308.72 s gammaloop-nextest-clinnet> 1: core::panicking::panic_fmt
  232. 308.72 s gammaloop-nextest-clinnet> 2: core::result::unwrap_failed
  233. 308.72 s gammaloop-nextest-clinnet> 3: public_typst_behavior::render
  234. 308.72 s gammaloop-nextest-clinnet> 4: <std::sync::once::Once>::call_once_force::<<std::sync::once_lock::OnceLock<alloc::string::String>>::initialize<<std::sync::once_lock::OnceLock<alloc::string::String>>::get_or_init<public_typst_behavior::linnest_public_svg::{closure#0}>::{closure#0}, !>::{closure#0}>::{closure#0}
  235. 308.72 s gammaloop-nextest-clinnet> 5: <std::sys::sync::once::futex::Once>::call
  236. 308.72 s gammaloop-nextest-clinnet> 6: <std::sync::once_lock::OnceLock<alloc::string::String>>::initialize::<<std::sync::once_lock::OnceLock<alloc::string::String>>::get_or_init<public_typst_behavior::linnest_public_svg::{closure#0}>::{closure#0}, !>
  237. 308.72 s gammaloop-nextest-clinnet> 7: <public_typst_behavior::public_linnest_labels_follow_their_carriers::{closure#0} as core::ops::function::FnOnce<()>>::call_once
  238. 308.72 s gammaloop-nextest-clinnet> note: Some details are omitted, run with `RUST_BACKTRACE=full` for a verbose backtrace.
  239. 308.72 s gammaloop-nextest-clinnet>
  240. 308.72 s gammaloop-nextest-clinnet> FAIL [ 228.180s] (34/38) clinnet::public_typst_behavior public_linnest_momentum_layers_place_shafts_and_labels
  241. 308.72 s gammaloop-nextest-clinnet> stdout ---
  242. 308.72 s gammaloop-nextest-clinnet>
  243. 308.72 s gammaloop-nextest-clinnet> running 1 test
  244. 308.72 s gammaloop-nextest-clinnet> test public_linnest_momentum_layers_place_shafts_and_labels has been running for over 60 seconds
  245. 308.72 s gammaloop-nextest-clinnet> test public_linnest_momentum_layers_place_shafts_and_labels ... FAILED
  246. 308.72 s gammaloop-nextest-clinnet>
  247. 308.72 s gammaloop-nextest-clinnet> failures:
  248. 308.72 s gammaloop-nextest-clinnet>
  249. 308.72 s gammaloop-nextest-clinnet> failures:
  250. 308.72 s gammaloop-nextest-clinnet> public_linnest_momentum_layers_place_shafts_and_labels
  251. 308.72 s gammaloop-nextest-clinnet>
  252. 308.72 s gammaloop-nextest-clinnet> test result: FAILED. 0 passed; 1 failed; 0 ignored; 0 measured; 17 filtered out; finished in 228.14s
  253. 308.72 s gammaloop-nextest-clinnet>
  254. 308.72 s gammaloop-nextest-clinnet> stderr ---
  255. 308.72 s gammaloop-nextest-clinnet>
  256. 308.72 s gammaloop-nextest-clinnet> thread 'public_linnest_momentum_layers_place_shafts_and_labels' (305) panicked at crates/clinnet/tests/public_typst_behavior.rs:81:55:
  257. 308.72 s gammaloop-nextest-clinnet> called `Result::unwrap()` on an `Err` value: typst failed while compiling template /build/.tmpmVuaZw/.clinnet/templates/linnest-public-behavior.svg
  258. 308.72 s gammaloop-nextest-clinnet>
  259. 308.72 s gammaloop-nextest-clinnet> Command executed:
  260. 308.72 s gammaloop-nextest-clinnet> "typst" "c" "/build/.tmpmVuaZw/.clinnet/templates/linnest-public-behavior.typ" "/build/.tmpmVuaZw/.clinnet/templates/linnest-public-behavior.svg" "--root" "/build/.tmpmVuaZw/.clinnet/templates"
  261. 308.72 s gammaloop-nextest-clinnet>
  262. 308.72 s gammaloop-nextest-clinnet> Typst stdout:
  263. 308.72 s gammaloop-nextest-clinnet>
  264. 308.72 s gammaloop-nextest-clinnet>
  265. 308.72 s gammaloop-nextest-clinnet> Typst stderr:
  266. 308.72 s gammaloop-nextest-clinnet>
  267. 308.72 s gammaloop-nextest-clinnet>
  268. 308.72 s gammaloop-nextest-clinnet> Location:
  269. 308.72 s gammaloop-nextest-clinnet> crates/clinnet/src/lib.rs:741:13
  270. 308.72 s gammaloop-nextest-clinnet> stack backtrace:
  271. 308.72 s gammaloop-nextest-clinnet> 0: __rustc::rust_begin_unwind
  272. 308.72 s gammaloop-nextest-clinnet> 1: core::panicking::panic_fmt
  273. 308.72 s gammaloop-nextest-clinnet> 2: core::result::unwrap_failed
  274. 308.72 s gammaloop-nextest-clinnet> 3: public_typst_behavior::render
  275. 308.72 s gammaloop-nextest-clinnet> 4: <std::sync::once::Once>::call_once_force::<<std::sync::once_lock::OnceLock<alloc::string::String>>::initialize<<std::sync::once_lock::OnceLock<alloc::string::String>>::get_or_init<public_typst_behavior::linnest_public_svg::{closure#0}>::{closure#0}, !>::{closure#0}>::{closure#0}
  276. 308.72 s gammaloop-nextest-clinnet> 5: <std::sys::sync::once::futex::Once>::call
  277. 308.72 s gammaloop-nextest-clinnet> 6: <std::sync::once_lock::OnceLock<alloc::string::String>>::initialize::<<std::sync::once_lock::OnceLock<alloc::string::String>>::get_or_init<public_typst_behavior::linnest_public_svg::{closure#0}>::{closure#0}, !>
  278. 308.72 s gammaloop-nextest-clinnet> 7: <public_typst_behavior::public_linnest_momentum_layers_place_shafts_and_labels::{closure#0} as core::ops::function::FnOnce<()>>::call_once
  279. 308.72 s gammaloop-nextest-clinnet> note: Some details are omitted, run with `RUST_BACKTRACE=full` for a verbose backtrace.
  280. 308.72 s gammaloop-nextest-clinnet>
  281. 308.73 s gammaloop-nextest-clinnet> error: test run failed
  282. 308.81 s gammaloop-nextest-clinnet>
  283. 308.81 s gammaloop-nextest-clinnet> ========== nextest test summary ==========
  284. 308.81 s gammaloop-nextest-clinnet> report: target/nextest/ci_gammaloop/junit.xml
  285. 308.81 s gammaloop-nextest-clinnet> tests: 38, failures: 3, errors: 0
  286. 308.81 s gammaloop-nextest-clinnet>
  287. 308.81 s gammaloop-nextest-clinnet> 1. clinnet::public_typst_behavior::public_linnest_arrow_shafts_and_crossing_gaps
  288. 308.81 s gammaloop-nextest-clinnet> failure: test failure with exit code 101
  289. 308.81 s gammaloop-nextest-clinnet> thread 'public_linnest_arrow_shafts_and_crossing_gaps' (286) panicked at crates/clinnet/tests/public_typst_behavior.rs:81:55:
  290. 308.81 s gammaloop-nextest-clinnet> called `Result::unwrap()` on an `Err` value: typst failed while compiling template /build/.tmpwqjOxv/.clinnet/templates/linnest-public-behavior.svg
  291. 308.81 s gammaloop-nextest-clinnet>
  292. 308.81 s gammaloop-nextest-clinnet> Command executed:
  293. 308.81 s gammaloop-nextest-clinnet> "typst" "c" "/build/.tmpwqjOxv/.clinnet/templates/linnest-public-behavior.typ" "/build/.tmpwqjOxv/.clinnet/templates/linnest-public-behavior.svg" "--root" "/build/.tmpwqjOxv/.clinnet/templates"
  294. 308.81 s gammaloop-nextest-clinnet>
  295. 308.81 s gammaloop-nextest-clinnet> Typst stdout:
  296. 308.81 s gammaloop-nextest-clinnet>
  297. 308.81 s gammaloop-nextest-clinnet>
  298. 308.81 s gammaloop-nextest-clinnet> Typst stderr:
  299. 308.81 s gammaloop-nextest-clinnet>
  300. 308.81 s gammaloop-nextest-clinnet>
  301. 308.81 s gammaloop-nextest-clinnet> Location:
  302. 308.81 s gammaloop-nextest-clinnet> crates/clinnet/src/lib.rs:741:13
  303. 308.81 s gammaloop-nextest-clinnet> stack backtrace:
  304. 308.81 s gammaloop-nextest-clinnet> 0: __rustc::rust_begin_unwind
  305. 308.81 s gammaloop-nextest-clinnet> 1: core::panicking::panic_fmt
  306. 308.81 s gammaloop-nextest-clinnet> 2: core::result::unwrap_failed
  307. 308.81 s gammaloop-nextest-clinnet> 3: public_typst_behavior::render
  308. 308.81 s gammaloop-nextest-clinnet> 4: <std::sync::once::Once>::call_once_force::<<std::sync::once_lock::OnceLock<alloc::string::String>>::initialize<<std::sync::once_lock::OnceLock<alloc::string::String>>::get_or_init<public_typst_behavior::linnest_public_svg::{closure#0}>::{closure#0}, !>::{closure#0}>::{closure#0}
  309. 308.81 s gammaloop-nextest-clinnet> 5: <std::sys::sync::once::futex::Once>::call
  310. 308.81 s gammaloop-nextest-clinnet> 6: <std::sync::once_lock::OnceLock<alloc::string::String>>::initialize::<<std::sync::once_lock::OnceLock<alloc::string::String>>::get_or_init<public_typst_behavior::linnest_public_svg::{closure#0}>::{closure#0}, !>
  311. 308.81 s gammaloop-nextest-clinnet> 7: <public_typst_behavior::public_linnest_arrow_shafts_and_crossing_gaps::{closure#0} as core::ops::function::FnOnce<()>>::call_once
  312. 308.81 s gammaloop-nextest-clinnet> note: Some details are omitted, run with `RUST_BACKTRACE=full` for a verbose backtrace.
  313. 308.81 s gammaloop-nextest-clinnet> system-out
  314. 308.81 s gammaloop-nextest-clinnet> running 1 test
  315. 308.81 s gammaloop-nextest-clinnet> test public_linnest_arrow_shafts_and_crossing_gaps has been running for over 60 seconds
  316. 308.81 s gammaloop-nextest-clinnet> test public_linnest_arrow_shafts_and_crossing_gaps ... FAILED
  317. 308.81 s gammaloop-nextest-clinnet>
  318. 308.81 s gammaloop-nextest-clinnet> failures:
  319. 308.81 s gammaloop-nextest-clinnet>
  320. 308.81 s gammaloop-nextest-clinnet> failures:
  321. 308.81 s gammaloop-nextest-clinnet> public_linnest_arrow_shafts_and_crossing_gaps
  322. 308.81 s gammaloop-nextest-clinnet>
  323. 308.81 s gammaloop-nextest-clinnet> test result: FAILED. 0 passed; 1 failed; 0 ignored; 0 measured; 17 filtered out; finished in 141.69s
  324. 308.81 s gammaloop-nextest-clinnet> system-err
  325. 308.81 s gammaloop-nextest-clinnet> thread 'public_linnest_arrow_shafts_and_crossing_gaps' (286) panicked at crates/clinnet/tests/public_typst_behavior.rs:81:55:
  326. 308.81 s gammaloop-nextest-clinnet> called `Result::unwrap()` on an `Err` value: typst failed while compiling template /build/.tmpwqjOxv/.clinnet/templates/linnest-public-behavior.svg
  327. 308.81 s gammaloop-nextest-clinnet>
  328. 308.81 s gammaloop-nextest-clinnet> Command executed:
  329. 308.81 s gammaloop-nextest-clinnet> "typst" "c" "/build/.tmpwqjOxv/.clinnet/templates/linnest-public-behavior.typ" "/build/.tmpwqjOxv/.clinnet/templates/linnest-public-behavior.svg" "--root" "/build/.tmpwqjOxv/.clinnet/templates"
  330. 308.81 s gammaloop-nextest-clinnet>
  331. 308.81 s gammaloop-nextest-clinnet> Typst stdout:
  332. 308.81 s gammaloop-nextest-clinnet>
  333. 308.81 s gammaloop-nextest-clinnet>
  334. 308.81 s gammaloop-nextest-clinnet> Typst stderr:
  335. 308.81 s gammaloop-nextest-clinnet>
  336. 308.81 s gammaloop-nextest-clinnet>
  337. 308.81 s gammaloop-nextest-clinnet> Location:
  338. 308.81 s gammaloop-nextest-clinnet> crates/clinnet/src/lib.rs:741:13
  339. 308.81 s gammaloop-nextest-clinnet> stack backtrace:
  340. 308.81 s gammaloop-nextest-clinnet> 0: __rustc::rust_begin_unwind
  341. 308.81 s gammaloop-nextest-clinnet> 1: core::panicking::panic_fmt
  342. 308.81 s gammaloop-nextest-clinnet> 2: core::result::unwrap_failed
  343. 308.81 s gammaloop-nextest-clinnet> 3: public_typst_behavior::render
  344. 308.81 s gammaloop-nextest-clinnet> 4: <std::sync::once::Once>::call_once_force::<<std::sync::once_lock::OnceLock<alloc::string::String>>::initialize<<std::sync::once_lock::OnceLock<alloc::string::String>>::get_or_init<public_typst_behavior::linnest_public_svg::{closure#0}>::{closure#0}, !>::{closure#0}>::{closure#0}
  345. 308.81 s gammaloop-nextest-clinnet> 5: <std::sys::sync::once::futex::Once>::call
  346. 308.81 s gammaloop-nextest-clinnet> 6: <std::sync::once_lock::OnceLock<alloc::string::String>>::initialize::<<std::sync::once_lock::OnceLock<alloc::string::String>>::get_or_init<public_typst_behavior::linnest_public_svg::{closure#0}>::{closure#0}, !>
  347. 308.81 s gammaloop-nextest-clinnet> 7: <public_typst_behavior::public_linnest_arrow_shafts_and_crossing_gaps::{closure#0} as core::ops::function::FnOnce<()>>::call_once
  348. 308.81 s gammaloop-nextest-clinnet> note: Some details are omitted, run with `RUST_BACKTRACE=full` for a verbose backtrace.
  349. 308.81 s gammaloop-nextest-clinnet>
  350. 308.81 s gammaloop-nextest-clinnet> 2. clinnet::public_typst_behavior::public_linnest_labels_follow_their_carriers
  351. 308.81 s gammaloop-nextest-clinnet> failure: test failure with exit code 101
  352. 308.81 s gammaloop-nextest-clinnet> thread 'public_linnest_labels_follow_their_carriers' (281) panicked at crates/clinnet/tests/public_typst_behavior.rs:81:55:
  353. 308.81 s gammaloop-nextest-clinnet> called `Result::unwrap()` on an `Err` value: typst failed while compiling template /build/.tmpWkJXOH/.clinnet/templates/linnest-public-behavior.svg
  354. 308.81 s gammaloop-nextest-clinnet>
  355. 308.81 s gammaloop-nextest-clinnet> Command executed:
  356. 308.81 s gammaloop-nextest-clinnet> "typst" "c" "/build/.tmpWkJXOH/.clinnet/templates/linnest-public-behavior.typ" "/build/.tmpWkJXOH/.clinnet/templates/linnest-public-behavior.svg" "--root" "/build/.tmpWkJXOH/.clinnet/templates"
  357. 308.81 s gammaloop-nextest-clinnet>
  358. 308.81 s gammaloop-nextest-clinnet> Typst stdout:
  359. 308.81 s gammaloop-nextest-clinnet>
  360. 308.81 s gammaloop-nextest-clinnet>
  361. 308.81 s gammaloop-nextest-clinnet> Typst stderr:
  362. 308.81 s gammaloop-nextest-clinnet>
  363. 308.81 s gammaloop-nextest-clinnet>
  364. 308.81 s gammaloop-nextest-clinnet> Location:
  365. 308.81 s gammaloop-nextest-clinnet> crates/clinnet/src/lib.rs:741:13
  366. 308.81 s gammaloop-nextest-clinnet> stack backtrace:
  367. 308.81 s gammaloop-nextest-clinnet> 0: __rustc::rust_begin_unwind
  368. 308.81 s gammaloop-nextest-clinnet> 1: core::panicking::panic_fmt
  369. 308.81 s gammaloop-nextest-clinnet> 2: core::result::unwrap_failed
  370. 308.81 s gammaloop-nextest-clinnet> 3: public_typst_behavior::render
  371. 308.81 s gammaloop-nextest-clinnet> 4: <std::sync::once::Once>::call_once_force::<<std::sync::once_lock::OnceLock<alloc::string::String>>::initialize<<std::sync::once_lock::OnceLock<alloc::string::String>>::get_or_init<public_typst_behavior::linnest_public_svg::{closure#0}>::{closure#0}, !>::{closure#0}>::{closure#0}
  372. 308.81 s gammaloop-nextest-clinnet> 5: <std::sys::sync::once::futex::Once>::call
  373. 308.81 s gammaloop-nextest-clinnet> 6: <std::sync::once_lock::OnceLock<alloc::string::String>>::initialize::<<std::sync::once_lock::OnceLock<alloc::string::String>>::get_or_init<public_typst_behavior::linnest_public_svg::{closure#0}>::{closure#0}, !>
  374. 308.81 s gammaloop-nextest-clinnet> 7: <public_typst_behavior::public_linnest_labels_follow_their_carriers::{closure#0} as core::ops::function::FnOnce<()>>::call_once
  375. 308.81 s gammaloop-nextest-clinnet> note: Some details are omitted, run with `RUST_BACKTRACE=full` for a verbose backtrace.
  376. 308.81 s gammaloop-nextest-clinnet> system-out
  377. 308.81 s gammaloop-nextest-clinnet> running 1 test
  378. 308.81 s gammaloop-nextest-clinnet> test public_linnest_labels_follow_their_carriers has been running for over 60 seconds
  379. 308.81 s gammaloop-nextest-clinnet> test public_linnest_labels_follow_their_carriers ... FAILED
  380. 308.81 s gammaloop-nextest-clinnet>
  381. 308.81 s gammaloop-nextest-clinnet> failures:
  382. 308.81 s gammaloop-nextest-clinnet>
  383. 308.81 s gammaloop-nextest-clinnet> failures:
  384. 308.81 s gammaloop-nextest-clinnet> public_linnest_labels_follow_their_carriers
  385. 308.81 s gammaloop-nextest-clinnet>
  386. 308.81 s gammaloop-nextest-clinnet> test result: FAILED. 0 passed; 1 failed; 0 ignored; 0 measured; 17 filtered out; finished in 152.39s
  387. 308.81 s gammaloop-nextest-clinnet> system-err
  388. 308.81 s gammaloop-nextest-clinnet> thread 'public_linnest_labels_follow_their_carriers' (281) panicked at crates/clinnet/tests/public_typst_behavior.rs:81:55:
  389. 308.81 s gammaloop-nextest-clinnet> called `Result::unwrap()` on an `Err` value: typst failed while compiling template /build/.tmpWkJXOH/.clinnet/templates/linnest-public-behavior.svg
  390. 308.81 s gammaloop-nextest-clinnet>
  391. 308.81 s gammaloop-nextest-clinnet> Command executed:
  392. 308.81 s gammaloop-nextest-clinnet> "typst" "c" "/build/.tmpWkJXOH/.clinnet/templates/linnest-public-behavior.typ" "/build/.tmpWkJXOH/.clinnet/templates/linnest-public-behavior.svg" "--root" "/build/.tmpWkJXOH/.clinnet/templates"
  393. 308.81 s gammaloop-nextest-clinnet>
  394. 308.81 s gammaloop-nextest-clinnet> Typst stdout:
  395. 308.81 s gammaloop-nextest-clinnet>
  396. 308.81 s gammaloop-nextest-clinnet>
  397. 308.81 s gammaloop-nextest-clinnet> Typst stderr:
  398. 308.81 s gammaloop-nextest-clinnet>
  399. 308.81 s gammaloop-nextest-clinnet>
  400. 308.81 s gammaloop-nextest-clinnet> Location:
  401. 308.81 s gammaloop-nextest-clinnet> crates/clinnet/src/lib.rs:741:13
  402. 308.81 s gammaloop-nextest-clinnet> stack backtrace:
  403. 308.81 s gammaloop-nextest-clinnet> 0: __rustc::rust_begin_unwind
  404. 308.81 s gammaloop-nextest-clinnet> 1: core::panicking::panic_fmt
  405. 308.81 s gammaloop-nextest-clinnet> 2: core::result::unwrap_failed
  406. 308.81 s gammaloop-nextest-clinnet> 3: public_typst_behavior::render
  407. 308.81 s gammaloop-nextest-clinnet> 4: <std::sync::once::Once>::call_once_force::<<std::sync::once_lock::OnceLock<alloc::string::String>>::initialize<<std::sync::once_lock::OnceLock<alloc::string::String>>::get_or_init<public_typst_behavior::linnest_public_svg::{closure#0}>::{closure#0}, !>::{closure#0}>::{closure#0}
  408. 308.81 s gammaloop-nextest-clinnet> 5: <std::sys::sync::once::futex::Once>::call
  409. 308.81 s gammaloop-nextest-clinnet> 6: <std::sync::once_lock::OnceLock<alloc::string::String>>::initialize::<<std::sync::once_lock::OnceLock<alloc::string::String>>::get_or_init<public_typst_behavior::linnest_public_svg::{closure#0}>::{closure#0}, !>
  410. 308.81 s gammaloop-nextest-clinnet> 7: <public_typst_behavior::public_linnest_labels_follow_their_carriers::{closure#0} as core::ops::function::FnOnce<()>>::call_once
  411. 308.81 s gammaloop-nextest-clinnet> note: Some details are omitted, run with `RUST_BACKTRACE=full` for a verbose backtrace.
  412. 308.81 s gammaloop-nextest-clinnet>
  413. 308.81 s gammaloop-nextest-clinnet> 3. clinnet::public_typst_behavior::public_linnest_momentum_layers_place_shafts_and_labels
  414. 308.81 s gammaloop-nextest-clinnet> failure: test failure with exit code 101
  415. 308.81 s gammaloop-nextest-clinnet> thread 'public_linnest_momentum_layers_place_shafts_and_labels' (305) panicked at crates/clinnet/tests/public_typst_behavior.rs:81:55:
  416. 308.81 s gammaloop-nextest-clinnet> called `Result::unwrap()` on an `Err` value: typst failed while compiling template /build/.tmpmVuaZw/.clinnet/templates/linnest-public-behavior.svg
  417. 308.81 s gammaloop-nextest-clinnet>
  418. 308.81 s gammaloop-nextest-clinnet> Command executed:
  419. 308.81 s gammaloop-nextest-clinnet> "typst" "c" "/build/.tmpmVuaZw/.clinnet/templates/linnest-public-behavior.typ" "/build/.tmpmVuaZw/.clinnet/templates/linnest-public-behavior.svg" "--root" "/build/.tmpmVuaZw/.clinnet/templates"
  420. 308.81 s gammaloop-nextest-clinnet>
  421. 308.81 s gammaloop-nextest-clinnet> Typst stdout:
  422. 308.81 s gammaloop-nextest-clinnet>
  423. 308.81 s gammaloop-nextest-clinnet>
  424. 308.81 s gammaloop-nextest-clinnet> Typst stderr:
  425. 308.81 s gammaloop-nextest-clinnet>
  426. 308.81 s gammaloop-nextest-clinnet>
  427. 308.81 s gammaloop-nextest-clinnet> Location:
  428. 308.81 s gammaloop-nextest-clinnet> crates/clinnet/src/lib.rs:741:13
  429. 308.81 s gammaloop-nextest-clinnet> stack backtrace:
  430. 308.81 s gammaloop-nextest-clinnet> 0: __rustc::rust_begin_unwind
  431. 308.81 s gammaloop-nextest-clinnet> 1: core::panicking::panic_fmt
  432. 308.81 s gammaloop-nextest-clinnet> 2: core::result::unwrap_failed
  433. 308.81 s gammaloop-nextest-clinnet> 3: public_typst_behavior::render
  434. 308.81 s gammaloop-nextest-clinnet> 4: <std::sync::once::Once>::call_once_force::<<std::sync::once_lock::OnceLock<alloc::string::String>>::initialize<<std::sync::once_lock::OnceLock<alloc::string::String>>::get_or_init<public_typst_behavior::linnest_public_svg::{closure#0}>::{closure#0}, !>::{closure#0}>::{closure#0}
  435. 308.81 s gammaloop-nextest-clinnet> 5: <std::sys::sync::once::futex::Once>::call
  436. 308.81 s gammaloop-nextest-clinnet> 6: <std::sync::once_lock::OnceLock<alloc::string::String>>::initialize::<<std::sync::once_lock::OnceLock<alloc::string::String>>::get_or_init<public_typst_behavior::linnest_public_svg::{closure#0}>::{closure#0}, !>
  437. 308.81 s gammaloop-nextest-clinnet> 7: <public_typst_behavior::public_linnest_momentum_layers_place_shafts_and_labels::{closure#0} as core::ops::function::FnOnce<()>>::call_once
  438. 308.81 s gammaloop-nextest-clinnet> note: Some details are omitted, run with `RUST_BACKTRACE=full` for a verbose backtrace.
  439. 308.81 s gammaloop-nextest-clinnet> system-out
  440. 308.81 s gammaloop-nextest-clinnet> running 1 test
  441. 308.81 s gammaloop-nextest-clinnet> test public_linnest_momentum_layers_place_shafts_and_labels has been running for over 60 seconds
  442. 308.81 s gammaloop-nextest-clinnet> test public_linnest_momentum_layers_place_shafts_and_labels ... FAILED
  443. 308.81 s gammaloop-nextest-clinnet>
  444. 308.81 s gammaloop-nextest-clinnet> failures:
  445. 308.81 s gammaloop-nextest-clinnet>
  446. 308.81 s gammaloop-nextest-clinnet> failures:
  447. 308.81 s gammaloop-nextest-clinnet> public_linnest_momentum_layers_place_shafts_and_labels
  448. 308.81 s gammaloop-nextest-clinnet>
  449. 308.81 s gammaloop-nextest-clinnet> test result: FAILED. 0 passed; 1 failed; 0 ignored; 0 measured; 17 filtered out; finished in 228.14s
  450. 308.81 s gammaloop-nextest-clinnet> system-err
  451. 308.81 s gammaloop-nextest-clinnet> thread 'public_linnest_momentum_layers_place_shafts_and_labels' (305) panicked at crates/clinnet/tests/public_typst_behavior.rs:81:55:
  452. 308.81 s gammaloop-nextest-clinnet> called `Result::unwrap()` on an `Err` value: typst failed while compiling template /build/.tmpmVuaZw/.clinnet/templates/linnest-public-behavior.svg
  453. 308.81 s gammaloop-nextest-clinnet>
  454. 308.81 s gammaloop-nextest-clinnet> Command executed:
  455. 308.81 s gammaloop-nextest-clinnet> "typst" "c" "/build/.tmpmVuaZw/.clinnet/templates/linnest-public-behavior.typ" "/build/.tmpmVuaZw/.clinnet/templates/linnest-public-behavior.svg" "--root" "/build/.tmpmVuaZw/.clinnet/templates"
  456. 308.81 s gammaloop-nextest-clinnet>
  457. 308.81 s gammaloop-nextest-clinnet> Typst stdout:
  458. 308.81 s gammaloop-nextest-clinnet>
  459. 308.81 s gammaloop-nextest-clinnet>
  460. 308.81 s gammaloop-nextest-clinnet> Typst stderr:
  461. 308.81 s gammaloop-nextest-clinnet>
  462. 308.81 s gammaloop-nextest-clinnet>
  463. 308.81 s gammaloop-nextest-clinnet> Location:
  464. 308.81 s gammaloop-nextest-clinnet> crates/clinnet/src/lib.rs:741:13
  465. 308.81 s gammaloop-nextest-clinnet> stack backtrace:
  466. 308.81 s gammaloop-nextest-clinnet> 0: __rustc::rust_begin_unwind
  467. 308.81 s gammaloop-nextest-clinnet> 1: core::panicking::panic_fmt
  468. 308.81 s gammaloop-nextest-clinnet> 2: core::result::unwrap_failed
  469. 308.81 s gammaloop-nextest-clinnet> 3: public_typst_behavior::render
  470. 308.81 s gammaloop-nextest-clinnet> 4: <std::sync::once::Once>::call_once_force::<<std::sync::once_lock::OnceLock<alloc::string::String>>::initialize<<std::sync::once_lock::OnceLock<alloc::string::String>>::get_or_init<public_typst_behavior::linnest_public_svg::{closure#0}>::{closure#0}, !>::{closure#0}>::{closure#0}
  471. 308.81 s gammaloop-nextest-clinnet> 5: <std::sys::sync::once::futex::Once>::call
  472. 308.81 s gammaloop-nextest-clinnet> 6: <std::sync::once_lock::OnceLock<alloc::string::String>>::initialize::<<std::sync::once_lock::OnceLock<alloc::string::String>>::get_or_init<public_typst_behavior::linnest_public_svg::{closure#0}>::{closure#0}, !>
  473. 308.81 s gammaloop-nextest-clinnet> 7: <public_typst_behavior::public_linnest_momentum_layers_place_shafts_and_labels::{closure#0} as core::ops::function::FnOnce<()>>::call_once
  474. 308.81 s gammaloop-nextest-clinnet> note: Some details are omitted, run with `RUST_BACKTRACE=full` for a verbose backtrace.
  475. 308.81 s gammaloop-nextest-clinnet> =========================================
  476. 308.93 s [0 built (1 failed)]error: Cannot build '/nix/store/4pqspwvh8pi9s2vg9g6mfsggpl9ynwzx-gammaloop-nextest-clinnet.drv'.
  477. 308.93 s Reason: builder failed with exit code 100.
  478. 308.93 s Output paths:
  479. 308.93 s /nix/store/v9zka7gxdrym1pq03r0i4w2q43fgdwcq-gammaloop-nextest-clinnet
  480. 308.93 s Last 449 log lines:
  481. 308.93 s > Nextest worker budget: 16
  482. 308.93 s > Extracting 4 binaries (including 1 non-test binary), 1 build script output directory, and 1 linked path to /build/source
  483. 308.93 s > Extracted 16 files to /build/source in 0.17s
  484. 308.93 s > ------------
  485. 308.93 s > Nextest run ID 87db954c-e4a2-4974-9730-8a14994d9732 with nextest profile: ci_gammaloop
  486. 308.93 s > Starting 38 tests across 3 binaries
  487. 308.93 s > FAIL [ 141.742s] (32/38) clinnet::public_typst_behavior public_linnest_arrow_shafts_and_crossing_gaps
  488. 308.93 s > stdout ---
  489. 308.93 s >
  490. 308.93 s > running 1 test
  491. 308.93 s > test public_linnest_arrow_shafts_and_crossing_gaps has been running for over 60 seconds
  492. 308.93 s > test public_linnest_arrow_shafts_and_crossing_gaps ... FAILED
  493. 308.93 s >
  494. 308.93 s > failures:
  495. 308.93 s >
  496. 308.93 s > failures:
  497. 308.93 s > public_linnest_arrow_shafts_and_crossing_gaps
  498. 308.93 s >
  499. 308.93 s > test result: FAILED. 0 passed; 1 failed; 0 ignored; 0 measured; 17 filtered out; finished in 141.69s
  500. 308.93 s >
  501. 308.93 s > stderr ---
  502. 308.93 s >
  503. 308.93 s > thread 'public_linnest_arrow_shafts_and_crossing_gaps' (286) panicked at crates/clinnet/tests/public_typst_behavior.rs:81:55:
  504. 308.93 s > called `Result::unwrap()` on an `Err` value: typst failed while compiling template /build/.tmpwqjOxv/.clinnet/templates/linnest-public-behavior.svg
  505. 308.93 s >
  506. 308.93 s > Command executed:
  507. 308.93 s > "typst" "c" "/build/.tmpwqjOxv/.clinnet/templates/linnest-public-behavior.typ" "/build/.tmpwqjOxv/.clinnet/templates/linnest-public-behavior.svg" "--root" "/build/.tmpwqjOxv/.clinnet/templates"
  508. 308.93 s >
  509. 308.93 s > Typst stdout:
  510. 308.93 s >
  511. 308.93 s >
  512. 308.93 s > Typst stderr:
  513. 308.93 s >
  514. 308.93 s >
  515. 308.93 s > Location:
  516. 308.93 s > crates/clinnet/src/lib.rs:741:13
  517. 308.93 s > stack backtrace:
  518. 308.93 s > 0: __rustc::rust_begin_unwind
  519. 308.93 s > 1: core::panicking::panic_fmt
  520. 308.93 s > 2: core::result::unwrap_failed
  521. 308.93 s > 3: public_typst_behavior::render
  522. 308.93 s > 4: <std::sync::once::Once>::call_once_force::<<std::sync::once_lock::OnceLock<alloc::string::String>>::initialize<<std::sync::once_lock::OnceLock<alloc::string::String>>::get_or_init<public_typst_behavior::linnest_public_svg::{closure#0}>::{closure#0}, !>::{closure#0}>::{closure#0}
  523. 308.93 s > 5: <std::sys::sync::once::futex::Once>::call
  524. 308.93 s > 6: <std::sync::once_lock::OnceLock<alloc::string::String>>::initialize::<<std::sync::once_lock::OnceLock<alloc::string::String>>::get_or_init<public_typst_behavior::linnest_public_svg::{closure#0}>::{closure#0}, !>
  525. 308.93 s > 7: <public_typst_behavior::public_linnest_arrow_shafts_and_crossing_gaps::{closure#0} as core::ops::function::FnOnce<()>>::call_once
  526. 308.93 s > note: Some details are omitted, run with `RUST_BACKTRACE=full` for a verbose backtrace.
  527. 308.93 s >
  528. 308.93 s > FAIL [ 152.422s] (33/38) clinnet::public_typst_behavior public_linnest_labels_follow_their_carriers
  529. 308.93 s > stdout ---
  530. 308.93 s >
  531. 308.93 s > running 1 test
  532. 308.93 s > test public_linnest_labels_follow_their_carriers has been running for over 60 seconds
  533. 308.93 s > test public_linnest_labels_follow_their_carriers ... FAILED
  534. 308.93 s >
  535. 308.93 s > failures:
  536. 308.93 s >
  537. 308.93 s > failures:
  538. 308.93 s > public_linnest_labels_follow_their_carriers
  539. 308.93 s >
  540. 308.93 s > test result: FAILED. 0 passed; 1 failed; 0 ignored; 0 measured; 17 filtered out; finished in 152.39s
  541. 308.93 s >
  542. 308.93 s > stderr ---
  543. 308.93 s >
  544. 308.93 s > thread 'public_linnest_labels_follow_their_carriers' (281) panicked at crates/clinnet/tests/public_typst_behavior.rs:81:55:
  545. 308.93 s > called `Result::unwrap()` on an `Err` value: typst failed while compiling template /build/.tmpWkJXOH/.clinnet/templates/linnest-public-behavior.svg
  546. 308.93 s >
  547. 308.93 s > Command executed:
  548. 308.93 s > "typst" "c" "/build/.tmpWkJXOH/.clinnet/templates/linnest-public-behavior.typ" "/build/.tmpWkJXOH/.clinnet/templates/linnest-public-behavior.svg" "--root" "/build/.tmpWkJXOH/.clinnet/templates"
  549. 308.93 s >
  550. 308.93 s > Typst stdout:
  551. 308.93 s >
  552. 308.93 s >
  553. 308.93 s > Typst stderr:
  554. 308.93 s >
  555. 308.93 s >
  556. 308.93 s > Location:
  557. 308.93 s > crates/clinnet/src/lib.rs:741:13
  558. 308.93 s > stack backtrace:
  559. 308.93 s > 0: __rustc::rust_begin_unwind
  560. 308.93 s > 1: core::panicking::panic_fmt
  561. 308.93 s > 2: core::result::unwrap_failed
  562. 308.93 s > 3: public_typst_behavior::render
  563. 308.93 s > 4: <std::sync::once::Once>::call_once_force::<<std::sync::once_lock::OnceLock<alloc::string::String>>::initialize<<std::sync::once_lock::OnceLock<alloc::string::String>>::get_or_init<public_typst_behavior::linnest_public_svg::{closure#0}>::{closure#0}, !>::{closure#0}>::{closure#0}
  564. 308.93 s > 5: <std::sys::sync::once::futex::Once>::call
  565. 308.93 s > 6: <std::sync::once_lock::OnceLock<alloc::string::String>>::initialize::<<std::sync::once_lock::OnceLock<alloc::string::String>>::get_or_init<public_typst_behavior::linnest_public_svg::{closure#0}>::{closure#0}, !>
  566. 308.93 s > 7: <public_typst_behavior::public_linnest_labels_follow_their_carriers::{closure#0} as core::ops::function::FnOnce<()>>::call_once
  567. 308.93 s > note: Some details are omitted, run with `RUST_BACKTRACE=full` for a verbose backtrace.
  568. 308.93 s >
  569. 308.93 s > FAIL [ 228.180s] (34/38) clinnet::public_typst_behavior public_linnest_momentum_layers_place_shafts_and_labels
  570. 308.93 s > stdout ---
  571. 308.93 s >
  572. 308.93 s > running 1 test
  573. 308.93 s > test public_linnest_momentum_layers_place_shafts_and_labels has been running for over 60 seconds
  574. 308.93 s > test public_linnest_momentum_layers_place_shafts_and_labels ... FAILED
  575. 308.93 s >
  576. 308.93 s > failures:
  577. 308.93 s >
  578. 308.93 s > failures:
  579. 308.93 s > public_linnest_momentum_layers_place_shafts_and_labels
  580. 308.93 s >
  581. 308.93 s > test result: FAILED. 0 passed; 1 failed; 0 ignored; 0 measured; 17 filtered out; finished in 228.14s
  582. 308.93 s >
  583. 308.93 s > stderr ---
  584. 308.93 s >
  585. 308.93 s > thread 'public_linnest_momentum_layers_place_shafts_and_labels' (305) panicked at crates/clinnet/tests/public_typst_behavior.rs:81:55:
  586. 308.93 s > called `Result::unwrap()` on an `Err` value: typst failed while compiling template /build/.tmpmVuaZw/.clinnet/templates/linnest-public-behavior.svg
  587. 308.93 s >
  588. 308.93 s > Command executed:
  589. 308.93 s > "typst" "c" "/build/.tmpmVuaZw/.clinnet/templates/linnest-public-behavior.typ" "/build/.tmpmVuaZw/.clinnet/templates/linnest-public-behavior.svg" "--root" "/build/.tmpmVuaZw/.clinnet/templates"
  590. 308.93 s >
  591. 308.93 s > Typst stdout:
  592. 308.93 s >
  593. 308.93 s >
  594. 308.93 s > Typst stderr:
  595. 308.93 s >
  596. 308.93 s >
  597. 308.93 s > Location:
  598. 308.93 s > crates/clinnet/src/lib.rs:741:13
  599. 308.93 s > stack backtrace:
  600. 308.93 s > 0: __rustc::rust_begin_unwind
  601. 308.93 s > 1: core::panicking::panic_fmt
  602. 308.93 s > 2: core::result::unwrap_failed
  603. 308.93 s > 3: public_typst_behavior::render
  604. 308.93 s > 4: <std::sync::once::Once>::call_once_force::<<std::sync::once_lock::OnceLock<alloc::string::String>>::initialize<<std::sync::once_lock::OnceLock<alloc::string::String>>::get_or_init<public_typst_behavior::linnest_public_svg::{closure#0}>::{closure#0}, !>::{closure#0}>::{closure#0}
  605. 308.93 s > 5: <std::sys::sync::once::futex::Once>::call
  606. 308.93 s > 6: <std::sync::once_lock::OnceLock<alloc::string::String>>::initialize::<<std::sync::once_lock::OnceLock<alloc::string::String>>::get_or_init<public_typst_behavior::linnest_public_svg::{closure#0}>::{closure#0}, !>
  607. 308.93 s > 7: <public_typst_behavior::public_linnest_momentum_layers_place_shafts_and_labels::{closure#0} as core::ops::function::FnOnce<()>>::call_once
  608. 308.93 s > note: Some details are omitted, run with `RUST_BACKTRACE=full` for a verbose backtrace.
  609. 308.93 s >
  610. 308.93 s > ------------
  611. 308.93 s > Summary [ 233.834s] 38 tests run: 35 passed (4 slow), 3 failed, 0 skipped
  612. 308.93 s > FAIL [ 141.742s] (32/38) clinnet::public_typst_behavior public_linnest_arrow_shafts_and_crossing_gaps
  613. 308.93 s > stdout ---
  614. 308.93 s >
  615. 308.93 s > running 1 test
  616. 308.93 s > test public_linnest_arrow_shafts_and_crossing_gaps has been running for over 60 seconds
  617. 308.93 s > test public_linnest_arrow_shafts_and_crossing_gaps ... FAILED
  618. 308.93 s >
  619. 308.93 s > failures:
  620. 308.93 s >
  621. 308.93 s > failures:
  622. 308.93 s > public_linnest_arrow_shafts_and_crossing_gaps
  623. 308.93 s >
  624. 308.93 s > test result: FAILED. 0 passed; 1 failed; 0 ignored; 0 measured; 17 filtered out; finished in 141.69s
  625. 308.93 s >
  626. 308.93 s > stderr ---
  627. 308.93 s >
  628. 308.93 s > thread 'public_linnest_arrow_shafts_and_crossing_gaps' (286) panicked at crates/clinnet/tests/public_typst_behavior.rs:81:55:
  629. 308.93 s > called `Result::unwrap()` on an `Err` value: typst failed while compiling template /build/.tmpwqjOxv/.clinnet/templates/linnest-public-behavior.svg
  630. 308.93 s >
  631. 308.93 s > Command executed:
  632. 308.93 s > "typst" "c" "/build/.tmpwqjOxv/.clinnet/templates/linnest-public-behavior.typ" "/build/.tmpwqjOxv/.clinnet/templates/linnest-public-behavior.svg" "--root" "/build/.tmpwqjOxv/.clinnet/templates"
  633. 308.93 s >
  634. 308.93 s > Typst stdout:
  635. 308.93 s >
  636. 308.93 s >
  637. 308.93 s > Typst stderr:
  638. 308.93 s >
  639. 308.93 s >
  640. 308.93 s > Location:
  641. 308.93 s > crates/clinnet/src/lib.rs:741:13
  642. 308.93 s > stack backtrace:
  643. 308.93 s > 0: __rustc::rust_begin_unwind
  644. 308.93 s > 1: core::panicking::panic_fmt
  645. 308.93 s > 2: core::result::unwrap_failed
  646. 308.93 s > 3: public_typst_behavior::render
  647. 308.93 s > 4: <std::sync::once::Once>::call_once_force::<<std::sync::once_lock::OnceLock<alloc::string::String>>::initialize<<std::sync::once_lock::OnceLock<alloc::string::String>>::get_or_init<public_typst_behavior::linnest_public_svg::{closure#0}>::{closure#0}, !>::{closure#0}>::{closure#0}
  648. 308.93 s > 5: <std::sys::sync::once::futex::Once>::call
  649. 308.93 s > 6: <std::sync::once_lock::OnceLock<alloc::string::String>>::initialize::<<std::sync::once_lock::OnceLock<alloc::string::String>>::get_or_init<public_typst_behavior::linnest_public_svg::{closure#0}>::{closure#0}, !>
  650. 308.93 s > 7: <public_typst_behavior::public_linnest_arrow_shafts_and_crossing_gaps::{closure#0} as core::ops::function::FnOnce<()>>::call_once
  651. 308.93 s > note: Some details are omitted, run with `RUST_BACKTRACE=full` for a verbose backtrace.
  652. 308.93 s >
  653. 308.93 s > FAIL [ 152.422s] (33/38) clinnet::public_typst_behavior public_linnest_labels_follow_their_carriers
  654. 308.93 s > stdout ---
  655. 308.93 s >
  656. 308.93 s > running 1 test
  657. 308.93 s > test public_linnest_labels_follow_their_carriers has been running for over 60 seconds
  658. 308.93 s > test public_linnest_labels_follow_their_carriers ... FAILED
  659. 308.93 s >
  660. 308.93 s > failures:
  661. 308.93 s >
  662. 308.93 s > failures:
  663. 308.93 s > public_linnest_labels_follow_their_carriers
  664. 308.93 s >
  665. 308.93 s > test result: FAILED. 0 passed; 1 failed; 0 ignored; 0 measured; 17 filtered out; finished in 152.39s
  666. 308.93 s >
  667. 308.93 s > stderr ---
  668. 308.93 s >
  669. 308.93 s > thread 'public_linnest_labels_follow_their_carriers' (281) panicked at crates/clinnet/tests/public_typst_behavior.rs:81:55:
  670. 308.93 s > called `Result::unwrap()` on an `Err` value: typst failed while compiling template /build/.tmpWkJXOH/.clinnet/templates/linnest-public-behavior.svg
  671. 308.93 s >
  672. 308.93 s > Command executed:
  673. 308.93 s > "typst" "c" "/build/.tmpWkJXOH/.clinnet/templates/linnest-public-behavior.typ" "/build/.tmpWkJXOH/.clinnet/templates/linnest-public-behavior.svg" "--root" "/build/.tmpWkJXOH/.clinnet/templates"
  674. 308.93 s >
  675. 308.93 s > Typst stdout:
  676. 308.93 s >
  677. 308.93 s >
  678. 308.93 s > Typst stderr:
  679. 308.93 s >
  680. 308.93 s >
  681. 308.93 s > Location:
  682. 308.93 s > crates/clinnet/src/lib.rs:741:13
  683. 308.93 s > stack backtrace:
  684. 308.93 s > 0: __rustc::rust_begin_unwind
  685. 308.93 s > 1: core::panicking::panic_fmt
  686. 308.93 s > 2: core::result::unwrap_failed
  687. 308.93 s > 3: public_typst_behavior::render
  688. 308.93 s > 4: <std::sync::once::Once>::call_once_force::<<std::sync::once_lock::OnceLock<alloc::string::String>>::initialize<<std::sync::once_lock::OnceLock<alloc::string::String>>::get_or_init<public_typst_behavior::linnest_public_svg::{closure#0}>::{closure#0}, !>::{closure#0}>::{closure#0}
  689. 308.93 s > 5: <std::sys::sync::once::futex::Once>::call
  690. 308.93 s > 6: <std::sync::once_lock::OnceLock<alloc::string::String>>::initialize::<<std::sync::once_lock::OnceLock<alloc::string::String>>::get_or_init<public_typst_behavior::linnest_public_svg::{closure#0}>::{closure#0}, !>
  691. 308.93 s > 7: <public_typst_behavior::public_linnest_labels_follow_their_carriers::{closure#0} as core::ops::function::FnOnce<()>>::call_once
  692. 308.93 s > note: Some details are omitted, run with `RUST_BACKTRACE=full` for a verbose backtrace.
  693. 308.93 s >
  694. 308.93 s > FAIL [ 228.180s] (34/38) clinnet::public_typst_behavior public_linnest_momentum_layers_place_shafts_and_labels
  695. 308.93 s > stdout ---
  696. 308.93 s >
  697. 308.93 s > running 1 test
  698. 308.93 s > test public_linnest_momentum_layers_place_shafts_and_labels has been running for over 60 seconds
  699. 308.93 s > test public_linnest_momentum_layers_place_shafts_and_labels ... FAILED
  700. 308.93 s >
  701. 308.93 s > failures:
  702. 308.93 s >
  703. 308.93 s > failures:
  704. 308.93 s > public_linnest_momentum_layers_place_shafts_and_labels
  705. 308.93 s >
  706. 308.93 s > test result: FAILED. 0 passed; 1 failed; 0 ignored; 0 measured; 17 filtered out; finished in 228.14s
  707. 308.93 s >
  708. 308.93 s > stderr ---
  709. 308.93 s >
  710. 308.93 s > thread 'public_linnest_momentum_layers_place_shafts_and_labels' (305) panicked at crates/clinnet/tests/public_typst_behavior.rs:81:55:
  711. 308.93 s > called `Result::unwrap()` on an `Err` value: typst failed while compiling template /build/.tmpmVuaZw/.clinnet/templates/linnest-public-behavior.svg
  712. 308.93 s >
  713. 308.93 s > Command executed:
  714. 308.93 s > "typst" "c" "/build/.tmpmVuaZw/.clinnet/templates/linnest-public-behavior.typ" "/build/.tmpmVuaZw/.clinnet/templates/linnest-public-behavior.svg" "--root" "/build/.tmpmVuaZw/.clinnet/templates"
  715. 308.93 s >
  716. 308.93 s > Typst stdout:
  717. 308.93 s >
  718. 308.93 s >
  719. 308.93 s > Typst stderr:
  720. 308.93 s >
  721. 308.93 s >
  722. 308.93 s > Location:
  723. 308.93 s > crates/clinnet/src/lib.rs:741:13
  724. 308.93 s > stack backtrace:
  725. 308.93 s > 0: __rustc::rust_begin_unwind
  726. 308.93 s > 1: core::panicking::panic_fmt
  727. 308.93 s > 2: core::result::unwrap_failed
  728. 308.93 s > 3: public_typst_behavior::render
  729. 308.93 s > 4: <std::sync::once::Once>::call_once_force::<<std::sync::once_lock::OnceLock<alloc::string::String>>::initialize<<std::sync::once_lock::OnceLock<alloc::string::String>>::get_or_init<public_typst_behavior::linnest_public_svg::{closure#0}>::{closure#0}, !>::{closure#0}>::{closure#0}
  730. 308.93 s > 5: <std::sys::sync::once::futex::Once>::call
  731. 308.93 s > 6: <std::sync::once_lock::OnceLock<alloc::string::String>>::initialize::<<std::sync::once_lock::OnceLock<alloc::string::String>>::get_or_init<public_typst_behavior::linnest_public_svg::{closure#0}>::{closure#0}, !>
  732. 308.93 s > 7: <public_typst_behavior::public_linnest_momentum_layers_place_shafts_and_labels::{closure#0} as core::ops::function::FnOnce<()>>::call_once
  733. 308.93 s > note: Some details are omitted, run with `RUST_BACKTRACE=full` for a verbose backtrace.
  734. 308.93 s >
  735. 308.93 s > error: test run failed
  736. 308.93 s >
  737. 308.93 s > ========== nextest test summary ==========
  738. 308.93 s > report: target/nextest/ci_gammaloop/junit.xml
  739. 308.93 s > tests: 38, failures: 3, errors: 0
  740. 308.93 s >
  741. 308.93 s > 1. clinnet::public_typst_behavior::public_linnest_arrow_shafts_and_crossing_gaps
  742. 308.93 s > failure: test failure with exit code 101
  743. 308.93 s > thread 'public_linnest_arrow_shafts_and_crossing_gaps' (286) panicked at crates/clinnet/tests/public_typst_behavior.rs:81:55:
  744. 308.93 s > called `Result::unwrap()` on an `Err` value: typst failed while compiling template /build/.tmpwqjOxv/.clinnet/templates/linnest-public-behavior.svg
  745. 308.93 s >
  746. 308.93 s > Command executed:
  747. 308.93 s > "typst" "c" "/build/.tmpwqjOxv/.clinnet/templates/linnest-public-behavior.typ" "/build/.tmpwqjOxv/.clinnet/templates/linnest-public-behavior.svg" "--root" "/build/.tmpwqjOxv/.clinnet/templates"
  748. 308.93 s >
  749. 308.93 s > Typst stdout:
  750. 308.93 s >
  751. 308.93 s >
  752. 308.93 s > Typst stderr:
  753. 308.93 s >
  754. 308.93 s >
  755. 308.93 s > Location:
  756. 308.93 s > crates/clinnet/src/lib.rs:741:13
  757. 308.93 s > stack backtrace:
  758. 308.93 s > 0: __rustc::rust_begin_unwind
  759. 308.93 s > 1: core::panicking::panic_fmt
  760. 308.93 s > 2: core::result::unwrap_failed
  761. 308.93 s > 3: public_typst_behavior::render
  762. 308.93 s > 4: <std::sync::once::Once>::call_once_force::<<std::sync::once_lock::OnceLock<alloc::string::String>>::initialize<<std::sync::once_lock::OnceLock<alloc::string::String>>::get_or_init<public_typst_behavior::linnest_public_svg::{closure#0}>::{closure#0}, !>::{closure#0}>::{closure#0}
  763. 308.93 s > 5: <std::sys::sync::once::futex::Once>::call
  764. 308.93 s > 6: <std::sync::once_lock::OnceLock<alloc::string::String>>::initialize::<<std::sync::once_lock::OnceLock<alloc::string::String>>::get_or_init<public_typst_behavior::linnest_public_svg::{closure#0}>::{closure#0}, !>
  765. 308.93 s > 7: <public_typst_behavior::public_linnest_arrow_shafts_and_crossing_gaps::{closure#0} as core::ops::function::FnOnce<()>>::call_once
  766. 308.93 s > note: Some details are omitted, run with `RUST_BACKTRACE=full` for a verbose backtrace.
  767. 308.93 s > system-out
  768. 308.93 s > running 1 test
  769. 308.93 s > test public_linnest_arrow_shafts_and_crossing_gaps has been running for over 60 seconds
  770. 308.93 s > test public_linnest_arrow_shafts_and_crossing_gaps ... FAILED
  771. 308.93 s >
  772. 308.93 s > failures:
  773. 308.93 s >
  774. 308.93 s > failures:
  775. 308.93 s > public_linnest_arrow_shafts_and_crossing_gaps
  776. 308.93 s >
  777. 308.93 s > test result: FAILED. 0 passed; 1 failed; 0 ignored; 0 measured; 17 filtered out; finished in 141.69s
  778. 308.93 s > system-err
  779. 308.93 s > thread 'public_linnest_arrow_shafts_and_crossing_gaps' (286) panicked at crates/clinnet/tests/public_typst_behavior.rs:81:55:
  780. 308.93 s > called `Result::unwrap()` on an `Err` value: typst failed while compiling template /build/.tmpwqjOxv/.clinnet/templates/linnest-public-behavior.svg
  781. 308.93 s >
  782. 308.93 s > Command executed:
  783. 308.93 s > "typst" "c" "/build/.tmpwqjOxv/.clinnet/templates/linnest-public-behavior.typ" "/build/.tmpwqjOxv/.clinnet/templates/linnest-public-behavior.svg" "--root" "/build/.tmpwqjOxv/.clinnet/templates"
  784. 308.93 s >
  785. 308.93 s > Typst stdout:
  786. 308.93 s >
  787. 308.93 s >
  788. 308.93 s > Typst stderr:
  789. 308.93 s >
  790. 308.93 s >
  791. 308.93 s > Location:
  792. 308.93 s > crates/clinnet/src/lib.rs:741:13
  793. 308.93 s > stack backtrace:
  794. 308.93 s > 0: __rustc::rust_begin_unwind
  795. 308.93 s > 1: core::panicking::panic_fmt
  796. 308.93 s > 2: core::result::unwrap_failed
  797. 308.93 s > 3: public_typst_behavior::render
  798. 308.93 s > 4: <std::sync::once::Once>::call_once_force::<<std::sync::once_lock::OnceLock<alloc::string::String>>::initialize<<std::sync::once_lock::OnceLock<alloc::string::String>>::get_or_init<public_typst_behavior::linnest_public_svg::{closure#0}>::{closure#0}, !>::{closure#0}>::{closure#0}
  799. 308.93 s > 5: <std::sys::sync::once::futex::Once>::call
  800. 308.93 s > 6: <std::sync::once_lock::OnceLock<alloc::string::String>>::initialize::<<std::sync::once_lock::OnceLock<alloc::string::String>>::get_or_init<public_typst_behavior::linnest_public_svg::{closure#0}>::{closure#0}, !>
  801. 308.93 s > 7: <public_typst_behavior::public_linnest_arrow_shafts_and_crossing_gaps::{closure#0} as core::ops::function::FnOnce<()>>::call_once
  802. 308.93 s > note: Some details are omitted, run with `RUST_BACKTRACE=full` for a verbose backtrace.
  803. 308.93 s >
  804. 308.93 s > 2. clinnet::public_typst_behavior::public_linnest_labels_follow_their_carriers
  805. 308.93 s > failure: test failure with exit code 101
  806. 308.93 s > thread 'public_linnest_labels_follow_their_carriers' (281) panicked at crates/clinnet/tests/public_typst_behavior.rs:81:55:
  807. 308.93 s > called `Result::unwrap()` on an `Err` value: typst failed while compiling template /build/.tmpWkJXOH/.clinnet/templates/linnest-public-behavior.svg
  808. 308.93 s >
  809. 308.93 s > Command executed:
  810. 308.93 s > "typst" "c" "/build/.tmpWkJXOH/.clinnet/templates/linnest-public-behavior.typ" "/build/.tmpWkJXOH/.clinnet/templates/linnest-public-behavior.svg" "--root" "/build/.tmpWkJXOH/.clinnet/templates"
  811. 308.93 s >
  812. 308.93 s > Typst stdout:
  813. 308.93 s >
  814. 308.93 s >
  815. 308.93 s > Typst stderr:
  816. 308.93 s >
  817. 308.93 s >
  818. 308.93 s > Location:
  819. 308.93 s > crates/clinnet/src/lib.rs:741:13
  820. 308.93 s > stack backtrace:
  821. 308.93 s > 0: __rustc::rust_begin_unwind
  822. 308.93 s > 1: core::panicking::panic_fmt
  823. 308.93 s > 2: core::result::unwrap_failed
  824. 308.93 s > 3: public_typst_behavior::render
  825. 308.93 s > 4: <std::sync::once::Once>::call_once_force::<<std::sync::once_lock::OnceLock<alloc::string::String>>::initialize<<std::sync::once_lock::OnceLock<alloc::string::String>>::get_or_init<public_typst_behavior::linnest_public_svg::{closure#0}>::{closure#0}, !>::{closure#0}>::{closure#0}
  826. 308.93 s > 5: <std::sys::sync::once::futex::Once>::call
  827. 308.93 s > 6: <std::sync::once_lock::OnceLock<alloc::string::String>>::initialize::<<std::sync::once_lock::OnceLock<alloc::string::String>>::get_or_init<public_typst_behavior::linnest_public_svg::{closure#0}>::{closure#0}, !>
  828. 308.93 s > 7: <public_typst_behavior::public_linnest_labels_follow_their_carriers::{closure#0} as core::ops::function::FnOnce<()>>::call_once
  829. 308.93 s > note: Some details are omitted, run with `RUST_BACKTRACE=full` for a verbose backtrace.
  830. 308.93 s > system-out
  831. 308.93 s > running 1 test
  832. 308.93 s > test public_linnest_labels_follow_their_carriers has been running for over 60 seconds
  833. 308.93 s > test public_linnest_labels_follow_their_carriers ... FAILED
  834. 308.93 s >
  835. 308.93 s > failures:
  836. 308.93 s >
  837. 308.93 s > failures:
  838. 308.93 s > public_linnest_labels_follow_their_carriers
  839. 308.93 s >
  840. 308.93 s > test result: FAILED. 0 passed; 1 failed; 0 ignored; 0 measured; 17 filtered out; finished in 152.39s
  841. 308.93 s > system-err
  842. 308.93 s > thread 'public_linnest_labels_follow_their_carriers' (281) panicked at crates/clinnet/tests/public_typst_behavior.rs:81:55:
  843. 308.93 s > called `Result::unwrap()` on an `Err` value: typst failed while compiling template /build/.tmpWkJXOH/.clinnet/templates/linnest-public-behavior.svg
  844. 308.93 s >
  845. 308.93 s > Command executed:
  846. 308.93 s > "typst" "c" "/build/.tmpWkJXOH/.clinnet/templates/linnest-public-behavior.typ" "/build/.tmpWkJXOH/.clinnet/templates/linnest-public-behavior.svg" "--root" "/build/.tmpWkJXOH/.clinnet/templates"
  847. 308.93 s >
  848. 308.93 s > Typst stdout:
  849. 308.93 s >
  850. 308.93 s >
  851. 308.93 s > Typst stderr:
  852. 308.93 s >
  853. 308.93 s >
  854. 308.93 s > Location:
  855. 308.93 s > crates/clinnet/src/lib.rs:741:13
  856. 308.93 s > stack backtrace:
  857. 308.93 s > 0: __rustc::rust_begin_unwind
  858. 308.93 s > 1: core::panicking::panic_fmt
  859. 308.93 s > 2: core::result::unwrap_failed
  860. 308.93 s > 3: public_typst_behavior::render
  861. 308.93 s > 4: <std::sync::once::Once>::call_once_force::<<std::sync::once_lock::OnceLock<alloc::string::String>>::initialize<<std::sync::once_lock::OnceLock<alloc::string::String>>::get_or_init<public_typst_behavior::linnest_public_svg::{closure#0}>::{closure#0}, !>::{closure#0}>::{closure#0}
  862. 308.93 s > 5: <std::sys::sync::once::futex::Once>::call
  863. 308.93 s > 6: <std::sync::once_lock::OnceLock<alloc::string::String>>::initialize::<<std::sync::once_lock::OnceLock<alloc::string::String>>::get_or_init<public_typst_behavior::linnest_public_svg::{closure#0}>::{closure#0}, !>
  864. 308.93 s > 7: <public_typst_behavior::public_linnest_labels_follow_their_carriers::{closure#0} as core::ops::function::FnOnce<()>>::call_once
  865. 308.93 s > note: Some details are omitted, run with `RUST_BACKTRACE=full` for a verbose backtrace.
  866. 308.93 s >
  867. 308.93 s > 3. clinnet::public_typst_behavior::public_linnest_momentum_layers_place_shafts_and_labels
  868. 308.93 s > failure: test failure with exit code 101
  869. 308.93 s > thread 'public_linnest_momentum_layers_place_shafts_and_labels' (305) panicked at crates/clinnet/tests/public_typst_behavior.rs:81:55:
  870. 308.93 s > called `Result::unwrap()` on an `Err` value: typst failed while compiling template /build/.tmpmVuaZw/.clinnet/templates/linnest-public-behavior.svg
  871. 308.93 s >
  872. 308.93 s > Command executed:
  873. 308.93 s > "typst" "c" "/build/.tmpmVuaZw/.clinnet/templates/linnest-public-behavior.typ" "/build/.tmpmVuaZw/.clinnet/templates/linnest-public-behavior.svg" "--root" "/build/.tmpmVuaZw/.clinnet/templates"
  874. 308.93 s >
  875. 308.93 s > Typst stdout:
  876. 308.93 s >
  877. 308.93 s >
  878. 308.93 s > Typst stderr:
  879. 308.93 s >
  880. 308.93 s >
  881. 308.93 s > Location:
  882. 308.93 s > crates/clinnet/src/lib.rs:741:13
  883. 308.93 s > stack backtrace:
  884. 308.93 s > 0: __rustc::rust_begin_unwind
  885. 308.93 s > 1: core::panicking::panic_fmt
  886. 308.93 s > 2: core::result::unwrap_failed
  887. 308.93 s > 3: public_typst_behavior::render
  888. 308.93 s > 4: <std::sync::once::Once>::call_once_force::<<std::sync::once_lock::OnceLock<alloc::string::String>>::initialize<<std::sync::once_lock::OnceLock<alloc::string::String>>::get_or_init<public_typst_behavior::linnest_public_svg::{closure#0}>::{closure#0}, !>::{closure#0}>::{closure#0}
  889. 308.93 s > 5: <std::sys::sync::once::futex::Once>::call
  890. 308.93 s > 6: <std::sync::once_lock::OnceLock<alloc::string::String>>::initialize::<<std::sync::once_lock::OnceLock<alloc::string::String>>::get_or_init<public_typst_behavior::linnest_public_svg::{closure#0}>::{closure#0}, !>
  891. 308.93 s > 7: <public_typst_behavior::public_linnest_momentum_layers_place_shafts_and_labels::{closure#0} as core::ops::function::FnOnce<()>>::call_once
  892. 308.93 s > note: Some details are omitted, run with `RUST_BACKTRACE=full` for a verbose backtrace.
  893. 308.93 s > system-out
  894. 308.93 s > running 1 test
  895. 308.93 s > test public_linnest_momentum_layers_place_shafts_and_labels has been running for over 60 seconds
  896. 308.93 s > test public_linnest_momentum_layers_place_shafts_and_labels ... FAILED
  897. 308.93 s >
  898. 308.93 s > failures:
  899. 308.93 s >
  900. 308.93 s > failures:
  901. 308.93 s > public_linnest_momentum_layers_place_shafts_and_labels
  902. 308.93 s >
  903. 308.93 s > test result: FAILED. 0 passed; 1 failed; 0 ignored; 0 measured; 17 filtered out; finished in 228.14s
  904. 308.93 s > system-err
  905. 308.93 s > thread 'public_linnest_momentum_layers_place_shafts_and_labels' (305) panicked at crates/clinnet/tests/public_typst_behavior.rs:81:55:
  906. 308.93 s > called `Result::unwrap()` on an `Err` value: typst failed while compiling template /build/.tmpmVuaZw/.clinnet/templates/linnest-public-behavior.svg
  907. 308.93 s >
  908. 308.93 s > Command executed:
  909. 308.93 s > "typst" "c" "/build/.tmpmVuaZw/.clinnet/templates/linnest-public-behavior.typ" "/build/.tmpmVuaZw/.clinnet/templates/linnest-public-behavior.svg" "--root" "/build/.tmpmVuaZw/.clinnet/templates"
  910. 308.93 s >
  911. 308.93 s > Typst stdout:
  912. 308.93 s >
  913. 308.93 s >
  914. 308.93 s > Typst stderr:
  915. 308.93 s >
  916. 308.93 s >
  917. 308.93 s > Location:
  918. 308.93 s > crates/clinnet/src/lib.rs:741:13
  919. 308.93 s > stack backtrace:
  920. 308.93 s > 0: __rustc::rust_begin_unwind
  921. 308.93 s > 1: core::panicking::panic_fmt
  922. 308.93 s > 2: core::result::unwrap_failed
  923. 308.93 s > 3: public_typst_behavior::render
  924. 308.93 s > 4: <std::sync::once::Once>::call_once_force::<<std::sync::once_lock::OnceLock<alloc::string::String>>::initialize<<std::sync::once_lock::OnceLock<alloc::string::String>>::get_or_init<public_typst_behavior::linnest_public_svg::{closure#0}>::{closure#0}, !>::{closure#0}>::{closure#0}
  925. 308.93 s > 5: <std::sys::sync::once::futex::Once>::call
  926. 308.93 s > 6: <std::sync::once_lock::OnceLock<alloc::string::String>>::initialize::<<std::sync::once_lock::OnceLock<alloc::string::String>>::get_or_init<public_typst_behavior::linnest_public_svg::{closure#0}>::{closure#0}, !>
  927. 308.93 s > 7: <public_typst_behavior::public_linnest_momentum_layers_place_shafts_and_labels::{closure#0} as core::ops::function::FnOnce<()>>::call_once
  928. 308.93 s > note: Some details are omitted, run with `RUST_BACKTRACE=full` for a verbose backtrace.
  929. 308.93 s > =========================================
  930. 308.93 s For full logs, run:
  931. 308.93 s nix log /nix/store/4pqspwvh8pi9s2vg9g6mfsggpl9ynwzx-gammaloop-nextest-clinnet.drv
  932. 309.25 s Run failed.