0.00 s
$ /nix/store/bhv6xyvqw6gjs3j488gi1z6wdv18bdpa-coreutils-9.11/bin/timeout --kill-after=15s 7200s /nix/store/bxgja2ppiqi6w2bgn0r07d7mgnl1k6k2-nix-2.34.8/bin/nix --extra-experimental-features nix-command --extra-experimental-features flakes flake clone git+https://github.com/alphal00p/gammaloop --dest /tmp/nix-ci-worker/stable-pwd/repo/
0.07 s
Cloning into '/tmp/nix-ci-worker/stable-pwd/repo'...
0.89 s
remote: Enumerating objects: 162134, done.
1.01 s
remote: Counting objects: 0% (1/16812)
remote: Counting objects: 1% (169/16812)
remote: Counting objects: 2% (337/16812)
remote: Counting objects: 3% (505/16812)
remote: Counting objects: 4% (673/16812)
remote: Counting objects: 5% (841/16812)
remote: Counting objects: 6% (1009/16812)
remote: Counting objects: 7% (1177/16812)
remote: Counting objects: 8% (1345/16812)
remote: Counting objects: 9% (1514/16812)
remote: Counting objects: 10% (1682/16812)
remote: Counting objects: 11% (1850/16812)
remote: Counting objects: 12% (2018/16812)
remote: Counting objects: 13% (2186/16812)
remote: Counting objects: 14% (2354/16812)
remote: Counting objects: 15% (2522/16812)
remote: Counting objects: 16% (2690/16812)
remote: Counting objects: 17% (2859/16812)
remote: Counting objects: 18% (3027/16812)
remote: Counting objects: 19% (3195/16812)
remote: Counting objects: 20% (3363/16812)
remote: Counting objects: 21% (3531/16812)
remote: Counting objects: 22% (3699/16812)
remote: Counting objects: 23% (3867/16812)
remote: Counting objects: 24% (4035/16812)
remote: Counting objects: 25% (4203/16812)
remote: Counting objects: 26% (4372/16812)
remote: Counting objects: 27% (4540/16812)
remote: Counting objects: 28% (4708/16812)
remote: Counting objects: 29% (4876/16812)
remote: Counting objects: 30% (5044/16812)
remote: Counting objects: 31% (5212/16812)
remote: Counting objects: 32% (5380/16812)
remote: Counting objects: 33% (5548/16812)
remote: Counting objects: 34% (5717/16812)
remote: Counting objects: 35% (5885/16812)
remote: Counting objects: 36% (6053/16812)
remote: Counting objects: 37% (6221/16812)
remote: Counting objects: 38% (6389/16812)
remote: Counting objects: 39% (6557/16812)
remote: Counting objects: 40% (6725/16812)
remote: Counting objects: 41% (6893/16812)
remote: Counting objects: 42% (7062/16812)
remote: Counting objects: 43% (7230/16812)
remote: Counting objects: 44% (7398/16812)
remote: Counting objects: 45% (7566/16812)
remote: Counting objects: 46% (7734/16812)
remote: Counting objects: 47% (7902/16812)
remote: Counting objects: 48% (8070/16812)
remote: Counting objects: 49% (8238/16812)
remote: Counting objects: 50% (8406/16812)
remote: Counting objects: 51% (8575/16812)
remote: Counting objects: 52% (8743/16812)
remote: Counting objects: 53% (8911/16812)
remote: Counting objects: 54% (9079/16812)
remote: Counting objects: 55% (9247/16812)
remote: Counting objects: 56% (9415/16812)
remote: Counting objects: 57% (9583/16812)
remote: Counting objects: 58% (9751/16812)
remote: Counting objects: 59% (9920/16812)
remote: Counting objects: 60% (10088/16812)
remote: Counting objects: 61% (10256/16812)
remote: Counting objects: 62% (10424/16812)
remote: Counting objects: 63% (10592/16812)
remote: Counting objects: 64% (10760/16812)
remote: Counting objects: 65% (10928/16812)
remote: Counting objects: 66% (11096/16812)
remote: Counting objects: 67% (11265/16812)
remote: Counting objects: 68% (11433/16812)
remote: Counting objects: 69% (11601/16812)
remote: Counting objects: 70% (11769/16812)
remote: Counting objects: 71% (11937/16812)
remote: Counting objects: 72% (12105/16812)
remote: Counting objects: 73% (12273/16812)
remote: Counting objects: 74% (12441/16812)
remote: Counting objects: 75% (12609/16812)
remote: Counting objects: 76% (12778/16812)
remote: Counting objects: 77% (12946/16812)
remote: Counting objects: 78% (13114/16812)
remote: Counting objects: 79% (13282/16812)
remote: Counting objects: 80% (13450/16812)
remote: Counting objects: 81% (13618/16812)
remote: Counting objects: 82% (13786/16812)
remote: Counting objects: 83% (13954/16812)
remote: Counting objects: 84% (14123/16812)
remote: Counting objects: 85% (14291/16812)
remote: Counting objects: 86% (14459/16812)
remote: Counting objects: 87% (14627/16812)
remote: Counting objects: 88% (14795/16812)
remote: Counting objects: 89% (14963/16812)
remote: Counting objects: 90% (15131/16812)
remote: Counting objects: 91% (15299/16812)
remote: Counting objects: 92% (15468/16812)
remote: Counting objects: 93% (15636/16812)
remote: Counting objects: 94% (15804/16812)
remote: Counting objects: 95% (15972/16812)
remote: Counting objects: 96% (16140/16812)
remote: Counting objects: 97% (16308/16812)
remote: Counting objects: 98% (16476/16812)
remote: Counting objects: 99% (16644/16812)
remote: Counting objects: 100% (16812/16812)
remote: Counting objects: 100% (16812/16812), done.
7.16 s
remote: Compressing objects: 0% (1/3844)
remote: Compressing objects: 1% (39/3844)
remote: Compressing objects: 2% (77/3844)
remote: Compressing objects: 3% (116/3844)
remote: Compressing objects: 4% (154/3844)
remote: Compressing objects: 5% (193/3844)
remote: Compressing objects: 6% (231/3844)
remote: Compressing objects: 7% (270/3844)
remote: Compressing objects: 8% (308/3844)
remote: Compressing objects: 9% (346/3844)
remote: Compressing objects: 10% (385/3844)
remote: Compressing objects: 10% (412/3844)
remote: Compressing objects: 11% (423/3844)
remote: Compressing objects: 12% (462/3844)
remote: Compressing objects: 13% (500/3844)
remote: Compressing objects: 13% (528/3844)
remote: Compressing objects: 14% (539/3844)
remote: Compressing objects: 15% (577/3844)
remote: Compressing objects: 15% (597/3844)
remote: Compressing objects: 16% (616/3844)
remote: Compressing objects: 17% (654/3844)
remote: Compressing objects: 18% (692/3844)
remote: Compressing objects: 18% (722/3844)
remote: Compressing objects: 19% (731/3844)
remote: Compressing objects: 20% (769/3844)
remote: Compressing objects: 21% (808/3844)
remote: Compressing objects: 22% (846/3844)
remote: Compressing objects: 23% (885/3844)
remote: Compressing objects: 23% (896/3844)
remote: Compressing objects: 24% (923/3844)
remote: Compressing objects: 25% (961/3844)
remote: Compressing objects: 26% (1000/3844)
remote: Compressing objects: 27% (1038/3844)
remote: Compressing objects: 28% (1077/3844)
remote: Compressing objects: 29% (1115/3844)
remote: Compressing objects: 30% (1154/3844)
remote: Compressing objects: 31% (1192/3844)
remote: Compressing objects: 32% (1231/3844)
remote: Compressing objects: 33% (1269/3844)
remote: Compressing objects: 33% (1302/3844)
remote: Compressing objects: 34% (1307/3844)
remote: Compressing objects: 35% (1346/3844)
remote: Compressing objects: 36% (1384/3844)
remote: Compressing objects: 37% (1423/3844)
remote: Compressing objects: 38% (1461/3844)
remote: Compressing objects: 39% (1500/3844)
remote: Compressing objects: 40% (1538/3844)
remote: Compressing objects: 41% (1577/3844)
remote: Compressing objects: 42% (1615/3844)
remote: Compressing objects: 43% (1653/3844)
remote: Compressing objects: 44% (1692/3844)
remote: Compressing objects: 45% (1730/3844)
remote: Compressing objects: 46% (1769/3844)
remote: Compressing objects: 47% (1807/3844)
remote: Compressing objects: 48% (1846/3844)
remote: Compressing objects: 49% (1884/3844)
remote: Compressing objects: 50% (1922/3844)
remote: Compressing objects: 51% (1961/3844)
remote: Compressing objects: 52% (1999/3844)
remote: Compressing objects: 53% (2038/3844)
remote: Compressing objects: 54% (2076/3844)
remote: Compressing objects: 55% (2115/3844)
remote: Compressing objects: 56% (2153/3844)
remote: Compressing objects: 57% (2192/3844)
remote: Compressing objects: 58% (2230/3844)
remote: Compressing objects: 59% (2268/3844)
remote: Compressing objects: 60% (2307/3844)
remote: Compressing objects: 61% (2345/3844)
remote: Compressing objects: 62% (2384/3844)
remote: Compressing objects: 63% (2422/3844)
remote: Compressing objects: 64% (2461/3844)
remote: Compressing objects: 65% (2499/3844)
remote: Compressing objects: 66% (2538/3844)
remote: Compressing objects: 67% (2576/3844)
remote: Compressing objects: 68% (2614/3844)
remote: Compressing objects: 69% (2653/3844)
remote: Compressing objects: 70% (2691/3844)
remote: Compressing objects: 71% (2730/3844)
remote: Compressing objects: 72% (2768/3844)
remote: Compressing objects: 73% (2807/3844)
remote: Compressing objects: 74% (2845/3844)
remote: Compressing objects: 75% (2883/3844)
remote: Compressing objects: 76% (2922/3844)
remote: Compressing objects: 77% (2960/3844)
remote: Compressing objects: 78% (2999/3844)
remote: Compressing objects: 79% (3037/3844)
remote: Compressing objects: 80% (3076/3844)
remote: Compressing objects: 81% (3114/3844)
remote: Compressing objects: 82% (3153/3844)
remote: Compressing objects: 83% (3191/3844)
remote: Compressing objects: 84% (3229/3844)
remote: Compressing objects: 85% (3268/3844)
remote: Compressing objects: 86% (3306/3844)
remote: Compressing objects: 87% (3345/3844)
remote: Compressing objects: 88% (3383/3844)
remote: Compressing objects: 89% (3422/3844)
remote: Compressing objects: 90% (3460/3844)
remote: Compressing objects: 91% (3499/3844)
remote: Compressing objects: 92% (3537/3844)
remote: Compressing objects: 93% (3575/3844)
remote: Compressing objects: 94% (3614/3844)
remote: Compressing objects: 95% (3652/3844)
remote: Compressing objects: 96% (3691/3844)
remote: Compressing objects: 97% (3729/3844)
remote: Compressing objects: 98% (3768/3844)
remote: Compressing objects: 99% (3806/3844)
remote: Compressing objects: 100% (3844/3844)
remote: Compressing objects: 100% (3844/3844), done.
33.19 s
Receiving objects: 0% (1/162134)
Receiving objects: 1% (1622/162134)
Receiving objects: 2% (3243/162134), 11.11 MiB | 22.20 MiB/s
Receiving objects: 3% (4865/162134), 11.11 MiB | 22.20 MiB/s
Receiving objects: 3% (5907/162134), 26.15 MiB | 26.14 MiB/s
Receiving objects: 4% (6486/162134), 26.15 MiB | 26.14 MiB/s
Receiving objects: 5% (8107/162134), 26.15 MiB | 26.14 MiB/s
Receiving objects: 6% (9729/162134), 36.32 MiB | 24.21 MiB/s
Receiving objects: 6% (11286/162134), 46.51 MiB | 23.21 MiB/s
Receiving objects: 7% (11350/162134), 46.51 MiB | 23.21 MiB/s
Receiving objects: 8% (12971/162134), 57.57 MiB | 22.90 MiB/s
Receiving objects: 8% (13607/162134), 57.57 MiB | 22.90 MiB/s
Receiving objects: 9% (14593/162134), 69.35 MiB | 23.01 MiB/s
Receiving objects: 10% (16214/162134), 69.35 MiB | 23.01 MiB/s
Receiving objects: 11% (17835/162134), 69.35 MiB | 23.01 MiB/s
Receiving objects: 12% (19457/162134), 76.02 MiB | 21.63 MiB/s
Receiving objects: 13% (21078/162134), 76.02 MiB | 21.63 MiB/s
Receiving objects: 14% (22699/162134), 76.02 MiB | 21.63 MiB/s
Receiving objects: 15% (24321/162134), 76.02 MiB | 21.63 MiB/s
Receiving objects: 16% (25942/162134), 76.02 MiB | 21.63 MiB/s
Receiving objects: 16% (26991/162134), 76.02 MiB | 21.63 MiB/s
Receiving objects: 17% (27563/162134), 76.02 MiB | 21.63 MiB/s
Receiving objects: 18% (29185/162134), 86.39 MiB | 21.52 MiB/s
Receiving objects: 19% (30806/162134), 86.39 MiB | 21.52 MiB/s
Receiving objects: 20% (32427/162134), 86.39 MiB | 21.52 MiB/s
Receiving objects: 21% (34049/162134), 86.39 MiB | 21.52 MiB/s
Receiving objects: 22% (35670/162134), 86.39 MiB | 21.52 MiB/s
Receiving objects: 23% (37291/162134), 86.39 MiB | 21.52 MiB/s
Receiving objects: 24% (38913/162134), 86.39 MiB | 21.52 MiB/s
Receiving objects: 25% (40534/162134), 86.39 MiB | 21.52 MiB/s
Receiving objects: 26% (42155/162134), 86.39 MiB | 21.52 MiB/s
Receiving objects: 27% (43777/162134), 92.91 MiB | 20.58 MiB/s
Receiving objects: 28% (45398/162134), 92.91 MiB | 20.58 MiB/s
Receiving objects: 28% (45588/162134), 92.91 MiB | 20.58 MiB/s
Receiving objects: 29% (47019/162134), 99.47 MiB | 19.55 MiB/s
Receiving objects: 30% (48641/162134), 99.47 MiB | 19.55 MiB/s
Receiving objects: 31% (50262/162134), 106.54 MiB | 17.75 MiB/s
Receiving objects: 32% (51883/162134), 106.54 MiB | 17.75 MiB/s
Receiving objects: 32% (52095/162134), 106.54 MiB | 17.75 MiB/s
Receiving objects: 33% (53505/162134), 113.92 MiB | 17.08 MiB/s
Receiving objects: 34% (55126/162134), 113.92 MiB | 17.08 MiB/s
Receiving objects: 35% (56747/162134), 113.92 MiB | 17.08 MiB/s
Receiving objects: 36% (58369/162134), 121.66 MiB | 16.55 MiB/s
Receiving objects: 36% (59925/162134), 129.77 MiB | 15.94 MiB/s
Receiving objects: 37% (59990/162134), 129.77 MiB | 15.94 MiB/s
Receiving objects: 38% (61611/162134), 129.77 MiB | 15.94 MiB/s
Receiving objects: 39% (63233/162134), 138.15 MiB | 15.19 MiB/s
Receiving objects: 40% (64854/162134), 138.15 MiB | 15.19 MiB/s
Receiving objects: 41% (66475/162134), 138.15 MiB | 15.19 MiB/s
Receiving objects: 42% (68097/162134), 138.15 MiB | 15.19 MiB/s
Receiving objects: 42% (68203/162134), 146.87 MiB | 15.64 MiB/s
Receiving objects: 42% (68220/162134), 164.78 MiB | 15.86 MiB/s
Receiving objects: 43% (69718/162134), 164.78 MiB | 15.86 MiB/s
Receiving objects: 44% (71339/162134), 164.78 MiB | 15.86 MiB/s
Receiving objects: 45% (72961/162134), 164.78 MiB | 15.86 MiB/s
Receiving objects: 46% (74582/162134), 164.78 MiB | 15.86 MiB/s
Receiving objects: 47% (76203/162134), 174.91 MiB | 16.67 MiB/s
Receiving objects: 47% (76303/162134), 174.91 MiB | 16.67 MiB/s
Receiving objects: 48% (77825/162134), 184.65 MiB | 17.30 MiB/s
Receiving objects: 49% (79446/162134), 184.65 MiB | 17.30 MiB/s
Receiving objects: 50% (81067/162134), 184.65 MiB | 17.30 MiB/s
Receiving objects: 51% (82689/162134), 184.65 MiB | 17.30 MiB/s
Receiving objects: 52% (84310/162134), 191.20 MiB | 16.71 MiB/s
Receiving objects: 53% (85932/162134), 191.20 MiB | 16.71 MiB/s
Receiving objects: 53% (86181/162134), 191.20 MiB | 16.71 MiB/s
Receiving objects: 54% (87553/162134), 199.40 MiB | 16.79 MiB/s
Receiving objects: 55% (89174/162134), 199.40 MiB | 16.79 MiB/s
Receiving objects: 55% (89768/162134), 210.68 MiB | 15.66 MiB/s
Receiving objects: 55% (89771/162134), 223.42 MiB | 14.59 MiB/s
Receiving objects: 55% (89802/162134), 237.55 MiB | 13.53 MiB/s
Receiving objects: 55% (89807/162134), 253.00 MiB | 13.71 MiB/s
Receiving objects: 56% (90796/162134), 253.00 MiB | 13.71 MiB/s
Receiving objects: 57% (92417/162134), 261.14 MiB | 13.71 MiB/s
Receiving objects: 57% (93134/162134), 261.14 MiB | 13.71 MiB/s
Receiving objects: 58% (94038/162134), 269.71 MiB | 14.39 MiB/s
Receiving objects: 59% (95660/162134), 278.54 MiB | 15.07 MiB/s
Receiving objects: 59% (96785/162134), 278.54 MiB | 15.07 MiB/s
Receiving objects: 60% (97281/162134), 278.54 MiB | 15.07 MiB/s
Receiving objects: 61% (98902/162134), 287.57 MiB | 15.70 MiB/s
Receiving objects: 61% (99756/162134), 297.19 MiB | 16.38 MiB/s
Receiving objects: 62% (100524/162134), 307.00 MiB | 17.02 MiB/s
Receiving objects: 63% (102145/162134), 307.00 MiB | 17.02 MiB/s
Receiving objects: 64% (103766/162134), 316.95 MiB | 17.62 MiB/s
Receiving objects: 65% (105388/162134), 316.95 MiB | 17.62 MiB/s
Receiving objects: 65% (105764/162134), 316.95 MiB | 17.62 MiB/s
Receiving objects: 66% (107009/162134), 327.38 MiB | 18.27 MiB/s
Receiving objects: 67% (108630/162134), 327.38 MiB | 18.27 MiB/s
Receiving objects: 68% (110252/162134), 327.38 MiB | 18.27 MiB/s
Receiving objects: 69% (111873/162134), 327.38 MiB | 18.27 MiB/s
Receiving objects: 70% (113494/162134), 327.38 MiB | 18.27 MiB/s
Receiving objects: 71% (115116/162134), 327.38 MiB | 18.27 MiB/s
Receiving objects: 72% (116737/162134), 327.38 MiB | 18.27 MiB/s
Receiving objects: 73% (118358/162134), 338.15 MiB | 18.90 MiB/s
Receiving objects: 74% (119980/162134), 338.15 MiB | 18.90 MiB/s
Receiving objects: 74% (120516/162134), 338.15 MiB | 18.90 MiB/s
Receiving objects: 75% (121601/162134), 338.15 MiB | 18.90 MiB/s
Receiving objects: 76% (123222/162134), 349.15 MiB | 19.50 MiB/s
Receiving objects: 77% (124844/162134), 360.49 MiB | 20.10 MiB/s
Receiving objects: 77% (126124/162134), 360.49 MiB | 20.10 MiB/s
Receiving objects: 78% (126465/162134), 360.49 MiB | 20.10 MiB/s
Receiving objects: 79% (128086/162134), 360.49 MiB | 20.10 MiB/s
Receiving objects: 80% (129708/162134), 372.13 MiB | 20.72 MiB/s
Receiving objects: 81% (131329/162134), 372.13 MiB | 20.72 MiB/s
Receiving objects: 81% (131979/162134), 395.88 MiB | 21.85 MiB/s
Receiving objects: 82% (132950/162134), 408.59 MiB | 22.49 MiB/s
Receiving objects: 82% (134110/162134), 408.59 MiB | 22.49 MiB/s
Receiving objects: 83% (134572/162134), 421.39 MiB | 23.14 MiB/s
Receiving objects: 84% (136193/162134), 421.39 MiB | 23.14 MiB/s
Receiving objects: 85% (137814/162134), 434.41 MiB | 23.72 MiB/s
Receiving objects: 85% (139047/162134), 434.41 MiB | 23.72 MiB/s
Receiving objects: 86% (139436/162134), 434.41 MiB | 23.72 MiB/s
Receiving objects: 87% (141057/162134), 462.83 MiB | 25.23 MiB/s
Receiving objects: 87% (142470/162134), 462.83 MiB | 25.23 MiB/s
Receiving objects: 88% (142678/162134), 462.83 MiB | 25.23 MiB/s
Receiving objects: 89% (144300/162134), 462.83 MiB | 25.23 MiB/s
Receiving objects: 90% (145921/162134), 478.98 MiB | 26.31 MiB/s
Receiving objects: 91% (147542/162134), 478.98 MiB | 26.31 MiB/s
Receiving objects: 92% (149164/162134), 478.98 MiB | 26.31 MiB/s
Receiving objects: 93% (150785/162134), 478.98 MiB | 26.31 MiB/s
Receiving objects: 94% (152406/162134), 478.98 MiB | 26.31 MiB/s
Receiving objects: 95% (154028/162134), 478.98 MiB | 26.31 MiB/s
Receiving objects: 96% (155649/162134), 478.98 MiB | 26.31 MiB/s
Receiving objects: 97% (157270/162134), 478.98 MiB | 26.31 MiB/s
Receiving objects: 98% (158892/162134), 478.98 MiB | 26.31 MiB/s
Receiving objects: 99% (160513/162134), 493.65 MiB | 26.98 MiB/s
Receiving objects: 99% (161886/162134), 493.65 MiB | 26.98 MiB/s
remote: Total 162134 (delta 14203), reused 13455 (delta 12950), pack-reused 145322 (from 3)
33.20 s
Receiving objects: 100% (162134/162134), 493.65 MiB | 26.98 MiB/s
Receiving objects: 100% (162134/162134), 500.72 MiB | 19.25 MiB/s, done.
41.81 s
Resolving deltas: 0% (0/105841)
Resolving deltas: 1% (1059/105841)
Resolving deltas: 2% (2117/105841)
Resolving deltas: 3% (3176/105841)
Resolving deltas: 4% (4234/105841)
Resolving deltas: 5% (5293/105841)
Resolving deltas: 6% (6351/105841)
Resolving deltas: 7% (7409/105841)
Resolving deltas: 8% (8468/105841)
Resolving deltas: 9% (9526/105841)
Resolving deltas: 10% (10585/105841)
Resolving deltas: 11% (11643/105841)
Resolving deltas: 12% (12701/105841)
Resolving deltas: 13% (13760/105841)
Resolving deltas: 14% (14818/105841)
Resolving deltas: 14% (15818/105841)
Resolving deltas: 15% (15878/105841)
Resolving deltas: 16% (16935/105841)
Resolving deltas: 17% (17993/105841)
Resolving deltas: 18% (19052/105841)
Resolving deltas: 19% (20110/105841)
Resolving deltas: 20% (21169/105841)
Resolving deltas: 20% (21706/105841)
Resolving deltas: 21% (22227/105841)
Resolving deltas: 22% (23286/105841)
Resolving deltas: 23% (24344/105841)
Resolving deltas: 24% (25402/105841)
Resolving deltas: 25% (26461/105841)
Resolving deltas: 26% (27519/105841)
Resolving deltas: 27% (28578/105841)
Resolving deltas: 28% (29636/105841)
Resolving deltas: 28% (29799/105841)
Resolving deltas: 29% (30694/105841)
Resolving deltas: 30% (31753/105841)
Resolving deltas: 31% (32811/105841)
Resolving deltas: 32% (33870/105841)
Resolving deltas: 33% (34928/105841)
Resolving deltas: 34% (35986/105841)
Resolving deltas: 35% (37045/105841)
Resolving deltas: 36% (38103/105841)
Resolving deltas: 37% (39162/105841)
Resolving deltas: 38% (40220/105841)
Resolving deltas: 39% (41278/105841)
Resolving deltas: 40% (42337/105841)
Resolving deltas: 41% (43395/105841)
Resolving deltas: 42% (44454/105841)
Resolving deltas: 43% (45512/105841)
Resolving deltas: 44% (46571/105841)
Resolving deltas: 45% (47629/105841)
Resolving deltas: 46% (48687/105841)
Resolving deltas: 47% (49746/105841)
Resolving deltas: 48% (50804/105841)
Resolving deltas: 49% (51863/105841)
Resolving deltas: 50% (52921/105841)
Resolving deltas: 51% (53979/105841)
Resolving deltas: 51% (54251/105841)
Resolving deltas: 52% (55038/105841)
Resolving deltas: 53% (56096/105841)
Resolving deltas: 54% (57155/105841)
Resolving deltas: 55% (58213/105841)
Resolving deltas: 56% (59271/105841)
Resolving deltas: 57% (60330/105841)
Resolving deltas: 58% (61388/105841)
Resolving deltas: 59% (62447/105841)
Resolving deltas: 59% (62790/105841)
Resolving deltas: 60% (63505/105841)
Resolving deltas: 61% (64564/105841)
Resolving deltas: 62% (65622/105841)
Resolving deltas: 63% (66680/105841)
Resolving deltas: 64% (67739/105841)
Resolving deltas: 65% (68797/105841)
Resolving deltas: 66% (69856/105841)
Resolving deltas: 67% (70914/105841)
Resolving deltas: 67% (71394/105841)
Resolving deltas: 68% (71972/105841)
Resolving deltas: 69% (73031/105841)
Resolving deltas: 70% (74089/105841)
Resolving deltas: 71% (75148/105841)
Resolving deltas: 72% (76206/105841)
Resolving deltas: 73% (77264/105841)
Resolving deltas: 74% (78323/105841)
Resolving deltas: 75% (79381/105841)
Resolving deltas: 76% (80440/105841)
Resolving deltas: 77% (81498/105841)
Resolving deltas: 78% (82556/105841)
Resolving deltas: 79% (83615/105841)
Resolving deltas: 80% (84673/105841)
Resolving deltas: 81% (85732/105841)
Resolving deltas: 82% (86790/105841)
Resolving deltas: 83% (87849/105841)
Resolving deltas: 84% (88908/105841)
Resolving deltas: 84% (89344/105841)
Resolving deltas: 85% (89965/105841)
Resolving deltas: 86% (91024/105841)
Resolving deltas: 87% (92082/105841)
Resolving deltas: 88% (93141/105841)
Resolving deltas: 89% (94199/105841)
Resolving deltas: 90% (95257/105841)
Resolving deltas: 91% (96316/105841)
Resolving deltas: 92% (97374/105841)
Resolving deltas: 93% (98433/105841)
Resolving deltas: 94% (99491/105841)
Resolving deltas: 95% (100549/105841)
Resolving deltas: 95% (100645/105841)
Resolving deltas: 96% (101609/105841)
Resolving deltas: 97% (102666/105841)
Resolving deltas: 98% (103725/105841)
Resolving deltas: 99% (104783/105841)
Resolving deltas: 100% (105841/105841)
Resolving deltas: 100% (105841/105841), done.
42.84 s
Fetching commit 30fb0f28cd3eff2e7ac9987fc78de90b6578e688 for idenso-sum-partner-contraction ...
42.84 s
$ /nix/store/b1wn5clix1mz4vpfih7x9cnj9qfh7c6h-git-2.54.0/bin/git fetch origin 30fb0f28cd3eff2e7ac9987fc78de90b6578e688
43.49 s
From https://github.com/alphal00p/gammaloop
43.49 s
* branch 30fb0f28cd3eff2e7ac9987fc78de90b6578e688 -> FETCH_HEAD
43.55 s
$ /nix/store/bhv6xyvqw6gjs3j488gi1z6wdv18bdpa-coreutils-9.11/bin/timeout --kill-after=15s 7200s /nix/store/b1wn5clix1mz4vpfih7x9cnj9qfh7c6h-git-2.54.0/bin/git -c advice.detachedHead=false checkout 30fb0f28cd3eff2e7ac9987fc78de90b6578e688
44.33 s
HEAD is now at 30fb0f28c nix-ci: enable NixCI for final review
44.36 s
$ /nix/store/bhv6xyvqw6gjs3j488gi1z6wdv18bdpa-coreutils-9.11/bin/timeout --kill-after=15s 7200s /nix/store/bxgja2ppiqi6w2bgn0r07d7mgnl1k6k2-nix-2.34.8/bin/nix --extra-experimental-features nix-command --extra-experimental-features flakes --log-format internal-json run .#packages.x86_64-linux.nix-ci-check-gammaloop-nextest-clinnet --print-build-logs
44.75 s
warning: ignoring untrusted flake configuration setting 'extra-substituters'.
44.75 s
Pass '--accept-flake-config' to trust it
44.75 s
warning: ignoring untrusted flake configuration setting 'extra-trusted-public-keys'.
44.75 s
Pass '--accept-flake-config' to trust it
44.78 s
error (ignored): SQLite database '/var/cache/nix-ci-worker/eval-cache-v6/ad1e34681b7cb3f21e06f8868585536794930dc44e483cecd8152fd1b60abc60.sqlite ' is busy
53.09 s
53.76 s
evaluating derivation 'gdo you want to allow configuration setting 'extra-substituters' to be set to 'https://cache.nix-ci.com ' (y/N)? do you want to permanently mark this value as untrusted (y/N)? warning: ignoring untrusted flake configuration setting 'extra-substituters'.
53.76 s
Pass '--accept-flake-config' to trust it
53.76 s
do you want to allow configuration setting 'extra-trusted-public-keys' to be set to 'nix-ci:g3xV5BDTLtIBZr/A00IU1x0EtKKlb7YLgBN2SgYgM6A= ' (y/N)? do you want to permanently mark this value as untrusted (y/N)? warning: ignoring untrusted flake configuration setting 'extra-trusted-public-keys'.
53.76 s
Pass '--accept-flake-config' to trust it
62.13 s
copying '/nix/store/cis1
evaluating derivation 'g
copying '/nix/store/cis1
evaluating derivation 'g
copying '/nix/store/cis1
evaluating derivation 'g
copying '/nix/store/cis1
evaluating derivation 'g
copying '/nix/store/cis1
evaluating derivation 'g
copying '/nix/store/cis1
evaluating derivation 'g
copying '/nix/store/cis1
evaluating derivation 'g
copying '/nix/store/cis1
evaluating derivation 'g
74.62 s
[0 /1 built]
[1 /0 /1 built] building g gammaloop-nextest-clinnet> Nextest worker budget: 16
74.68 s
gammaloop-nextest-clinnet> Extracting 4 binaries (including 1 non-test binary), 1 build script output directory, and 1 linked path to /build/source
74.84 s
gammaloop-nextest-clinnet> Extracted 16 files to /build/source in 0.17s
74.88 s
gammaloop-nextest-clinnet> ------------
74.88 s
gammaloop-nextest-clinnet> Nextest run ID 87db954c-e4a2-4974-9730-8a14994d9732 with nextest profile: ci_gammaloop
74.88 s
gammaloop-nextest-clinnet> Starting 38 tests across 3 binaries
216.69 s
gammaloop-nextest-clinnet> FAIL [ 141.742s] (32/38) clinnet::public_typst_behavior public_linnest_arrow_shafts_and_crossing_gaps
216.69 s
gammaloop-nextest-clinnet> stdout ---
216.69 s
gammaloop-nextest-clinnet>
216.69 s
gammaloop-nextest-clinnet> running 1 test
216.69 s
gammaloop-nextest-clinnet> test public_linnest_arrow_shafts_and_crossing_gaps has been running for over 60 seconds
216.69 s
gammaloop-nextest-clinnet> test public_linnest_arrow_shafts_and_crossing_gaps ... FAILED
216.69 s
gammaloop-nextest-clinnet>
216.69 s
gammaloop-nextest-clinnet> failures:
216.69 s
gammaloop-nextest-clinnet>
216.69 s
gammaloop-nextest-clinnet> failures:
216.69 s
gammaloop-nextest-clinnet> public_linnest_arrow_shafts_and_crossing_gaps
216.69 s
gammaloop-nextest-clinnet>
216.69 s
gammaloop-nextest-clinnet> test result: FAILED. 0 passed; 1 failed; 0 ignored; 0 measured; 17 filtered out; finished in 141.69s
216.69 s
gammaloop-nextest-clinnet>
216.69 s
gammaloop-nextest-clinnet> stderr ---
216.69 s
gammaloop-nextest-clinnet>
216.69 s
gammaloop-nextest-clinnet> thread 'public_linnest_arrow_shafts_and_crossing_gaps' (286) panicked at crates/clinnet/tests/public_typst_behavior.rs:81:55:
216.69 s
gammaloop-nextest-clinnet> called `Result::unwrap()` on an `Err` value: typst failed while compiling template /build/.tmpwqjOxv/.clinnet/templates/linnest-public-behavior.svg
216.69 s
gammaloop-nextest-clinnet>
216.69 s
gammaloop-nextest-clinnet> Command executed:
216.69 s
gammaloop-nextest-clinnet> "typst" "c" "/build/.tmpwqjOxv/.clinnet/templates/linnest-public-behavior.typ" "/build/.tmpwqjOxv/.clinnet/templates/linnest-public-behavior.svg" "--root" "/build/.tmpwqjOxv/.clinnet/templates"
216.69 s
gammaloop-nextest-clinnet>
216.69 s
gammaloop-nextest-clinnet> Typst stdout:
216.69 s
gammaloop-nextest-clinnet>
216.69 s
gammaloop-nextest-clinnet>
216.69 s
gammaloop-nextest-clinnet> Typst stderr:
216.69 s
gammaloop-nextest-clinnet>
216.69 s
gammaloop-nextest-clinnet>
216.69 s
gammaloop-nextest-clinnet> Location:
216.69 s
gammaloop-nextest-clinnet> crates/clinnet/src/lib.rs:741:13
216.69 s
gammaloop-nextest-clinnet> stack backtrace:
216.69 s
gammaloop-nextest-clinnet> 0: __rustc::rust_begin_unwind
216.69 s
gammaloop-nextest-clinnet> 1: core::panicking::panic_fmt
216.69 s
gammaloop-nextest-clinnet> 2: core::result::unwrap_failed
216.69 s
gammaloop-nextest-clinnet> 3: public_typst_behavior::render
216.69 s
gammaloop-nextest-clinnet> 4: <std::sync::once::Once>::call_once_force::<<std::sync::once_lock::OnceLock<alloc::string::String>>::initialize<<std::sync::once_lock::OnceLock<alloc::string::String>>::get_or_init<public_typst_behavior::linnest_public_svg::{closure#0}>::{closure#0}, !>::{closure#0}>::{closure#0}
216.69 s
gammaloop-nextest-clinnet> 5: <std::sys::sync::once::futex::Once>::call
216.69 s
gammaloop-nextest-clinnet> 6: <std::sync::once_lock::OnceLock<alloc::string::String>>::initialize::<<std::sync::once_lock::OnceLock<alloc::string::String>>::get_or_init<public_typst_behavior::linnest_public_svg::{closure#0}>::{closure#0}, !>
216.69 s
gammaloop-nextest-clinnet> 7: <public_typst_behavior::public_linnest_arrow_shafts_and_crossing_gaps::{closure#0} as core::ops::function::FnOnce<()>>::call_once
216.69 s
gammaloop-nextest-clinnet> note: Some details are omitted, run with `RUST_BACKTRACE=full` for a verbose backtrace.
216.69 s
gammaloop-nextest-clinnet>
227.38 s
gammaloop-nextest-clinnet> FAIL [ 152.422s] (33/38) clinnet::public_typst_behavior public_linnest_labels_follow_their_carriers
227.38 s
gammaloop-nextest-clinnet> stdout ---
227.38 s
gammaloop-nextest-clinnet>
227.38 s
gammaloop-nextest-clinnet> running 1 test
227.38 s
gammaloop-nextest-clinnet> test public_linnest_labels_follow_their_carriers has been running for over 60 seconds
227.38 s
gammaloop-nextest-clinnet> test public_linnest_labels_follow_their_carriers ... FAILED
227.38 s
gammaloop-nextest-clinnet>
227.38 s
gammaloop-nextest-clinnet> failures:
227.38 s
gammaloop-nextest-clinnet>
227.38 s
gammaloop-nextest-clinnet> failures:
227.38 s
gammaloop-nextest-clinnet> public_linnest_labels_follow_their_carriers
227.38 s
gammaloop-nextest-clinnet>
227.38 s
gammaloop-nextest-clinnet> test result: FAILED. 0 passed; 1 failed; 0 ignored; 0 measured; 17 filtered out; finished in 152.39s
227.38 s
gammaloop-nextest-clinnet>
227.38 s
gammaloop-nextest-clinnet> stderr ---
227.38 s
gammaloop-nextest-clinnet>
227.38 s
gammaloop-nextest-clinnet> thread 'public_linnest_labels_follow_their_carriers' (281) panicked at crates/clinnet/tests/public_typst_behavior.rs:81:55:
227.38 s
gammaloop-nextest-clinnet> called `Result::unwrap()` on an `Err` value: typst failed while compiling template /build/.tmpWkJXOH/.clinnet/templates/linnest-public-behavior.svg
227.38 s
gammaloop-nextest-clinnet>
227.38 s
gammaloop-nextest-clinnet> Command executed:
227.38 s
gammaloop-nextest-clinnet> "typst" "c" "/build/.tmpWkJXOH/.clinnet/templates/linnest-public-behavior.typ" "/build/.tmpWkJXOH/.clinnet/templates/linnest-public-behavior.svg" "--root" "/build/.tmpWkJXOH/.clinnet/templates"
227.38 s
gammaloop-nextest-clinnet>
227.38 s
gammaloop-nextest-clinnet> Typst stdout:
227.38 s
gammaloop-nextest-clinnet>
227.38 s
gammaloop-nextest-clinnet>
227.38 s
gammaloop-nextest-clinnet> Typst stderr:
227.38 s
gammaloop-nextest-clinnet>
227.38 s
gammaloop-nextest-clinnet>
227.38 s
gammaloop-nextest-clinnet> Location:
227.38 s
gammaloop-nextest-clinnet> crates/clinnet/src/lib.rs:741:13
227.38 s
gammaloop-nextest-clinnet> stack backtrace:
227.38 s
gammaloop-nextest-clinnet> 0: __rustc::rust_begin_unwind
227.38 s
gammaloop-nextest-clinnet> 1: core::panicking::panic_fmt
227.38 s
gammaloop-nextest-clinnet> 2: core::result::unwrap_failed
227.38 s
gammaloop-nextest-clinnet> 3: public_typst_behavior::render
227.38 s
gammaloop-nextest-clinnet> 4: <std::sync::once::Once>::call_once_force::<<std::sync::once_lock::OnceLock<alloc::string::String>>::initialize<<std::sync::once_lock::OnceLock<alloc::string::String>>::get_or_init<public_typst_behavior::linnest_public_svg::{closure#0}>::{closure#0}, !>::{closure#0}>::{closure#0}
227.38 s
gammaloop-nextest-clinnet> 5: <std::sys::sync::once::futex::Once>::call
227.38 s
gammaloop-nextest-clinnet> 6: <std::sync::once_lock::OnceLock<alloc::string::String>>::initialize::<<std::sync::once_lock::OnceLock<alloc::string::String>>::get_or_init<public_typst_behavior::linnest_public_svg::{closure#0}>::{closure#0}, !>
227.38 s
gammaloop-nextest-clinnet> 7: <public_typst_behavior::public_linnest_labels_follow_their_carriers::{closure#0} as core::ops::function::FnOnce<()>>::call_once
227.38 s
gammaloop-nextest-clinnet> note: Some details are omitted, run with `RUST_BACKTRACE=full` for a verbose backtrace.
227.38 s
gammaloop-nextest-clinnet>
303.16 s
gammaloop-nextest-clinnet> FAIL [ 228.180s] (34/38) clinnet::public_typst_behavior public_linnest_momentum_layers_place_shafts_and_labels
303.16 s
gammaloop-nextest-clinnet> stdout ---
303.16 s
gammaloop-nextest-clinnet>
303.16 s
gammaloop-nextest-clinnet> running 1 test
303.16 s
gammaloop-nextest-clinnet> test public_linnest_momentum_layers_place_shafts_and_labels has been running for over 60 seconds
303.16 s
gammaloop-nextest-clinnet> test public_linnest_momentum_layers_place_shafts_and_labels ... FAILED
303.16 s
gammaloop-nextest-clinnet>
303.16 s
gammaloop-nextest-clinnet> failures:
303.16 s
gammaloop-nextest-clinnet>
303.16 s
gammaloop-nextest-clinnet> failures:
303.16 s
gammaloop-nextest-clinnet> public_linnest_momentum_layers_place_shafts_and_labels
303.16 s
gammaloop-nextest-clinnet>
303.16 s
gammaloop-nextest-clinnet> test result: FAILED. 0 passed; 1 failed; 0 ignored; 0 measured; 17 filtered out; finished in 228.14s
303.16 s
gammaloop-nextest-clinnet>
303.16 s
gammaloop-nextest-clinnet> stderr ---
303.16 s
gammaloop-nextest-clinnet>
303.16 s
gammaloop-nextest-clinnet> thread 'public_linnest_momentum_layers_place_shafts_and_labels' (305) panicked at crates/clinnet/tests/public_typst_behavior.rs:81:55:
303.16 s
gammaloop-nextest-clinnet> called `Result::unwrap()` on an `Err` value: typst failed while compiling template /build/.tmpmVuaZw/.clinnet/templates/linnest-public-behavior.svg
303.16 s
gammaloop-nextest-clinnet>
303.16 s
gammaloop-nextest-clinnet> Command executed:
303.16 s
gammaloop-nextest-clinnet> "typst" "c" "/build/.tmpmVuaZw/.clinnet/templates/linnest-public-behavior.typ" "/build/.tmpmVuaZw/.clinnet/templates/linnest-public-behavior.svg" "--root" "/build/.tmpmVuaZw/.clinnet/templates"
303.16 s
gammaloop-nextest-clinnet>
303.16 s
gammaloop-nextest-clinnet> Typst stdout:
303.16 s
gammaloop-nextest-clinnet>
303.16 s
gammaloop-nextest-clinnet>
303.16 s
gammaloop-nextest-clinnet> Typst stderr:
303.16 s
gammaloop-nextest-clinnet>
303.16 s
gammaloop-nextest-clinnet>
303.16 s
gammaloop-nextest-clinnet> Location:
303.16 s
gammaloop-nextest-clinnet> crates/clinnet/src/lib.rs:741:13
303.16 s
gammaloop-nextest-clinnet> stack backtrace:
303.16 s
gammaloop-nextest-clinnet> 0: __rustc::rust_begin_unwind
303.16 s
gammaloop-nextest-clinnet> 1: core::panicking::panic_fmt
303.16 s
gammaloop-nextest-clinnet> 2: core::result::unwrap_failed
303.16 s
gammaloop-nextest-clinnet> 3: public_typst_behavior::render
303.16 s
gammaloop-nextest-clinnet> 4: <std::sync::once::Once>::call_once_force::<<std::sync::once_lock::OnceLock<alloc::string::String>>::initialize<<std::sync::once_lock::OnceLock<alloc::string::String>>::get_or_init<public_typst_behavior::linnest_public_svg::{closure#0}>::{closure#0}, !>::{closure#0}>::{closure#0}
303.16 s
gammaloop-nextest-clinnet> 5: <std::sys::sync::once::futex::Once>::call
303.16 s
gammaloop-nextest-clinnet> 6: <std::sync::once_lock::OnceLock<alloc::string::String>>::initialize::<<std::sync::once_lock::OnceLock<alloc::string::String>>::get_or_init<public_typst_behavior::linnest_public_svg::{closure#0}>::{closure#0}, !>
303.16 s
gammaloop-nextest-clinnet> 7: <public_typst_behavior::public_linnest_momentum_layers_place_shafts_and_labels::{closure#0} as core::ops::function::FnOnce<()>>::call_once
303.16 s
gammaloop-nextest-clinnet> note: Some details are omitted, run with `RUST_BACKTRACE=full` for a verbose backtrace.
303.16 s
gammaloop-nextest-clinnet>
308.72 s
gammaloop-nextest-clinnet> ------------
308.72 s
gammaloop-nextest-clinnet> Summary [ 233.834s] 38 tests run: 35 passed (4 slow ), 3 failed , 0 skipped
308.72 s
gammaloop-nextest-clinnet> FAIL [ 141.742s] (32/38) clinnet::public_typst_behavior public_linnest_arrow_shafts_and_crossing_gaps
308.72 s
gammaloop-nextest-clinnet> stdout ---
308.72 s
gammaloop-nextest-clinnet>
308.72 s
gammaloop-nextest-clinnet> running 1 test
308.72 s
gammaloop-nextest-clinnet> test public_linnest_arrow_shafts_and_crossing_gaps has been running for over 60 seconds
308.72 s
gammaloop-nextest-clinnet> test public_linnest_arrow_shafts_and_crossing_gaps ... FAILED
308.72 s
gammaloop-nextest-clinnet>
308.72 s
gammaloop-nextest-clinnet> failures:
308.72 s
gammaloop-nextest-clinnet>
308.72 s
gammaloop-nextest-clinnet> failures:
308.72 s
gammaloop-nextest-clinnet> public_linnest_arrow_shafts_and_crossing_gaps
308.72 s
gammaloop-nextest-clinnet>
308.72 s
gammaloop-nextest-clinnet> test result: FAILED. 0 passed; 1 failed; 0 ignored; 0 measured; 17 filtered out; finished in 141.69s
308.72 s
gammaloop-nextest-clinnet>
308.72 s
gammaloop-nextest-clinnet> stderr ---
308.72 s
gammaloop-nextest-clinnet>
308.72 s
gammaloop-nextest-clinnet> thread 'public_linnest_arrow_shafts_and_crossing_gaps' (286) panicked at crates/clinnet/tests/public_typst_behavior.rs:81:55:
308.72 s
gammaloop-nextest-clinnet> called `Result::unwrap()` on an `Err` value: typst failed while compiling template /build/.tmpwqjOxv/.clinnet/templates/linnest-public-behavior.svg
308.72 s
gammaloop-nextest-clinnet>
308.72 s
gammaloop-nextest-clinnet> Command executed:
308.72 s
gammaloop-nextest-clinnet> "typst" "c" "/build/.tmpwqjOxv/.clinnet/templates/linnest-public-behavior.typ" "/build/.tmpwqjOxv/.clinnet/templates/linnest-public-behavior.svg" "--root" "/build/.tmpwqjOxv/.clinnet/templates"
308.72 s
gammaloop-nextest-clinnet>
308.72 s
gammaloop-nextest-clinnet> Typst stdout:
308.72 s
gammaloop-nextest-clinnet>
308.72 s
gammaloop-nextest-clinnet>
308.72 s
gammaloop-nextest-clinnet> Typst stderr:
308.72 s
gammaloop-nextest-clinnet>
308.72 s
gammaloop-nextest-clinnet>
308.72 s
gammaloop-nextest-clinnet> Location:
308.72 s
gammaloop-nextest-clinnet> crates/clinnet/src/lib.rs:741:13
308.72 s
gammaloop-nextest-clinnet> stack backtrace:
308.72 s
gammaloop-nextest-clinnet> 0: __rustc::rust_begin_unwind
308.72 s
gammaloop-nextest-clinnet> 1: core::panicking::panic_fmt
308.72 s
gammaloop-nextest-clinnet> 2: core::result::unwrap_failed
308.72 s
gammaloop-nextest-clinnet> 3: public_typst_behavior::render
308.72 s
gammaloop-nextest-clinnet> 4: <std::sync::once::Once>::call_once_force::<<std::sync::once_lock::OnceLock<alloc::string::String>>::initialize<<std::sync::once_lock::OnceLock<alloc::string::String>>::get_or_init<public_typst_behavior::linnest_public_svg::{closure#0}>::{closure#0}, !>::{closure#0}>::{closure#0}
308.72 s
gammaloop-nextest-clinnet> 5: <std::sys::sync::once::futex::Once>::call
308.72 s
gammaloop-nextest-clinnet> 6: <std::sync::once_lock::OnceLock<alloc::string::String>>::initialize::<<std::sync::once_lock::OnceLock<alloc::string::String>>::get_or_init<public_typst_behavior::linnest_public_svg::{closure#0}>::{closure#0}, !>
308.72 s
gammaloop-nextest-clinnet> 7: <public_typst_behavior::public_linnest_arrow_shafts_and_crossing_gaps::{closure#0} as core::ops::function::FnOnce<()>>::call_once
308.72 s
gammaloop-nextest-clinnet> note: Some details are omitted, run with `RUST_BACKTRACE=full` for a verbose backtrace.
308.72 s
gammaloop-nextest-clinnet>
308.72 s
gammaloop-nextest-clinnet> FAIL [ 152.422s] (33/38) clinnet::public_typst_behavior public_linnest_labels_follow_their_carriers
308.72 s
gammaloop-nextest-clinnet> stdout ---
308.72 s
gammaloop-nextest-clinnet>
308.72 s
gammaloop-nextest-clinnet> running 1 test
308.72 s
gammaloop-nextest-clinnet> test public_linnest_labels_follow_their_carriers has been running for over 60 seconds
308.72 s
gammaloop-nextest-clinnet> test public_linnest_labels_follow_their_carriers ... FAILED
308.72 s
gammaloop-nextest-clinnet>
308.72 s
gammaloop-nextest-clinnet> failures:
308.72 s
gammaloop-nextest-clinnet>
308.72 s
gammaloop-nextest-clinnet> failures:
308.72 s
gammaloop-nextest-clinnet> public_linnest_labels_follow_their_carriers
308.72 s
gammaloop-nextest-clinnet>
308.72 s
gammaloop-nextest-clinnet> test result: FAILED. 0 passed; 1 failed; 0 ignored; 0 measured; 17 filtered out; finished in 152.39s
308.72 s
gammaloop-nextest-clinnet>
308.72 s
gammaloop-nextest-clinnet> stderr ---
308.72 s
gammaloop-nextest-clinnet>
308.72 s
gammaloop-nextest-clinnet> thread 'public_linnest_labels_follow_their_carriers' (281) panicked at crates/clinnet/tests/public_typst_behavior.rs:81:55:
308.72 s
gammaloop-nextest-clinnet> called `Result::unwrap()` on an `Err` value: typst failed while compiling template /build/.tmpWkJXOH/.clinnet/templates/linnest-public-behavior.svg
308.72 s
gammaloop-nextest-clinnet>
308.72 s
gammaloop-nextest-clinnet> Command executed:
308.72 s
gammaloop-nextest-clinnet> "typst" "c" "/build/.tmpWkJXOH/.clinnet/templates/linnest-public-behavior.typ" "/build/.tmpWkJXOH/.clinnet/templates/linnest-public-behavior.svg" "--root" "/build/.tmpWkJXOH/.clinnet/templates"
308.72 s
gammaloop-nextest-clinnet>
308.72 s
gammaloop-nextest-clinnet> Typst stdout:
308.72 s
gammaloop-nextest-clinnet>
308.72 s
gammaloop-nextest-clinnet>
308.72 s
gammaloop-nextest-clinnet> Typst stderr:
308.72 s
gammaloop-nextest-clinnet>
308.72 s
gammaloop-nextest-clinnet>
308.72 s
gammaloop-nextest-clinnet> Location:
308.72 s
gammaloop-nextest-clinnet> crates/clinnet/src/lib.rs:741:13
308.72 s
gammaloop-nextest-clinnet> stack backtrace:
308.72 s
gammaloop-nextest-clinnet> 0: __rustc::rust_begin_unwind
308.72 s
gammaloop-nextest-clinnet> 1: core::panicking::panic_fmt
308.72 s
gammaloop-nextest-clinnet> 2: core::result::unwrap_failed
308.72 s
gammaloop-nextest-clinnet> 3: public_typst_behavior::render
308.72 s
gammaloop-nextest-clinnet> 4: <std::sync::once::Once>::call_once_force::<<std::sync::once_lock::OnceLock<alloc::string::String>>::initialize<<std::sync::once_lock::OnceLock<alloc::string::String>>::get_or_init<public_typst_behavior::linnest_public_svg::{closure#0}>::{closure#0}, !>::{closure#0}>::{closure#0}
308.72 s
gammaloop-nextest-clinnet> 5: <std::sys::sync::once::futex::Once>::call
308.72 s
gammaloop-nextest-clinnet> 6: <std::sync::once_lock::OnceLock<alloc::string::String>>::initialize::<<std::sync::once_lock::OnceLock<alloc::string::String>>::get_or_init<public_typst_behavior::linnest_public_svg::{closure#0}>::{closure#0}, !>
308.72 s
gammaloop-nextest-clinnet> 7: <public_typst_behavior::public_linnest_labels_follow_their_carriers::{closure#0} as core::ops::function::FnOnce<()>>::call_once
308.72 s
gammaloop-nextest-clinnet> note: Some details are omitted, run with `RUST_BACKTRACE=full` for a verbose backtrace.
308.72 s
gammaloop-nextest-clinnet>
308.72 s
gammaloop-nextest-clinnet> FAIL [ 228.180s] (34/38) clinnet::public_typst_behavior public_linnest_momentum_layers_place_shafts_and_labels
308.72 s
gammaloop-nextest-clinnet> stdout ---
308.72 s
gammaloop-nextest-clinnet>
308.72 s
gammaloop-nextest-clinnet> running 1 test
308.72 s
gammaloop-nextest-clinnet> test public_linnest_momentum_layers_place_shafts_and_labels has been running for over 60 seconds
308.72 s
gammaloop-nextest-clinnet> test public_linnest_momentum_layers_place_shafts_and_labels ... FAILED
308.72 s
gammaloop-nextest-clinnet>
308.72 s
gammaloop-nextest-clinnet> failures:
308.72 s
gammaloop-nextest-clinnet>
308.72 s
gammaloop-nextest-clinnet> failures:
308.72 s
gammaloop-nextest-clinnet> public_linnest_momentum_layers_place_shafts_and_labels
308.72 s
gammaloop-nextest-clinnet>
308.72 s
gammaloop-nextest-clinnet> test result: FAILED. 0 passed; 1 failed; 0 ignored; 0 measured; 17 filtered out; finished in 228.14s
308.72 s
gammaloop-nextest-clinnet>
308.72 s
gammaloop-nextest-clinnet> stderr ---
308.72 s
gammaloop-nextest-clinnet>
308.72 s
gammaloop-nextest-clinnet> thread 'public_linnest_momentum_layers_place_shafts_and_labels' (305) panicked at crates/clinnet/tests/public_typst_behavior.rs:81:55:
308.72 s
gammaloop-nextest-clinnet> called `Result::unwrap()` on an `Err` value: typst failed while compiling template /build/.tmpmVuaZw/.clinnet/templates/linnest-public-behavior.svg
308.72 s
gammaloop-nextest-clinnet>
308.72 s
gammaloop-nextest-clinnet> Command executed:
308.72 s
gammaloop-nextest-clinnet> "typst" "c" "/build/.tmpmVuaZw/.clinnet/templates/linnest-public-behavior.typ" "/build/.tmpmVuaZw/.clinnet/templates/linnest-public-behavior.svg" "--root" "/build/.tmpmVuaZw/.clinnet/templates"
308.72 s
gammaloop-nextest-clinnet>
308.72 s
gammaloop-nextest-clinnet> Typst stdout:
308.72 s
gammaloop-nextest-clinnet>
308.72 s
gammaloop-nextest-clinnet>
308.72 s
gammaloop-nextest-clinnet> Typst stderr:
308.72 s
gammaloop-nextest-clinnet>
308.72 s
gammaloop-nextest-clinnet>
308.72 s
gammaloop-nextest-clinnet> Location:
308.72 s
gammaloop-nextest-clinnet> crates/clinnet/src/lib.rs:741:13
308.72 s
gammaloop-nextest-clinnet> stack backtrace:
308.72 s
gammaloop-nextest-clinnet> 0: __rustc::rust_begin_unwind
308.72 s
gammaloop-nextest-clinnet> 1: core::panicking::panic_fmt
308.72 s
gammaloop-nextest-clinnet> 2: core::result::unwrap_failed
308.72 s
gammaloop-nextest-clinnet> 3: public_typst_behavior::render
308.72 s
gammaloop-nextest-clinnet> 4: <std::sync::once::Once>::call_once_force::<<std::sync::once_lock::OnceLock<alloc::string::String>>::initialize<<std::sync::once_lock::OnceLock<alloc::string::String>>::get_or_init<public_typst_behavior::linnest_public_svg::{closure#0}>::{closure#0}, !>::{closure#0}>::{closure#0}
308.72 s
gammaloop-nextest-clinnet> 5: <std::sys::sync::once::futex::Once>::call
308.72 s
gammaloop-nextest-clinnet> 6: <std::sync::once_lock::OnceLock<alloc::string::String>>::initialize::<<std::sync::once_lock::OnceLock<alloc::string::String>>::get_or_init<public_typst_behavior::linnest_public_svg::{closure#0}>::{closure#0}, !>
308.72 s
gammaloop-nextest-clinnet> 7: <public_typst_behavior::public_linnest_momentum_layers_place_shafts_and_labels::{closure#0} as core::ops::function::FnOnce<()>>::call_once
308.72 s
gammaloop-nextest-clinnet> note: Some details are omitted, run with `RUST_BACKTRACE=full` for a verbose backtrace.
308.72 s
gammaloop-nextest-clinnet>
308.73 s
gammaloop-nextest-clinnet> error : test run failed
308.81 s
gammaloop-nextest-clinnet>
308.81 s
gammaloop-nextest-clinnet> ========== nextest test summary ==========
308.81 s
gammaloop-nextest-clinnet> report: target/nextest/ci_gammaloop/junit.xml
308.81 s
gammaloop-nextest-clinnet> tests: 38, failures: 3, errors: 0
308.81 s
gammaloop-nextest-clinnet>
308.81 s
gammaloop-nextest-clinnet> 1. clinnet::public_typst_behavior::public_linnest_arrow_shafts_and_crossing_gaps
308.81 s
gammaloop-nextest-clinnet> failure: test failure with exit code 101
308.81 s
gammaloop-nextest-clinnet> thread 'public_linnest_arrow_shafts_and_crossing_gaps' (286) panicked at crates/clinnet/tests/public_typst_behavior.rs:81:55:
308.81 s
gammaloop-nextest-clinnet> called `Result::unwrap()` on an `Err` value: typst failed while compiling template /build/.tmpwqjOxv/.clinnet/templates/linnest-public-behavior.svg
308.81 s
gammaloop-nextest-clinnet>
308.81 s
gammaloop-nextest-clinnet> Command executed:
308.81 s
gammaloop-nextest-clinnet> "typst" "c" "/build/.tmpwqjOxv/.clinnet/templates/linnest-public-behavior.typ" "/build/.tmpwqjOxv/.clinnet/templates/linnest-public-behavior.svg" "--root" "/build/.tmpwqjOxv/.clinnet/templates"
308.81 s
gammaloop-nextest-clinnet>
308.81 s
gammaloop-nextest-clinnet> Typst stdout:
308.81 s
gammaloop-nextest-clinnet>
308.81 s
gammaloop-nextest-clinnet>
308.81 s
gammaloop-nextest-clinnet> Typst stderr:
308.81 s
gammaloop-nextest-clinnet>
308.81 s
gammaloop-nextest-clinnet>
308.81 s
gammaloop-nextest-clinnet> Location:
308.81 s
gammaloop-nextest-clinnet> crates/clinnet/src/lib.rs:741:13
308.81 s
gammaloop-nextest-clinnet> stack backtrace:
308.81 s
gammaloop-nextest-clinnet> 0: __rustc::rust_begin_unwind
308.81 s
gammaloop-nextest-clinnet> 1: core::panicking::panic_fmt
308.81 s
gammaloop-nextest-clinnet> 2: core::result::unwrap_failed
308.81 s
gammaloop-nextest-clinnet> 3: public_typst_behavior::render
308.81 s
gammaloop-nextest-clinnet> 4: <std::sync::once::Once>::call_once_force::<<std::sync::once_lock::OnceLock<alloc::string::String>>::initialize<<std::sync::once_lock::OnceLock<alloc::string::String>>::get_or_init<public_typst_behavior::linnest_public_svg::{closure#0}>::{closure#0}, !>::{closure#0}>::{closure#0}
308.81 s
gammaloop-nextest-clinnet> 5: <std::sys::sync::once::futex::Once>::call
308.81 s
gammaloop-nextest-clinnet> 6: <std::sync::once_lock::OnceLock<alloc::string::String>>::initialize::<<std::sync::once_lock::OnceLock<alloc::string::String>>::get_or_init<public_typst_behavior::linnest_public_svg::{closure#0}>::{closure#0}, !>
308.81 s
gammaloop-nextest-clinnet> 7: <public_typst_behavior::public_linnest_arrow_shafts_and_crossing_gaps::{closure#0} as core::ops::function::FnOnce<()>>::call_once
308.81 s
gammaloop-nextest-clinnet> note: Some details are omitted, run with `RUST_BACKTRACE=full` for a verbose backtrace.
308.81 s
gammaloop-nextest-clinnet> system-out
308.81 s
gammaloop-nextest-clinnet> running 1 test
308.81 s
gammaloop-nextest-clinnet> test public_linnest_arrow_shafts_and_crossing_gaps has been running for over 60 seconds
308.81 s
gammaloop-nextest-clinnet> test public_linnest_arrow_shafts_and_crossing_gaps ... FAILED
308.81 s
gammaloop-nextest-clinnet>
308.81 s
gammaloop-nextest-clinnet> failures:
308.81 s
gammaloop-nextest-clinnet>
308.81 s
gammaloop-nextest-clinnet> failures:
308.81 s
gammaloop-nextest-clinnet> public_linnest_arrow_shafts_and_crossing_gaps
308.81 s
gammaloop-nextest-clinnet>
308.81 s
gammaloop-nextest-clinnet> test result: FAILED. 0 passed; 1 failed; 0 ignored; 0 measured; 17 filtered out; finished in 141.69s
308.81 s
gammaloop-nextest-clinnet> system-err
308.81 s
gammaloop-nextest-clinnet> thread 'public_linnest_arrow_shafts_and_crossing_gaps' (286) panicked at crates/clinnet/tests/public_typst_behavior.rs:81:55:
308.81 s
gammaloop-nextest-clinnet> called `Result::unwrap()` on an `Err` value: typst failed while compiling template /build/.tmpwqjOxv/.clinnet/templates/linnest-public-behavior.svg
308.81 s
gammaloop-nextest-clinnet>
308.81 s
gammaloop-nextest-clinnet> Command executed:
308.81 s
gammaloop-nextest-clinnet> "typst" "c" "/build/.tmpwqjOxv/.clinnet/templates/linnest-public-behavior.typ" "/build/.tmpwqjOxv/.clinnet/templates/linnest-public-behavior.svg" "--root" "/build/.tmpwqjOxv/.clinnet/templates"
308.81 s
gammaloop-nextest-clinnet>
308.81 s
gammaloop-nextest-clinnet> Typst stdout:
308.81 s
gammaloop-nextest-clinnet>
308.81 s
gammaloop-nextest-clinnet>
308.81 s
gammaloop-nextest-clinnet> Typst stderr:
308.81 s
gammaloop-nextest-clinnet>
308.81 s
gammaloop-nextest-clinnet>
308.81 s
gammaloop-nextest-clinnet> Location:
308.81 s
gammaloop-nextest-clinnet> crates/clinnet/src/lib.rs:741:13
308.81 s
gammaloop-nextest-clinnet> stack backtrace:
308.81 s
gammaloop-nextest-clinnet> 0: __rustc::rust_begin_unwind
308.81 s
gammaloop-nextest-clinnet> 1: core::panicking::panic_fmt
308.81 s
gammaloop-nextest-clinnet> 2: core::result::unwrap_failed
308.81 s
gammaloop-nextest-clinnet> 3: public_typst_behavior::render
308.81 s
gammaloop-nextest-clinnet> 4: <std::sync::once::Once>::call_once_force::<<std::sync::once_lock::OnceLock<alloc::string::String>>::initialize<<std::sync::once_lock::OnceLock<alloc::string::String>>::get_or_init<public_typst_behavior::linnest_public_svg::{closure#0}>::{closure#0}, !>::{closure#0}>::{closure#0}
308.81 s
gammaloop-nextest-clinnet> 5: <std::sys::sync::once::futex::Once>::call
308.81 s
gammaloop-nextest-clinnet> 6: <std::sync::once_lock::OnceLock<alloc::string::String>>::initialize::<<std::sync::once_lock::OnceLock<alloc::string::String>>::get_or_init<public_typst_behavior::linnest_public_svg::{closure#0}>::{closure#0}, !>
308.81 s
gammaloop-nextest-clinnet> 7: <public_typst_behavior::public_linnest_arrow_shafts_and_crossing_gaps::{closure#0} as core::ops::function::FnOnce<()>>::call_once
308.81 s
gammaloop-nextest-clinnet> note: Some details are omitted, run with `RUST_BACKTRACE=full` for a verbose backtrace.
308.81 s
gammaloop-nextest-clinnet>
308.81 s
gammaloop-nextest-clinnet> 2. clinnet::public_typst_behavior::public_linnest_labels_follow_their_carriers
308.81 s
gammaloop-nextest-clinnet> failure: test failure with exit code 101
308.81 s
gammaloop-nextest-clinnet> thread 'public_linnest_labels_follow_their_carriers' (281) panicked at crates/clinnet/tests/public_typst_behavior.rs:81:55:
308.81 s
gammaloop-nextest-clinnet> called `Result::unwrap()` on an `Err` value: typst failed while compiling template /build/.tmpWkJXOH/.clinnet/templates/linnest-public-behavior.svg
308.81 s
gammaloop-nextest-clinnet>
308.81 s
gammaloop-nextest-clinnet> Command executed:
308.81 s
gammaloop-nextest-clinnet> "typst" "c" "/build/.tmpWkJXOH/.clinnet/templates/linnest-public-behavior.typ" "/build/.tmpWkJXOH/.clinnet/templates/linnest-public-behavior.svg" "--root" "/build/.tmpWkJXOH/.clinnet/templates"
308.81 s
gammaloop-nextest-clinnet>
308.81 s
gammaloop-nextest-clinnet> Typst stdout:
308.81 s
gammaloop-nextest-clinnet>
308.81 s
gammaloop-nextest-clinnet>
308.81 s
gammaloop-nextest-clinnet> Typst stderr:
308.81 s
gammaloop-nextest-clinnet>
308.81 s
gammaloop-nextest-clinnet>
308.81 s
gammaloop-nextest-clinnet> Location:
308.81 s
gammaloop-nextest-clinnet> crates/clinnet/src/lib.rs:741:13
308.81 s
gammaloop-nextest-clinnet> stack backtrace:
308.81 s
gammaloop-nextest-clinnet> 0: __rustc::rust_begin_unwind
308.81 s
gammaloop-nextest-clinnet> 1: core::panicking::panic_fmt
308.81 s
gammaloop-nextest-clinnet> 2: core::result::unwrap_failed
308.81 s
gammaloop-nextest-clinnet> 3: public_typst_behavior::render
308.81 s
gammaloop-nextest-clinnet> 4: <std::sync::once::Once>::call_once_force::<<std::sync::once_lock::OnceLock<alloc::string::String>>::initialize<<std::sync::once_lock::OnceLock<alloc::string::String>>::get_or_init<public_typst_behavior::linnest_public_svg::{closure#0}>::{closure#0}, !>::{closure#0}>::{closure#0}
308.81 s
gammaloop-nextest-clinnet> 5: <std::sys::sync::once::futex::Once>::call
308.81 s
gammaloop-nextest-clinnet> 6: <std::sync::once_lock::OnceLock<alloc::string::String>>::initialize::<<std::sync::once_lock::OnceLock<alloc::string::String>>::get_or_init<public_typst_behavior::linnest_public_svg::{closure#0}>::{closure#0}, !>
308.81 s
gammaloop-nextest-clinnet> 7: <public_typst_behavior::public_linnest_labels_follow_their_carriers::{closure#0} as core::ops::function::FnOnce<()>>::call_once
308.81 s
gammaloop-nextest-clinnet> note: Some details are omitted, run with `RUST_BACKTRACE=full` for a verbose backtrace.
308.81 s
gammaloop-nextest-clinnet> system-out
308.81 s
gammaloop-nextest-clinnet> running 1 test
308.81 s
gammaloop-nextest-clinnet> test public_linnest_labels_follow_their_carriers has been running for over 60 seconds
308.81 s
gammaloop-nextest-clinnet> test public_linnest_labels_follow_their_carriers ... FAILED
308.81 s
gammaloop-nextest-clinnet>
308.81 s
gammaloop-nextest-clinnet> failures:
308.81 s
gammaloop-nextest-clinnet>
308.81 s
gammaloop-nextest-clinnet> failures:
308.81 s
gammaloop-nextest-clinnet> public_linnest_labels_follow_their_carriers
308.81 s
gammaloop-nextest-clinnet>
308.81 s
gammaloop-nextest-clinnet> test result: FAILED. 0 passed; 1 failed; 0 ignored; 0 measured; 17 filtered out; finished in 152.39s
308.81 s
gammaloop-nextest-clinnet> system-err
308.81 s
gammaloop-nextest-clinnet> thread 'public_linnest_labels_follow_their_carriers' (281) panicked at crates/clinnet/tests/public_typst_behavior.rs:81:55:
308.81 s
gammaloop-nextest-clinnet> called `Result::unwrap()` on an `Err` value: typst failed while compiling template /build/.tmpWkJXOH/.clinnet/templates/linnest-public-behavior.svg
308.81 s
gammaloop-nextest-clinnet>
308.81 s
gammaloop-nextest-clinnet> Command executed:
308.81 s
gammaloop-nextest-clinnet> "typst" "c" "/build/.tmpWkJXOH/.clinnet/templates/linnest-public-behavior.typ" "/build/.tmpWkJXOH/.clinnet/templates/linnest-public-behavior.svg" "--root" "/build/.tmpWkJXOH/.clinnet/templates"
308.81 s
gammaloop-nextest-clinnet>
308.81 s
gammaloop-nextest-clinnet> Typst stdout:
308.81 s
gammaloop-nextest-clinnet>
308.81 s
gammaloop-nextest-clinnet>
308.81 s
gammaloop-nextest-clinnet> Typst stderr:
308.81 s
gammaloop-nextest-clinnet>
308.81 s
gammaloop-nextest-clinnet>
308.81 s
gammaloop-nextest-clinnet> Location:
308.81 s
gammaloop-nextest-clinnet> crates/clinnet/src/lib.rs:741:13
308.81 s
gammaloop-nextest-clinnet> stack backtrace:
308.81 s
gammaloop-nextest-clinnet> 0: __rustc::rust_begin_unwind
308.81 s
gammaloop-nextest-clinnet> 1: core::panicking::panic_fmt
308.81 s
gammaloop-nextest-clinnet> 2: core::result::unwrap_failed
308.81 s
gammaloop-nextest-clinnet> 3: public_typst_behavior::render
308.81 s
gammaloop-nextest-clinnet> 4: <std::sync::once::Once>::call_once_force::<<std::sync::once_lock::OnceLock<alloc::string::String>>::initialize<<std::sync::once_lock::OnceLock<alloc::string::String>>::get_or_init<public_typst_behavior::linnest_public_svg::{closure#0}>::{closure#0}, !>::{closure#0}>::{closure#0}
308.81 s
gammaloop-nextest-clinnet> 5: <std::sys::sync::once::futex::Once>::call
308.81 s
gammaloop-nextest-clinnet> 6: <std::sync::once_lock::OnceLock<alloc::string::String>>::initialize::<<std::sync::once_lock::OnceLock<alloc::string::String>>::get_or_init<public_typst_behavior::linnest_public_svg::{closure#0}>::{closure#0}, !>
308.81 s
gammaloop-nextest-clinnet> 7: <public_typst_behavior::public_linnest_labels_follow_their_carriers::{closure#0} as core::ops::function::FnOnce<()>>::call_once
308.81 s
gammaloop-nextest-clinnet> note: Some details are omitted, run with `RUST_BACKTRACE=full` for a verbose backtrace.
308.81 s
gammaloop-nextest-clinnet>
308.81 s
gammaloop-nextest-clinnet> 3. clinnet::public_typst_behavior::public_linnest_momentum_layers_place_shafts_and_labels
308.81 s
gammaloop-nextest-clinnet> failure: test failure with exit code 101
308.81 s
gammaloop-nextest-clinnet> thread 'public_linnest_momentum_layers_place_shafts_and_labels' (305) panicked at crates/clinnet/tests/public_typst_behavior.rs:81:55:
308.81 s
gammaloop-nextest-clinnet> called `Result::unwrap()` on an `Err` value: typst failed while compiling template /build/.tmpmVuaZw/.clinnet/templates/linnest-public-behavior.svg
308.81 s
gammaloop-nextest-clinnet>
308.81 s
gammaloop-nextest-clinnet> Command executed:
308.81 s
gammaloop-nextest-clinnet> "typst" "c" "/build/.tmpmVuaZw/.clinnet/templates/linnest-public-behavior.typ" "/build/.tmpmVuaZw/.clinnet/templates/linnest-public-behavior.svg" "--root" "/build/.tmpmVuaZw/.clinnet/templates"
308.81 s
gammaloop-nextest-clinnet>
308.81 s
gammaloop-nextest-clinnet> Typst stdout:
308.81 s
gammaloop-nextest-clinnet>
308.81 s
gammaloop-nextest-clinnet>
308.81 s
gammaloop-nextest-clinnet> Typst stderr:
308.81 s
gammaloop-nextest-clinnet>
308.81 s
gammaloop-nextest-clinnet>
308.81 s
gammaloop-nextest-clinnet> Location:
308.81 s
gammaloop-nextest-clinnet> crates/clinnet/src/lib.rs:741:13
308.81 s
gammaloop-nextest-clinnet> stack backtrace:
308.81 s
gammaloop-nextest-clinnet> 0: __rustc::rust_begin_unwind
308.81 s
gammaloop-nextest-clinnet> 1: core::panicking::panic_fmt
308.81 s
gammaloop-nextest-clinnet> 2: core::result::unwrap_failed
308.81 s
gammaloop-nextest-clinnet> 3: public_typst_behavior::render
308.81 s
gammaloop-nextest-clinnet> 4: <std::sync::once::Once>::call_once_force::<<std::sync::once_lock::OnceLock<alloc::string::String>>::initialize<<std::sync::once_lock::OnceLock<alloc::string::String>>::get_or_init<public_typst_behavior::linnest_public_svg::{closure#0}>::{closure#0}, !>::{closure#0}>::{closure#0}
308.81 s
gammaloop-nextest-clinnet> 5: <std::sys::sync::once::futex::Once>::call
308.81 s
gammaloop-nextest-clinnet> 6: <std::sync::once_lock::OnceLock<alloc::string::String>>::initialize::<<std::sync::once_lock::OnceLock<alloc::string::String>>::get_or_init<public_typst_behavior::linnest_public_svg::{closure#0}>::{closure#0}, !>
308.81 s
gammaloop-nextest-clinnet> 7: <public_typst_behavior::public_linnest_momentum_layers_place_shafts_and_labels::{closure#0} as core::ops::function::FnOnce<()>>::call_once
308.81 s
gammaloop-nextest-clinnet> note: Some details are omitted, run with `RUST_BACKTRACE=full` for a verbose backtrace.
308.81 s
gammaloop-nextest-clinnet> system-out
308.81 s
gammaloop-nextest-clinnet> running 1 test
308.81 s
gammaloop-nextest-clinnet> test public_linnest_momentum_layers_place_shafts_and_labels has been running for over 60 seconds
308.81 s
gammaloop-nextest-clinnet> test public_linnest_momentum_layers_place_shafts_and_labels ... FAILED
308.81 s
gammaloop-nextest-clinnet>
308.81 s
gammaloop-nextest-clinnet> failures:
308.81 s
gammaloop-nextest-clinnet>
308.81 s
gammaloop-nextest-clinnet> failures:
308.81 s
gammaloop-nextest-clinnet> public_linnest_momentum_layers_place_shafts_and_labels
308.81 s
gammaloop-nextest-clinnet>
308.81 s
gammaloop-nextest-clinnet> test result: FAILED. 0 passed; 1 failed; 0 ignored; 0 measured; 17 filtered out; finished in 228.14s
308.81 s
gammaloop-nextest-clinnet> system-err
308.81 s
gammaloop-nextest-clinnet> thread 'public_linnest_momentum_layers_place_shafts_and_labels' (305) panicked at crates/clinnet/tests/public_typst_behavior.rs:81:55:
308.81 s
gammaloop-nextest-clinnet> called `Result::unwrap()` on an `Err` value: typst failed while compiling template /build/.tmpmVuaZw/.clinnet/templates/linnest-public-behavior.svg
308.81 s
gammaloop-nextest-clinnet>
308.81 s
gammaloop-nextest-clinnet> Command executed:
308.81 s
gammaloop-nextest-clinnet> "typst" "c" "/build/.tmpmVuaZw/.clinnet/templates/linnest-public-behavior.typ" "/build/.tmpmVuaZw/.clinnet/templates/linnest-public-behavior.svg" "--root" "/build/.tmpmVuaZw/.clinnet/templates"
308.81 s
gammaloop-nextest-clinnet>
308.81 s
gammaloop-nextest-clinnet> Typst stdout:
308.81 s
gammaloop-nextest-clinnet>
308.81 s
gammaloop-nextest-clinnet>
308.81 s
gammaloop-nextest-clinnet> Typst stderr:
308.81 s
gammaloop-nextest-clinnet>
308.81 s
gammaloop-nextest-clinnet>
308.81 s
gammaloop-nextest-clinnet> Location:
308.81 s
gammaloop-nextest-clinnet> crates/clinnet/src/lib.rs:741:13
308.81 s
gammaloop-nextest-clinnet> stack backtrace:
308.81 s
gammaloop-nextest-clinnet> 0: __rustc::rust_begin_unwind
308.81 s
gammaloop-nextest-clinnet> 1: core::panicking::panic_fmt
308.81 s
gammaloop-nextest-clinnet> 2: core::result::unwrap_failed
308.81 s
gammaloop-nextest-clinnet> 3: public_typst_behavior::render
308.81 s
gammaloop-nextest-clinnet> 4: <std::sync::once::Once>::call_once_force::<<std::sync::once_lock::OnceLock<alloc::string::String>>::initialize<<std::sync::once_lock::OnceLock<alloc::string::String>>::get_or_init<public_typst_behavior::linnest_public_svg::{closure#0}>::{closure#0}, !>::{closure#0}>::{closure#0}
308.81 s
gammaloop-nextest-clinnet> 5: <std::sys::sync::once::futex::Once>::call
308.81 s
gammaloop-nextest-clinnet> 6: <std::sync::once_lock::OnceLock<alloc::string::String>>::initialize::<<std::sync::once_lock::OnceLock<alloc::string::String>>::get_or_init<public_typst_behavior::linnest_public_svg::{closure#0}>::{closure#0}, !>
308.81 s
gammaloop-nextest-clinnet> 7: <public_typst_behavior::public_linnest_momentum_layers_place_shafts_and_labels::{closure#0} as core::ops::function::FnOnce<()>>::call_once
308.81 s
gammaloop-nextest-clinnet> note: Some details are omitted, run with `RUST_BACKTRACE=full` for a verbose backtrace.
308.81 s
gammaloop-nextest-clinnet> =========================================
308.93 s
[0 built (1 failed )]error: Cannot build '/nix/store/4pqspwvh8pi9s2vg9g6mfsggpl9ynwzx-gammaloop-nextest-clinnet.drv '.
308.93 s
Reason: builder failed with exit code 100 .
308.93 s
Output paths:
308.93 s
/nix/store/v9zka7gxdrym1pq03r0i4w2q43fgdwcq-gammaloop-nextest-clinnet
308.93 s
Last 449 log lines:
308.93 s
> Nextest worker budget: 16
308.93 s
> Extracting 4 binaries (including 1 non-test binary), 1 build script output directory, and 1 linked path to /build/source
308.93 s
> Extracted 16 files to /build/source in 0.17s
308.93 s
> ------------
308.93 s
> Nextest run ID 87db954c-e4a2-4974-9730-8a14994d9732 with nextest profile: ci_gammaloop
308.93 s
> Starting 38 tests across 3 binaries
308.93 s
> FAIL [ 141.742s] (32/38) clinnet::public_typst_behavior public_linnest_arrow_shafts_and_crossing_gaps
308.93 s
> stdout ---
308.93 s
>
308.93 s
> running 1 test
308.93 s
> test public_linnest_arrow_shafts_and_crossing_gaps has been running for over 60 seconds
308.93 s
> test public_linnest_arrow_shafts_and_crossing_gaps ... FAILED
308.93 s
>
308.93 s
> failures:
308.93 s
>
308.93 s
> failures:
308.93 s
> public_linnest_arrow_shafts_and_crossing_gaps
308.93 s
>
308.93 s
> test result: FAILED. 0 passed; 1 failed; 0 ignored; 0 measured; 17 filtered out; finished in 141.69s
308.93 s
>
308.93 s
> stderr ---
308.93 s
>
308.93 s
> thread 'public_linnest_arrow_shafts_and_crossing_gaps' (286) panicked at crates/clinnet/tests/public_typst_behavior.rs:81:55:
308.93 s
> called `Result::unwrap()` on an `Err` value: typst failed while compiling template /build/.tmpwqjOxv/.clinnet/templates/linnest-public-behavior.svg
308.93 s
>
308.93 s
> Command executed:
308.93 s
> "typst" "c" "/build/.tmpwqjOxv/.clinnet/templates/linnest-public-behavior.typ" "/build/.tmpwqjOxv/.clinnet/templates/linnest-public-behavior.svg" "--root" "/build/.tmpwqjOxv/.clinnet/templates"
308.93 s
>
308.93 s
> Typst stdout:
308.93 s
>
308.93 s
>
308.93 s
> Typst stderr:
308.93 s
>
308.93 s
>
308.93 s
> Location:
308.93 s
> crates/clinnet/src/lib.rs:741:13
308.93 s
> stack backtrace:
308.93 s
> 0: __rustc::rust_begin_unwind
308.93 s
> 1: core::panicking::panic_fmt
308.93 s
> 2: core::result::unwrap_failed
308.93 s
> 3: public_typst_behavior::render
308.93 s
> 4: <std::sync::once::Once>::call_once_force::<<std::sync::once_lock::OnceLock<alloc::string::String>>::initialize<<std::sync::once_lock::OnceLock<alloc::string::String>>::get_or_init<public_typst_behavior::linnest_public_svg::{closure#0}>::{closure#0}, !>::{closure#0}>::{closure#0}
308.93 s
> 5: <std::sys::sync::once::futex::Once>::call
308.93 s
> 6: <std::sync::once_lock::OnceLock<alloc::string::String>>::initialize::<<std::sync::once_lock::OnceLock<alloc::string::String>>::get_or_init<public_typst_behavior::linnest_public_svg::{closure#0}>::{closure#0}, !>
308.93 s
> 7: <public_typst_behavior::public_linnest_arrow_shafts_and_crossing_gaps::{closure#0} as core::ops::function::FnOnce<()>>::call_once
308.93 s
> note: Some details are omitted, run with `RUST_BACKTRACE=full` for a verbose backtrace.
308.93 s
>
308.93 s
> FAIL [ 152.422s] (33/38) clinnet::public_typst_behavior public_linnest_labels_follow_their_carriers
308.93 s
> stdout ---
308.93 s
>
308.93 s
> running 1 test
308.93 s
> test public_linnest_labels_follow_their_carriers has been running for over 60 seconds
308.93 s
> test public_linnest_labels_follow_their_carriers ... FAILED
308.93 s
>
308.93 s
> failures:
308.93 s
>
308.93 s
> failures:
308.93 s
> public_linnest_labels_follow_their_carriers
308.93 s
>
308.93 s
> test result: FAILED. 0 passed; 1 failed; 0 ignored; 0 measured; 17 filtered out; finished in 152.39s
308.93 s
>
308.93 s
> stderr ---
308.93 s
>
308.93 s
> thread 'public_linnest_labels_follow_their_carriers' (281) panicked at crates/clinnet/tests/public_typst_behavior.rs:81:55:
308.93 s
> called `Result::unwrap()` on an `Err` value: typst failed while compiling template /build/.tmpWkJXOH/.clinnet/templates/linnest-public-behavior.svg
308.93 s
>
308.93 s
> Command executed:
308.93 s
> "typst" "c" "/build/.tmpWkJXOH/.clinnet/templates/linnest-public-behavior.typ" "/build/.tmpWkJXOH/.clinnet/templates/linnest-public-behavior.svg" "--root" "/build/.tmpWkJXOH/.clinnet/templates"
308.93 s
>
308.93 s
> Typst stdout:
308.93 s
>
308.93 s
>
308.93 s
> Typst stderr:
308.93 s
>
308.93 s
>
308.93 s
> Location:
308.93 s
> crates/clinnet/src/lib.rs:741:13
308.93 s
> stack backtrace:
308.93 s
> 0: __rustc::rust_begin_unwind
308.93 s
> 1: core::panicking::panic_fmt
308.93 s
> 2: core::result::unwrap_failed
308.93 s
> 3: public_typst_behavior::render
308.93 s
> 4: <std::sync::once::Once>::call_once_force::<<std::sync::once_lock::OnceLock<alloc::string::String>>::initialize<<std::sync::once_lock::OnceLock<alloc::string::String>>::get_or_init<public_typst_behavior::linnest_public_svg::{closure#0}>::{closure#0}, !>::{closure#0}>::{closure#0}
308.93 s
> 5: <std::sys::sync::once::futex::Once>::call
308.93 s
> 6: <std::sync::once_lock::OnceLock<alloc::string::String>>::initialize::<<std::sync::once_lock::OnceLock<alloc::string::String>>::get_or_init<public_typst_behavior::linnest_public_svg::{closure#0}>::{closure#0}, !>
308.93 s
> 7: <public_typst_behavior::public_linnest_labels_follow_their_carriers::{closure#0} as core::ops::function::FnOnce<()>>::call_once
308.93 s
> note: Some details are omitted, run with `RUST_BACKTRACE=full` for a verbose backtrace.
308.93 s
>
308.93 s
> FAIL [ 228.180s] (34/38) clinnet::public_typst_behavior public_linnest_momentum_layers_place_shafts_and_labels
308.93 s
> stdout ---
308.93 s
>
308.93 s
> running 1 test
308.93 s
> test public_linnest_momentum_layers_place_shafts_and_labels has been running for over 60 seconds
308.93 s
> test public_linnest_momentum_layers_place_shafts_and_labels ... FAILED
308.93 s
>
308.93 s
> failures:
308.93 s
>
308.93 s
> failures:
308.93 s
> public_linnest_momentum_layers_place_shafts_and_labels
308.93 s
>
308.93 s
> test result: FAILED. 0 passed; 1 failed; 0 ignored; 0 measured; 17 filtered out; finished in 228.14s
308.93 s
>
308.93 s
> stderr ---
308.93 s
>
308.93 s
> thread 'public_linnest_momentum_layers_place_shafts_and_labels' (305) panicked at crates/clinnet/tests/public_typst_behavior.rs:81:55:
308.93 s
> called `Result::unwrap()` on an `Err` value: typst failed while compiling template /build/.tmpmVuaZw/.clinnet/templates/linnest-public-behavior.svg
308.93 s
>
308.93 s
> Command executed:
308.93 s
> "typst" "c" "/build/.tmpmVuaZw/.clinnet/templates/linnest-public-behavior.typ" "/build/.tmpmVuaZw/.clinnet/templates/linnest-public-behavior.svg" "--root" "/build/.tmpmVuaZw/.clinnet/templates"
308.93 s
>
308.93 s
> Typst stdout:
308.93 s
>
308.93 s
>
308.93 s
> Typst stderr:
308.93 s
>
308.93 s
>
308.93 s
> Location:
308.93 s
> crates/clinnet/src/lib.rs:741:13
308.93 s
> stack backtrace:
308.93 s
> 0: __rustc::rust_begin_unwind
308.93 s
> 1: core::panicking::panic_fmt
308.93 s
> 2: core::result::unwrap_failed
308.93 s
> 3: public_typst_behavior::render
308.93 s
> 4: <std::sync::once::Once>::call_once_force::<<std::sync::once_lock::OnceLock<alloc::string::String>>::initialize<<std::sync::once_lock::OnceLock<alloc::string::String>>::get_or_init<public_typst_behavior::linnest_public_svg::{closure#0}>::{closure#0}, !>::{closure#0}>::{closure#0}
308.93 s
> 5: <std::sys::sync::once::futex::Once>::call
308.93 s
> 6: <std::sync::once_lock::OnceLock<alloc::string::String>>::initialize::<<std::sync::once_lock::OnceLock<alloc::string::String>>::get_or_init<public_typst_behavior::linnest_public_svg::{closure#0}>::{closure#0}, !>
308.93 s
> 7: <public_typst_behavior::public_linnest_momentum_layers_place_shafts_and_labels::{closure#0} as core::ops::function::FnOnce<()>>::call_once
308.93 s
> note: Some details are omitted, run with `RUST_BACKTRACE=full` for a verbose backtrace.
308.93 s
>
308.93 s
> ------------
308.93 s
> Summary [ 233.834s] 38 tests run: 35 passed (4 slow ), 3 failed , 0 skipped
308.93 s
> FAIL [ 141.742s] (32/38) clinnet::public_typst_behavior public_linnest_arrow_shafts_and_crossing_gaps
308.93 s
> stdout ---
308.93 s
>
308.93 s
> running 1 test
308.93 s
> test public_linnest_arrow_shafts_and_crossing_gaps has been running for over 60 seconds
308.93 s
> test public_linnest_arrow_shafts_and_crossing_gaps ... FAILED
308.93 s
>
308.93 s
> failures:
308.93 s
>
308.93 s
> failures:
308.93 s
> public_linnest_arrow_shafts_and_crossing_gaps
308.93 s
>
308.93 s
> test result: FAILED. 0 passed; 1 failed; 0 ignored; 0 measured; 17 filtered out; finished in 141.69s
308.93 s
>
308.93 s
> stderr ---
308.93 s
>
308.93 s
> thread 'public_linnest_arrow_shafts_and_crossing_gaps' (286) panicked at crates/clinnet/tests/public_typst_behavior.rs:81:55:
308.93 s
> called `Result::unwrap()` on an `Err` value: typst failed while compiling template /build/.tmpwqjOxv/.clinnet/templates/linnest-public-behavior.svg
308.93 s
>
308.93 s
> Command executed:
308.93 s
> "typst" "c" "/build/.tmpwqjOxv/.clinnet/templates/linnest-public-behavior.typ" "/build/.tmpwqjOxv/.clinnet/templates/linnest-public-behavior.svg" "--root" "/build/.tmpwqjOxv/.clinnet/templates"
308.93 s
>
308.93 s
> Typst stdout:
308.93 s
>
308.93 s
>
308.93 s
> Typst stderr:
308.93 s
>
308.93 s
>
308.93 s
> Location:
308.93 s
> crates/clinnet/src/lib.rs:741:13
308.93 s
> stack backtrace:
308.93 s
> 0: __rustc::rust_begin_unwind
308.93 s
> 1: core::panicking::panic_fmt
308.93 s
> 2: core::result::unwrap_failed
308.93 s
> 3: public_typst_behavior::render
308.93 s
> 4: <std::sync::once::Once>::call_once_force::<<std::sync::once_lock::OnceLock<alloc::string::String>>::initialize<<std::sync::once_lock::OnceLock<alloc::string::String>>::get_or_init<public_typst_behavior::linnest_public_svg::{closure#0}>::{closure#0}, !>::{closure#0}>::{closure#0}
308.93 s
> 5: <std::sys::sync::once::futex::Once>::call
308.93 s
> 6: <std::sync::once_lock::OnceLock<alloc::string::String>>::initialize::<<std::sync::once_lock::OnceLock<alloc::string::String>>::get_or_init<public_typst_behavior::linnest_public_svg::{closure#0}>::{closure#0}, !>
308.93 s
> 7: <public_typst_behavior::public_linnest_arrow_shafts_and_crossing_gaps::{closure#0} as core::ops::function::FnOnce<()>>::call_once
308.93 s
> note: Some details are omitted, run with `RUST_BACKTRACE=full` for a verbose backtrace.
308.93 s
>
308.93 s
> FAIL [ 152.422s] (33/38) clinnet::public_typst_behavior public_linnest_labels_follow_their_carriers
308.93 s
> stdout ---
308.93 s
>
308.93 s
> running 1 test
308.93 s
> test public_linnest_labels_follow_their_carriers has been running for over 60 seconds
308.93 s
> test public_linnest_labels_follow_their_carriers ... FAILED
308.93 s
>
308.93 s
> failures:
308.93 s
>
308.93 s
> failures:
308.93 s
> public_linnest_labels_follow_their_carriers
308.93 s
>
308.93 s
> test result: FAILED. 0 passed; 1 failed; 0 ignored; 0 measured; 17 filtered out; finished in 152.39s
308.93 s
>
308.93 s
> stderr ---
308.93 s
>
308.93 s
> thread 'public_linnest_labels_follow_their_carriers' (281) panicked at crates/clinnet/tests/public_typst_behavior.rs:81:55:
308.93 s
> called `Result::unwrap()` on an `Err` value: typst failed while compiling template /build/.tmpWkJXOH/.clinnet/templates/linnest-public-behavior.svg
308.93 s
>
308.93 s
> Command executed:
308.93 s
> "typst" "c" "/build/.tmpWkJXOH/.clinnet/templates/linnest-public-behavior.typ" "/build/.tmpWkJXOH/.clinnet/templates/linnest-public-behavior.svg" "--root" "/build/.tmpWkJXOH/.clinnet/templates"
308.93 s
>
308.93 s
> Typst stdout:
308.93 s
>
308.93 s
>
308.93 s
> Typst stderr:
308.93 s
>
308.93 s
>
308.93 s
> Location:
308.93 s
> crates/clinnet/src/lib.rs:741:13
308.93 s
> stack backtrace:
308.93 s
> 0: __rustc::rust_begin_unwind
308.93 s
> 1: core::panicking::panic_fmt
308.93 s
> 2: core::result::unwrap_failed
308.93 s
> 3: public_typst_behavior::render
308.93 s
> 4: <std::sync::once::Once>::call_once_force::<<std::sync::once_lock::OnceLock<alloc::string::String>>::initialize<<std::sync::once_lock::OnceLock<alloc::string::String>>::get_or_init<public_typst_behavior::linnest_public_svg::{closure#0}>::{closure#0}, !>::{closure#0}>::{closure#0}
308.93 s
> 5: <std::sys::sync::once::futex::Once>::call
308.93 s
> 6: <std::sync::once_lock::OnceLock<alloc::string::String>>::initialize::<<std::sync::once_lock::OnceLock<alloc::string::String>>::get_or_init<public_typst_behavior::linnest_public_svg::{closure#0}>::{closure#0}, !>
308.93 s
> 7: <public_typst_behavior::public_linnest_labels_follow_their_carriers::{closure#0} as core::ops::function::FnOnce<()>>::call_once
308.93 s
> note: Some details are omitted, run with `RUST_BACKTRACE=full` for a verbose backtrace.
308.93 s
>
308.93 s
> FAIL [ 228.180s] (34/38) clinnet::public_typst_behavior public_linnest_momentum_layers_place_shafts_and_labels
308.93 s
> stdout ---
308.93 s
>
308.93 s
> running 1 test
308.93 s
> test public_linnest_momentum_layers_place_shafts_and_labels has been running for over 60 seconds
308.93 s
> test public_linnest_momentum_layers_place_shafts_and_labels ... FAILED
308.93 s
>
308.93 s
> failures:
308.93 s
>
308.93 s
> failures:
308.93 s
> public_linnest_momentum_layers_place_shafts_and_labels
308.93 s
>
308.93 s
> test result: FAILED. 0 passed; 1 failed; 0 ignored; 0 measured; 17 filtered out; finished in 228.14s
308.93 s
>
308.93 s
> stderr ---
308.93 s
>
308.93 s
> thread 'public_linnest_momentum_layers_place_shafts_and_labels' (305) panicked at crates/clinnet/tests/public_typst_behavior.rs:81:55:
308.93 s
> called `Result::unwrap()` on an `Err` value: typst failed while compiling template /build/.tmpmVuaZw/.clinnet/templates/linnest-public-behavior.svg
308.93 s
>
308.93 s
> Command executed:
308.93 s
> "typst" "c" "/build/.tmpmVuaZw/.clinnet/templates/linnest-public-behavior.typ" "/build/.tmpmVuaZw/.clinnet/templates/linnest-public-behavior.svg" "--root" "/build/.tmpmVuaZw/.clinnet/templates"
308.93 s
>
308.93 s
> Typst stdout:
308.93 s
>
308.93 s
>
308.93 s
> Typst stderr:
308.93 s
>
308.93 s
>
308.93 s
> Location:
308.93 s
> crates/clinnet/src/lib.rs:741:13
308.93 s
> stack backtrace:
308.93 s
> 0: __rustc::rust_begin_unwind
308.93 s
> 1: core::panicking::panic_fmt
308.93 s
> 2: core::result::unwrap_failed
308.93 s
> 3: public_typst_behavior::render
308.93 s
> 4: <std::sync::once::Once>::call_once_force::<<std::sync::once_lock::OnceLock<alloc::string::String>>::initialize<<std::sync::once_lock::OnceLock<alloc::string::String>>::get_or_init<public_typst_behavior::linnest_public_svg::{closure#0}>::{closure#0}, !>::{closure#0}>::{closure#0}
308.93 s
> 5: <std::sys::sync::once::futex::Once>::call
308.93 s
> 6: <std::sync::once_lock::OnceLock<alloc::string::String>>::initialize::<<std::sync::once_lock::OnceLock<alloc::string::String>>::get_or_init<public_typst_behavior::linnest_public_svg::{closure#0}>::{closure#0}, !>
308.93 s
> 7: <public_typst_behavior::public_linnest_momentum_layers_place_shafts_and_labels::{closure#0} as core::ops::function::FnOnce<()>>::call_once
308.93 s
> note: Some details are omitted, run with `RUST_BACKTRACE=full` for a verbose backtrace.
308.93 s
>
308.93 s
> error : test run failed
308.93 s
>
308.93 s
> ========== nextest test summary ==========
308.93 s
> report: target/nextest/ci_gammaloop/junit.xml
308.93 s
> tests: 38, failures: 3, errors: 0
308.93 s
>
308.93 s
> 1. clinnet::public_typst_behavior::public_linnest_arrow_shafts_and_crossing_gaps
308.93 s
> failure: test failure with exit code 101
308.93 s
> thread 'public_linnest_arrow_shafts_and_crossing_gaps' (286) panicked at crates/clinnet/tests/public_typst_behavior.rs:81:55:
308.93 s
> called `Result::unwrap()` on an `Err` value: typst failed while compiling template /build/.tmpwqjOxv/.clinnet/templates/linnest-public-behavior.svg
308.93 s
>
308.93 s
> Command executed:
308.93 s
> "typst" "c" "/build/.tmpwqjOxv/.clinnet/templates/linnest-public-behavior.typ" "/build/.tmpwqjOxv/.clinnet/templates/linnest-public-behavior.svg" "--root" "/build/.tmpwqjOxv/.clinnet/templates"
308.93 s
>
308.93 s
> Typst stdout:
308.93 s
>
308.93 s
>
308.93 s
> Typst stderr:
308.93 s
>
308.93 s
>
308.93 s
> Location:
308.93 s
> crates/clinnet/src/lib.rs:741:13
308.93 s
> stack backtrace:
308.93 s
> 0: __rustc::rust_begin_unwind
308.93 s
> 1: core::panicking::panic_fmt
308.93 s
> 2: core::result::unwrap_failed
308.93 s
> 3: public_typst_behavior::render
308.93 s
> 4: <std::sync::once::Once>::call_once_force::<<std::sync::once_lock::OnceLock<alloc::string::String>>::initialize<<std::sync::once_lock::OnceLock<alloc::string::String>>::get_or_init<public_typst_behavior::linnest_public_svg::{closure#0}>::{closure#0}, !>::{closure#0}>::{closure#0}
308.93 s
> 5: <std::sys::sync::once::futex::Once>::call
308.93 s
> 6: <std::sync::once_lock::OnceLock<alloc::string::String>>::initialize::<<std::sync::once_lock::OnceLock<alloc::string::String>>::get_or_init<public_typst_behavior::linnest_public_svg::{closure#0}>::{closure#0}, !>
308.93 s
> 7: <public_typst_behavior::public_linnest_arrow_shafts_and_crossing_gaps::{closure#0} as core::ops::function::FnOnce<()>>::call_once
308.93 s
> note: Some details are omitted, run with `RUST_BACKTRACE=full` for a verbose backtrace.
308.93 s
> system-out
308.93 s
> running 1 test
308.93 s
> test public_linnest_arrow_shafts_and_crossing_gaps has been running for over 60 seconds
308.93 s
> test public_linnest_arrow_shafts_and_crossing_gaps ... FAILED
308.93 s
>
308.93 s
> failures:
308.93 s
>
308.93 s
> failures:
308.93 s
> public_linnest_arrow_shafts_and_crossing_gaps
308.93 s
>
308.93 s
> test result: FAILED. 0 passed; 1 failed; 0 ignored; 0 measured; 17 filtered out; finished in 141.69s
308.93 s
> system-err
308.93 s
> thread 'public_linnest_arrow_shafts_and_crossing_gaps' (286) panicked at crates/clinnet/tests/public_typst_behavior.rs:81:55:
308.93 s
> called `Result::unwrap()` on an `Err` value: typst failed while compiling template /build/.tmpwqjOxv/.clinnet/templates/linnest-public-behavior.svg
308.93 s
>
308.93 s
> Command executed:
308.93 s
> "typst" "c" "/build/.tmpwqjOxv/.clinnet/templates/linnest-public-behavior.typ" "/build/.tmpwqjOxv/.clinnet/templates/linnest-public-behavior.svg" "--root" "/build/.tmpwqjOxv/.clinnet/templates"
308.93 s
>
308.93 s
> Typst stdout:
308.93 s
>
308.93 s
>
308.93 s
> Typst stderr:
308.93 s
>
308.93 s
>
308.93 s
> Location:
308.93 s
> crates/clinnet/src/lib.rs:741:13
308.93 s
> stack backtrace:
308.93 s
> 0: __rustc::rust_begin_unwind
308.93 s
> 1: core::panicking::panic_fmt
308.93 s
> 2: core::result::unwrap_failed
308.93 s
> 3: public_typst_behavior::render
308.93 s
> 4: <std::sync::once::Once>::call_once_force::<<std::sync::once_lock::OnceLock<alloc::string::String>>::initialize<<std::sync::once_lock::OnceLock<alloc::string::String>>::get_or_init<public_typst_behavior::linnest_public_svg::{closure#0}>::{closure#0}, !>::{closure#0}>::{closure#0}
308.93 s
> 5: <std::sys::sync::once::futex::Once>::call
308.93 s
> 6: <std::sync::once_lock::OnceLock<alloc::string::String>>::initialize::<<std::sync::once_lock::OnceLock<alloc::string::String>>::get_or_init<public_typst_behavior::linnest_public_svg::{closure#0}>::{closure#0}, !>
308.93 s
> 7: <public_typst_behavior::public_linnest_arrow_shafts_and_crossing_gaps::{closure#0} as core::ops::function::FnOnce<()>>::call_once
308.93 s
> note: Some details are omitted, run with `RUST_BACKTRACE=full` for a verbose backtrace.
308.93 s
>
308.93 s
> 2. clinnet::public_typst_behavior::public_linnest_labels_follow_their_carriers
308.93 s
> failure: test failure with exit code 101
308.93 s
> thread 'public_linnest_labels_follow_their_carriers' (281) panicked at crates/clinnet/tests/public_typst_behavior.rs:81:55:
308.93 s
> called `Result::unwrap()` on an `Err` value: typst failed while compiling template /build/.tmpWkJXOH/.clinnet/templates/linnest-public-behavior.svg
308.93 s
>
308.93 s
> Command executed:
308.93 s
> "typst" "c" "/build/.tmpWkJXOH/.clinnet/templates/linnest-public-behavior.typ" "/build/.tmpWkJXOH/.clinnet/templates/linnest-public-behavior.svg" "--root" "/build/.tmpWkJXOH/.clinnet/templates"
308.93 s
>
308.93 s
> Typst stdout:
308.93 s
>
308.93 s
>
308.93 s
> Typst stderr:
308.93 s
>
308.93 s
>
308.93 s
> Location:
308.93 s
> crates/clinnet/src/lib.rs:741:13
308.93 s
> stack backtrace:
308.93 s
> 0: __rustc::rust_begin_unwind
308.93 s
> 1: core::panicking::panic_fmt
308.93 s
> 2: core::result::unwrap_failed
308.93 s
> 3: public_typst_behavior::render
308.93 s
> 4: <std::sync::once::Once>::call_once_force::<<std::sync::once_lock::OnceLock<alloc::string::String>>::initialize<<std::sync::once_lock::OnceLock<alloc::string::String>>::get_or_init<public_typst_behavior::linnest_public_svg::{closure#0}>::{closure#0}, !>::{closure#0}>::{closure#0}
308.93 s
> 5: <std::sys::sync::once::futex::Once>::call
308.93 s
> 6: <std::sync::once_lock::OnceLock<alloc::string::String>>::initialize::<<std::sync::once_lock::OnceLock<alloc::string::String>>::get_or_init<public_typst_behavior::linnest_public_svg::{closure#0}>::{closure#0}, !>
308.93 s
> 7: <public_typst_behavior::public_linnest_labels_follow_their_carriers::{closure#0} as core::ops::function::FnOnce<()>>::call_once
308.93 s
> note: Some details are omitted, run with `RUST_BACKTRACE=full` for a verbose backtrace.
308.93 s
> system-out
308.93 s
> running 1 test
308.93 s
> test public_linnest_labels_follow_their_carriers has been running for over 60 seconds
308.93 s
> test public_linnest_labels_follow_their_carriers ... FAILED
308.93 s
>
308.93 s
> failures:
308.93 s
>
308.93 s
> failures:
308.93 s
> public_linnest_labels_follow_their_carriers
308.93 s
>
308.93 s
> test result: FAILED. 0 passed; 1 failed; 0 ignored; 0 measured; 17 filtered out; finished in 152.39s
308.93 s
> system-err
308.93 s
> thread 'public_linnest_labels_follow_their_carriers' (281) panicked at crates/clinnet/tests/public_typst_behavior.rs:81:55:
308.93 s
> called `Result::unwrap()` on an `Err` value: typst failed while compiling template /build/.tmpWkJXOH/.clinnet/templates/linnest-public-behavior.svg
308.93 s
>
308.93 s
> Command executed:
308.93 s
> "typst" "c" "/build/.tmpWkJXOH/.clinnet/templates/linnest-public-behavior.typ" "/build/.tmpWkJXOH/.clinnet/templates/linnest-public-behavior.svg" "--root" "/build/.tmpWkJXOH/.clinnet/templates"
308.93 s
>
308.93 s
> Typst stdout:
308.93 s
>
308.93 s
>
308.93 s
> Typst stderr:
308.93 s
>
308.93 s
>
308.93 s
> Location:
308.93 s
> crates/clinnet/src/lib.rs:741:13
308.93 s
> stack backtrace:
308.93 s
> 0: __rustc::rust_begin_unwind
308.93 s
> 1: core::panicking::panic_fmt
308.93 s
> 2: core::result::unwrap_failed
308.93 s
> 3: public_typst_behavior::render
308.93 s
> 4: <std::sync::once::Once>::call_once_force::<<std::sync::once_lock::OnceLock<alloc::string::String>>::initialize<<std::sync::once_lock::OnceLock<alloc::string::String>>::get_or_init<public_typst_behavior::linnest_public_svg::{closure#0}>::{closure#0}, !>::{closure#0}>::{closure#0}
308.93 s
> 5: <std::sys::sync::once::futex::Once>::call
308.93 s
> 6: <std::sync::once_lock::OnceLock<alloc::string::String>>::initialize::<<std::sync::once_lock::OnceLock<alloc::string::String>>::get_or_init<public_typst_behavior::linnest_public_svg::{closure#0}>::{closure#0}, !>
308.93 s
> 7: <public_typst_behavior::public_linnest_labels_follow_their_carriers::{closure#0} as core::ops::function::FnOnce<()>>::call_once
308.93 s
> note: Some details are omitted, run with `RUST_BACKTRACE=full` for a verbose backtrace.
308.93 s
>
308.93 s
> 3. clinnet::public_typst_behavior::public_linnest_momentum_layers_place_shafts_and_labels
308.93 s
> failure: test failure with exit code 101
308.93 s
> thread 'public_linnest_momentum_layers_place_shafts_and_labels' (305) panicked at crates/clinnet/tests/public_typst_behavior.rs:81:55:
308.93 s
> called `Result::unwrap()` on an `Err` value: typst failed while compiling template /build/.tmpmVuaZw/.clinnet/templates/linnest-public-behavior.svg
308.93 s
>
308.93 s
> Command executed:
308.93 s
> "typst" "c" "/build/.tmpmVuaZw/.clinnet/templates/linnest-public-behavior.typ" "/build/.tmpmVuaZw/.clinnet/templates/linnest-public-behavior.svg" "--root" "/build/.tmpmVuaZw/.clinnet/templates"
308.93 s
>
308.93 s
> Typst stdout:
308.93 s
>
308.93 s
>
308.93 s
> Typst stderr:
308.93 s
>
308.93 s
>
308.93 s
> Location:
308.93 s
> crates/clinnet/src/lib.rs:741:13
308.93 s
> stack backtrace:
308.93 s
> 0: __rustc::rust_begin_unwind
308.93 s
> 1: core::panicking::panic_fmt
308.93 s
> 2: core::result::unwrap_failed
308.93 s
> 3: public_typst_behavior::render
308.93 s
> 4: <std::sync::once::Once>::call_once_force::<<std::sync::once_lock::OnceLock<alloc::string::String>>::initialize<<std::sync::once_lock::OnceLock<alloc::string::String>>::get_or_init<public_typst_behavior::linnest_public_svg::{closure#0}>::{closure#0}, !>::{closure#0}>::{closure#0}
308.93 s
> 5: <std::sys::sync::once::futex::Once>::call
308.93 s
> 6: <std::sync::once_lock::OnceLock<alloc::string::String>>::initialize::<<std::sync::once_lock::OnceLock<alloc::string::String>>::get_or_init<public_typst_behavior::linnest_public_svg::{closure#0}>::{closure#0}, !>
308.93 s
> 7: <public_typst_behavior::public_linnest_momentum_layers_place_shafts_and_labels::{closure#0} as core::ops::function::FnOnce<()>>::call_once
308.93 s
> note: Some details are omitted, run with `RUST_BACKTRACE=full` for a verbose backtrace.
308.93 s
> system-out
308.93 s
> running 1 test
308.93 s
> test public_linnest_momentum_layers_place_shafts_and_labels has been running for over 60 seconds
308.93 s
> test public_linnest_momentum_layers_place_shafts_and_labels ... FAILED
308.93 s
>
308.93 s
> failures:
308.93 s
>
308.93 s
> failures:
308.93 s
> public_linnest_momentum_layers_place_shafts_and_labels
308.93 s
>
308.93 s
> test result: FAILED. 0 passed; 1 failed; 0 ignored; 0 measured; 17 filtered out; finished in 228.14s
308.93 s
> system-err
308.93 s
> thread 'public_linnest_momentum_layers_place_shafts_and_labels' (305) panicked at crates/clinnet/tests/public_typst_behavior.rs:81:55:
308.93 s
> called `Result::unwrap()` on an `Err` value: typst failed while compiling template /build/.tmpmVuaZw/.clinnet/templates/linnest-public-behavior.svg
308.93 s
>
308.93 s
> Command executed:
308.93 s
> "typst" "c" "/build/.tmpmVuaZw/.clinnet/templates/linnest-public-behavior.typ" "/build/.tmpmVuaZw/.clinnet/templates/linnest-public-behavior.svg" "--root" "/build/.tmpmVuaZw/.clinnet/templates"
308.93 s
>
308.93 s
> Typst stdout:
308.93 s
>
308.93 s
>
308.93 s
> Typst stderr:
308.93 s
>
308.93 s
>
308.93 s
> Location:
308.93 s
> crates/clinnet/src/lib.rs:741:13
308.93 s
> stack backtrace:
308.93 s
> 0: __rustc::rust_begin_unwind
308.93 s
> 1: core::panicking::panic_fmt
308.93 s
> 2: core::result::unwrap_failed
308.93 s
> 3: public_typst_behavior::render
308.93 s
> 4: <std::sync::once::Once>::call_once_force::<<std::sync::once_lock::OnceLock<alloc::string::String>>::initialize<<std::sync::once_lock::OnceLock<alloc::string::String>>::get_or_init<public_typst_behavior::linnest_public_svg::{closure#0}>::{closure#0}, !>::{closure#0}>::{closure#0}
308.93 s
> 5: <std::sys::sync::once::futex::Once>::call
308.93 s
> 6: <std::sync::once_lock::OnceLock<alloc::string::String>>::initialize::<<std::sync::once_lock::OnceLock<alloc::string::String>>::get_or_init<public_typst_behavior::linnest_public_svg::{closure#0}>::{closure#0}, !>
308.93 s
> 7: <public_typst_behavior::public_linnest_momentum_layers_place_shafts_and_labels::{closure#0} as core::ops::function::FnOnce<()>>::call_once
308.93 s
> note: Some details are omitted, run with `RUST_BACKTRACE=full` for a verbose backtrace.
308.93 s
> =========================================
308.93 s
For full logs, run:
308.93 s
nix log /nix/store/4pqspwvh8pi9s2vg9g6mfsggpl9ynwzx-gammaloop-nextest-clinnet.drv
309.25 s
Run failed.