build packages.x86_64-linux.crate-test-binaries-gammaloop-api

Reproduce this run
Original Run
  1. 0.68 s $ /nix/store/9ypz3flqsrl5xl495mm8h645gadjsxi1-coreutils-9.11/bin/timeout --kill-after=15s 7200s /nix/store/23zk8sgzamrbmj1fday15szf7f2279s8-nix-2.34.7/bin/nix --extra-experimental-features nix-command --extra-experimental-features flakes --log-format internal-json build --no-link --print-out-paths git+https://github.com/alphal00p/gammaloop?ref=ir_safe_threshold_ct_rework&rev=0f3c75c08b143ceb3ca042d89635da65d3e874c6&shallow=1#packages.x86_64-linux.crate-test-binaries-gammaloop-api --print-build-logs
  2. 2.72 s
  3. 3.36 s Downloading cached gammaloop-ci-test-binary-dependencies-9f61ebb64a841b09-Cargo.toml from https://cache.nix-ci.com
  4. 3.36 s Downloaded cached gammaloop-ci-test-binary-dependencies-9f61ebb64a841b09-Cargo.toml (1216 B) in 3ms
  5. 3.40 s Building /nix/store/gjanqzix5qm8a625pvig0l49v8j57c83-gammaloop-ci-test-binary-dependencies-9f61ebb64a841b09-gammaloop-api-dev-dependency.toml.drv
  6. 3.47 s Building /nix/store/l8ckhxdkkp0clvvjik6ffd2l3ndrbfzy-gammaloop-ci-test-dependencies-9f61ebb64a841b09-Cargo.toml.drv
  7. 3.50 s Downloading cached gammaloop-crate-test-dependencies-31e37aec92971227-inputs from https://cache.nix-ci.com
  8. 3.53 s Downloading cached gammaloop-ci-test-binary-dependencies-be74a11b6e47d216-Cargo.toml from https://cache.nix-ci.com
  9. 3.54 s Downloaded cached gammaloop-ci-test-binary-dependencies-be74a11b6e47d216-Cargo.toml (1272 B) in 8ms
  10. 3.55 s Building /nix/store/591rpggq8cd8qybdcdnws142c6yphaq5-gammaloop-ci-test-dependencies-be74a11b6e47d216-Cargo.toml.drv
  11. 3.58 s Downloading cached gammaloop-crate-test-dependencies-326651bd60141f1c-inputs from https://cache.nix-ci.com
  12. 3.59 s Downloading cached gammaloop-ci-test-binary-dependencies-01b6df4f694091ad-Cargo.toml from https://cache.nix-ci.com
  13. 3.62 s Downloaded cached gammaloop-ci-test-binary-dependencies-01b6df4f694091ad-Cargo.toml (472 B) in 23ms
  14. 3.63 s Building /nix/store/dlis7pd279dmlp5myparww3k0rq17zqn-gammaloop-ci-test-dependencies-01b6df4f694091ad-Cargo.toml.drv
  15. 3.76 s Building /nix/store/khndxd25mjw3syl5wqdwm2r6kxma64fd-gammaloop-crate-test-dependencies-01b6df4f694091ad-inputs.drv
  16. 3.76 s Progress: 0 of 18 built (5 building), 1 of 7 downloaded from cache (4 downloading)
  17. 3.76 s Progress: 0 of 18 built (5 building), 2 of 7 downloaded from cache (3 downloading)
  18. 3.76 s Progress: 0 of 18 built (5 building), 3 of 7 downloaded from cache (2 downloading)
  19. 3.78 s [gammaloop-ci-test-binary-dependencies-9f61ebb64a841b09-gammaloop-api-dev-dependency.toml:post-build] Uploading to the NixCI cache: /nix/store/vhcmgrk7260kgi2pc23q8zk41zb3y02a-gammaloop-ci-test-binary-dependencies-9f61ebb64a841b09-gammaloop-api-dev-dependency.toml
  20. 3.83 s [gammaloop-ci-test-binary-dependencies-9f61ebb64a841b09-gammaloop-api-dev-dependency.toml:post-build] warning: 'warn-short-path-literals' is deprecated, use 'lint-short-path-literals = ignore' instead
  21. 3.87 s [gammaloop-ci-test-binary-dependencies-9f61ebb64a841b09-gammaloop-api-dev-dependency.toml:post-build] copying 0 paths...
  22. 3.93 s [gammaloop-ci-test-binary-dependencies-9f61ebb64a841b09-gammaloop-api-dev-dependency.toml:post-build] warning: 'warn-short-path-literals' is deprecated, use 'lint-short-path-literals = ignore' instead
  23. 4.00 s [gammaloop-ci-test-binary-dependencies-9f61ebb64a841b09-gammaloop-api-dev-dependency.toml:post-build] copying 0 paths...
  24. 4.01 s Uploaded gammaloop-ci-test-binary-dependencies-9f61ebb64a841b09-gammaloop-api-dev-dependency.toml in 249ms
  25. 4.01 s Progress: 1 of 19 built (4 building), 3 of 7 downloaded from cache (2 downloading)
  26. 4.01 s Built gammaloop-ci-test-binary-dependencies-9f61ebb64a841b09-gammaloop-api-dev-dependency.toml in 611ms
  27. 4.04 s [gammaloop-ci-test-dependencies-01b6df4f694091ad-Cargo.toml:post-build] Uploading to the NixCI cache: /nix/store/hja43bk0b3697iwanm67x93zm7si30di-gammaloop-ci-test-dependencies-01b6df4f694091ad-Cargo.toml
  28. 4.09 s [gammaloop-ci-test-dependencies-01b6df4f694091ad-Cargo.toml:post-build] warning: 'warn-short-path-literals' is deprecated, use 'lint-short-path-literals = ignore' instead
  29. 4.13 s [gammaloop-ci-test-dependencies-01b6df4f694091ad-Cargo.toml:post-build] copying 0 paths...
  30. 4.19 s [gammaloop-ci-test-dependencies-01b6df4f694091ad-Cargo.toml:post-build] warning: 'warn-short-path-literals' is deprecated, use 'lint-short-path-literals = ignore' instead
  31. 4.25 s [gammaloop-ci-test-dependencies-01b6df4f694091ad-Cargo.toml:post-build] copying 0 paths...
  32. 4.26 s Uploaded gammaloop-ci-test-dependencies-01b6df4f694091ad-Cargo.toml in 246ms
  33. 4.26 s Progress: 2 of 20 built (3 building), 3 of 7 downloaded from cache (2 downloading)
  34. 4.26 s Built gammaloop-ci-test-dependencies-01b6df4f694091ad-Cargo.toml in 633ms
  35. 4.29 s [gammaloop-ci-test-dependencies-9f61ebb64a841b09-Cargo.toml:post-build] Uploading to the NixCI cache: /nix/store/58ls9qrc3xb5rcknjp5nz29sgmpczvdn-gammaloop-ci-test-dependencies-9f61ebb64a841b09-Cargo.toml
  36. 4.34 s [gammaloop-ci-test-dependencies-9f61ebb64a841b09-Cargo.toml:post-build] warning: 'warn-short-path-literals' is deprecated, use 'lint-short-path-literals = ignore' instead
  37. 4.38 s [gammaloop-ci-test-dependencies-9f61ebb64a841b09-Cargo.toml:post-build] copying 0 paths...
  38. 4.45 s [gammaloop-ci-test-dependencies-9f61ebb64a841b09-Cargo.toml:post-build] warning: 'warn-short-path-literals' is deprecated, use 'lint-short-path-literals = ignore' instead
  39. 4.51 s [gammaloop-ci-test-dependencies-9f61ebb64a841b09-Cargo.toml:post-build] copying 0 paths...
  40. 4.53 s Uploaded gammaloop-ci-test-dependencies-9f61ebb64a841b09-Cargo.toml in 259ms
  41. 4.53 s Progress: 3 of 21 built (2 building), 3 of 7 downloaded from cache (2 downloading)
  42. 4.53 s Built gammaloop-ci-test-dependencies-9f61ebb64a841b09-Cargo.toml in 1.0s
  43. 4.56 s [gammaloop-ci-test-dependencies-be74a11b6e47d216-Cargo.toml:post-build] Uploading to the NixCI cache: /nix/store/2zz13s0l4xk4x3w2np3wv8zwvmj4f9fn-gammaloop-ci-test-dependencies-be74a11b6e47d216-Cargo.toml
  44. 4.62 s [gammaloop-ci-test-dependencies-be74a11b6e47d216-Cargo.toml:post-build] warning: 'warn-short-path-literals' is deprecated, use 'lint-short-path-literals = ignore' instead
  45. 4.66 s [gammaloop-ci-test-dependencies-be74a11b6e47d216-Cargo.toml:post-build] copying 0 paths...
  46. 4.72 s [gammaloop-ci-test-dependencies-be74a11b6e47d216-Cargo.toml:post-build] warning: 'warn-short-path-literals' is deprecated, use 'lint-short-path-literals = ignore' instead
  47. 4.78 s [gammaloop-ci-test-dependencies-be74a11b6e47d216-Cargo.toml:post-build] copying 0 paths...
  48. 4.80 s Uploaded gammaloop-ci-test-dependencies-be74a11b6e47d216-Cargo.toml in 264ms
  49. 4.80 s Progress: 4 of 22 built (1 building), 3 of 7 downloaded from cache (2 downloading)
  50. 4.80 s Built gammaloop-ci-test-dependencies-be74a11b6e47d216-Cargo.toml in 1.2s
  51. 7.78 s [gammaloop-crate-test-dependencies-01b6df4f694091ad-inputs:post-build] Uploading to the NixCI cache: /nix/store/nl746b47wsv13dga4cc66ar5c6qcgm5a-gammaloop-crate-test-dependencies-01b6df4f694091ad-inputs
  52. 7.82 s [gammaloop-crate-test-dependencies-01b6df4f694091ad-inputs:post-build] warning: 'warn-short-path-literals' is deprecated, use 'lint-short-path-literals = ignore' instead
  53. 7.84 s [gammaloop-crate-test-dependencies-01b6df4f694091ad-inputs:post-build] copying 1 paths...
  54. 7.84 s [gammaloop-crate-test-dependencies-01b6df4f694091ad-inputs:post-build] copying path '/nix/store/nl746b47wsv13dga4cc66ar5c6qcgm5a-gammaloop-crate-test-dependencies-01b6df4f694091ad-inputs' to 'https://cache.nix-ci.com'...
  55. 20.84 s Downloaded cached gammaloop-crate-test-dependencies-31e37aec92971227-inputs (1.4 GiB) in 17.3s
  56. 21.24 s Downloaded cached gammaloop-crate-test-dependencies-326651bd60141f1c-inputs (1.5 GiB) in 17.6s
  57. 29.86 s [gammaloop-crate-test-dependencies-01b6df4f694091ad-inputs:post-build] warning: 'warn-short-path-literals' is deprecated, use 'lint-short-path-literals = ignore' instead
  58. 31.50 s [gammaloop-crate-test-dependencies-01b6df4f694091ad-inputs:post-build] copying 0 paths...
  59. 31.50 s Uploaded gammaloop-crate-test-dependencies-01b6df4f694091ad-inputs in 23.7s
  60. 31.50 s Progress: 5 of 16 built, 3 of 7 downloaded from cache (2 downloading)
  61. 31.50 s Built gammaloop-crate-test-dependencies-01b6df4f694091ad-inputs in 27.7s
  62. 31.50 s Building /nix/store/ws9vagiq35xc2wqs0jkv47dvz01b14px-gammaloop-crate-test-dependencies-01b6df4f694091ad-deps-0.1.0.drv
  63. 31.50 s Progress: 5 of 15 built (1 building), 4 of 7 downloaded from cache (1 downloading)
  64. 31.50 s Progress: 5 of 15 built (1 building), 5 of 7 downloaded from cache
  65. 31.50 s Downloading cached gammaloop-crate-test-dependencies-31e37aec92971227-deps from https://cache.nix-ci.com
  66. 31.50 s Downloading cached gammaloop-crate-test-dependencies-326651bd60141f1c-deps from https://cache.nix-ci.com
  67. 31.50 s Downloaded cached gammaloop-crate-test-dependencies-326651bd60141f1c-deps (183 KiB) in 1ms
  68. 31.50 s Progress: 5 of 15 built (1 building), 6 of 7 downloaded from cache (1 downloading)
  69. 31.51 s [gammaloop-crate-test-dependencies-01b6df4f694091ad-deps] Phase: unpackPhase
  70. 31.51 s [gammaloop-crate-test-dependencies-01b6df4f694091ad-deps] unpacking source archive /nix/store/3a1pc45na8qzhszmri71nb5ni0wpqkjd-source
  71. 31.51 s [gammaloop-crate-test-dependencies-01b6df4f694091ad-deps] source root is source
  72. 31.51 s Downloaded cached gammaloop-crate-test-dependencies-31e37aec92971227-deps (10.9 MiB) in 12ms
  73. 31.51 s Progress: 5 of 14 built (1 building), 7 of 7 downloaded from cache
  74. 31.51 s [gammaloop-crate-test-dependencies-01b6df4f694091ad-deps] Phase: patchPhase
  75. 31.51 s [gammaloop-crate-test-dependencies-01b6df4f694091ad-deps] Executing configureCargoCommonVars
  76. 31.51 s [gammaloop-crate-test-dependencies-01b6df4f694091ad-deps] copying cargo artifacts from /nix/store/nl746b47wsv13dga4cc66ar5c6qcgm5a-gammaloop-crate-test-dependencies-01b6df4f694091ad-inputs/target to target
  77. 31.51 s [gammaloop-crate-test-dependencies-01b6df4f694091ad-deps] will deep copy artifacts (instead of symlinking) as requested
  78. 31.56 s [gammaloop-crate-test-dependencies-01b6df4f694091ad-deps] Phase: updateAutotoolsGnuConfigScriptsPhase
  79. 31.59 s [gammaloop-crate-test-dependencies-01b6df4f694091ad-deps] Phase: configurePhase
  80. 31.59 s [gammaloop-crate-test-dependencies-01b6df4f694091ad-deps] will append /build/source/.cargo-home/config.toml with contents of /nix/store/yhvbfm4fzwpxbf22ypggjx69dpf2hlmh-vendor-cargo-deps/config.toml
  81. 31.59 s [gammaloop-crate-test-dependencies-01b6df4f694091ad-deps] default configurePhase, nothing to do
  82. 31.60 s [gammaloop-crate-test-dependencies-01b6df4f694091ad-deps] Phase: buildPhase
  83. 31.60 s [gammaloop-crate-test-dependencies-01b6df4f694091ad-deps] +++ command cargo --version
  84. 31.60 s [gammaloop-crate-test-dependencies-01b6df4f694091ad-deps] cargo 1.97.0 (c980f4866 2026-06-30)
  85. 31.60 s [gammaloop-crate-test-dependencies-01b6df4f694091ad-deps] +++ command cargo build --profile ci-optim --offline -p gammaloop-ci-test-dependencies-01b6df4f694091ad -p gammaloop-workspace-hack --features symbolica/tracing_max_level_info --lib
  86. 31.94 s [gammaloop-crate-test-dependencies-01b6df4f694091ad-deps] Compiling vakint v0.1.2 (/build/source/crates/vakint)
  87. 31.94 s [gammaloop-crate-test-dependencies-01b6df4f694091ad-deps] Compiling gammaloop-workspace-hack v0.1.0 (/build/source/crates/gammaloop-workspace-hack)
  88. 35.94 s [gammaloop-crate-test-dependencies-01b6df4f694091ad-deps] Compiling gammaloop-ci-test-dependencies-01b6df4f694091ad v0.1.0 (/build/source/crates/gammaloop-ci-test-dependencies-01b6df4f694091ad)
  89. 87.53 s [gammaloop-crate-test-dependencies-01b6df4f694091ad-deps] Finished `ci-optim` profile [optimized] target(s) in 55.92s
  90. 87.64 s [gammaloop-crate-test-dependencies-01b6df4f694091ad-deps] warning: the following packages contain code that will be rejected by a future version of Rust: proc-macro-error2 v2.0.1
  91. 87.64 s [gammaloop-crate-test-dependencies-01b6df4f694091ad-deps] note: to see what the problems were, use the option `--future-incompat-report`, or run `cargo report future-incompatibilities --id 1`
  92. 87.68 s [gammaloop-crate-test-dependencies-01b6df4f694091ad-deps] +++ command cargo build --profile ci-optim --offline -p gammaloop-ci-test-binary-dependencies-01b6df4f694091ad -p vakint --features symbolica/tracing_max_level_info --lib
  93. 87.85 s [gammaloop-crate-test-dependencies-01b6df4f694091ad-deps] Compiling test-log-core v0.2.20
  94. 87.85 s [gammaloop-crate-test-dependencies-01b6df4f694091ad-deps] Compiling env_filter v1.0.1
  95. 87.92 s [gammaloop-crate-test-dependencies-01b6df4f694091ad-deps] Compiling env_logger v0.11.10
  96. 88.67 s [gammaloop-crate-test-dependencies-01b6df4f694091ad-deps] Compiling test-log-macros v0.2.20
  97. 89.61 s [gammaloop-crate-test-dependencies-01b6df4f694091ad-deps] Compiling test-log v0.2.20
  98. 89.63 s [gammaloop-crate-test-dependencies-01b6df4f694091ad-deps] Compiling gammaloop-ci-test-binary-dependencies-01b6df4f694091ad v0.1.0 (/build/source/crates/gammaloop-ci-test-binary-dependencies-01b6df4f694091ad)
  99. 89.65 s [gammaloop-crate-test-dependencies-01b6df4f694091ad-deps] Finished `ci-optim` profile [optimized] target(s) in 1.96s
  100. 89.75 s [gammaloop-crate-test-dependencies-01b6df4f694091ad-deps] warning: the following packages contain code that will be rejected by a future version of Rust: proc-macro-error2 v2.0.1
  101. 89.75 s [gammaloop-crate-test-dependencies-01b6df4f694091ad-deps] note: to see what the problems were, use the option `--future-incompat-report`, or run `cargo report future-incompatibilities --id 1`
  102. 89.79 s [gammaloop-crate-test-dependencies-01b6df4f694091ad-deps] buildPhase completed in 58 seconds
  103. 89.79 s [gammaloop-crate-test-dependencies-01b6df4f694091ad-deps] Phase: installPhase
  104. 89.80 s [gammaloop-crate-test-dependencies-01b6df4f694091ad-deps] linking previous artifacts /nix/store/nl746b47wsv13dga4cc66ar5c6qcgm5a-gammaloop-crate-test-dependencies-01b6df4f694091ad-inputs to /nix/store/xi7mcsz760dicf0937nwlbq8i9y3hcvj-gammaloop-crate-test-dependencies-01b6df4f694091ad-deps-0.1.0/target.tar.zst
  105. 89.92 s [gammaloop-crate-test-dependencies-01b6df4f694091ad-deps] /*stdin*\ : 31.99% ( 68.9 MiB => 22.1 MiB, /nix/store/xi7mcsz760dicf0937nwlbq8i9y3hcvj-gammaloop-crate-test-dependencies-01b6df4f694091ad-deps-0.1.0/target.tar.zst)
  106. 89.94 s [gammaloop-crate-test-dependencies-01b6df4f694091ad-deps] Phase: fixupPhase
  107. 89.94 s [gammaloop-crate-test-dependencies-01b6df4f694091ad-deps] shrinking RPATHs of ELF executables and libraries in /nix/store/xi7mcsz760dicf0937nwlbq8i9y3hcvj-gammaloop-crate-test-dependencies-01b6df4f694091ad-deps-0.1.0
  108. 89.95 s [gammaloop-crate-test-dependencies-01b6df4f694091ad-deps] checking for references to /build/ in /nix/store/xi7mcsz760dicf0937nwlbq8i9y3hcvj-gammaloop-crate-test-dependencies-01b6df4f694091ad-deps-0.1.0...
  109. 89.95 s [gammaloop-crate-test-dependencies-01b6df4f694091ad-deps] patching script interpreter paths in /nix/store/xi7mcsz760dicf0937nwlbq8i9y3hcvj-gammaloop-crate-test-dependencies-01b6df4f694091ad-deps-0.1.0
  110. 90.15 s [gammaloop-crate-test-dependencies-01b6df4f694091ad-deps:post-build] Uploading to the NixCI cache: /nix/store/xi7mcsz760dicf0937nwlbq8i9y3hcvj-gammaloop-crate-test-dependencies-01b6df4f694091ad-deps-0.1.0
  111. 90.19 s [gammaloop-crate-test-dependencies-01b6df4f694091ad-deps:post-build] warning: 'warn-short-path-literals' is deprecated, use 'lint-short-path-literals = ignore' instead
  112. 90.22 s [gammaloop-crate-test-dependencies-01b6df4f694091ad-deps:post-build] copying 0 paths...
  113. 90.26 s [gammaloop-crate-test-dependencies-01b6df4f694091ad-deps:post-build] warning: 'warn-short-path-literals' is deprecated, use 'lint-short-path-literals = ignore' instead
  114. 90.39 s [gammaloop-crate-test-dependencies-01b6df4f694091ad-deps:post-build] copying 0 paths...
  115. 90.41 s Uploaded gammaloop-crate-test-dependencies-01b6df4f694091ad-deps in 266ms
  116. 90.41 s Progress: 6 of 14 built, 7 of 7 downloaded from cache
  117. 90.41 s Built gammaloop-crate-test-dependencies-01b6df4f694091ad-deps in 58.9s
  118. 90.49 s Building /nix/store/plmsnq2mhv97g165kpcwrvnhq4y1mzsm-gammaloop-crate-test-dependencies-be74a11b6e47d216-inputs.drv
  119. 100.53 s [gammaloop-crate-test-dependencies-be74a11b6e47d216-inputs:post-build] Uploading to the NixCI cache: /nix/store/c6dbsa10b5zg7qjn4z3mvip1xnq7wn2n-gammaloop-crate-test-dependencies-be74a11b6e47d216-inputs
  120. 101.85 s [gammaloop-crate-test-dependencies-be74a11b6e47d216-inputs:post-build] warning: 'warn-short-path-literals' is deprecated, use 'lint-short-path-literals = ignore' instead
  121. 101.85 s [gammaloop-crate-test-dependencies-be74a11b6e47d216-inputs:post-build] copying 0 paths...
  122. 101.85 s [gammaloop-crate-test-dependencies-be74a11b6e47d216-inputs:post-build] warning: 'warn-short-path-literals' is deprecated, use 'lint-short-path-literals = ignore' instead
  123. 101.86 s [gammaloop-crate-test-dependencies-be74a11b6e47d216-inputs:post-build] copying 0 paths...
  124. 101.86 s Uploaded gammaloop-crate-test-dependencies-be74a11b6e47d216-inputs in 1.3s
  125. 101.86 s Progress: 7 of 14 built, 7 of 7 downloaded from cache
  126. 101.86 s Built gammaloop-crate-test-dependencies-be74a11b6e47d216-inputs in 11.3s
  127. 101.86 s Building /nix/store/n1dwvr36v3ijpadbfz9ll5w27m4rx23l-gammaloop-crate-test-dependencies-be74a11b6e47d216-deps-0.1.0.drv
  128. 101.86 s [gammaloop-crate-test-dependencies-be74a11b6e47d216-deps] Phase: unpackPhase
  129. 101.86 s [gammaloop-crate-test-dependencies-be74a11b6e47d216-deps] unpacking source archive /nix/store/bb8cmn7kfzz2m8aam2mng9wj6lksns30-source
  130. 101.86 s [gammaloop-crate-test-dependencies-be74a11b6e47d216-deps] source root is source
  131. 101.86 s [gammaloop-crate-test-dependencies-be74a11b6e47d216-deps] Phase: patchPhase
  132. 101.86 s [gammaloop-crate-test-dependencies-be74a11b6e47d216-deps] Executing configureCargoCommonVars
  133. 101.86 s [gammaloop-crate-test-dependencies-be74a11b6e47d216-deps] copying cargo artifacts from /nix/store/c6dbsa10b5zg7qjn4z3mvip1xnq7wn2n-gammaloop-crate-test-dependencies-be74a11b6e47d216-inputs/target to target
  134. 101.86 s [gammaloop-crate-test-dependencies-be74a11b6e47d216-deps] will deep copy artifacts (instead of symlinking) as requested
  135. 102.47 s [gammaloop-crate-test-dependencies-be74a11b6e47d216-deps] Phase: updateAutotoolsGnuConfigScriptsPhase
  136. 102.50 s [gammaloop-crate-test-dependencies-be74a11b6e47d216-deps] Phase: configurePhase
  137. 102.51 s [gammaloop-crate-test-dependencies-be74a11b6e47d216-deps] will append /build/source/.cargo-home/config.toml with contents of /nix/store/yhvbfm4fzwpxbf22ypggjx69dpf2hlmh-vendor-cargo-deps/config.toml
  138. 102.51 s [gammaloop-crate-test-dependencies-be74a11b6e47d216-deps] default configurePhase, nothing to do
  139. 102.51 s [gammaloop-crate-test-dependencies-be74a11b6e47d216-deps] Phase: buildPhase
  140. 102.52 s [gammaloop-crate-test-dependencies-be74a11b6e47d216-deps] +++ command cargo --version
  141. 102.52 s [gammaloop-crate-test-dependencies-be74a11b6e47d216-deps] cargo 1.97.0 (c980f4866 2026-06-30)
  142. 102.52 s [gammaloop-crate-test-dependencies-be74a11b6e47d216-deps] +++ command cargo build --profile ci-optim --offline -p gammaloop-ci-test-dependencies-be74a11b6e47d216 -p gammaloop-workspace-hack --features gammaloop-tracing-filter/clap,gammaloop-tracing-filter/symbolica,idenso/bincode,idenso/reference-cases,linnet/bincode,linnet/drawing,linnet/serde,linnet/symbolica,spenso-macros/shadowing,spenso/shadowing,symbolica/tracing_max_level_info --lib
  143. 103.05 s [gammaloop-crate-test-dependencies-be74a11b6e47d216-deps] Compiling gammalooprs v0.3.4 (/build/source/crates/gammalooprs)
  144. 134.68 s [gammaloop-crate-test-dependencies-be74a11b6e47d216-deps] Compiling gammaloop-ci-test-dependencies-be74a11b6e47d216 v0.1.0 (/build/source/crates/gammaloop-ci-test-dependencies-be74a11b6e47d216)
  145. 192.04 s [gammaloop-crate-test-dependencies-be74a11b6e47d216-deps] Finished `ci-optim` profile [optimized] target(s) in 1m 29s
  146. 192.64 s [gammaloop-crate-test-dependencies-be74a11b6e47d216-deps] warning: the following packages contain code that will be rejected by a future version of Rust: proc-macro-error2 v2.0.1
  147. 192.64 s [gammaloop-crate-test-dependencies-be74a11b6e47d216-deps] note: to see what the problems were, use the option `--future-incompat-report`, or run `cargo report future-incompatibilities --id 1`
  148. 192.64 s [gammaloop-crate-test-dependencies-be74a11b6e47d216-deps] +++ command cargo build --profile ci-optim --offline -p gammaloop-ci-test-binary-dependencies-be74a11b6e47d216 -p gammalooprs --features gammaloop-tracing-filter/clap,gammaloop-tracing-filter/symbolica,idenso/bincode,idenso/reference-cases,linnet/bincode,linnet/drawing,linnet/serde,linnet/symbolica,spenso-macros/shadowing,spenso/shadowing,symbolica/tracing_max_level_info --lib
  149. 192.64 s [gammaloop-crate-test-dependencies-be74a11b6e47d216-deps] Compiling gammaloop-ci-test-binary-dependencies-be74a11b6e47d216 v0.1.0 (/build/source/crates/gammaloop-ci-test-binary-dependencies-be74a11b6e47d216)
  150. 192.64 s [gammaloop-crate-test-dependencies-be74a11b6e47d216-deps] Compiling gammalooprs v0.3.4 (/build/source/crates/gammalooprs)
  151. 284.94 s [gammaloop-crate-test-dependencies-be74a11b6e47d216-deps] Finished `ci-optim` profile [optimized] target(s) in 1m 32s
  152. 285.05 s [gammaloop-crate-test-dependencies-be74a11b6e47d216-deps] warning: the following packages contain code that will be rejected by a future version of Rust: proc-macro-error2 v2.0.1
  153. 285.05 s [gammaloop-crate-test-dependencies-be74a11b6e47d216-deps] note: to see what the problems were, use the option `--future-incompat-report`, or run `cargo report future-incompatibilities --id 1`
  154. 285.09 s [gammaloop-crate-test-dependencies-be74a11b6e47d216-deps] buildPhase completed in 3 minutes 2 seconds
  155. 285.09 s [gammaloop-crate-test-dependencies-be74a11b6e47d216-deps] Phase: installPhase
  156. 285.10 s [gammaloop-crate-test-dependencies-be74a11b6e47d216-deps] linking previous artifacts /nix/store/c6dbsa10b5zg7qjn4z3mvip1xnq7wn2n-gammaloop-crate-test-dependencies-be74a11b6e47d216-inputs to /nix/store/dvxv1q5j1a0zp1hhqykbzyrrp1b1rafx-gammaloop-crate-test-dependencies-be74a11b6e47d216-deps-0.1.0/target.tar.zst
  157. 285.39 s [gammaloop-crate-test-dependencies-be74a11b6e47d216-deps] /*stdin*\ : 21.57% ( 399 MiB => 86.0 MiB, /nix/store/dvxv1q5j1a0zp1hhqykbzyrrp1b1rafx-gammaloop-crate-test-dependencies-be74a11b6e47d216-deps-0.1.0/target.tar.zst)
  158. 285.42 s [gammaloop-crate-test-dependencies-be74a11b6e47d216-deps] Phase: fixupPhase
  159. 285.43 s [gammaloop-crate-test-dependencies-be74a11b6e47d216-deps] shrinking RPATHs of ELF executables and libraries in /nix/store/dvxv1q5j1a0zp1hhqykbzyrrp1b1rafx-gammaloop-crate-test-dependencies-be74a11b6e47d216-deps-0.1.0
  160. 285.43 s [gammaloop-crate-test-dependencies-be74a11b6e47d216-deps] checking for references to /build/ in /nix/store/dvxv1q5j1a0zp1hhqykbzyrrp1b1rafx-gammaloop-crate-test-dependencies-be74a11b6e47d216-deps-0.1.0...
  161. 285.44 s [gammaloop-crate-test-dependencies-be74a11b6e47d216-deps] patching script interpreter paths in /nix/store/dvxv1q5j1a0zp1hhqykbzyrrp1b1rafx-gammaloop-crate-test-dependencies-be74a11b6e47d216-deps-0.1.0
  162. 285.79 s [gammaloop-crate-test-dependencies-be74a11b6e47d216-deps:post-build] Uploading to the NixCI cache: /nix/store/dvxv1q5j1a0zp1hhqykbzyrrp1b1rafx-gammaloop-crate-test-dependencies-be74a11b6e47d216-deps-0.1.0
  163. 285.83 s [gammaloop-crate-test-dependencies-be74a11b6e47d216-deps:post-build] warning: 'warn-short-path-literals' is deprecated, use 'lint-short-path-literals = ignore' instead
  164. 285.86 s [gammaloop-crate-test-dependencies-be74a11b6e47d216-deps:post-build] copying 0 paths...
  165. 285.91 s [gammaloop-crate-test-dependencies-be74a11b6e47d216-deps:post-build] warning: 'warn-short-path-literals' is deprecated, use 'lint-short-path-literals = ignore' instead
  166. 286.10 s [gammaloop-crate-test-dependencies-be74a11b6e47d216-deps:post-build] copying 0 paths...
  167. 286.12 s Uploaded gammaloop-crate-test-dependencies-be74a11b6e47d216-deps in 342ms
  168. 286.12 s Progress: 8 of 14 built, 7 of 7 downloaded from cache
  169. 286.12 s Built gammaloop-crate-test-dependencies-be74a11b6e47d216-deps in 3m04s
  170. 286.19 s Building /nix/store/9mxkwmpcmf0xwv682jylhb5fn17259rf-gammaloop-crate-test-dependencies-9f61ebb64a841b09-inputs.drv
  171. 297.89 s [gammaloop-crate-test-dependencies-9f61ebb64a841b09-inputs:post-build] Uploading to the NixCI cache: /nix/store/7cxhiclj6qj1l1cmpqm211cys6k1r6zr-gammaloop-crate-test-dependencies-9f61ebb64a841b09-inputs
  172. 297.93 s [gammaloop-crate-test-dependencies-9f61ebb64a841b09-inputs:post-build] warning: 'warn-short-path-literals' is deprecated, use 'lint-short-path-literals = ignore' instead
  173. 297.96 s [gammaloop-crate-test-dependencies-9f61ebb64a841b09-inputs:post-build] copying 0 paths...
  174. 298.01 s [gammaloop-crate-test-dependencies-9f61ebb64a841b09-inputs:post-build] warning: 'warn-short-path-literals' is deprecated, use 'lint-short-path-literals = ignore' instead
  175. 298.13 s [gammaloop-crate-test-dependencies-9f61ebb64a841b09-inputs:post-build] copying 0 paths...
  176. 298.15 s Uploaded gammaloop-crate-test-dependencies-9f61ebb64a841b09-inputs in 274ms
  177. 298.15 s Progress: 9 of 14 built, 7 of 7 downloaded from cache
  178. 298.15 s Built gammaloop-crate-test-dependencies-9f61ebb64a841b09-inputs in 11.9s
  179. 298.23 s Building /nix/store/a3j3rdyra8qmp4x57r01bbci5wj8mn5y-gammaloop-crate-test-dependencies-9f61ebb64a841b09-deps-0.1.0.drv
  180. 298.31 s [gammaloop-crate-test-dependencies-9f61ebb64a841b09-deps] Phase: unpackPhase
  181. 298.31 s [gammaloop-crate-test-dependencies-9f61ebb64a841b09-deps] unpacking source archive /nix/store/hvpiydmn827l0lp566cymnsi14h6w553-source
  182. 298.35 s [gammaloop-crate-test-dependencies-9f61ebb64a841b09-deps] source root is source
  183. 298.37 s [gammaloop-crate-test-dependencies-9f61ebb64a841b09-deps] Phase: patchPhase
  184. 298.54 s [gammaloop-crate-test-dependencies-9f61ebb64a841b09-deps] Executing configureCargoCommonVars
  185. 298.54 s [gammaloop-crate-test-dependencies-9f61ebb64a841b09-deps] copying cargo artifacts from /nix/store/7cxhiclj6qj1l1cmpqm211cys6k1r6zr-gammaloop-crate-test-dependencies-9f61ebb64a841b09-inputs/target to target
  186. 298.54 s [gammaloop-crate-test-dependencies-9f61ebb64a841b09-deps] will deep copy artifacts (instead of symlinking) as requested
  187. 299.84 s [gammaloop-crate-test-dependencies-9f61ebb64a841b09-deps] Phase: updateAutotoolsGnuConfigScriptsPhase
  188. 299.88 s [gammaloop-crate-test-dependencies-9f61ebb64a841b09-deps] Phase: configurePhase
  189. 299.89 s [gammaloop-crate-test-dependencies-9f61ebb64a841b09-deps] will append /build/source/.cargo-home/config.toml with contents of /nix/store/yhvbfm4fzwpxbf22ypggjx69dpf2hlmh-vendor-cargo-deps/config.toml
  190. 299.89 s [gammaloop-crate-test-dependencies-9f61ebb64a841b09-deps] default configurePhase, nothing to do
  191. 299.90 s [gammaloop-crate-test-dependencies-9f61ebb64a841b09-deps] Phase: buildPhase
  192. 299.90 s [gammaloop-crate-test-dependencies-9f61ebb64a841b09-deps] +++ command cargo --version
  193. 299.91 s [gammaloop-crate-test-dependencies-9f61ebb64a841b09-deps] cargo 1.97.0 (c980f4866 2026-06-30)
  194. 299.91 s [gammaloop-crate-test-dependencies-9f61ebb64a841b09-deps] +++ command cargo build --profile ci-optim --offline -p gammaloop-ci-test-dependencies-9f61ebb64a841b09 -p gammaloop-workspace-hack --features gammaloop-tracing-filter/clap,gammaloop-tracing-filter/symbolica,idenso/bincode,idenso/reference-cases,linnet/bincode,linnet/drawing,linnet/serde,linnet/symbolica,spenso-macros/shadowing,spenso/shadowing,symbolica/tracing_max_level_info --lib
  195. 300.90 s [gammaloop-crate-test-dependencies-9f61ebb64a841b09-deps] Compiling gammaloop-api v0.1.0 (/build/source/crates/gammaloop-api)
  196. 351.95 s [gammaloop-crate-test-dependencies-9f61ebb64a841b09-deps] Compiling gammaloop-ci-test-dependencies-9f61ebb64a841b09 v0.1.0 (/build/source/crates/gammaloop-ci-test-dependencies-9f61ebb64a841b09)
  197. 351.97 s [gammaloop-crate-test-dependencies-9f61ebb64a841b09-deps] Finished `ci-optim` profile [optimized] target(s) in 52.05s
  198. 352.08 s [gammaloop-crate-test-dependencies-9f61ebb64a841b09-deps] warning: the following packages contain code that will be rejected by a future version of Rust: proc-macro-error2 v2.0.1
  199. 352.08 s [gammaloop-crate-test-dependencies-9f61ebb64a841b09-deps] note: to see what the problems were, use the option `--future-incompat-report`, or run `cargo report future-incompatibilities --id 1`
  200. 352.12 s [gammaloop-crate-test-dependencies-9f61ebb64a841b09-deps] +++ command cargo build --profile ci-optim --offline -p gammaloop-api -p gammaloop-ci-test-binary-dependencies-9f61ebb64a841b09 --features gammaloop-tracing-filter/clap,gammaloop-tracing-filter/symbolica,idenso/bincode,idenso/reference-cases,linnet/bincode,linnet/drawing,linnet/serde,linnet/symbolica,spenso-macros/shadowing,spenso/shadowing,symbolica/tracing_max_level_info --lib
  201. 352.36 s [gammaloop-crate-test-dependencies-9f61ebb64a841b09-deps] Compiling gammaloop-ci-test-binary-dependencies-9f61ebb64a841b09 v0.1.0 (/build/source/crates/gammaloop-ci-test-binary-dependencies-9f61ebb64a841b09)
  202. 352.36 s [gammaloop-crate-test-dependencies-9f61ebb64a841b09-deps] Compiling gammaloop-api v0.1.0 (/build/source/crates/gammaloop-api)
  203. 389.99 s [gammaloop-crate-test-dependencies-9f61ebb64a841b09-deps] Finished `ci-optim` profile [optimized] target(s) in 37.86s
  204. 390.11 s [gammaloop-crate-test-dependencies-9f61ebb64a841b09-deps] warning: the following packages contain code that will be rejected by a future version of Rust: proc-macro-error2 v2.0.1
  205. 390.11 s [gammaloop-crate-test-dependencies-9f61ebb64a841b09-deps] note: to see what the problems were, use the option `--future-incompat-report`, or run `cargo report future-incompatibilities --id 1`
  206. 390.15 s [gammaloop-crate-test-dependencies-9f61ebb64a841b09-deps] buildPhase completed in 1 minutes 30 seconds
  207. 390.15 s [gammaloop-crate-test-dependencies-9f61ebb64a841b09-deps] Phase: installPhase
  208. 390.16 s [gammaloop-crate-test-dependencies-9f61ebb64a841b09-deps] linking previous artifacts /nix/store/7cxhiclj6qj1l1cmpqm211cys6k1r6zr-gammaloop-crate-test-dependencies-9f61ebb64a841b09-inputs to /nix/store/pmwv1v8byvs63wvs2a2iw2s66rvyifz5-gammaloop-crate-test-dependencies-9f61ebb64a841b09-deps-0.1.0/target.tar.zst
  209. 390.27 s [gammaloop-crate-test-dependencies-9f61ebb64a841b09-deps] /*stdin*\ : 18.90% ( 110 MiB => 20.8 MiB, /nix/store/pmwv1v8byvs63wvs2a2iw2s66rvyifz5-gammaloop-crate-test-dependencies-9f61ebb64a841b09-deps-0.1.0/target.tar.zst)
  210. 390.29 s [gammaloop-crate-test-dependencies-9f61ebb64a841b09-deps] Phase: fixupPhase
  211. 390.30 s [gammaloop-crate-test-dependencies-9f61ebb64a841b09-deps] shrinking RPATHs of ELF executables and libraries in /nix/store/pmwv1v8byvs63wvs2a2iw2s66rvyifz5-gammaloop-crate-test-dependencies-9f61ebb64a841b09-deps-0.1.0
  212. 390.31 s [gammaloop-crate-test-dependencies-9f61ebb64a841b09-deps] checking for references to /build/ in /nix/store/pmwv1v8byvs63wvs2a2iw2s66rvyifz5-gammaloop-crate-test-dependencies-9f61ebb64a841b09-deps-0.1.0...
  213. 390.31 s [gammaloop-crate-test-dependencies-9f61ebb64a841b09-deps] patching script interpreter paths in /nix/store/pmwv1v8byvs63wvs2a2iw2s66rvyifz5-gammaloop-crate-test-dependencies-9f61ebb64a841b09-deps-0.1.0
  214. 390.61 s [gammaloop-crate-test-dependencies-9f61ebb64a841b09-deps:post-build] Uploading to the NixCI cache: /nix/store/pmwv1v8byvs63wvs2a2iw2s66rvyifz5-gammaloop-crate-test-dependencies-9f61ebb64a841b09-deps-0.1.0
  215. 390.65 s [gammaloop-crate-test-dependencies-9f61ebb64a841b09-deps:post-build] warning: 'warn-short-path-literals' is deprecated, use 'lint-short-path-literals = ignore' instead
  216. 390.69 s [gammaloop-crate-test-dependencies-9f61ebb64a841b09-deps:post-build] copying 0 paths...
  217. 390.74 s [gammaloop-crate-test-dependencies-9f61ebb64a841b09-deps:post-build] warning: 'warn-short-path-literals' is deprecated, use 'lint-short-path-literals = ignore' instead
  218. 390.85 s [gammaloop-crate-test-dependencies-9f61ebb64a841b09-deps:post-build] copying 0 paths...
  219. 390.87 s Uploaded gammaloop-crate-test-dependencies-9f61ebb64a841b09-deps in 276ms
  220. 390.87 s Progress: 10 of 14 built, 7 of 7 downloaded from cache
  221. 390.87 s Built gammaloop-crate-test-dependencies-9f61ebb64a841b09-deps in 1m32s
  222. 390.94 s Building /nix/store/86ngwrsxlp0g1y6fiji6db5b50jrwh00-gammaloop-crate-test-binaries-gammaloop-api-9f61ebb64a841b09-inputs.drv
  223. 399.60 s [gammaloop-crate-test-binaries-gammaloop-api-9f61ebb64a841b09-inputs:post-build] Uploading to the NixCI cache: /nix/store/d3ijrg2ayz7qv9a8qp3677zcckc2iykx-gammaloop-crate-test-binaries-gammaloop-api-9f61ebb64a841b09-inputs
  224. 399.65 s [gammaloop-crate-test-binaries-gammaloop-api-9f61ebb64a841b09-inputs:post-build] warning: 'warn-short-path-literals' is deprecated, use 'lint-short-path-literals = ignore' instead
  225. 399.69 s [gammaloop-crate-test-binaries-gammaloop-api-9f61ebb64a841b09-inputs:post-build] copying 0 paths...
  226. 399.74 s [gammaloop-crate-test-binaries-gammaloop-api-9f61ebb64a841b09-inputs:post-build] warning: 'warn-short-path-literals' is deprecated, use 'lint-short-path-literals = ignore' instead
  227. 399.87 s [gammaloop-crate-test-binaries-gammaloop-api-9f61ebb64a841b09-inputs:post-build] copying 0 paths...
  228. 399.89 s Uploaded gammaloop-crate-test-binaries-gammaloop-api-9f61ebb64a841b09-inputs in 294ms
  229. 399.89 s Progress: 11 of 14 built, 7 of 7 downloaded from cache
  230. 399.89 s Built gammaloop-crate-test-binaries-gammaloop-api-9f61ebb64a841b09-inputs in 8.9s
  231. 399.96 s Building /nix/store/v0w139f1m1jz6pw3d3s89r9ir6s9c0zm-gammaloop-crate-test-binaries-gammaloop-api-9f61ebb64a841b09-deps-0.1.0.drv
  232. 400.03 s [gammaloop-crate-test-binaries-gammaloop-api-9f61ebb64a841b09-deps] Phase: unpackPhase
  233. 400.03 s [gammaloop-crate-test-binaries-gammaloop-api-9f61ebb64a841b09-deps] unpacking source archive /nix/store/kcn2fq72jfq7k83ikfcfilf4j56dk7qk-source
  234. 400.13 s [gammaloop-crate-test-binaries-gammaloop-api-9f61ebb64a841b09-deps] source root is source
  235. 400.14 s [gammaloop-crate-test-binaries-gammaloop-api-9f61ebb64a841b09-deps] Phase: patchPhase
  236. 400.22 s [gammaloop-crate-test-binaries-gammaloop-api-9f61ebb64a841b09-deps] Executing configureCargoCommonVars
  237. 400.23 s [gammaloop-crate-test-binaries-gammaloop-api-9f61ebb64a841b09-deps] copying cargo artifacts from /nix/store/d3ijrg2ayz7qv9a8qp3677zcckc2iykx-gammaloop-crate-test-binaries-gammaloop-api-9f61ebb64a841b09-inputs/target to target
  238. 400.23 s [gammaloop-crate-test-binaries-gammaloop-api-9f61ebb64a841b09-deps] will deep copy artifacts (instead of symlinking) as requested
  239. 401.52 s [gammaloop-crate-test-binaries-gammaloop-api-9f61ebb64a841b09-deps] Phase: updateAutotoolsGnuConfigScriptsPhase
  240. 402.10 s [gammaloop-crate-test-binaries-gammaloop-api-9f61ebb64a841b09-deps] Phase: configurePhase
  241. 402.11 s [gammaloop-crate-test-binaries-gammaloop-api-9f61ebb64a841b09-deps] will append /build/source/.cargo-home/config.toml with contents of /nix/store/yhvbfm4fzwpxbf22ypggjx69dpf2hlmh-vendor-cargo-deps/config.toml
  242. 402.12 s [gammaloop-crate-test-binaries-gammaloop-api-9f61ebb64a841b09-deps] default configurePhase, nothing to do
  243. 402.12 s [gammaloop-crate-test-binaries-gammaloop-api-9f61ebb64a841b09-deps] Phase: buildPhase
  244. 402.13 s [gammaloop-crate-test-binaries-gammaloop-api-9f61ebb64a841b09-deps] +++ command cargo --version
  245. 402.13 s [gammaloop-crate-test-binaries-gammaloop-api-9f61ebb64a841b09-deps] cargo 1.97.0 (c980f4866 2026-06-30)
  246. 402.13 s [gammaloop-crate-test-binaries-gammaloop-api-9f61ebb64a841b09-deps] +++ command cargo test --profile ci-optim --no-run --offline -p gammaloop-api
  247. 402.95 s [gammaloop-crate-test-binaries-gammaloop-api-9f61ebb64a841b09-deps] Compiling gammaloop-api v0.1.0 (/build/source/crates/gammaloop-api)
  248. 405.25 s [gammaloop-crate-test-binaries-gammaloop-api-9f61ebb64a841b09-deps] error[E0063]: missing field `center_group` in initializer of `ThresholdCountertermVariantMetadata`
  249. 405.27 s [gammaloop-crate-test-binaries-gammaloop-api-9f61ebb64a841b09-deps] --> crates/gammaloop-api/src/commands/display.rs:2060:28
  250. 405.27 s [gammaloop-crate-test-binaries-gammaloop-api-9f61ebb64a841b09-deps] |
  251. 405.27 s [gammaloop-crate-test-binaries-gammaloop-api-9f61ebb64a841b09-deps] 2060 | variants: vec![ThresholdCountertermVariantMetadata {
  252. 405.27 s [gammaloop-crate-test-binaries-gammaloop-api-9f61ebb64a841b09-deps] | ^^^^^^^^^^^^^^^^^^^^^^^^^^^^^^^^^^^ missing `center_group`
  253. 405.27 s [gammaloop-crate-test-binaries-gammaloop-api-9f61ebb64a841b09-deps]
  254. 405.27 s [gammaloop-crate-test-binaries-gammaloop-api-9f61ebb64a841b09-deps] error[E0063]: missing field `center_group` in initializer of `ThresholdCountertermVariantMetadata`
  255. 405.27 s [gammaloop-crate-test-binaries-gammaloop-api-9f61ebb64a841b09-deps] --> crates/gammaloop-api/src/commands/display.rs:2092:28
  256. 405.27 s [gammaloop-crate-test-binaries-gammaloop-api-9f61ebb64a841b09-deps] |
  257. 405.27 s [gammaloop-crate-test-binaries-gammaloop-api-9f61ebb64a841b09-deps] 2092 | variants: vec![ThresholdCountertermVariantMetadata {
  258. 405.27 s [gammaloop-crate-test-binaries-gammaloop-api-9f61ebb64a841b09-deps] | ^^^^^^^^^^^^^^^^^^^^^^^^^^^^^^^^^^^ missing `center_group`
  259. 405.27 s [gammaloop-crate-test-binaries-gammaloop-api-9f61ebb64a841b09-deps]
  260. 408.48 s [gammaloop-crate-test-binaries-gammaloop-api-9f61ebb64a841b09-deps] For more information about this error, try `rustc --explain E0063`.
  261. 408.51 s [gammaloop-crate-test-binaries-gammaloop-api-9f61ebb64a841b09-deps] error: could not compile `gammaloop-api` (lib test) due to 2 previous errors
  262. 408.82 s Progress: 11 of 13 built (1 failed), 7 of 7 downloaded from cache
  263. 408.82 s Failed to build gammaloop-crate-test-binaries-gammaloop-api-9f61ebb64a841b09-deps after 8.8s
  264. 408.82 s error: Cannot build '/nix/store/v0w139f1m1jz6pw3d3s89r9ir6s9c0zm-gammaloop-crate-test-binaries-gammaloop-api-9f61ebb64a841b09-deps-0.1.0.drv'.
  265. 408.82 s Reason: builder failed with exit code 101.
  266. 408.82 s Output paths:
  267. 408.82 s /nix/store/wikykpk971aw3b1yy8y20zh3ib8qn1z3-gammaloop-crate-test-binaries-gammaloop-api-9f61ebb64a841b09-deps-0.1.0
  268. 408.82 s Last 30 log lines:
  269. 408.82 s > Running phase: unpackPhase
  270. 408.82 s > unpacking source archive /nix/store/kcn2fq72jfq7k83ikfcfilf4j56dk7qk-source
  271. 408.82 s > source root is source
  272. 408.82 s > Running phase: patchPhase
  273. 408.82 s > Executing configureCargoCommonVars
  274. 408.82 s > copying cargo artifacts from /nix/store/d3ijrg2ayz7qv9a8qp3677zcckc2iykx-gammaloop-crate-test-binaries-gammaloop-api-9f61ebb64a841b09-inputs/target to target
  275. 408.82 s > will deep copy artifacts (instead of symlinking) as requested
  276. 408.82 s > Running phase: updateAutotoolsGnuConfigScriptsPhase
  277. 408.82 s > Running phase: configurePhase
  278. 408.82 s > will append /build/source/.cargo-home/config.toml with contents of /nix/store/yhvbfm4fzwpxbf22ypggjx69dpf2hlmh-vendor-cargo-deps/config.toml
  279. 408.82 s > default configurePhase, nothing to do
  280. 408.82 s > Running phase: buildPhase
  281. 408.82 s > +++ command cargo --version
  282. 408.82 s > cargo 1.97.0 (c980f4866 2026-06-30)
  283. 408.82 s > +++ command cargo test --profile ci-optim --no-run --offline -p gammaloop-api
  284. 408.82 s > Compiling gammaloop-api v0.1.0 (/build/source/crates/gammaloop-api)
  285. 408.82 s > error[E0063]: missing field `center_group` in initializer of `ThresholdCountertermVariantMetadata`
  286. 408.82 s > --> crates/gammaloop-api/src/commands/display.rs:2060:28
  287. 408.82 s > |
  288. 408.82 s > 2060 | variants: vec![ThresholdCountertermVariantMetadata {
  289. 408.82 s > | ^^^^^^^^^^^^^^^^^^^^^^^^^^^^^^^^^^^ missing `center_group`
  290. 408.82 s >
  291. 408.82 s > error[E0063]: missing field `center_group` in initializer of `ThresholdCountertermVariantMetadata`
  292. 408.82 s > --> crates/gammaloop-api/src/commands/display.rs:2092:28
  293. 408.82 s > |
  294. 408.82 s > 2092 | variants: vec![ThresholdCountertermVariantMetadata {
  295. 408.82 s > | ^^^^^^^^^^^^^^^^^^^^^^^^^^^^^^^^^^^ missing `center_group`
  296. 408.82 s >
  297. 408.82 s > For more information about this error, try `rustc --explain E0063`.
  298. 408.82 s > error: could not compile `gammaloop-api` (lib test) due to 2 previous errors
  299. 408.82 s For full logs, run:
  300. 408.82 s nix log /nix/store/v0w139f1m1jz6pw3d3s89r9ir6s9c0zm-gammaloop-crate-test-binaries-gammaloop-api-9f61ebb64a841b09-deps-0.1.0.drv
  301. 408.82 s error: Cannot build '/nix/store/v15cz4cxxqdq3vgjjrjby8jz3405ksr5-nix-ci-artifact-barrier-crate-test-binaries-gammaloop-api.drv'.
  302. 408.82 s Reason: 1 dependency failed.
  303. 408.82 s Output paths:
  304. 408.82 s /nix/store/i5blyswnzz1nsmpxw218p9ssxnslpsiy-nix-ci-artifact-barrier-crate-test-binaries-gammaloop-api
  305. 408.83 s Build failed due to failed dependency
  306. 408.86 s Build failed.