build packages.x86_64-linux.crate-test-binaries-gammaloop-api

Reproduce this run
Retry Run
  1. 0.22 s $ /nix/store/9ypz3flqsrl5xl495mm8h645gadjsxi1-coreutils-9.11/bin/timeout --kill-after=15s 7200s /nix/store/23zk8sgzamrbmj1fday15szf7f2279s8-nix-2.34.7/bin/nix --extra-experimental-features nix-command --extra-experimental-features flakes --log-format internal-json build --no-link --print-out-paths git+https://github.com/alphal00p/gammaloop?ref=ir_safe_threshold_ct_rework&rev=0f3c75c08b143ceb3ca042d89635da65d3e874c6&shallow=1#packages.x86_64-linux.crate-test-binaries-gammaloop-api --print-build-logs
  2. 0.28 s error (ignored): SQLite database '/var/cache/nix-ci-worker/eval-cache-v6/494c24376b357b9e2a13d260e80e861810ab7e8f6ba34a2206cc787992343ef1.sqlite' is busy
  3. 3.25 s
  4. 4.15 s Downloading cached gammaloop-ci-test-binary-dependencies-9f61ebb64a841b09-Cargo.toml from https://cache.nix-ci.com
  5. 4.20 s Building /nix/store/gjanqzix5qm8a625pvig0l49v8j57c83-gammaloop-ci-test-binary-dependencies-9f61ebb64a841b09-gammaloop-api-dev-dependency.toml.drv
  6. 4.20 s Downloading cached gammaloop-crate-test-dependencies-9f61ebb64a841b09-inputs from https://cache.nix-ci.com
  7. 4.20 s Downloaded cached gammaloop-ci-test-binary-dependencies-9f61ebb64a841b09-Cargo.toml (1216 B) in 47ms
  8. 4.20 s Progress: 0 of 6 built (1 building), 1 of 3 downloaded from cache (1 downloading)
  9. 4.25 s [gammaloop-ci-test-binary-dependencies-9f61ebb64a841b09-gammaloop-api-dev-dependency.toml:post-build] Uploading to the NixCI cache: /nix/store/vhcmgrk7260kgi2pc23q8zk41zb3y02a-gammaloop-ci-test-binary-dependencies-9f61ebb64a841b09-gammaloop-api-dev-dependency.toml
  10. 4.30 s [gammaloop-ci-test-binary-dependencies-9f61ebb64a841b09-gammaloop-api-dev-dependency.toml:post-build] warning: 'warn-short-path-literals' is deprecated, use 'lint-short-path-literals = ignore' instead
  11. 4.44 s [gammaloop-ci-test-binary-dependencies-9f61ebb64a841b09-gammaloop-api-dev-dependency.toml:post-build] copying 0 paths...
  12. 4.49 s [gammaloop-ci-test-binary-dependencies-9f61ebb64a841b09-gammaloop-api-dev-dependency.toml:post-build] warning: 'warn-short-path-literals' is deprecated, use 'lint-short-path-literals = ignore' instead
  13. 4.64 s [gammaloop-ci-test-binary-dependencies-9f61ebb64a841b09-gammaloop-api-dev-dependency.toml:post-build] copying 0 paths...
  14. 4.66 s Uploaded gammaloop-ci-test-binary-dependencies-9f61ebb64a841b09-gammaloop-api-dev-dependency.toml in 417ms
  15. 4.66 s Progress: 1 of 6 built, 1 of 3 downloaded from cache (1 downloading)
  16. 4.66 s Built gammaloop-ci-test-binary-dependencies-9f61ebb64a841b09-gammaloop-api-dev-dependency.toml in 460ms
  17. 34.88 s Downloaded cached gammaloop-crate-test-dependencies-9f61ebb64a841b09-inputs (2.2 GiB) in 30.6s
  18. 34.92 s Progress: 1 of 5 built, 2 of 3 downloaded from cache
  19. 34.92 s Downloading cached gammaloop-crate-test-dependencies-9f61ebb64a841b09-deps from https://cache.nix-ci.com
  20. 34.92 s Downloaded cached gammaloop-crate-test-dependencies-9f61ebb64a841b09-deps in 0ms
  21. 34.92 s Progress: 1 of 5 built, 3 of 3 downloaded from cache
  22. 35.00 s Building /nix/store/86ngwrsxlp0g1y6fiji6db5b50jrwh00-gammaloop-crate-test-binaries-gammaloop-api-9f61ebb64a841b09-inputs.drv
  23. 47.64 s [gammaloop-crate-test-binaries-gammaloop-api-9f61ebb64a841b09-inputs:post-build] Uploading to the NixCI cache: /nix/store/d3ijrg2ayz7qv9a8qp3677zcckc2iykx-gammaloop-crate-test-binaries-gammaloop-api-9f61ebb64a841b09-inputs
  24. 48.34 s [gammaloop-crate-test-binaries-gammaloop-api-9f61ebb64a841b09-inputs:post-build] warning: 'warn-short-path-literals' is deprecated, use 'lint-short-path-literals = ignore' instead
  25. 48.46 s [gammaloop-crate-test-binaries-gammaloop-api-9f61ebb64a841b09-inputs:post-build] copying 1 paths...
  26. 48.46 s [gammaloop-crate-test-binaries-gammaloop-api-9f61ebb64a841b09-inputs:post-build] copying path '/nix/store/d3ijrg2ayz7qv9a8qp3677zcckc2iykx-gammaloop-crate-test-binaries-gammaloop-api-9f61ebb64a841b09-inputs' to 'https://cache.nix-ci.com'...
  27. 230.40 s [gammaloop-crate-test-binaries-gammaloop-api-9f61ebb64a841b09-inputs:post-build] warning: 'warn-short-path-literals' is deprecated, use 'lint-short-path-literals = ignore' instead
  28. 230.75 s [gammaloop-crate-test-binaries-gammaloop-api-9f61ebb64a841b09-inputs:post-build] copying 1 paths...
  29. 230.75 s [gammaloop-crate-test-binaries-gammaloop-api-9f61ebb64a841b09-inputs:post-build] copying path '/nix/store/86ngwrsxlp0g1y6fiji6db5b50jrwh00-gammaloop-crate-test-binaries-gammaloop-api-9f61ebb64a841b09-inputs.drv' to 'https://cache.nix-ci.com'...
  30. 231.03 s Uploaded gammaloop-crate-test-binaries-gammaloop-api-9f61ebb64a841b09-inputs in 3m03s
  31. 231.03 s Progress: 2 of 5 built, 3 of 3 downloaded from cache
  32. 231.03 s Built gammaloop-crate-test-binaries-gammaloop-api-9f61ebb64a841b09-inputs in 3m16s
  33. 231.13 s Building /nix/store/v0w139f1m1jz6pw3d3s89r9ir6s9c0zm-gammaloop-crate-test-binaries-gammaloop-api-9f61ebb64a841b09-deps-0.1.0.drv
  34. 231.22 s [gammaloop-crate-test-binaries-gammaloop-api-9f61ebb64a841b09-deps] Phase: unpackPhase
  35. 231.23 s [gammaloop-crate-test-binaries-gammaloop-api-9f61ebb64a841b09-deps] unpacking source archive /nix/store/kcn2fq72jfq7k83ikfcfilf4j56dk7qk-source
  36. 231.33 s [gammaloop-crate-test-binaries-gammaloop-api-9f61ebb64a841b09-deps] source root is source
  37. 231.35 s [gammaloop-crate-test-binaries-gammaloop-api-9f61ebb64a841b09-deps] Phase: patchPhase
  38. 231.46 s [gammaloop-crate-test-binaries-gammaloop-api-9f61ebb64a841b09-deps] Executing configureCargoCommonVars
  39. 231.46 s [gammaloop-crate-test-binaries-gammaloop-api-9f61ebb64a841b09-deps] copying cargo artifacts from /nix/store/d3ijrg2ayz7qv9a8qp3677zcckc2iykx-gammaloop-crate-test-binaries-gammaloop-api-9f61ebb64a841b09-inputs/target to target
  40. 231.46 s [gammaloop-crate-test-binaries-gammaloop-api-9f61ebb64a841b09-deps] will deep copy artifacts (instead of symlinking) as requested
  41. 234.85 s [gammaloop-crate-test-binaries-gammaloop-api-9f61ebb64a841b09-deps] Phase: updateAutotoolsGnuConfigScriptsPhase
  42. 234.89 s [gammaloop-crate-test-binaries-gammaloop-api-9f61ebb64a841b09-deps] Phase: configurePhase
  43. 234.90 s [gammaloop-crate-test-binaries-gammaloop-api-9f61ebb64a841b09-deps] will append /build/source/.cargo-home/config.toml with contents of /nix/store/yhvbfm4fzwpxbf22ypggjx69dpf2hlmh-vendor-cargo-deps/config.toml
  44. 234.90 s [gammaloop-crate-test-binaries-gammaloop-api-9f61ebb64a841b09-deps] default configurePhase, nothing to do
  45. 234.90 s [gammaloop-crate-test-binaries-gammaloop-api-9f61ebb64a841b09-deps] Phase: buildPhase
  46. 234.91 s [gammaloop-crate-test-binaries-gammaloop-api-9f61ebb64a841b09-deps] +++ command cargo --version
  47. 234.91 s [gammaloop-crate-test-binaries-gammaloop-api-9f61ebb64a841b09-deps] cargo 1.97.0 (c980f4866 2026-06-30)
  48. 234.91 s [gammaloop-crate-test-binaries-gammaloop-api-9f61ebb64a841b09-deps] +++ command cargo test --profile ci-optim --no-run --offline -p gammaloop-api
  49. 235.77 s [gammaloop-crate-test-binaries-gammaloop-api-9f61ebb64a841b09-deps] Compiling gammaloop-api v0.1.0 (/build/source/crates/gammaloop-api)
  50. 238.44 s [gammaloop-crate-test-binaries-gammaloop-api-9f61ebb64a841b09-deps] error[E0063]: missing field `center_group` in initializer of `ThresholdCountertermVariantMetadata`
  51. 238.44 s [gammaloop-crate-test-binaries-gammaloop-api-9f61ebb64a841b09-deps] --> crates/gammaloop-api/src/commands/display.rs:2060:28
  52. 238.44 s [gammaloop-crate-test-binaries-gammaloop-api-9f61ebb64a841b09-deps] |
  53. 238.44 s [gammaloop-crate-test-binaries-gammaloop-api-9f61ebb64a841b09-deps] 2060 | variants: vec![ThresholdCountertermVariantMetadata {
  54. 238.44 s [gammaloop-crate-test-binaries-gammaloop-api-9f61ebb64a841b09-deps] | ^^^^^^^^^^^^^^^^^^^^^^^^^^^^^^^^^^^ missing `center_group`
  55. 238.44 s [gammaloop-crate-test-binaries-gammaloop-api-9f61ebb64a841b09-deps]
  56. 238.44 s [gammaloop-crate-test-binaries-gammaloop-api-9f61ebb64a841b09-deps] error[E0063]: missing field `center_group` in initializer of `ThresholdCountertermVariantMetadata`
  57. 238.44 s [gammaloop-crate-test-binaries-gammaloop-api-9f61ebb64a841b09-deps] --> crates/gammaloop-api/src/commands/display.rs:2092:28
  58. 238.44 s [gammaloop-crate-test-binaries-gammaloop-api-9f61ebb64a841b09-deps] |
  59. 238.44 s [gammaloop-crate-test-binaries-gammaloop-api-9f61ebb64a841b09-deps] 2092 | variants: vec![ThresholdCountertermVariantMetadata {
  60. 238.44 s [gammaloop-crate-test-binaries-gammaloop-api-9f61ebb64a841b09-deps] | ^^^^^^^^^^^^^^^^^^^^^^^^^^^^^^^^^^^ missing `center_group`
  61. 238.44 s [gammaloop-crate-test-binaries-gammaloop-api-9f61ebb64a841b09-deps]
  62. 243.44 s [gammaloop-crate-test-binaries-gammaloop-api-9f61ebb64a841b09-deps] For more information about this error, try `rustc --explain E0063`.
  63. 243.50 s [gammaloop-crate-test-binaries-gammaloop-api-9f61ebb64a841b09-deps] error: could not compile `gammaloop-api` (lib test) due to 2 previous errors
  64. 244.05 s Progress: 2 of 4 built (1 failed), 3 of 3 downloaded from cache
  65. 244.05 s Failed to build gammaloop-crate-test-binaries-gammaloop-api-9f61ebb64a841b09-deps after 12.9s
  66. 244.05 s error: Cannot build '/nix/store/v0w139f1m1jz6pw3d3s89r9ir6s9c0zm-gammaloop-crate-test-binaries-gammaloop-api-9f61ebb64a841b09-deps-0.1.0.drv'.
  67. 244.05 s Reason: builder failed with exit code 101.
  68. 244.05 s Output paths:
  69. 244.05 s /nix/store/wikykpk971aw3b1yy8y20zh3ib8qn1z3-gammaloop-crate-test-binaries-gammaloop-api-9f61ebb64a841b09-deps-0.1.0
  70. 244.05 s Last 30 log lines:
  71. 244.05 s > Running phase: unpackPhase
  72. 244.05 s > unpacking source archive /nix/store/kcn2fq72jfq7k83ikfcfilf4j56dk7qk-source
  73. 244.05 s > source root is source
  74. 244.05 s > Running phase: patchPhase
  75. 244.05 s > Executing configureCargoCommonVars
  76. 244.05 s > copying cargo artifacts from /nix/store/d3ijrg2ayz7qv9a8qp3677zcckc2iykx-gammaloop-crate-test-binaries-gammaloop-api-9f61ebb64a841b09-inputs/target to target
  77. 244.05 s > will deep copy artifacts (instead of symlinking) as requested
  78. 244.05 s > Running phase: updateAutotoolsGnuConfigScriptsPhase
  79. 244.05 s > Running phase: configurePhase
  80. 244.05 s > will append /build/source/.cargo-home/config.toml with contents of /nix/store/yhvbfm4fzwpxbf22ypggjx69dpf2hlmh-vendor-cargo-deps/config.toml
  81. 244.05 s > default configurePhase, nothing to do
  82. 244.05 s > Running phase: buildPhase
  83. 244.05 s > +++ command cargo --version
  84. 244.05 s > cargo 1.97.0 (c980f4866 2026-06-30)
  85. 244.05 s > +++ command cargo test --profile ci-optim --no-run --offline -p gammaloop-api
  86. 244.05 s > Compiling gammaloop-api v0.1.0 (/build/source/crates/gammaloop-api)
  87. 244.05 s > error[E0063]: missing field `center_group` in initializer of `ThresholdCountertermVariantMetadata`
  88. 244.05 s > --> crates/gammaloop-api/src/commands/display.rs:2060:28
  89. 244.05 s > |
  90. 244.05 s > 2060 | variants: vec![ThresholdCountertermVariantMetadata {
  91. 244.05 s > | ^^^^^^^^^^^^^^^^^^^^^^^^^^^^^^^^^^^ missing `center_group`
  92. 244.05 s >
  93. 244.05 s > error[E0063]: missing field `center_group` in initializer of `ThresholdCountertermVariantMetadata`
  94. 244.05 s > --> crates/gammaloop-api/src/commands/display.rs:2092:28
  95. 244.05 s > |
  96. 244.05 s > 2092 | variants: vec![ThresholdCountertermVariantMetadata {
  97. 244.05 s > | ^^^^^^^^^^^^^^^^^^^^^^^^^^^^^^^^^^^ missing `center_group`
  98. 244.05 s >
  99. 244.05 s > For more information about this error, try `rustc --explain E0063`.
  100. 244.05 s > error: could not compile `gammaloop-api` (lib test) due to 2 previous errors
  101. 244.05 s For full logs, run:
  102. 244.05 s nix log /nix/store/v0w139f1m1jz6pw3d3s89r9ir6s9c0zm-gammaloop-crate-test-binaries-gammaloop-api-9f61ebb64a841b09-deps-0.1.0.drv
  103. 244.05 s error: Cannot build '/nix/store/v15cz4cxxqdq3vgjjrjby8jz3405ksr5-nix-ci-artifact-barrier-crate-test-binaries-gammaloop-api.drv'.
  104. 244.05 s Reason: 1 dependency failed.
  105. 244.05 s Output paths:
  106. 244.05 s /nix/store/i5blyswnzz1nsmpxw218p9ssxnslpsiy-nix-ci-artifact-barrier-crate-test-binaries-gammaloop-api
  107. 244.06 s Build failed due to failed dependency
  108. 244.14 s Build failed.