build checks.x86_64-linux.gammaloop-check

Reproduce this run
Retry Run
  1. 0.00 s $ /nix/store/9ypz3flqsrl5xl495mm8h645gadjsxi1-coreutils-9.11/bin/timeout --kill-after=15s 7200s /nix/store/23zk8sgzamrbmj1fday15szf7f2279s8-nix-2.34.7/bin/nix --extra-experimental-features nix-command --extra-experimental-features flakes --log-format internal-json build --no-link --print-out-paths git+https://github.com/alphal00p/gammaloop?ref=ir_safe_threshold_subtraction&rev=6c3b1ff79c34a5e34e424ddd51dd218105b48f53&shallow=1#checks.x86_64-linux.gammaloop-check --print-build-logs
  2. 4.03 s
  3. 5.41 s Building /nix/store/bcqc79if6hchn98779cm1bksy0kvkzh2-gammaloop-workspace-check-0.1.0.drv
  4. 5.61 s [gammaloop-workspace-check] Phase: unpackPhase
  5. 5.61 s [gammaloop-workspace-check] unpacking source archive /nix/store/bcy0vqqk2ibk38nik2bb809ck03m92g2-source
  6. 5.82 s [gammaloop-workspace-check] source root is source
  7. 5.87 s [gammaloop-workspace-check] Phase: patchPhase
  8. 5.88 s [gammaloop-workspace-check] Executing configureCargoCommonVars
  9. 5.90 s [gammaloop-workspace-check] decompressing cargo artifacts from /nix/store/wxpx6lf642pgxp2wz1pw1lxksj5p1wb0-gammaloop-workspace-deps-deps-0.1.0/target.tar.zst to target
  10. 8.89 s [gammaloop-workspace-check] Phase: updateAutotoolsGnuConfigScriptsPhase
  11. 8.95 s [gammaloop-workspace-check] Phase: configurePhase
  12. 8.95 s [gammaloop-workspace-check] will append /build/source/.cargo-home/config.toml with contents of /nix/store/8zq9ya5slh345hbylmsibxw827bi98w0-vendor-cargo-deps/config.toml
  13. 8.96 s [gammaloop-workspace-check] default configurePhase, nothing to do
  14. 8.96 s [gammaloop-workspace-check] Phase: buildPhase
  15. 8.96 s [gammaloop-workspace-check] +++ command cargo --version
  16. 8.97 s [gammaloop-workspace-check] cargo 1.97.0 (c980f4866 2026-06-30)
  17. 9.01 s [gammaloop-workspace-check] +++ command cargo check --profile ci-optim --locked --workspace --features gammaloop-tracing-filter/clap,gammaloop-tracing-filter/symbolica,idenso/bincode,idenso/reference-cases,linnet/bincode,linnet/drawing,linnet/rkyv,linnet/serde,linnet/symbolica,spenso-macros/shadowing,spenso/shadowing,symbolica/tracing_max_level_info,three-dimensional-reps/display,three-dimensional-reps/eval,three-dimensional-reps/serde --all-targets
  18. 9.76 s [gammaloop-workspace-check] Checking serde_core v1.0.228
  19. 9.77 s [gammaloop-workspace-check] Checking libc v0.2.186
  20. 9.77 s [gammaloop-workspace-check] Checking cfg-if v1.0.4
  21. 9.77 s [gammaloop-workspace-check] Checking memchr v2.8.0
  22. 9.79 s [gammaloop-workspace-check] Checking once_cell v1.21.4
  23. 9.80 s [gammaloop-workspace-check] Checking either v1.15.0
  24. 9.80 s [gammaloop-workspace-check] Checking itoa v1.0.18
  25. 9.82 s [gammaloop-workspace-check] Checking libm v0.2.16
  26. 9.83 s [gammaloop-workspace-check] Checking log v0.4.29
  27. 9.83 s [gammaloop-workspace-check] Checking zerocopy v0.8.48
  28. 9.83 s [gammaloop-workspace-check] Checking regex-syntax v0.8.10
  29. 9.83 s [gammaloop-workspace-check] Checking crossbeam-utils v0.8.21
  30. 9.83 s [gammaloop-workspace-check] Checking equivalent v1.0.2
  31. 9.87 s [gammaloop-workspace-check] Checking zmij v1.0.21
  32. 9.88 s [gammaloop-workspace-check] Checking bytemuck v1.25.0
  33. 9.88 s [gammaloop-workspace-check] Checking lazy_static v1.5.0
  34. 9.88 s [gammaloop-workspace-check] Compiling target-lexicon v0.13.5
  35. 9.93 s [gammaloop-workspace-check] Checking arrayvec v0.7.6
  36. 9.98 s [gammaloop-workspace-check] Checking powerfmt v0.2.0
  37. 10.19 s [gammaloop-workspace-check] Checking safe_arch v0.7.4
  38. 10.20 s [gammaloop-workspace-check] Checking time-core v0.1.8
  39. 10.24 s [gammaloop-workspace-check] Checking num-conv v0.2.1
  40. 10.25 s [gammaloop-workspace-check] Checking num_threads v0.1.7
  41. 10.31 s [gammaloop-workspace-check] Checking deranged v0.5.8
  42. 10.47 s [gammaloop-workspace-check] Checking pin-project-lite v0.2.17
  43. 10.49 s [gammaloop-workspace-check] Checking allocator-api2 v0.2.21
  44. 10.51 s [gammaloop-workspace-check] Checking foldhash v0.2.0
  45. 10.52 s [gammaloop-workspace-check] Checking itertools v0.14.0
  46. 10.55 s [gammaloop-workspace-check] Checking tracing-core v0.1.36
  47. 10.61 s [gammaloop-workspace-check] Checking const-random v0.1.18
  48. 10.66 s [gammaloop-workspace-check] Checking aho-corasick v1.1.4
  49. 10.66 s [gammaloop-workspace-check] Checking static_assertions v1.1.0
  50. 10.66 s [gammaloop-workspace-check] Checking nu-ansi-term v0.50.3
  51. 10.73 s [gammaloop-workspace-check] Checking unty v0.0.4
  52. 10.74 s [gammaloop-workspace-check] Checking winnow v1.0.2
  53. 10.81 s [gammaloop-workspace-check] Checking sharded-slab v0.1.7
  54. 10.98 s [gammaloop-workspace-check] Checking hashbrown v0.16.1
  55. 11.11 s [gammaloop-workspace-check] Checking getrandom v0.3.4
  56. 11.33 s [gammaloop-workspace-check] Checking wide v0.7.33
  57. 11.34 s [gammaloop-workspace-check] Checking gmp-mpfr-sys v1.7.1
  58. 11.54 s [gammaloop-workspace-check] Checking crossbeam-epoch v0.9.18
  59. 11.77 s [gammaloop-workspace-check] Checking rand_core v0.9.5
  60. 11.77 s [gammaloop-workspace-check] Checking safe_arch v1.0.0
  61. 11.82 s [gammaloop-workspace-check] Checking tracing v0.1.44
  62. 11.95 s [gammaloop-workspace-check] Checking tracing-log v0.2.0
  63. 11.99 s [gammaloop-workspace-check] Checking thread_local v1.1.9
  64. 12.04 s [gammaloop-workspace-check] Checking toml_writer v1.1.1+spec-1.1.0
  65. 12.10 s [gammaloop-workspace-check] Checking indenter v0.3.4
  66. 12.17 s [gammaloop-workspace-check] Checking az v1.3.0
  67. 12.19 s [gammaloop-workspace-check] Checking crossbeam-deque v0.8.6
  68. 12.21 s [gammaloop-workspace-check] Compiling phf_shared v0.11.3
  69. 12.21 s [gammaloop-workspace-check] Checking anyhow v1.0.102
  70. 12.27 s [gammaloop-workspace-check] Checking alloc-no-stdlib v2.0.4
  71. 12.41 s [gammaloop-workspace-check] Checking utf8parse v0.2.2
  72. 12.50 s [gammaloop-workspace-check] Checking rayon-core v1.13.0
  73. 12.54 s [gammaloop-workspace-check] Checking rawpointer v0.2.1
  74. 12.59 s [gammaloop-workspace-check] Checking dyn-clone v1.0.20
  75. 12.68 s [gammaloop-workspace-check] Checking anstyle-parse v1.0.0
  76. 12.70 s [gammaloop-workspace-check] Checking matrixmultiply v0.3.10
  77. 12.78 s [gammaloop-workspace-check] Checking alloc-stdlib v0.2.2
  78. 13.09 s [gammaloop-workspace-check] Checking wide v1.3.0
  79. 13.10 s [gammaloop-workspace-check] Checking colored v3.1.1
  80. 13.15 s [gammaloop-workspace-check] Checking anstyle v1.0.14
  81. 13.30 s [gammaloop-workspace-check] Checking is_terminal_polyfill v1.70.2
  82. 13.31 s [gammaloop-workspace-check] Checking colorchoice v1.0.5
  83. 13.51 s [gammaloop-workspace-check] Checking anstyle-query v1.1.5
  84. 13.52 s [gammaloop-workspace-check] Checking num-traits v0.2.19
  85. 13.58 s [gammaloop-workspace-check] Checking time v0.3.47
  86. 13.60 s [gammaloop-workspace-check] Compiling phf_generator v0.11.3
  87. 13.62 s [gammaloop-workspace-check] Checking eyre v0.6.12
  88. 13.71 s [gammaloop-workspace-check] Checking rayon v1.12.0
  89. 13.82 s [gammaloop-workspace-check] Checking unicode-width v0.2.2
  90. 13.89 s [gammaloop-workspace-check] Checking bitflags v1.3.2
  91. 13.98 s [gammaloop-workspace-check] Compiling phf_codegen v0.11.3
  92. 14.08 s [gammaloop-workspace-check] Checking toml_parser v1.1.2+spec-1.1.0
  93. 14.10 s [gammaloop-workspace-check] Compiling pyo3-build-config v0.28.3
  94. 14.24 s [gammaloop-workspace-check] Checking region v3.0.2
  95. 14.25 s [gammaloop-workspace-check] Checking brotli-decompressor v5.0.0
  96. 14.34 s [gammaloop-workspace-check] Checking anstream v1.0.0
  97. 14.54 s [gammaloop-workspace-check] Checking wasmtime-jit-icache-coherence v34.0.2
  98. 14.63 s [gammaloop-workspace-check] Checking hugepage-rs v0.1.1
  99. 14.81 s [gammaloop-workspace-check] Checking inventory v0.3.24
  100. 14.87 s [gammaloop-workspace-check] Checking regex-automata v0.4.14
  101. 14.92 s [gammaloop-workspace-check] Checking spec_math v0.1.6
  102. 14.94 s [gammaloop-workspace-check] Checking thiserror v2.0.18
  103. 15.05 s [gammaloop-workspace-check] Compiling getopts v0.2.24
  104. 15.06 s [gammaloop-workspace-check] Checking libloading v0.9.0
  105. 15.12 s [gammaloop-workspace-check] Checking approx v0.5.1
  106. 15.18 s [gammaloop-workspace-check] Checking num-integer v0.1.46
  107. 15.22 s [gammaloop-workspace-check] Checking append-only-vec v0.1.8
  108. 15.29 s [gammaloop-workspace-check] Checking byteorder v1.5.0
  109. 15.43 s [gammaloop-workspace-check] Checking tinyjson v2.5.1
  110. 15.46 s [gammaloop-workspace-check] Checking bytes v1.11.1
  111. 15.46 s [gammaloop-workspace-check] Checking self_cell v1.2.2
  112. 15.52 s [gammaloop-workspace-check] Compiling unic-common v0.9.0
  113. 15.61 s [gammaloop-workspace-check] Compiling unic-char-range v0.9.0
  114. 15.72 s [gammaloop-workspace-check] Checking linux-raw-sys v0.12.1
  115. 15.77 s [gammaloop-workspace-check] Compiling unic-char-property v0.9.0
  116. 15.87 s [gammaloop-workspace-check] Compiling unicode_names2_generator v1.3.0
  117. 15.89 s [gammaloop-workspace-check] Compiling unic-ucd-version v0.9.0
  118. 15.96 s [gammaloop-workspace-check] Compiling rustpython-parser-vendored v0.4.0
  119. 16.03 s [gammaloop-workspace-check] Compiling is-macro v0.3.7
  120. 16.15 s [gammaloop-workspace-check] Checking iana-time-zone v0.1.65
  121. 16.23 s [gammaloop-workspace-check] Compiling rustpython-parser v0.4.0
  122. 16.41 s [gammaloop-workspace-check] Checking serde v1.0.228
  123. 16.42 s [gammaloop-workspace-check] Checking serde_json v1.0.149
  124. 16.45 s [gammaloop-workspace-check] Checking bitflags v2.11.1
  125. 16.51 s [gammaloop-workspace-check] Checking serde_spanned v1.1.1
  126. 16.58 s [gammaloop-workspace-check] Checking toml_datetime v1.1.1+spec-1.1.0
  127. 16.58 s [gammaloop-workspace-check] Checking brotli v8.0.2
  128. 16.75 s [gammaloop-workspace-check] Checking rustix v1.1.4
  129. 16.80 s [gammaloop-workspace-check] Compiling phf v0.11.3
  130. 16.91 s [gammaloop-workspace-check] Checking rustc-hash v2.1.2
  131. 17.14 s [gammaloop-workspace-check] Compiling unic-ucd-ident v0.9.0
  132. 17.35 s [gammaloop-workspace-check] Checking toml v1.1.2+spec-1.1.0
  133. 17.44 s [gammaloop-workspace-check] Compiling unic-emoji-char v0.9.0
  134. 17.57 s [gammaloop-workspace-check] Compiling rustc-hash v1.1.0
  135. 17.73 s [gammaloop-workspace-check] Compiling lalrpop-util v0.20.2
  136. 17.78 s [gammaloop-workspace-check] Checking unicode-segmentation v1.13.2
  137. 17.81 s [gammaloop-workspace-check] Compiling symbolica v2.2.0 (https://github.com/alphal00p/symbolica?rev=4d0a833eb8e059d1f95bdae5abed2559830b235f#4d0a833e)
  138. 17.83 s [gammaloop-workspace-check] Checking smallvec v1.15.1
  139. 17.84 s [gammaloop-workspace-check] Checking num-complex v0.4.6
  140. 18.06 s [gammaloop-workspace-check] Checking tracing-serde v0.2.0
  141. 18.07 s [gammaloop-workspace-check] Checking bincode v2.0.1
  142. 18.36 s [gammaloop-workspace-check] Checking smartstring v1.0.1
  143. 18.39 s [gammaloop-workspace-check] Checking chrono v0.4.44
  144. 18.80 s [gammaloop-workspace-check] Checking simba v0.9.1
  145. 19.34 s [gammaloop-workspace-check] Checking ndarray v0.17.2
  146. 19.64 s [gammaloop-workspace-check] Checking rug v1.30.0
  147. 19.88 s [gammaloop-workspace-check] Checking typenum v1.20.0
  148. 19.93 s [gammaloop-workspace-check] Checking getrandom v0.2.17
  149. 20.14 s [gammaloop-workspace-check] Checking scopeguard v1.2.0
  150. 20.23 s [gammaloop-workspace-check] Checking lock_api v0.4.14
  151. 20.31 s [gammaloop-workspace-check] Checking parking_lot_core v0.9.12
  152. 20.31 s [gammaloop-workspace-check] Checking unicode-ident v1.0.24
  153. 20.43 s [gammaloop-workspace-check] Checking hashbrown v0.17.0
  154. 20.66 s [gammaloop-workspace-check] Checking parking_lot v0.12.5
  155. 20.66 s [gammaloop-workspace-check] Checking errno v0.3.14
  156. 20.76 s [gammaloop-workspace-check] Checking clap_lex v1.1.0
  157. 20.85 s [gammaloop-workspace-check] Checking ppv-lite86 v0.2.21
  158. 21.05 s [gammaloop-workspace-check] Checking ahash v0.8.12
  159. 21.11 s [gammaloop-workspace-check] Checking strsim v0.11.1
  160. 21.25 s [gammaloop-workspace-check] Checking generic-array v0.14.7
  161. 21.41 s [gammaloop-workspace-check] Checking unicase v2.9.0
  162. 21.62 s [gammaloop-workspace-check] Checking signal-hook-registry v1.4.8
  163. 21.63 s [gammaloop-workspace-check] Checking vte v0.14.1
  164. 21.80 s [gammaloop-workspace-check] Checking indexmap v2.14.0
  165. 21.83 s [gammaloop-workspace-check] Checking same-file v1.0.6
  166. 21.89 s [gammaloop-workspace-check] Checking matchers v0.2.0
  167. 21.96 s [gammaloop-workspace-check] Checking regex v1.12.3
  168. 22.06 s [gammaloop-workspace-check] Checking signal-hook v0.3.18
  169. 22.08 s [gammaloop-workspace-check] Checking rand_chacha v0.9.0
  170. 22.21 s [gammaloop-workspace-check] Checking walkdir v2.5.0
  171. 22.24 s [gammaloop-workspace-check] Checking half v2.7.1
  172. 22.36 s [gammaloop-workspace-check] Checking terminal_size v0.4.4
  173. 22.45 s [gammaloop-workspace-check] Checking block-buffer v0.10.4
  174. 22.48 s [gammaloop-workspace-check] Checking clap_builder v4.6.0
  175. 22.50 s [gammaloop-workspace-check] Checking rand v0.9.4
  176. 22.55 s [gammaloop-workspace-check] Checking tracing-subscriber v0.3.23
  177. 22.56 s [gammaloop-workspace-check] Checking crypto-common v0.1.7
  178. 22.67 s [gammaloop-workspace-check] Checking mio v1.2.0
  179. 22.80 s [gammaloop-workspace-check] Checking ciborium-io v0.2.2
  180. 22.80 s [gammaloop-workspace-check] Checking minimal-lexical v0.2.1
  181. 23.13 s [gammaloop-workspace-check] Checking derive_more v2.1.1
  182. 23.14 s [gammaloop-workspace-check] Checking digest v0.10.7
  183. 23.23 s [gammaloop-workspace-check] Checking ciborium-ll v0.2.2
  184. 23.32 s [gammaloop-workspace-check] Checking nom v7.1.3
  185. 23.34 s [gammaloop-workspace-check] Checking num-bigint v0.4.6
  186. 23.36 s [gammaloop-workspace-check] Checking signal-hook-mio v0.2.5
  187. 23.38 s [gammaloop-workspace-check] Checking console v0.16.3
  188. 23.47 s [gammaloop-workspace-check] Checking symjit v2.21.0
  189. 23.52 s [gammaloop-workspace-check] Checking bstr v1.12.1
  190. 23.67 s [gammaloop-workspace-check] Checking cpufeatures v0.2.17
  191. 23.70 s [gammaloop-workspace-check] Checking linux-raw-sys v0.4.15
  192. 23.72 s [gammaloop-workspace-check] Checking winnow v0.7.15
  193. 23.89 s [gammaloop-workspace-check] Checking sha2 v0.10.9
  194. 24.44 s [gammaloop-workspace-check] Checking globset v0.4.18
  195. 24.45 s [gammaloop-workspace-check] Checking ciborium v0.2.2
  196. 24.86 s [gammaloop-workspace-check] Checking rustix v0.38.44
  197. 25.04 s [gammaloop-workspace-check] Compiling unicode_names2 v1.3.0
  198. 25.39 s [gammaloop-workspace-check] Checking getrandom v0.4.2
  199. 25.57 s [gammaloop-workspace-check] Checking rand_core v0.6.4
  200. 25.65 s [gammaloop-workspace-check] Checking fastrand v2.4.1
  201. 25.72 s [gammaloop-workspace-check] Checking plotters-backend v0.3.7
  202. 25.93 s [gammaloop-workspace-check] Checking fnv v1.0.7
  203. 25.99 s [gammaloop-workspace-check] Checking plotters-svg v0.3.7
  204. 26.06 s [gammaloop-workspace-check] Checking clap v4.6.1
  205. 26.11 s [gammaloop-workspace-check] Checking rust-embed-utils v8.11.0
  206. 26.12 s [gammaloop-workspace-check] Checking crossterm v0.28.1
  207. 26.16 s [gammaloop-workspace-check] Checking tempfile v3.27.0
  208. 26.27 s [gammaloop-workspace-check] Checking serde_spanned v0.6.9
  209. 26.29 s [gammaloop-workspace-check] Checking toml_datetime v0.6.11
  210. 26.37 s [gammaloop-workspace-check] Checking itertools v0.10.5
  211. 26.53 s [gammaloop-workspace-check] Checking cast v0.3.0
  212. 26.77 s [gammaloop-workspace-check] Checking tap v1.0.1
  213. 26.87 s [gammaloop-workspace-check] Checking toml_write v0.1.2
  214. 27.05 s [gammaloop-workspace-check] Checking wyz v0.5.1
  215. 27.20 s [gammaloop-workspace-check] Checking ansitok v0.3.0
  216. 27.22 s [gammaloop-workspace-check] Checking rand_chacha v0.3.1
  217. 27.62 s [gammaloop-workspace-check] Checking plotters v0.3.7
  218. 27.69 s [gammaloop-workspace-check] Checking tinytemplate v1.2.1
  219. 27.79 s [gammaloop-workspace-check] Checking radium v0.7.0
  220. 27.93 s [gammaloop-workspace-check] Checking typeid v1.0.3
  221. 27.98 s [gammaloop-workspace-check] Checking similar v2.7.0
  222. 28.31 s [gammaloop-workspace-check] Checking is-terminal v0.4.17
  223. 28.43 s [gammaloop-workspace-check] Checking oorandom v11.1.5
  224. 28.58 s [gammaloop-workspace-check] Checking bytecount v0.6.9
  225. 28.59 s [gammaloop-workspace-check] Checking toml_edit v0.22.27
  226. 28.65 s [gammaloop-workspace-check] Checking anes v0.1.6
  227. 28.69 s [gammaloop-workspace-check] Checking ansi-str v0.9.0
  228. 28.77 s [gammaloop-workspace-check] Checking funty v2.0.0
  229. 28.79 s [gammaloop-workspace-check] Checking testing_table v0.3.0
  230. 28.89 s [gammaloop-workspace-check] Checking ron v0.12.1
  231. 28.93 s [gammaloop-workspace-check] Checking rand v0.8.6
  232. 29.29 s [gammaloop-workspace-check] Checking papergrid v0.17.0
  233. 29.31 s [gammaloop-workspace-check] Checking toml_edit v0.25.11+spec-1.1.0
  234. 29.33 s [gammaloop-workspace-check] Checking criterion-plot v0.5.0
  235. 29.59 s [gammaloop-workspace-check] Compiling pyo3-macros-backend v0.28.3
  236. 29.68 s [gammaloop-workspace-check] Compiling pyo3-ffi v0.28.3
  237. 29.96 s [gammaloop-workspace-check] Compiling pyo3 v0.28.3
  238. 30.30 s [gammaloop-workspace-check] Compiling numpy v0.28.0
  239. 30.56 s [gammaloop-workspace-check] Checking bitvec v1.0.1
  240. 30.68 s [gammaloop-workspace-check] Checking criterion v0.5.1
  241. 31.97 s [gammaloop-workspace-check] Checking env_filter v1.0.1
  242. 31.97 s [gammaloop-workspace-check] Checking uncased v0.9.10
  243. 32.02 s [gammaloop-workspace-check] Checking xprec v0.2.2
  244. 32.02 s [gammaloop-workspace-check] Checking toml v0.8.23
  245. 32.02 s [gammaloop-workspace-check] Checking jiff v0.2.24
  246. 32.02 s [gammaloop-workspace-check] Checking insta v1.47.2
  247. 32.02 s [gammaloop-workspace-check] Checking ptr_meta v0.1.4
  248. 32.02 s [gammaloop-workspace-check] Checking tabled v0.20.0
  249. 32.06 s [gammaloop-workspace-check] Checking ucd-trie v0.1.7
  250. 32.17 s [gammaloop-workspace-check] Checking simdutf8 v0.1.5
  251. 32.20 s [gammaloop-workspace-check] Checking ahash v0.7.8
  252. 32.27 s [gammaloop-workspace-check] Checking pest v2.8.6
  253. 32.34 s [gammaloop-workspace-check] Checking approx v0.4.0
  254. 32.37 s [gammaloop-workspace-check] Checking seahash v4.1.0
  255. 32.42 s [gammaloop-workspace-check] Checking cgmath v0.18.0
  256. 32.50 s [gammaloop-workspace-check] Checking num-rational v0.4.2
  257. 32.69 s [gammaloop-workspace-check] Checking num-iter v0.1.45
  258. 32.71 s [gammaloop-workspace-check] Checking bytecheck v0.6.12
  259. 32.93 s [gammaloop-workspace-check] Checking hashbrown v0.12.3
  260. 33.04 s [gammaloop-workspace-check] Checking ref-ops v0.2.5
  261. 33.24 s [gammaloop-workspace-check] Checking num v0.4.3
  262. 33.26 s [gammaloop-workspace-check] Checking rand_xoshiro v0.6.0
  263. 33.45 s [gammaloop-workspace-check] Checking features v0.10.0
  264. 33.51 s [gammaloop-workspace-check] Checking constcat v0.5.1
  265. 33.55 s [gammaloop-workspace-check] Checking gat-lending-iterator v0.1.8
  266. 33.59 s [gammaloop-workspace-check] Checking rend v0.4.2
  267. 33.82 s [gammaloop-workspace-check] Checking colored v2.2.0
  268. 33.86 s [gammaloop-workspace-check] Checking figment v0.10.19
  269. 34.06 s [gammaloop-workspace-check] Checking arrayref v0.3.9
  270. 34.09 s [gammaloop-workspace-check] Checking constant_time_eq v0.4.2
  271. 34.11 s [gammaloop-workspace-check] Checking cpufeatures v0.3.0
  272. 34.17 s [gammaloop-workspace-check] Checking base64 v0.22.1
  273. 34.22 s [gammaloop-workspace-check] Checking blake3 v1.8.5
  274. 34.26 s [gammaloop-workspace-check] Checking siphasher v1.0.2
  275. 34.55 s [gammaloop-workspace-check] Checking joinery v2.1.0
  276. 34.61 s [gammaloop-workspace-check] Checking phf_shared v0.13.1
  277. 34.67 s [gammaloop-workspace-check] Checking titlecase v2.2.1
  278. 34.78 s [gammaloop-workspace-check] Checking rust_lisp v0.18.0
  279. 34.82 s [gammaloop-workspace-check] Checking subprocess v0.2.15
  280. 35.17 s [gammaloop-workspace-check] Compiling vakint v0.1.2 (/build/source/crates/vakint)
  281. 35.17 s [gammaloop-workspace-check] Checking phf v0.13.1
  282. 35.28 s [gammaloop-workspace-check] Checking version-compare v0.2.1
  283. 35.28 s [gammaloop-workspace-check] Checking xpct v0.5.1
  284. 35.42 s [gammaloop-workspace-check] Checking ryu v1.0.23
  285. 35.44 s [gammaloop-workspace-check] Checking castaway v0.2.4
  286. 35.50 s [gammaloop-workspace-check] Checking toml_datetime v0.7.5+spec-1.1.0
  287. 35.63 s [gammaloop-workspace-check] Checking strum v0.27.2
  288. 35.65 s [gammaloop-workspace-check] Checking toml v0.9.12+spec-1.1.0
  289. 35.72 s [gammaloop-workspace-check] Checking compact_str v0.9.0
  290. 36.19 s [gammaloop-workspace-check] Compiling rustpython-parser-core v0.4.0
  291. 36.24 s [gammaloop-workspace-check] Checking string-template-plus v0.4.3
  292. 36.33 s [gammaloop-workspace-check] Checking unicode-truncate v2.0.1
  293. 36.44 s [gammaloop-workspace-check] Compiling rustpython-ast v0.4.0
  294. 36.48 s [gammaloop-workspace-check] Checking kasuari v0.4.12
  295. 36.59 s [gammaloop-workspace-check] Checking lru v0.16.4
  296. 36.62 s [gammaloop-workspace-check] Checking vte v0.15.0
  297. 36.65 s [gammaloop-workspace-check] Checking portable-atomic v1.13.1
  298. 36.67 s [gammaloop-workspace-check] Checking unit-prefix v0.5.2
  299. 36.67 s [gammaloop-workspace-check] Checking rand_distr v0.4.3
  300. 36.67 s [gammaloop-workspace-check] Checking simba v0.6.0
  301. 36.72 s [gammaloop-workspace-check] Checking vt100 v0.16.2
  302. 36.81 s [gammaloop-workspace-check] Checking line-clipping v0.3.7
  303. 36.84 s [gammaloop-workspace-check] Compiling three-dimensional-reps v0.1.0 (/build/source/crates/three-dimensional-reps)
  304. 36.99 s [gammaloop-workspace-check] Checking gimli v0.32.3
  305. 37.05 s [gammaloop-workspace-check] Checking adler2 v2.0.1
  306. 37.11 s [gammaloop-workspace-check] Checking thiserror v1.0.69
  307. 37.13 s [gammaloop-workspace-check] Checking miniz_oxide v0.8.9
  308. 37.20 s [gammaloop-workspace-check] Checking derive_builder v0.11.2
  309. 37.23 s [gammaloop-workspace-check] Checking ratatui-core v0.1.0
  310. 37.24 s [gammaloop-workspace-check] Checking object v0.37.3
  311. 37.31 s [gammaloop-workspace-check] Checking crossterm v0.29.0
  312. 37.39 s [gammaloop-workspace-check] Checking dot-parser v0.5.1
  313. 37.58 s [gammaloop-workspace-check] Checking owo-colors v4.3.0
  314. 37.65 s [gammaloop-workspace-check] Checking tracing-error v0.2.1
  315. 38.03 s [gammaloop-workspace-check] Checking typed-index-collections v3.5.0
  316. 38.08 s [gammaloop-workspace-check] Checking indicatif v0.18.4
  317. 38.09 s [gammaloop-workspace-check] Checking serde-big-array v0.5.1
  318. 38.36 s [gammaloop-workspace-check] Checking amd v0.2.2
  319. 38.60 s [gammaloop-workspace-check] Checking itertools v0.11.0
  320. 38.76 s [gammaloop-workspace-check] Compiling gammaloop-tracing-filter-macros v0.1.0 (/build/source/crates/gammaloop-tracing-filter-macros)
  321. 39.08 s [gammaloop-workspace-check] Checking option-ext v0.2.0
  322. 39.12 s [gammaloop-workspace-check] Checking rustc-demangle v0.1.27
  323. 39.23 s [gammaloop-workspace-check] Checking dirs-sys v0.5.0
  324. 39.36 s [gammaloop-workspace-check] Checking ref-cast v1.0.25
  325. 39.39 s [gammaloop-workspace-check] Checking nix v0.31.2
  326. 39.42 s [gammaloop-workspace-check] Checking color-spantrace v0.3.0
  327. 39.46 s [gammaloop-workspace-check] Checking integer-sqrt v0.1.5
  328. 39.52 s [gammaloop-workspace-check] Checking brotli-decompressor v4.0.3
  329. 39.55 s [gammaloop-workspace-check] Checking crossbeam-channel v0.5.15
  330. 39.93 s [gammaloop-workspace-check] Checking itertools v0.12.1
  331. 40.44 s [gammaloop-workspace-check] Checking ratatui-widgets v0.3.0
  332. 40.45 s [gammaloop-workspace-check] Checking ratatui-crossterm v0.1.0
  333. 40.52 s [gammaloop-workspace-check] Compiling gammalooprs v0.3.4 (/build/source/crates/gammalooprs)
  334. 40.75 s [gammaloop-workspace-check] Checking unsafe-libyaml v0.2.11
  335. 40.90 s [gammaloop-workspace-check] Checking symlink v0.1.0
  336. 41.04 s [gammaloop-workspace-check] Checking tracing-appender v0.2.5
  337. 41.04 s [gammaloop-workspace-check] Checking ctrlc v3.5.2
  338. 41.38 s [gammaloop-workspace-check] Checking include_dir v0.7.4
  339. 41.52 s [gammaloop-workspace-check] Checking addr2line v0.25.1
  340. 41.56 s [gammaloop-workspace-check] Checking tracing-indicatif v0.3.14
  341. 41.75 s [gammaloop-workspace-check] Checking pathfinding v4.15.0
  342. 41.88 s [gammaloop-workspace-check] Checking schemars v1.2.1
  343. 42.29 s [gammaloop-workspace-check] Checking brotli v7.0.0
  344. 42.31 s [gammaloop-workspace-check] Checking clarabel v0.11.1
  345. 42.44 s [gammaloop-workspace-check] Checking dirs v6.0.0
  346. 42.51 s [gammaloop-workspace-check] Checking slotmap v1.1.1
  347. 42.53 s [gammaloop-workspace-check] Checking env_logger v0.11.10
  348. 42.64 s [gammaloop-workspace-check] Checking json5 v0.4.1
  349. 42.95 s [gammaloop-workspace-check] Checking vectorize v0.2.0
  350. 43.03 s [gammaloop-workspace-check] Checking base62 v2.2.4
  351. 43.14 s [gammaloop-workspace-check] Checking ringbuffer v0.16.0
  352. 43.22 s [gammaloop-workspace-check] Checking serde_yaml v0.9.34+deprecated
  353. 43.31 s [gammaloop-workspace-check] Checking rust-embed v8.11.0
  354. 43.43 s [gammaloop-workspace-check] Checking clap_complete v4.6.3
  355. 43.49 s [gammaloop-workspace-check] Checking fd-lock v4.0.4
  356. 43.64 s [gammaloop-workspace-check] Checking strip-ansi-escapes v0.2.1
  357. 43.72 s [gammaloop-workspace-check] Compiling gammaloop-api v0.1.0 (/build/source/crates/gammaloop-api)
  358. 43.74 s [gammaloop-workspace-check] Checking rkyv v0.7.46
  359. 43.81 s [gammaloop-workspace-check] Checking itertools v0.13.0
  360. 44.64 s [gammaloop-workspace-check] Checking strum v0.26.3
  361. 44.67 s [gammaloop-workspace-check] Checking clap_complete_nushell v4.6.0
  362. 44.74 s [gammaloop-workspace-check] Checking sysinfo v0.33.1
  363. 44.75 s [gammaloop-workspace-check] Checking backtrace v0.3.76
  364. 44.92 s [gammaloop-workspace-check] Checking shlex v1.3.0
  365. 44.97 s [gammaloop-workspace-check] Checking futures-core v0.3.32
  366. 45.09 s [gammaloop-workspace-check] Checking slab v0.4.12
  367. 45.11 s [gammaloop-workspace-check] Checking futures-task v0.3.32
  368. 45.27 s [gammaloop-workspace-check] Checking sdd v3.0.10
  369. 45.29 s [gammaloop-workspace-check] Checking reedline v0.42.0
  370. 45.34 s [gammaloop-workspace-check] Checking ratatui-macros v0.7.0
  371. 45.37 s [gammaloop-workspace-check] Compiling gammaloop-integration-tests v0.1.0 (/build/source/tests)
  372. 45.41 s [gammaloop-workspace-check] Compiling test-log-core v0.2.20
  373. 45.43 s [gammaloop-workspace-check] Checking ratatui v0.30.0
  374. 45.50 s [gammaloop-workspace-check] Checking futures-util v0.3.32
  375. 45.56 s [gammaloop-workspace-check] Checking color-eyre v0.6.5
  376. 45.71 s [gammaloop-workspace-check] Compiling rustc_version v0.4.1
  377. 45.73 s [gammaloop-workspace-check] Checking scc v2.4.0
  378. 45.91 s [gammaloop-workspace-check] Checking which v8.0.2
  379. 46.10 s [gammaloop-workspace-check] Checking bincode v1.3.3
  380. 46.27 s [gammaloop-workspace-check] Compiling gungraun-runner v0.18.2
  381. 46.35 s [gammaloop-workspace-check] Checking proc-macro2 v1.0.106
  382. 46.98 s [gammaloop-workspace-check] Checking quote v1.0.45
  383. 47.21 s [gammaloop-workspace-check] Checking maplit v1.0.2
  384. 47.28 s [gammaloop-workspace-check] Checking base64 v0.21.7
  385. 47.34 s [gammaloop-workspace-check] Compiling iai-callgrind-runner v0.14.2
  386. 47.89 s [gammaloop-workspace-check] Compiling numerica v2.2.0 (https://github.com/alphal00p/symbolica?rev=4d0a833eb8e059d1f95bdae5abed2559830b235f#4d0a833e)
  387. 48.78 s [gammaloop-workspace-check] Checking ron v0.8.1
  388. 49.19 s [gammaloop-workspace-check] Checking kurbo v0.13.0
  389. 49.22 s [gammaloop-workspace-check] Checking wait-timeout v0.2.1
  390. 49.37 s [gammaloop-workspace-check] Checking quick-error v1.2.3
  391. 49.42 s [gammaloop-workspace-check] Compiling iai-callgrind v0.14.2
  392. 49.44 s [gammaloop-workspace-check] Compiling gungraun-macros v0.8.0
  393. 49.51 s [gammaloop-workspace-check] Checking bit-vec v0.8.0
  394. 49.55 s [gammaloop-workspace-check] Checking rusty-fork v0.3.1
  395. 49.66 s [gammaloop-workspace-check] Checking bit-set v0.8.0
  396. 49.80 s [gammaloop-workspace-check] Checking syn v2.0.117
  397. 49.82 s [gammaloop-workspace-check] Compiling iai-callgrind-macros v0.5.1
  398. 49.83 s [gammaloop-workspace-check] Checking rand_xorshift v0.4.0
  399. 50.05 s [gammaloop-workspace-check] Checking console v0.15.11
  400. 50.09 s [gammaloop-workspace-check] Compiling test-log-macros v0.2.20
  401. 50.16 s [gammaloop-workspace-check] Checking unarray v0.1.4
  402. 50.21 s [gammaloop-workspace-check] Checking pathdiff v0.2.3
  403. 50.30 s [gammaloop-workspace-check] Checking proptest v1.11.0
  404. 50.64 s [gammaloop-workspace-check] Checking futures-executor v0.3.32
  405. 50.87 s [gammaloop-workspace-check] Checking similar-asserts v1.7.0
  406. 51.02 s [gammaloop-workspace-check] Checking serial_test v3.4.0
  407. 51.23 s [gammaloop-workspace-check] Checking clinnet v0.1.8 (/build/source/crates/clinnet)
  408. 51.47 s [gammaloop-workspace-check] Checking kurvst v0.1.0 (/build/source/crates/kurvst)
  409. 52.84 s [gammaloop-workspace-check] Compiling graphica v2.1.0 (https://github.com/alphal00p/symbolica?rev=4d0a833eb8e059d1f95bdae5abed2559830b235f#4d0a833e)
  410. 53.58 s [gammaloop-workspace-check] Checking nalgebra v0.29.0
  411. 55.92 s [gammaloop-workspace-check] Checking test-log v0.2.20
  412. 64.33 s [gammaloop-workspace-check] Compiling pyo3-macros v0.28.3
  413. 64.60 s [gammaloop-workspace-check] Checking gungraun v0.18.2
  414. 64.74 s [gammaloop-workspace-check] Compiling pyo3-stub-gen-derive v0.17.2
  415. 65.39 s [gammaloop-workspace-check] Checking statrs v0.16.1
  416. 66.21 s [gammaloop-workspace-check] Checking momtrop v0.3.0
  417. 72.52 s [gammaloop-workspace-check] Checking pyo3-stub-gen v0.17.2
  418. 79.57 s [gammaloop-workspace-check] Checking symbolica-utils v0.1.0 (/build/source/crates/symbolica-utils)
  419. 79.57 s [gammaloop-workspace-check] Checking spenso-macros v0.3.2 (/build/source/crates/spenso-macros)
  420. 289.43 s [gammaloop-workspace-check] Compiling gammaloop-workspace-hack v0.1.0 (/build/source/crates/gammaloop-workspace-hack)
  421. 289.65 s [gammaloop-workspace-check] Checking linnet v0.17.0 (/build/source/crates/linnet)
  422. 292.78 s [gammaloop-workspace-check] Checking spenso v0.6.0 (/build/source/crates/spenso)
  423. 293.12 s [gammaloop-workspace-check] Checking linnet-py v0.1.0 (/build/source/crates/linnet-py)
  424. 293.13 s [gammaloop-workspace-check] Checking linnest v0.1.0 (/build/source/crates/linnest)
  425. 297.76 s [gammaloop-workspace-check] Checking idenso v0.3.0 (/build/source/crates/idenso)
  426. 297.76 s [gammaloop-workspace-check] Checking gammaloop-tracing-filter v0.1.0 (/build/source/crates/gammaloop-tracing-filter)
  427. 299.38 s [gammaloop-workspace-check] Checking spenso-hep-lib v0.1.7 (/build/source/crates/spenso-hep-lib)
  428. 299.52 s [gammaloop-workspace-check] Checking spynso3 v0.1.2 (/build/source/crates/spynso3)
  429. 310.93 s [gammaloop-workspace-check] error[E0283]: type annotations needed
  430. 310.93 s [gammaloop-workspace-check] --> crates/gammalooprs/src/momentum/sample.rs:1165:35
  431. 310.93 s [gammaloop-workspace-check] |
  432. 310.93 s [gammaloop-workspace-check] 1165 | requested.into_iter().collect(),
  433. 310.93 s [gammaloop-workspace-check] | ^^^^^^^ cannot infer type of the type parameter `B` declared on the method `collect`
  434. 310.93 s [gammaloop-workspace-check] |
  435. 310.93 s [gammaloop-workspace-check] = note: the type must implement `FromIterator<linnet::half_edge::involution::EdgeIndex>`
  436. 310.93 s [gammaloop-workspace-check] note: required by a bound in `std::iter::Iterator::collect`
  437. 310.93 s [gammaloop-workspace-check] --> /rustc/2d8144b7880597b6e6d3dfd63a9a9efae3f533d3/library/core/src/iter/traits/iterator.rs:2077:4
  438. 310.93 s [gammaloop-workspace-check] help: consider specifying the generic argument
  439. 310.93 s [gammaloop-workspace-check] |
  440. 310.93 s [gammaloop-workspace-check] 1165 | requested.into_iter().collect::<Vec<_>>(),
  441. 310.93 s [gammaloop-workspace-check] | ++++++++++
  442. 310.93 s [gammaloop-workspace-check]
  443. 310.94 s [gammaloop-workspace-check] error[E0283]: type annotations needed
  444. 310.94 s [gammaloop-workspace-check] --> crates/gammalooprs/src/momentum/sample.rs:1165:35
  445. 310.94 s [gammaloop-workspace-check] |
  446. 310.94 s [gammaloop-workspace-check] 1161 | / assert_eq!(
  447. 310.94 s [gammaloop-workspace-check] 1162 | | subspace
  448. 310.94 s [gammaloop-workspace-check] 1163 | | .iter_basis_edges(&all_lmbs)
  449. 310.94 s [gammaloop-workspace-check] 1164 | | .collect::<std::collections::BTreeSet<_>>(),
  450. 310.94 s [gammaloop-workspace-check] 1165 | | requested.into_iter().collect(),
  451. 310.94 s [gammaloop-workspace-check] | | ^^^^^^^ cannot infer type of the type parameter `B` declared on the method `collect`
  452. 310.94 s [gammaloop-workspace-check] 1166 | | );
  453. 310.94 s [gammaloop-workspace-check] | |_________- type must be known at this point
  454. 310.94 s [gammaloop-workspace-check] |
  455. 310.94 s [gammaloop-workspace-check] = note: multiple `impl`s satisfying `std::collections::BTreeSet<linnet::half_edge::involution::EdgeIndex>: PartialEq<_>` found in the following crates: `alloc`, `rkyv`:
  456. 310.94 s [gammaloop-workspace-check] - impl<K, AK> PartialEq<rkyv::collections::btree_set::ArchivedBTreeSet<AK>> for std::collections::BTreeSet<K>
  457. 310.94 s [gammaloop-workspace-check] where AK: PartialEq<K>;
  458. 310.94 s [gammaloop-workspace-check] - impl<T, A> PartialEq for std::collections::BTreeSet<T, A>
  459. 310.94 s [gammaloop-workspace-check] where T: PartialEq, A: Allocator, A: Clone;
  460. 310.94 s [gammaloop-workspace-check] help: consider specifying the generic argument
  461. 310.94 s [gammaloop-workspace-check] |
  462. 310.94 s [gammaloop-workspace-check] 1165 | requested.into_iter().collect::<Vec<_>>(),
  463. 310.94 s [gammaloop-workspace-check] | ++++++++++
  464. 310.94 s [gammaloop-workspace-check]
  465. 311.66 s [gammaloop-workspace-check] error[E0283]: type annotations needed
  466. 311.66 s [gammaloop-workspace-check] --> crates/gammalooprs/src/momentum/sample.rs:1182:35
  467. 311.66 s [gammaloop-workspace-check] |
  468. 311.66 s [gammaloop-workspace-check] 1178 | / assert_eq!(
  469. 311.66 s [gammaloop-workspace-check] 1179 | | common_subspace
  470. 311.66 s [gammaloop-workspace-check] 1180 | | .iter_basis_edges(&all_lmbs)
  471. 311.66 s [gammaloop-workspace-check] 1181 | | .collect::<std::collections::BTreeSet<_>>(),
  472. 311.66 s [gammaloop-workspace-check] 1182 | | requested.into_iter().collect(),
  473. 311.66 s [gammaloop-workspace-check] | | ^^^^^^^ cannot infer type of the type parameter `B` declared on the method `collect`
  474. 311.66 s [gammaloop-workspace-check] 1183 | | );
  475. 311.66 s [gammaloop-workspace-check] | |_________- type must be known at this point
  476. 311.66 s [gammaloop-workspace-check] |
  477. 311.66 s [gammaloop-workspace-check] = note: multiple `impl`s satisfying `std::collections::BTreeSet<linnet::half_edge::involution::EdgeIndex>: PartialEq<_>` found in the following crates: `alloc`, `rkyv`:
  478. 311.66 s [gammaloop-workspace-check] - impl<K, AK> PartialEq<rkyv::collections::btree_set::ArchivedBTreeSet<AK>> for std::collections::BTreeSet<K>
  479. 311.66 s [gammaloop-workspace-check] where AK: PartialEq<K>;
  480. 311.66 s [gammaloop-workspace-check] - impl<T, A> PartialEq for std::collections::BTreeSet<T, A>
  481. 311.66 s [gammaloop-workspace-check] where T: PartialEq, A: Allocator, A: Clone;
  482. 311.66 s [gammaloop-workspace-check] help: consider specifying the generic argument
  483. 311.66 s [gammaloop-workspace-check] |
  484. 311.66 s [gammaloop-workspace-check] 1182 | requested.into_iter().collect::<Vec<_>>(),
  485. 311.66 s [gammaloop-workspace-check] | ++++++++++
  486. 311.66 s [gammaloop-workspace-check]
  487. 311.68 s [gammaloop-workspace-check] error[E0283]: type annotations needed
  488. 311.68 s [gammaloop-workspace-check] --> crates/gammalooprs/src/momentum/sample.rs:1203:35
  489. 311.68 s [gammaloop-workspace-check] |
  490. 311.68 s [gammaloop-workspace-check] 1199 | / assert_eq!(
  491. 311.68 s [gammaloop-workspace-check] 1200 | | sparse_common_subspace
  492. 311.68 s [gammaloop-workspace-check] 1201 | | .iter_basis_edges(&all_lmbs)
  493. 311.68 s [gammaloop-workspace-check] 1202 | | .collect::<std::collections::BTreeSet<_>>(),
  494. 311.68 s [gammaloop-workspace-check] 1203 | | requested.into_iter().collect(),
  495. 311.68 s [gammaloop-workspace-check] | | ^^^^^^^ cannot infer type of the type parameter `B` declared on the method `collect`
  496. 311.68 s [gammaloop-workspace-check] 1204 | | );
  497. 311.68 s [gammaloop-workspace-check] | |_________- type must be known at this point
  498. 311.68 s [gammaloop-workspace-check] |
  499. 311.68 s [gammaloop-workspace-check] = note: multiple `impl`s satisfying `std::collections::BTreeSet<linnet::half_edge::involution::EdgeIndex>: PartialEq<_>` found in the following crates: `alloc`, `rkyv`:
  500. 311.68 s [gammaloop-workspace-check] - impl<K, AK> PartialEq<rkyv::collections::btree_set::ArchivedBTreeSet<AK>> for std::collections::BTreeSet<K>
  501. 311.68 s [gammaloop-workspace-check] where AK: PartialEq<K>;
  502. 311.68 s [gammaloop-workspace-check] - impl<T, A> PartialEq for std::collections::BTreeSet<T, A>
  503. 311.68 s [gammaloop-workspace-check] where T: PartialEq, A: Allocator, A: Clone;
  504. 311.68 s [gammaloop-workspace-check] help: consider specifying the generic argument
  505. 311.68 s [gammaloop-workspace-check] |
  506. 311.68 s [gammaloop-workspace-check] 1203 | requested.into_iter().collect::<Vec<_>>(),
  507. 311.68 s [gammaloop-workspace-check] | ++++++++++
  508. 311.68 s [gammaloop-workspace-check]
  509. 313.41 s [gammaloop-workspace-check] error[E0283]: type annotations needed
  510. 313.41 s [gammaloop-workspace-check] --> crates/gammalooprs/src/processes/amplitude.rs:3336:49
  511. 313.41 s [gammaloop-workspace-check] |
  512. 313.41 s [gammaloop-workspace-check] 3336 | variant_ids.iter().copied().collect(),
  513. 313.41 s [gammaloop-workspace-check] | ^^^^^^^ cannot infer type of the type parameter `B` declared on the method `collect`
  514. 313.41 s [gammaloop-workspace-check] |
  515. 313.41 s [gammaloop-workspace-check] = note: the type must implement `FromIterator<processes::threshold_counterterms::ThresholdCountertermVariantId>`
  516. 313.41 s [gammaloop-workspace-check] note: required by a bound in `std::iter::Iterator::collect`
  517. 313.41 s [gammaloop-workspace-check] --> /rustc/2d8144b7880597b6e6d3dfd63a9a9efae3f533d3/library/core/src/iter/traits/iterator.rs:2077:4
  518. 313.41 s [gammaloop-workspace-check] help: consider specifying the generic argument
  519. 313.41 s [gammaloop-workspace-check] |
  520. 313.41 s [gammaloop-workspace-check] 3336 | variant_ids.iter().copied().collect::<Vec<_>>(),
  521. 313.41 s [gammaloop-workspace-check] | ++++++++++
  522. 313.41 s [gammaloop-workspace-check]
  523. 313.41 s [gammaloop-workspace-check] error[E0283]: type annotations needed
  524. 313.41 s [gammaloop-workspace-check] --> crates/gammalooprs/src/processes/amplitude.rs:3336:49
  525. 313.41 s [gammaloop-workspace-check] |
  526. 313.41 s [gammaloop-workspace-check] 3334 | / assert_eq!(
  527. 313.41 s [gammaloop-workspace-check] 3335 | | referenced_variants,
  528. 313.41 s [gammaloop-workspace-check] 3336 | | variant_ids.iter().copied().collect(),
  529. 313.41 s [gammaloop-workspace-check] | | ^^^^^^^ cannot infer type of the type parameter `B` declared on the method `collect`
  530. 313.41 s [gammaloop-workspace-check] 3337 | | "overlap groups must retain every semantic duplicate independently",
  531. 313.41 s [gammaloop-workspace-check] 3338 | | );
  532. 313.41 s [gammaloop-workspace-check] | |_________________- type must be known at this point
  533. 313.41 s [gammaloop-workspace-check] |
  534. 313.41 s [gammaloop-workspace-check] = note: multiple `impl`s satisfying `std::collections::BTreeSet<processes::threshold_counterterms::ThresholdCountertermVariantId>: PartialEq<_>` found in the following crates: `alloc`, `rkyv`:
  535. 313.41 s [gammaloop-workspace-check] - impl<K, AK> PartialEq<rkyv::collections::btree_set::ArchivedBTreeSet<AK>> for std::collections::BTreeSet<K>
  536. 313.41 s [gammaloop-workspace-check] where AK: PartialEq<K>;
  537. 313.41 s [gammaloop-workspace-check] - impl<T, A> PartialEq for std::collections::BTreeSet<T, A>
  538. 313.41 s [gammaloop-workspace-check] where T: PartialEq, A: Allocator, A: Clone;
  539. 313.41 s [gammaloop-workspace-check] help: consider specifying the generic argument
  540. 313.41 s [gammaloop-workspace-check] |
  541. 313.41 s [gammaloop-workspace-check] 3336 | variant_ids.iter().copied().collect::<Vec<_>>(),
  542. 313.41 s [gammaloop-workspace-check] | ++++++++++
  543. 313.41 s [gammaloop-workspace-check]
  544. 313.58 s [gammaloop-workspace-check] error[E0283]: type annotations needed
  545. 313.58 s [gammaloop-workspace-check] --> crates/gammalooprs/src/processes/amplitude.rs:4098:59
  546. 313.58 s [gammaloop-workspace-check] |
  547. 313.58 s [gammaloop-workspace-check] 4098 | assert_eq!(orders, [1, 2].into_iter().collect());
  548. 313.58 s [gammaloop-workspace-check] | ^^^^^^^ cannot infer type of the type parameter `B` declared on the method `collect`
  549. 313.58 s [gammaloop-workspace-check] |
  550. 313.58 s [gammaloop-workspace-check] = note: the type must implement `FromIterator<i32>`
  551. 313.58 s [gammaloop-workspace-check] note: required by a bound in `std::iter::Iterator::collect`
  552. 313.58 s [gammaloop-workspace-check] --> /rustc/2d8144b7880597b6e6d3dfd63a9a9efae3f533d3/library/core/src/iter/traits/iterator.rs:2077:4
  553. 313.58 s [gammaloop-workspace-check] help: consider specifying the generic argument
  554. 313.58 s [gammaloop-workspace-check] |
  555. 313.58 s [gammaloop-workspace-check] 4098 | assert_eq!(orders, [1, 2].into_iter().collect::<Vec<_>>());
  556. 313.58 s [gammaloop-workspace-check] | ++++++++++
  557. 313.58 s [gammaloop-workspace-check]
  558. 313.59 s [gammaloop-workspace-check] error[E0283]: type annotations needed
  559. 313.59 s [gammaloop-workspace-check] --> crates/gammalooprs/src/processes/amplitude.rs:4098:59
  560. 313.59 s [gammaloop-workspace-check] |
  561. 313.59 s [gammaloop-workspace-check] 4098 | assert_eq!(orders, [1, 2].into_iter().collect());
  562. 313.59 s [gammaloop-workspace-check] | --------------------------------------^^^^^^^---
  563. 313.59 s [gammaloop-workspace-check] | | |
  564. 313.59 s [gammaloop-workspace-check] | | cannot infer type of the type parameter `B` declared on the method `collect`
  565. 313.59 s [gammaloop-workspace-check] | type must be known at this point
  566. 313.59 s [gammaloop-workspace-check] |
  567. 313.59 s [gammaloop-workspace-check] = note: multiple `impl`s satisfying `std::collections::BTreeSet<usize>: PartialEq<_>` found in the following crates: `alloc`, `rkyv`:
  568. 313.59 s [gammaloop-workspace-check] - impl<K, AK> PartialEq<rkyv::collections::btree_set::ArchivedBTreeSet<AK>> for std::collections::BTreeSet<K>
  569. 313.59 s [gammaloop-workspace-check] where AK: PartialEq<K>;
  570. 313.59 s [gammaloop-workspace-check] - impl<T, A> PartialEq for std::collections::BTreeSet<T, A>
  571. 313.59 s [gammaloop-workspace-check] where T: PartialEq, A: Allocator, A: Clone;
  572. 313.59 s [gammaloop-workspace-check] help: consider specifying the generic argument
  573. 313.59 s [gammaloop-workspace-check] |
  574. 313.59 s [gammaloop-workspace-check] 4098 | assert_eq!(orders, [1, 2].into_iter().collect::<Vec<_>>());
  575. 313.59 s [gammaloop-workspace-check] | ++++++++++
  576. 313.59 s [gammaloop-workspace-check]
  577. 313.61 s [gammaloop-workspace-check] error[E0283]: type annotations needed
  578. 313.61 s [gammaloop-workspace-check] --> crates/gammalooprs/src/processes/amplitude.rs:4129:48
  579. 313.61 s [gammaloop-workspace-check] |
  580. 313.61 s [gammaloop-workspace-check] 4123 | / assert_eq!(
  581. 313.61 s [gammaloop-workspace-check] 4124 | | evaluator
  582. 313.61 s [gammaloop-workspace-check] 4125 | | .evaluator_stacks
  583. 313.61 s [gammaloop-workspace-check] 4126 | | .keys()
  584. 313.61 s [gammaloop-workspace-check] ... |
  585. 313.61 s [gammaloop-workspace-check] 4129 | | [1, 2].into_iter().collect()
  586. 313.61 s [gammaloop-workspace-check] | | ^^^^^^^ cannot infer type of the type parameter `B` declared on the method `collect`
  587. 313.61 s [gammaloop-workspace-check] 4130 | | );
  588. 313.61 s [gammaloop-workspace-check] | |_________________________- type must be known at this point
  589. 313.61 s [gammaloop-workspace-check] |
  590. 313.61 s [gammaloop-workspace-check] = note: multiple `impl`s satisfying `std::collections::BTreeSet<usize>: PartialEq<_>` found in the following crates: `alloc`, `rkyv`:
  591. 313.61 s [gammaloop-workspace-check] - impl<K, AK> PartialEq<rkyv::collections::btree_set::ArchivedBTreeSet<AK>> for std::collections::BTreeSet<K>
  592. 313.61 s [gammaloop-workspace-check] where AK: PartialEq<K>;
  593. 313.61 s [gammaloop-workspace-check] - impl<T, A> PartialEq for std::collections::BTreeSet<T, A>
  594. 313.61 s [gammaloop-workspace-check] where T: PartialEq, A: Allocator, A: Clone;
  595. 313.61 s [gammaloop-workspace-check] help: consider specifying the generic argument
  596. 313.61 s [gammaloop-workspace-check] |
  597. 313.61 s [gammaloop-workspace-check] 4129 | [1, 2].into_iter().collect::<Vec<_>>()
  598. 313.61 s [gammaloop-workspace-check] | ++++++++++
  599. 313.61 s [gammaloop-workspace-check]
  600. 313.70 s [gammaloop-workspace-check] error[E0283]: type annotations needed
  601. 313.70 s [gammaloop-workspace-check] --> crates/gammalooprs/src/processes/amplitude.rs:4160:30
  602. 313.70 s [gammaloop-workspace-check] |
  603. 313.70 s [gammaloop-workspace-check] 4148 | / assert_eq!(
  604. 313.70 s [gammaloop-workspace-check] 4149 | | registry
  605. 313.70 s [gammaloop-workspace-check] 4150 | | .components
  606. 313.70 s [gammaloop-workspace-check] 4151 | | .iter()
  607. 313.70 s [gammaloop-workspace-check] ... |
  608. 313.70 s [gammaloop-workspace-check] 4160 | | .collect()
  609. 313.70 s [gammaloop-workspace-check] | | ^^^^^^^ cannot infer type of the type parameter `B` declared on the method `collect`
  610. 313.70 s [gammaloop-workspace-check] 4161 | | );
  611. 313.70 s [gammaloop-workspace-check] | |_________________________- type must be known at this point
  612. 313.70 s [gammaloop-workspace-check] |
  613. 313.70 s [gammaloop-workspace-check] = note: multiple `impl`s satisfying `std::collections::BTreeSet<processes::threshold_counterterms::ThresholdCountertermComponentKind>: PartialEq<_>` found in the following crates: `alloc`, `rkyv`:
  614. 313.70 s [gammaloop-workspace-check] - impl<K, AK> PartialEq<rkyv::collections::btree_set::ArchivedBTreeSet<AK>> for std::collections::BTreeSet<K>
  615. 313.70 s [gammaloop-workspace-check] where AK: PartialEq<K>;
  616. 313.70 s [gammaloop-workspace-check] - impl<T, A> PartialEq for std::collections::BTreeSet<T, A>
  617. 313.70 s [gammaloop-workspace-check] where T: PartialEq, A: Allocator, A: Clone;
  618. 313.70 s [gammaloop-workspace-check] help: consider specifying the generic argument
  619. 313.70 s [gammaloop-workspace-check] |
  620. 313.70 s [gammaloop-workspace-check] 4160 | .collect::<Vec<_>>()
  621. 313.70 s [gammaloop-workspace-check] | ++++++++++
  622. 313.70 s [gammaloop-workspace-check]
  623. 313.72 s [gammaloop-workspace-check] error[E0283]: type annotations needed
  624. 313.72 s [gammaloop-workspace-check] --> crates/gammalooprs/src/processes/amplitude.rs:4214:26
  625. 313.72 s [gammaloop-workspace-check] |
  626. 313.72 s [gammaloop-workspace-check] 4201 | / assert_eq!(
  627. 313.72 s [gammaloop-workspace-check] 4202 | | decomposition
  628. 313.72 s [gammaloop-workspace-check] 4203 | | .components
  629. 313.72 s [gammaloop-workspace-check] 4204 | | .iter()
  630. 313.72 s [gammaloop-workspace-check] ... |
  631. 313.72 s [gammaloop-workspace-check] 4214 | | .collect()
  632. 313.72 s [gammaloop-workspace-check] | | ^^^^^^^ cannot infer type of the type parameter `B` declared on the method `collect`
  633. 313.72 s [gammaloop-workspace-check] 4215 | | );
  634. 313.72 s [gammaloop-workspace-check] | |_____________________- type must be known at this point
  635. 313.72 s [gammaloop-workspace-check] |
  636. 313.72 s [gammaloop-workspace-check] = note: multiple `impl`s satisfying `std::collections::BTreeSet<processes::threshold_counterterms::ThresholdCountertermComponentKind>: PartialEq<_>` found in the following crates: `alloc`, `rkyv`:
  637. 313.72 s [gammaloop-workspace-check] - impl<K, AK> PartialEq<rkyv::collections::btree_set::ArchivedBTreeSet<AK>> for std::collections::BTreeSet<K>
  638. 313.72 s [gammaloop-workspace-check] where AK: PartialEq<K>;
  639. 313.72 s [gammaloop-workspace-check] - impl<T, A> PartialEq for std::collections::BTreeSet<T, A>
  640. 313.72 s [gammaloop-workspace-check] where T: PartialEq, A: Allocator, A: Clone;
  641. 313.72 s [gammaloop-workspace-check] help: consider specifying the generic argument
  642. 313.72 s [gammaloop-workspace-check] |
  643. 313.72 s [gammaloop-workspace-check] 4214 | .collect::<Vec<_>>()
  644. 313.72 s [gammaloop-workspace-check] | ++++++++++
  645. 313.72 s [gammaloop-workspace-check]
  646. 313.83 s [gammaloop-workspace-check] error[E0277]: can't compare `std::option::Option<&[linnet::half_edge::involution::EdgeIndex]>` with `std::option::Option<&[linnet::half_edge::involution::EdgeIndex; 1]>`
  647. 313.83 s [gammaloop-workspace-check] --> crates/gammalooprs/src/processes/cross_section/ir_safe_threshold_fixture_tests.rs:817:25
  648. 313.83 s [gammaloop-workspace-check] |
  649. 313.83 s [gammaloop-workspace-check] 816 | .any(|variant| variant.requested_subspace.as_deref()
  650. 313.83 s [gammaloop-workspace-check] | -------------------------------------
  651. 313.83 s [gammaloop-workspace-check] 817 | == Some(&[EdgeIndex::from(3)])),
  652. 313.83 s [gammaloop-workspace-check] | ^^ ---------------------------
  653. 313.83 s [gammaloop-workspace-check] | |
  654. 313.83 s [gammaloop-workspace-check] | no implementation for `std::option::Option<&[linnet::half_edge::involution::EdgeIndex]> == std::option::Option<&[linnet::half_edge::involution::EdgeIndex; 1]>`
  655. 313.83 s [gammaloop-workspace-check] |
  656. 313.83 s [gammaloop-workspace-check] = help: the trait `PartialEq<std::option::Option<&[linnet::half_edge::involution::EdgeIndex; 1]>>` is not implemented for `std::option::Option<&[linnet::half_edge::involution::EdgeIndex]>`
  657. 313.83 s [gammaloop-workspace-check] help: the following other types implement trait `PartialEq<Rhs>`
  658. 313.83 s [gammaloop-workspace-check] --> /nix/store/8zq9ya5slh345hbylmsibxw827bi98w0-vendor-cargo-deps/c19b7c6f923b580ac259164a89f2577984ad5ab09ee9d583b888f934adbbe8d0/rkyv-0.7.46/src/impls/alloc/niche.rs:24:1
  659. 313.83 s [gammaloop-workspace-check] |
  660. 313.83 s [gammaloop-workspace-check] 24 | / impl<T, U> PartialEq<ArchivedOptionBox<T>> for Option<Box<U>>
  661. 313.83 s [gammaloop-workspace-check] 25 | | where
  662. 313.83 s [gammaloop-workspace-check] 26 | | T: ArchivePointee + PartialEq<U> + ?Sized,
  663. 313.83 s [gammaloop-workspace-check] 27 | | U: ?Sized,
  664. 313.83 s [gammaloop-workspace-check] | |______________^ `std::option::Option<Box<U>>` implements `PartialEq<rkyv::niche::option_box::ArchivedOptionBox<T>>`
  665. 313.83 s [gammaloop-workspace-check] --> /rustc/2d8144b7880597b6e6d3dfd63a9a9efae3f533d3/library/core/src/option.rs:2434:0
  666. 313.83 s [gammaloop-workspace-check] |
  667. 313.83 s [gammaloop-workspace-check] = note: `std::option::Option<T>` implements `PartialEq`
  668. 313.83 s [gammaloop-workspace-check] |
  669. 313.83 s [gammaloop-workspace-check] ::: /nix/store/8zq9ya5slh345hbylmsibxw827bi98w0-vendor-cargo-deps/c19b7c6f923b580ac259164a89f2577984ad5ab09ee9d583b888f934adbbe8d0/rkyv-0.7.46/src/option.rs:210:1
  670. 313.83 s [gammaloop-workspace-check] |
  671. 313.83 s [gammaloop-workspace-check] 210 | impl<T: PartialEq<U>, U> PartialEq<ArchivedOption<T>> for Option<U> {
  672. 313.83 s [gammaloop-workspace-check] | ^^^^^^^^^^^^^^^^^^^^^^^^^^^^^^^^^^^^^^^^^^^^^^^^^^^^^^^^^^^^^^^^^^^ `std::option::Option<U>` implements `PartialEq<rkyv::option::ArchivedOption<T>>`
  673. 313.83 s [gammaloop-workspace-check]
  674. 314.35 s [gammaloop-workspace-check] error[E0283]: type annotations needed
  675. 314.35 s [gammaloop-workspace-check] --> crates/gammalooprs/src/processes/no_directive_equivalence_tests.rs:459:43
  676. 314.35 s [gammaloop-workspace-check] |
  677. 314.35 s [gammaloop-workspace-check] 459 | (0..graph.cuts.len()).collect(),
  678. 314.35 s [gammaloop-workspace-check] | ^^^^^^^ cannot infer type of the type parameter `B` declared on the method `collect`
  679. 314.35 s [gammaloop-workspace-check] |
  680. 314.35 s [gammaloop-workspace-check] = note: multiple `impl`s satisfying `_: FromIterator<usize>` found in the following crates: `spenso`, `tabled`:
  681. 314.35 s [gammaloop-workspace-check] - impl FromIterator<usize> for ExpandedIndex;
  682. 314.35 s [gammaloop-workspace-check] - impl FromIterator<usize> for HeightList;
  683. 314.35 s [gammaloop-workspace-check] - impl FromIterator<usize> for WidthList;
  684. 314.35 s [gammaloop-workspace-check] note: required by a bound in `std::iter::Iterator::collect`
  685. 314.35 s [gammaloop-workspace-check] --> /rustc/2d8144b7880597b6e6d3dfd63a9a9efae3f533d3/library/core/src/iter/traits/iterator.rs:2077:4
  686. 314.35 s [gammaloop-workspace-check] help: consider specifying the generic argument
  687. 314.35 s [gammaloop-workspace-check] |
  688. 314.35 s [gammaloop-workspace-check] 459 | (0..graph.cuts.len()).collect::<Vec<_>>(),
  689. 314.35 s [gammaloop-workspace-check] | ++++++++++
  690. 314.35 s [gammaloop-workspace-check]
  691. 314.35 s [gammaloop-workspace-check] error[E0283]: type annotations needed
  692. 314.35 s [gammaloop-workspace-check] --> crates/gammalooprs/src/processes/no_directive_equivalence_tests.rs:459:43
  693. 314.35 s [gammaloop-workspace-check] |
  694. 314.35 s [gammaloop-workspace-check] 457 | / assert_eq!(
  695. 314.35 s [gammaloop-workspace-check] 458 | | grouped_cut_ids,
  696. 314.35 s [gammaloop-workspace-check] 459 | | (0..graph.cuts.len()).collect(),
  697. 314.35 s [gammaloop-workspace-check] | | ^^^^^^^ cannot infer type of the type parameter `B` declared on the method `collect`
  698. 314.35 s [gammaloop-workspace-check] 460 | | "every discovered process-valid cut must remain in the numerical LU evaluation",
  699. 314.35 s [gammaloop-workspace-check] 461 | | );
  700. 314.35 s [gammaloop-workspace-check] | |_________________- type must be known at this point
  701. 314.35 s [gammaloop-workspace-check] |
  702. 314.35 s [gammaloop-workspace-check] = note: multiple `impl`s satisfying `std::collections::BTreeSet<usize>: PartialEq<_>` found in the following crates: `alloc`, `rkyv`:
  703. 314.35 s [gammaloop-workspace-check] - impl<K, AK> PartialEq<rkyv::collections::btree_set::ArchivedBTreeSet<AK>> for std::collections::BTreeSet<K>
  704. 314.35 s [gammaloop-workspace-check] where AK: PartialEq<K>;
  705. 314.35 s [gammaloop-workspace-check] - impl<T, A> PartialEq for std::collections::BTreeSet<T, A>
  706. 314.35 s [gammaloop-workspace-check] where T: PartialEq, A: Allocator, A: Clone;
  707. 314.35 s [gammaloop-workspace-check] help: consider specifying the generic argument
  708. 314.35 s [gammaloop-workspace-check] |
  709. 314.35 s [gammaloop-workspace-check] 459 | (0..graph.cuts.len()).collect::<Vec<_>>(),
  710. 314.35 s [gammaloop-workspace-check] | ++++++++++
  711. 314.35 s [gammaloop-workspace-check]
  712. 314.37 s [gammaloop-workspace-check] error[E0283]: type annotations needed
  713. 314.37 s [gammaloop-workspace-check] --> crates/gammalooprs/src/processes/raised_cross_section_tests.rs:150:31
  714. 314.37 s [gammaloop-workspace-check] |
  715. 314.37 s [gammaloop-workspace-check] 150 | (0..graph.cuts.len()).collect(),
  716. 314.37 s [gammaloop-workspace-check] | ^^^^^^^ cannot infer type of the type parameter `B` declared on the method `collect`
  717. 314.37 s [gammaloop-workspace-check] |
  718. 314.37 s [gammaloop-workspace-check] = note: multiple `impl`s satisfying `_: FromIterator<usize>` found in the following crates: `spenso`, `tabled`:
  719. 314.37 s [gammaloop-workspace-check] - impl FromIterator<usize> for ExpandedIndex;
  720. 314.37 s [gammaloop-workspace-check] - impl FromIterator<usize> for HeightList;
  721. 314.37 s [gammaloop-workspace-check] - impl FromIterator<usize> for WidthList;
  722. 314.37 s [gammaloop-workspace-check] note: required by a bound in `std::iter::Iterator::collect`
  723. 314.37 s [gammaloop-workspace-check] --> /rustc/2d8144b7880597b6e6d3dfd63a9a9efae3f533d3/library/core/src/iter/traits/iterator.rs:2077:4
  724. 314.37 s [gammaloop-workspace-check] help: consider specifying the generic argument
  725. 314.37 s [gammaloop-workspace-check] |
  726. 314.37 s [gammaloop-workspace-check] 150 | (0..graph.cuts.len()).collect::<Vec<_>>(),
  727. 314.37 s [gammaloop-workspace-check] | ++++++++++
  728. 314.37 s [gammaloop-workspace-check]
  729. 314.38 s [gammaloop-workspace-check] error[E0283]: type annotations needed
  730. 314.38 s [gammaloop-workspace-check] --> crates/gammalooprs/src/processes/raised_cross_section_tests.rs:150:31
  731. 314.38 s [gammaloop-workspace-check] |
  732. 314.38 s [gammaloop-workspace-check] 148 | / assert_eq!(
  733. 314.38 s [gammaloop-workspace-check] 149 | | grouped_cut_ids,
  734. 314.38 s [gammaloop-workspace-check] 150 | | (0..graph.cuts.len()).collect(),
  735. 314.38 s [gammaloop-workspace-check] | | ^^^^^^^ cannot infer type of the type parameter `B` declared on the method `collect`
  736. 314.38 s [gammaloop-workspace-check] 151 | | "every discovered process-valid cut must remain in the numerical LU evaluation",
  737. 314.38 s [gammaloop-workspace-check] 152 | | );
  738. 314.38 s [gammaloop-workspace-check] | |_____- type must be known at this point
  739. 314.38 s [gammaloop-workspace-check] |
  740. 314.38 s [gammaloop-workspace-check] = note: multiple `impl`s satisfying `std::collections::BTreeSet<usize>: PartialEq<_>` found in the following crates: `alloc`, `rkyv`:
  741. 314.38 s [gammaloop-workspace-check] - impl<K, AK> PartialEq<rkyv::collections::btree_set::ArchivedBTreeSet<AK>> for std::collections::BTreeSet<K>
  742. 314.38 s [gammaloop-workspace-check] where AK: PartialEq<K>;
  743. 314.38 s [gammaloop-workspace-check] - impl<T, A> PartialEq for std::collections::BTreeSet<T, A>
  744. 314.38 s [gammaloop-workspace-check] where T: PartialEq, A: Allocator, A: Clone;
  745. 314.38 s [gammaloop-workspace-check] help: consider specifying the generic argument
  746. 314.38 s [gammaloop-workspace-check] |
  747. 314.38 s [gammaloop-workspace-check] 150 | (0..graph.cuts.len()).collect::<Vec<_>>(),
  748. 314.38 s [gammaloop-workspace-check] | ++++++++++
  749. 314.38 s [gammaloop-workspace-check]
  750. 320.41 s [gammaloop-workspace-check] warning: method `lu_prefactor_helper` is never used
  751. 320.41 s [gammaloop-workspace-check] --> crates/gammalooprs/src/processes/cross_section.rs:1965:8
  752. 320.41 s [gammaloop-workspace-check] |
  753. 320.41 s [gammaloop-workspace-check] 1429 | impl CrossSectionGraph {
  754. 320.41 s [gammaloop-workspace-check] | ---------------------- method in this implementation
  755. 320.41 s [gammaloop-workspace-check] ...
  756. 320.41 s [gammaloop-workspace-check] 1965 | fn lu_prefactor_helper(&self) -> Atom {
  757. 320.41 s [gammaloop-workspace-check] | ^^^^^^^^^^^^^^^^^^^
  758. 320.41 s [gammaloop-workspace-check] |
  759. 320.41 s [gammaloop-workspace-check] = note: `#[warn(dead_code)]` (part of `#[warn(unused)]`) on by default
  760. 320.41 s [gammaloop-workspace-check]
  761. 323.37 s [gammaloop-workspace-check] warning: `gammalooprs` (lib) generated 1 warning
  762. 328.10 s [gammaloop-workspace-check] Some errors have detailed explanations: E0277, E0283.
  763. 328.10 s [gammaloop-workspace-check] For more information about an error, try `rustc --explain E0277`.
  764. 328.22 s [gammaloop-workspace-check] error: could not compile `gammalooprs` (lib test) due to 16 previous errors
  765. 328.22 s [gammaloop-workspace-check] warning: build failed, waiting for other jobs to finish...
  766. 330.82 s Progress: 0 of 1 built (1 failed)
  767. 330.82 s Failed to build gammaloop-workspace-check after 5m25s
  768. 330.83 s Cannot build '/nix/store/bcqc79if6hchn98779cm1bksy0kvkzh2-gammaloop-workspace-check-0.1.0.drv'.
  769. 330.83 s Reason: builder failed with exit code 101.
  770. 330.83 s Output paths:
  771. 330.83 s /nix/store/5icl4qp5m7zfzfy0j18qvwvxghnximcs-gammaloop-workspace-check-0.1.0
  772. 330.83 s Last 762 log lines:
  773. 330.83 s > Running phase: unpackPhase
  774. 330.83 s > unpacking source archive /nix/store/bcy0vqqk2ibk38nik2bb809ck03m92g2-source
  775. 330.83 s > source root is source
  776. 330.83 s > Running phase: patchPhase
  777. 330.83 s > Executing configureCargoCommonVars
  778. 330.83 s > decompressing cargo artifacts from /nix/store/wxpx6lf642pgxp2wz1pw1lxksj5p1wb0-gammaloop-workspace-deps-deps-0.1.0/target.tar.zst to target
  779. 330.83 s > Running phase: updateAutotoolsGnuConfigScriptsPhase
  780. 330.83 s > Running phase: configurePhase
  781. 330.83 s > will append /build/source/.cargo-home/config.toml with contents of /nix/store/8zq9ya5slh345hbylmsibxw827bi98w0-vendor-cargo-deps/config.toml
  782. 330.83 s > default configurePhase, nothing to do
  783. 330.83 s > Running phase: buildPhase
  784. 330.83 s > +++ command cargo --version
  785. 330.83 s > cargo 1.97.0 (c980f4866 2026-06-30)
  786. 330.83 s > +++ command cargo check --profile ci-optim --locked --workspace --features gammaloop-tracing-filter/clap,gammaloop-tracing-filter/symbolica,idenso/bincode,idenso/reference-cases,linnet/bincode,linnet/drawing,linnet/rkyv,linnet/serde,linnet/symbolica,spenso-macros/shadowing,spenso/shadowing,symbolica/tracing_max_level_info,three-dimensional-reps/display,three-dimensional-reps/eval,three-dimensional-reps/serde --all-targets
  787. 330.83 s > Checking serde_core v1.0.228
  788. 330.83 s > Checking libc v0.2.186
  789. 330.83 s > Checking cfg-if v1.0.4
  790. 330.83 s > Checking memchr v2.8.0
  791. 330.83 s > Checking once_cell v1.21.4
  792. 330.83 s > Checking either v1.15.0
  793. 330.83 s > Checking itoa v1.0.18
  794. 330.83 s > Checking libm v0.2.16
  795. 330.83 s > Checking log v0.4.29
  796. 330.83 s > Checking zerocopy v0.8.48
  797. 330.83 s > Checking regex-syntax v0.8.10
  798. 330.83 s > Checking crossbeam-utils v0.8.21
  799. 330.83 s > Checking equivalent v1.0.2
  800. 330.83 s > Checking zmij v1.0.21
  801. 330.83 s > Checking bytemuck v1.25.0
  802. 330.83 s > Checking lazy_static v1.5.0
  803. 330.83 s > Compiling target-lexicon v0.13.5
  804. 330.83 s > Checking arrayvec v0.7.6
  805. 330.83 s > Checking powerfmt v0.2.0
  806. 330.83 s > Checking safe_arch v0.7.4
  807. 330.83 s > Checking time-core v0.1.8
  808. 330.83 s > Checking num-conv v0.2.1
  809. 330.83 s > Checking num_threads v0.1.7
  810. 330.83 s > Checking deranged v0.5.8
  811. 330.83 s > Checking pin-project-lite v0.2.17
  812. 330.83 s > Checking allocator-api2 v0.2.21
  813. 330.83 s > Checking foldhash v0.2.0
  814. 330.83 s > Checking itertools v0.14.0
  815. 330.83 s > Checking tracing-core v0.1.36
  816. 330.83 s > Checking const-random v0.1.18
  817. 330.83 s > Checking aho-corasick v1.1.4
  818. 330.83 s > Checking static_assertions v1.1.0
  819. 330.83 s > Checking nu-ansi-term v0.50.3
  820. 330.83 s > Checking unty v0.0.4
  821. 330.83 s > Checking winnow v1.0.2
  822. 330.83 s > Checking sharded-slab v0.1.7
  823. 330.83 s > Checking hashbrown v0.16.1
  824. 330.83 s > Checking getrandom v0.3.4
  825. 330.83 s > Checking wide v0.7.33
  826. 330.83 s > Checking gmp-mpfr-sys v1.7.1
  827. 330.83 s > Checking crossbeam-epoch v0.9.18
  828. 330.83 s > Checking rand_core v0.9.5
  829. 330.83 s > Checking safe_arch v1.0.0
  830. 330.83 s > Checking tracing v0.1.44
  831. 330.83 s > Checking tracing-log v0.2.0
  832. 330.83 s > Checking thread_local v1.1.9
  833. 330.83 s > Checking toml_writer v1.1.1+spec-1.1.0
  834. 330.83 s > Checking indenter v0.3.4
  835. 330.83 s > Checking az v1.3.0
  836. 330.83 s > Checking crossbeam-deque v0.8.6
  837. 330.83 s > Compiling phf_shared v0.11.3
  838. 330.83 s > Checking anyhow v1.0.102
  839. 330.83 s > Checking alloc-no-stdlib v2.0.4
  840. 330.83 s > Checking utf8parse v0.2.2
  841. 330.83 s > Checking rayon-core v1.13.0
  842. 330.83 s > Checking rawpointer v0.2.1
  843. 330.83 s > Checking dyn-clone v1.0.20
  844. 330.83 s > Checking anstyle-parse v1.0.0
  845. 330.83 s > Checking matrixmultiply v0.3.10
  846. 330.83 s > Checking alloc-stdlib v0.2.2
  847. 330.83 s > Checking wide v1.3.0
  848. 330.83 s > Checking colored v3.1.1
  849. 330.83 s > Checking anstyle v1.0.14
  850. 330.83 s > Checking is_terminal_polyfill v1.70.2
  851. 330.83 s > Checking colorchoice v1.0.5
  852. 330.83 s > Checking anstyle-query v1.1.5
  853. 330.83 s > Checking num-traits v0.2.19
  854. 330.83 s > Checking time v0.3.47
  855. 330.83 s > Compiling phf_generator v0.11.3
  856. 330.83 s > Checking eyre v0.6.12
  857. 330.83 s > Checking rayon v1.12.0
  858. 330.83 s > Checking unicode-width v0.2.2
  859. 330.83 s > Checking bitflags v1.3.2
  860. 330.83 s > Compiling phf_codegen v0.11.3
  861. 330.83 s > Checking toml_parser v1.1.2+spec-1.1.0
  862. 330.83 s > Compiling pyo3-build-config v0.28.3
  863. 330.83 s > Checking region v3.0.2
  864. 330.83 s > Checking brotli-decompressor v5.0.0
  865. 330.83 s > Checking anstream v1.0.0
  866. 330.83 s > Checking wasmtime-jit-icache-coherence v34.0.2
  867. 330.83 s > Checking hugepage-rs v0.1.1
  868. 330.83 s > Checking inventory v0.3.24
  869. 330.83 s > Checking regex-automata v0.4.14
  870. 330.83 s > Checking spec_math v0.1.6
  871. 330.83 s > Checking thiserror v2.0.18
  872. 330.83 s > Compiling getopts v0.2.24
  873. 330.83 s > Checking libloading v0.9.0
  874. 330.83 s > Checking approx v0.5.1
  875. 330.83 s > Checking num-integer v0.1.46
  876. 330.83 s > Checking append-only-vec v0.1.8
  877. 330.83 s > Checking byteorder v1.5.0
  878. 330.83 s > Checking tinyjson v2.5.1
  879. 330.83 s > Checking bytes v1.11.1
  880. 330.83 s > Checking self_cell v1.2.2
  881. 330.83 s > Compiling unic-common v0.9.0
  882. 330.83 s > Compiling unic-char-range v0.9.0
  883. 330.83 s > Checking linux-raw-sys v0.12.1
  884. 330.83 s > Compiling unic-char-property v0.9.0
  885. 330.83 s > Compiling unicode_names2_generator v1.3.0
  886. 330.83 s > Compiling unic-ucd-version v0.9.0
  887. 330.83 s > Compiling rustpython-parser-vendored v0.4.0
  888. 330.83 s > Compiling is-macro v0.3.7
  889. 330.83 s > Checking iana-time-zone v0.1.65
  890. 330.83 s > Compiling rustpython-parser v0.4.0
  891. 330.83 s > Checking serde v1.0.228
  892. 330.83 s > Checking serde_json v1.0.149
  893. 330.83 s > Checking bitflags v2.11.1
  894. 330.83 s > Checking serde_spanned v1.1.1
  895. 330.83 s > Checking toml_datetime v1.1.1+spec-1.1.0
  896. 330.83 s > Checking brotli v8.0.2
  897. 330.83 s > Checking rustix v1.1.4
  898. 330.83 s > Compiling phf v0.11.3
  899. 330.83 s > Checking rustc-hash v2.1.2
  900. 330.83 s > Compiling unic-ucd-ident v0.9.0
  901. 330.83 s > Checking toml v1.1.2+spec-1.1.0
  902. 330.83 s > Compiling unic-emoji-char v0.9.0
  903. 330.83 s > Compiling rustc-hash v1.1.0
  904. 330.83 s > Compiling lalrpop-util v0.20.2
  905. 330.83 s > Checking unicode-segmentation v1.13.2
  906. 330.83 s > Compiling symbolica v2.2.0 (https://github.com/alphal00p/symbolica?rev=4d0a833eb8e059d1f95bdae5abed2559830b235f#4d0a833e)
  907. 330.83 s > Checking smallvec v1.15.1
  908. 330.83 s > Checking num-complex v0.4.6
  909. 330.83 s > Checking tracing-serde v0.2.0
  910. 330.83 s > Checking bincode v2.0.1
  911. 330.83 s > Checking smartstring v1.0.1
  912. 330.83 s > Checking chrono v0.4.44
  913. 330.83 s > Checking simba v0.9.1
  914. 330.83 s > Checking ndarray v0.17.2
  915. 330.83 s > Checking rug v1.30.0
  916. 330.83 s > Checking typenum v1.20.0
  917. 330.83 s > Checking getrandom v0.2.17
  918. 330.83 s > Checking scopeguard v1.2.0
  919. 330.83 s > Checking lock_api v0.4.14
  920. 330.83 s > Checking parking_lot_core v0.9.12
  921. 330.83 s > Checking unicode-ident v1.0.24
  922. 330.83 s > Checking hashbrown v0.17.0
  923. 330.83 s > Checking parking_lot v0.12.5
  924. 330.83 s > Checking errno v0.3.14
  925. 330.83 s > Checking clap_lex v1.1.0
  926. 330.83 s > Checking ppv-lite86 v0.2.21
  927. 330.83 s > Checking ahash v0.8.12
  928. 330.83 s > Checking strsim v0.11.1
  929. 330.83 s > Checking generic-array v0.14.7
  930. 330.83 s > Checking unicase v2.9.0
  931. 330.83 s > Checking signal-hook-registry v1.4.8
  932. 330.83 s > Checking vte v0.14.1
  933. 330.83 s > Checking indexmap v2.14.0
  934. 330.83 s > Checking same-file v1.0.6
  935. 330.83 s > Checking matchers v0.2.0
  936. 330.83 s > Checking regex v1.12.3
  937. 330.83 s > Checking signal-hook v0.3.18
  938. 330.83 s > Checking rand_chacha v0.9.0
  939. 330.83 s > Checking walkdir v2.5.0
  940. 330.83 s > Checking half v2.7.1
  941. 330.83 s > Checking terminal_size v0.4.4
  942. 330.83 s > Checking block-buffer v0.10.4
  943. 330.83 s > Checking clap_builder v4.6.0
  944. 330.83 s > Checking rand v0.9.4
  945. 330.83 s > Checking tracing-subscriber v0.3.23
  946. 330.83 s > Checking crypto-common v0.1.7
  947. 330.83 s > Checking mio v1.2.0
  948. 330.83 s > Checking ciborium-io v0.2.2
  949. 330.83 s > Checking minimal-lexical v0.2.1
  950. 330.83 s > Checking derive_more v2.1.1
  951. 330.83 s > Checking digest v0.10.7
  952. 330.83 s > Checking ciborium-ll v0.2.2
  953. 330.83 s > Checking nom v7.1.3
  954. 330.83 s > Checking num-bigint v0.4.6
  955. 330.83 s > Checking signal-hook-mio v0.2.5
  956. 330.83 s > Checking console v0.16.3
  957. 330.83 s > Checking symjit v2.21.0
  958. 330.83 s > Checking bstr v1.12.1
  959. 330.83 s > Checking cpufeatures v0.2.17
  960. 330.83 s > Checking linux-raw-sys v0.4.15
  961. 330.83 s > Checking winnow v0.7.15
  962. 330.83 s > Checking sha2 v0.10.9
  963. 330.83 s > Checking globset v0.4.18
  964. 330.83 s > Checking ciborium v0.2.2
  965. 330.83 s > Checking rustix v0.38.44
  966. 330.83 s > Compiling unicode_names2 v1.3.0
  967. 330.83 s > Checking getrandom v0.4.2
  968. 330.83 s > Checking rand_core v0.6.4
  969. 330.83 s > Checking fastrand v2.4.1
  970. 330.83 s > Checking plotters-backend v0.3.7
  971. 330.83 s > Checking fnv v1.0.7
  972. 330.83 s > Checking plotters-svg v0.3.7
  973. 330.83 s > Checking clap v4.6.1
  974. 330.83 s > Checking rust-embed-utils v8.11.0
  975. 330.83 s > Checking crossterm v0.28.1
  976. 330.83 s > Checking tempfile v3.27.0
  977. 330.83 s > Checking serde_spanned v0.6.9
  978. 330.83 s > Checking toml_datetime v0.6.11
  979. 330.83 s > Checking itertools v0.10.5
  980. 330.83 s > Checking cast v0.3.0
  981. 330.83 s > Checking tap v1.0.1
  982. 330.83 s > Checking toml_write v0.1.2
  983. 330.83 s > Checking wyz v0.5.1
  984. 330.83 s > Checking ansitok v0.3.0
  985. 330.83 s > Checking rand_chacha v0.3.1
  986. 330.83 s > Checking plotters v0.3.7
  987. 330.83 s > Checking tinytemplate v1.2.1
  988. 330.83 s > Checking radium v0.7.0
  989. 330.83 s > Checking typeid v1.0.3
  990. 330.83 s > Checking similar v2.7.0
  991. 330.83 s > Checking is-terminal v0.4.17
  992. 330.83 s > Checking oorandom v11.1.5
  993. 330.83 s > Checking bytecount v0.6.9
  994. 330.83 s > Checking toml_edit v0.22.27
  995. 330.83 s > Checking anes v0.1.6
  996. 330.83 s > Checking ansi-str v0.9.0
  997. 330.83 s > Checking funty v2.0.0
  998. 330.83 s > Checking testing_table v0.3.0
  999. 330.83 s > Checking ron v0.12.1
  1000. 330.83 s > Checking rand v0.8.6
  1001. 330.83 s > Checking papergrid v0.17.0
  1002. 330.83 s > Checking toml_edit v0.25.11+spec-1.1.0
  1003. 330.83 s > Checking criterion-plot v0.5.0
  1004. 330.83 s > Compiling pyo3-macros-backend v0.28.3
  1005. 330.83 s > Compiling pyo3-ffi v0.28.3
  1006. 330.83 s > Compiling pyo3 v0.28.3
  1007. 330.83 s > Compiling numpy v0.28.0
  1008. 330.83 s > Checking bitvec v1.0.1
  1009. 330.83 s > Checking criterion v0.5.1
  1010. 330.83 s > Checking env_filter v1.0.1
  1011. 330.83 s > Checking uncased v0.9.10
  1012. 330.83 s > Checking xprec v0.2.2
  1013. 330.83 s > Checking toml v0.8.23
  1014. 330.83 s > Checking jiff v0.2.24
  1015. 330.83 s > Checking insta v1.47.2
  1016. 330.83 s > Checking ptr_meta v0.1.4
  1017. 330.83 s > Checking tabled v0.20.0
  1018. 330.83 s > Checking ucd-trie v0.1.7
  1019. 330.83 s > Checking simdutf8 v0.1.5
  1020. 330.83 s > Checking ahash v0.7.8
  1021. 330.83 s > Checking pest v2.8.6
  1022. 330.83 s > Checking approx v0.4.0
  1023. 330.83 s > Checking seahash v4.1.0
  1024. 330.83 s > Checking cgmath v0.18.0
  1025. 330.83 s > Checking num-rational v0.4.2
  1026. 330.83 s > Checking num-iter v0.1.45
  1027. 330.83 s > Checking bytecheck v0.6.12
  1028. 330.83 s > Checking hashbrown v0.12.3
  1029. 330.83 s > Checking ref-ops v0.2.5
  1030. 330.83 s > Checking num v0.4.3
  1031. 330.83 s > Checking rand_xoshiro v0.6.0
  1032. 330.83 s > Checking features v0.10.0
  1033. 330.83 s > Checking constcat v0.5.1
  1034. 330.83 s > Checking gat-lending-iterator v0.1.8
  1035. 330.83 s > Checking rend v0.4.2
  1036. 330.83 s > Checking colored v2.2.0
  1037. 330.83 s > Checking figment v0.10.19
  1038. 330.83 s > Checking arrayref v0.3.9
  1039. 330.83 s > Checking constant_time_eq v0.4.2
  1040. 330.83 s > Checking cpufeatures v0.3.0
  1041. 330.83 s > Checking base64 v0.22.1
  1042. 330.83 s > Checking blake3 v1.8.5
  1043. 330.83 s > Checking siphasher v1.0.2
  1044. 330.83 s > Checking joinery v2.1.0
  1045. 330.83 s > Checking phf_shared v0.13.1
  1046. 330.83 s > Checking titlecase v2.2.1
  1047. 330.83 s > Checking rust_lisp v0.18.0
  1048. 330.83 s > Checking subprocess v0.2.15
  1049. 330.83 s > Compiling vakint v0.1.2 (/build/source/crates/vakint)
  1050. 330.83 s > Checking phf v0.13.1
  1051. 330.83 s > Checking version-compare v0.2.1
  1052. 330.83 s > Checking xpct v0.5.1
  1053. 330.83 s > Checking ryu v1.0.23
  1054. 330.83 s > Checking castaway v0.2.4
  1055. 330.83 s > Checking toml_datetime v0.7.5+spec-1.1.0
  1056. 330.83 s > Checking strum v0.27.2
  1057. 330.83 s > Checking toml v0.9.12+spec-1.1.0
  1058. 330.83 s > Checking compact_str v0.9.0
  1059. 330.83 s > Compiling rustpython-parser-core v0.4.0
  1060. 330.83 s > Checking string-template-plus v0.4.3
  1061. 330.83 s > Checking unicode-truncate v2.0.1
  1062. 330.83 s > Compiling rustpython-ast v0.4.0
  1063. 330.83 s > Checking kasuari v0.4.12
  1064. 330.83 s > Checking lru v0.16.4
  1065. 330.83 s > Checking vte v0.15.0
  1066. 330.83 s > Checking portable-atomic v1.13.1
  1067. 330.83 s > Checking unit-prefix v0.5.2
  1068. 330.83 s > Checking rand_distr v0.4.3
  1069. 330.83 s > Checking simba v0.6.0
  1070. 330.83 s > Checking vt100 v0.16.2
  1071. 330.83 s > Checking line-clipping v0.3.7
  1072. 330.83 s > Compiling three-dimensional-reps v0.1.0 (/build/source/crates/three-dimensional-reps)
  1073. 330.83 s > Checking gimli v0.32.3
  1074. 330.83 s > Checking adler2 v2.0.1
  1075. 330.83 s > Checking thiserror v1.0.69
  1076. 330.83 s > Checking miniz_oxide v0.8.9
  1077. 330.83 s > Checking derive_builder v0.11.2
  1078. 330.83 s > Checking ratatui-core v0.1.0
  1079. 330.83 s > Checking object v0.37.3
  1080. 330.83 s > Checking crossterm v0.29.0
  1081. 330.83 s > Checking dot-parser v0.5.1
  1082. 330.83 s > Checking owo-colors v4.3.0
  1083. 330.83 s > Checking tracing-error v0.2.1
  1084. 330.83 s > Checking typed-index-collections v3.5.0
  1085. 330.83 s > Checking indicatif v0.18.4
  1086. 330.83 s > Checking serde-big-array v0.5.1
  1087. 330.83 s > Checking amd v0.2.2
  1088. 330.83 s > Checking itertools v0.11.0
  1089. 330.83 s > Compiling gammaloop-tracing-filter-macros v0.1.0 (/build/source/crates/gammaloop-tracing-filter-macros)
  1090. 330.83 s > Checking option-ext v0.2.0
  1091. 330.83 s > Checking rustc-demangle v0.1.27
  1092. 330.83 s > Checking dirs-sys v0.5.0
  1093. 330.83 s > Checking ref-cast v1.0.25
  1094. 330.83 s > Checking nix v0.31.2
  1095. 330.83 s > Checking color-spantrace v0.3.0
  1096. 330.83 s > Checking integer-sqrt v0.1.5
  1097. 330.83 s > Checking brotli-decompressor v4.0.3
  1098. 330.83 s > Checking crossbeam-channel v0.5.15
  1099. 330.83 s > Checking itertools v0.12.1
  1100. 330.83 s > Checking ratatui-widgets v0.3.0
  1101. 330.83 s > Checking ratatui-crossterm v0.1.0
  1102. 330.83 s > Compiling gammalooprs v0.3.4 (/build/source/crates/gammalooprs)
  1103. 330.83 s > Checking unsafe-libyaml v0.2.11
  1104. 330.83 s > Checking symlink v0.1.0
  1105. 330.83 s > Checking tracing-appender v0.2.5
  1106. 330.83 s > Checking ctrlc v3.5.2
  1107. 330.83 s > Checking include_dir v0.7.4
  1108. 330.83 s > Checking addr2line v0.25.1
  1109. 330.83 s > Checking tracing-indicatif v0.3.14
  1110. 330.83 s > Checking pathfinding v4.15.0
  1111. 330.83 s > Checking schemars v1.2.1
  1112. 330.83 s > Checking brotli v7.0.0
  1113. 330.83 s > Checking clarabel v0.11.1
  1114. 330.83 s > Checking dirs v6.0.0
  1115. 330.83 s > Checking slotmap v1.1.1
  1116. 330.83 s > Checking env_logger v0.11.10
  1117. 330.83 s > Checking json5 v0.4.1
  1118. 330.83 s > Checking vectorize v0.2.0
  1119. 330.83 s > Checking base62 v2.2.4
  1120. 330.83 s > Checking ringbuffer v0.16.0
  1121. 330.83 s > Checking serde_yaml v0.9.34+deprecated
  1122. 330.83 s > Checking rust-embed v8.11.0
  1123. 330.83 s > Checking clap_complete v4.6.3
  1124. 330.83 s > Checking fd-lock v4.0.4
  1125. 330.83 s > Checking strip-ansi-escapes v0.2.1
  1126. 330.83 s > Compiling gammaloop-api v0.1.0 (/build/source/crates/gammaloop-api)
  1127. 330.83 s > Checking rkyv v0.7.46
  1128. 330.83 s > Checking itertools v0.13.0
  1129. 330.83 s > Checking strum v0.26.3
  1130. 330.83 s > Checking clap_complete_nushell v4.6.0
  1131. 330.83 s > Checking sysinfo v0.33.1
  1132. 330.83 s > Checking backtrace v0.3.76
  1133. 330.83 s > Checking shlex v1.3.0
  1134. 330.83 s > Checking futures-core v0.3.32
  1135. 330.83 s > Checking slab v0.4.12
  1136. 330.83 s > Checking futures-task v0.3.32
  1137. 330.83 s > Checking sdd v3.0.10
  1138. 330.83 s > Checking reedline v0.42.0
  1139. 330.83 s > Checking ratatui-macros v0.7.0
  1140. 330.83 s > Compiling gammaloop-integration-tests v0.1.0 (/build/source/tests)
  1141. 330.83 s > Compiling test-log-core v0.2.20
  1142. 330.83 s > Checking ratatui v0.30.0
  1143. 330.83 s > Checking futures-util v0.3.32
  1144. 330.83 s > Checking color-eyre v0.6.5
  1145. 330.83 s > Compiling rustc_version v0.4.1
  1146. 330.83 s > Checking scc v2.4.0
  1147. 330.83 s > Checking which v8.0.2
  1148. 330.83 s > Checking bincode v1.3.3
  1149. 330.83 s > Compiling gungraun-runner v0.18.2
  1150. 330.83 s > Checking proc-macro2 v1.0.106
  1151. 330.83 s > Checking quote v1.0.45
  1152. 330.83 s > Checking maplit v1.0.2
  1153. 330.83 s > Checking base64 v0.21.7
  1154. 330.83 s > Compiling iai-callgrind-runner v0.14.2
  1155. 330.83 s > Compiling numerica v2.2.0 (https://github.com/alphal00p/symbolica?rev=4d0a833eb8e059d1f95bdae5abed2559830b235f#4d0a833e)
  1156. 330.83 s > Checking ron v0.8.1
  1157. 330.83 s > Checking kurbo v0.13.0
  1158. 330.83 s > Checking wait-timeout v0.2.1
  1159. 330.83 s > Checking quick-error v1.2.3
  1160. 330.83 s > Compiling iai-callgrind v0.14.2
  1161. 330.83 s > Compiling gungraun-macros v0.8.0
  1162. 330.83 s > Checking bit-vec v0.8.0
  1163. 330.83 s > Checking rusty-fork v0.3.1
  1164. 330.83 s > Checking bit-set v0.8.0
  1165. 330.83 s > Checking syn v2.0.117
  1166. 330.83 s > Compiling iai-callgrind-macros v0.5.1
  1167. 330.83 s > Checking rand_xorshift v0.4.0
  1168. 330.83 s > Checking console v0.15.11
  1169. 330.83 s > Compiling test-log-macros v0.2.20
  1170. 330.83 s > Checking unarray v0.1.4
  1171. 330.83 s > Checking pathdiff v0.2.3
  1172. 330.83 s > Checking proptest v1.11.0
  1173. 330.83 s > Checking futures-executor v0.3.32
  1174. 330.83 s > Checking similar-asserts v1.7.0
  1175. 330.83 s > Checking serial_test v3.4.0
  1176. 330.83 s > Checking clinnet v0.1.8 (/build/source/crates/clinnet)
  1177. 330.83 s > Checking kurvst v0.1.0 (/build/source/crates/kurvst)
  1178. 330.83 s > Compiling graphica v2.1.0 (https://github.com/alphal00p/symbolica?rev=4d0a833eb8e059d1f95bdae5abed2559830b235f#4d0a833e)
  1179. 330.83 s > Checking nalgebra v0.29.0
  1180. 330.83 s > Checking test-log v0.2.20
  1181. 330.83 s > Compiling pyo3-macros v0.28.3
  1182. 330.83 s > Checking gungraun v0.18.2
  1183. 330.83 s > Compiling pyo3-stub-gen-derive v0.17.2
  1184. 330.83 s > Checking statrs v0.16.1
  1185. 330.83 s > Checking momtrop v0.3.0
  1186. 330.83 s > Checking pyo3-stub-gen v0.17.2
  1187. 330.83 s > Checking symbolica-utils v0.1.0 (/build/source/crates/symbolica-utils)
  1188. 330.83 s > Checking spenso-macros v0.3.2 (/build/source/crates/spenso-macros)
  1189. 330.83 s > Compiling gammaloop-workspace-hack v0.1.0 (/build/source/crates/gammaloop-workspace-hack)
  1190. 330.83 s > Checking linnet v0.17.0 (/build/source/crates/linnet)
  1191. 330.83 s > Checking spenso v0.6.0 (/build/source/crates/spenso)
  1192. 330.83 s > Checking linnet-py v0.1.0 (/build/source/crates/linnet-py)
  1193. 330.83 s > Checking linnest v0.1.0 (/build/source/crates/linnest)
  1194. 330.83 s > Checking idenso v0.3.0 (/build/source/crates/idenso)
  1195. 330.83 s > Checking gammaloop-tracing-filter v0.1.0 (/build/source/crates/gammaloop-tracing-filter)
  1196. 330.83 s > Checking spenso-hep-lib v0.1.7 (/build/source/crates/spenso-hep-lib)
  1197. 330.83 s > Checking spynso3 v0.1.2 (/build/source/crates/spynso3)
  1198. 330.83 s > error[E0283]: type annotations needed
  1199. 330.83 s > --> crates/gammalooprs/src/momentum/sample.rs:1165:35
  1200. 330.83 s > |
  1201. 330.83 s > 1165 | requested.into_iter().collect(),
  1202. 330.83 s > | ^^^^^^^ cannot infer type of the type parameter `B` declared on the method `collect`
  1203. 330.83 s > |
  1204. 330.83 s > = note: the type must implement `FromIterator<linnet::half_edge::involution::EdgeIndex>`
  1205. 330.83 s > note: required by a bound in `std::iter::Iterator::collect`
  1206. 330.83 s > --> /rustc/2d8144b7880597b6e6d3dfd63a9a9efae3f533d3/library/core/src/iter/traits/iterator.rs:2077:4
  1207. 330.83 s > help: consider specifying the generic argument
  1208. 330.83 s > |
  1209. 330.83 s > 1165 | requested.into_iter().collect::<Vec<_>>(),
  1210. 330.83 s > | ++++++++++
  1211. 330.83 s >
  1212. 330.83 s > error[E0283]: type annotations needed
  1213. 330.83 s > --> crates/gammalooprs/src/momentum/sample.rs:1165:35
  1214. 330.83 s > |
  1215. 330.83 s > 1161 | / assert_eq!(
  1216. 330.83 s > 1162 | | subspace
  1217. 330.83 s > 1163 | | .iter_basis_edges(&all_lmbs)
  1218. 330.83 s > 1164 | | .collect::<std::collections::BTreeSet<_>>(),
  1219. 330.83 s > 1165 | | requested.into_iter().collect(),
  1220. 330.83 s > | | ^^^^^^^ cannot infer type of the type parameter `B` declared on the method `collect`
  1221. 330.83 s > 1166 | | );
  1222. 330.83 s > | |_________- type must be known at this point
  1223. 330.83 s > |
  1224. 330.83 s > = note: multiple `impl`s satisfying `std::collections::BTreeSet<linnet::half_edge::involution::EdgeIndex>: PartialEq<_>` found in the following crates: `alloc`, `rkyv`:
  1225. 330.83 s > - impl<K, AK> PartialEq<rkyv::collections::btree_set::ArchivedBTreeSet<AK>> for std::collections::BTreeSet<K>
  1226. 330.83 s > where AK: PartialEq<K>;
  1227. 330.83 s > - impl<T, A> PartialEq for std::collections::BTreeSet<T, A>
  1228. 330.83 s > where T: PartialEq, A: Allocator, A: Clone;
  1229. 330.83 s > help: consider specifying the generic argument
  1230. 330.83 s > |
  1231. 330.83 s > 1165 | requested.into_iter().collect::<Vec<_>>(),
  1232. 330.83 s > | ++++++++++
  1233. 330.83 s >
  1234. 330.83 s > error[E0283]: type annotations needed
  1235. 330.83 s > --> crates/gammalooprs/src/momentum/sample.rs:1182:35
  1236. 330.83 s > |
  1237. 330.83 s > 1178 | / assert_eq!(
  1238. 330.83 s > 1179 | | common_subspace
  1239. 330.83 s > 1180 | | .iter_basis_edges(&all_lmbs)
  1240. 330.83 s > 1181 | | .collect::<std::collections::BTreeSet<_>>(),
  1241. 330.83 s > 1182 | | requested.into_iter().collect(),
  1242. 330.83 s > | | ^^^^^^^ cannot infer type of the type parameter `B` declared on the method `collect`
  1243. 330.83 s > 1183 | | );
  1244. 330.83 s > | |_________- type must be known at this point
  1245. 330.83 s > |
  1246. 330.83 s > = note: multiple `impl`s satisfying `std::collections::BTreeSet<linnet::half_edge::involution::EdgeIndex>: PartialEq<_>` found in the following crates: `alloc`, `rkyv`:
  1247. 330.83 s > - impl<K, AK> PartialEq<rkyv::collections::btree_set::ArchivedBTreeSet<AK>> for std::collections::BTreeSet<K>
  1248. 330.83 s > where AK: PartialEq<K>;
  1249. 330.83 s > - impl<T, A> PartialEq for std::collections::BTreeSet<T, A>
  1250. 330.83 s > where T: PartialEq, A: Allocator, A: Clone;
  1251. 330.83 s > help: consider specifying the generic argument
  1252. 330.83 s > |
  1253. 330.83 s > 1182 | requested.into_iter().collect::<Vec<_>>(),
  1254. 330.83 s > | ++++++++++
  1255. 330.83 s >
  1256. 330.83 s > error[E0283]: type annotations needed
  1257. 330.83 s > --> crates/gammalooprs/src/momentum/sample.rs:1203:35
  1258. 330.83 s > |
  1259. 330.83 s > 1199 | / assert_eq!(
  1260. 330.83 s > 1200 | | sparse_common_subspace
  1261. 330.83 s > 1201 | | .iter_basis_edges(&all_lmbs)
  1262. 330.83 s > 1202 | | .collect::<std::collections::BTreeSet<_>>(),
  1263. 330.83 s > 1203 | | requested.into_iter().collect(),
  1264. 330.83 s > | | ^^^^^^^ cannot infer type of the type parameter `B` declared on the method `collect`
  1265. 330.83 s > 1204 | | );
  1266. 330.83 s > | |_________- type must be known at this point
  1267. 330.83 s > |
  1268. 330.83 s > = note: multiple `impl`s satisfying `std::collections::BTreeSet<linnet::half_edge::involution::EdgeIndex>: PartialEq<_>` found in the following crates: `alloc`, `rkyv`:
  1269. 330.83 s > - impl<K, AK> PartialEq<rkyv::collections::btree_set::ArchivedBTreeSet<AK>> for std::collections::BTreeSet<K>
  1270. 330.83 s > where AK: PartialEq<K>;
  1271. 330.83 s > - impl<T, A> PartialEq for std::collections::BTreeSet<T, A>
  1272. 330.83 s > where T: PartialEq, A: Allocator, A: Clone;
  1273. 330.83 s > help: consider specifying the generic argument
  1274. 330.83 s > |
  1275. 330.83 s > 1203 | requested.into_iter().collect::<Vec<_>>(),
  1276. 330.83 s > | ++++++++++
  1277. 330.83 s >
  1278. 330.83 s > error[E0283]: type annotations needed
  1279. 330.83 s > --> crates/gammalooprs/src/processes/amplitude.rs:3336:49
  1280. 330.83 s > |
  1281. 330.83 s > 3336 | variant_ids.iter().copied().collect(),
  1282. 330.83 s > | ^^^^^^^ cannot infer type of the type parameter `B` declared on the method `collect`
  1283. 330.83 s > |
  1284. 330.83 s > = note: the type must implement `FromIterator<processes::threshold_counterterms::ThresholdCountertermVariantId>`
  1285. 330.83 s > note: required by a bound in `std::iter::Iterator::collect`
  1286. 330.83 s > --> /rustc/2d8144b7880597b6e6d3dfd63a9a9efae3f533d3/library/core/src/iter/traits/iterator.rs:2077:4
  1287. 330.83 s > help: consider specifying the generic argument
  1288. 330.83 s > |
  1289. 330.83 s > 3336 | variant_ids.iter().copied().collect::<Vec<_>>(),
  1290. 330.83 s > | ++++++++++
  1291. 330.83 s >
  1292. 330.83 s > error[E0283]: type annotations needed
  1293. 330.83 s > --> crates/gammalooprs/src/processes/amplitude.rs:3336:49
  1294. 330.83 s > |
  1295. 330.83 s > 3334 | / assert_eq!(
  1296. 330.83 s > 3335 | | referenced_variants,
  1297. 330.83 s > 3336 | | variant_ids.iter().copied().collect(),
  1298. 330.83 s > | | ^^^^^^^ cannot infer type of the type parameter `B` declared on the method `collect`
  1299. 330.83 s > 3337 | | "overlap groups must retain every semantic duplicate independently",
  1300. 330.83 s > 3338 | | );
  1301. 330.83 s > | |_________________- type must be known at this point
  1302. 330.83 s > |
  1303. 330.83 s > = note: multiple `impl`s satisfying `std::collections::BTreeSet<processes::threshold_counterterms::ThresholdCountertermVariantId>: PartialEq<_>` found in the following crates: `alloc`, `rkyv`:
  1304. 330.83 s > - impl<K, AK> PartialEq<rkyv::collections::btree_set::ArchivedBTreeSet<AK>> for std::collections::BTreeSet<K>
  1305. 330.83 s > where AK: PartialEq<K>;
  1306. 330.83 s > - impl<T, A> PartialEq for std::collections::BTreeSet<T, A>
  1307. 330.83 s > where T: PartialEq, A: Allocator, A: Clone;
  1308. 330.83 s > help: consider specifying the generic argument
  1309. 330.83 s > |
  1310. 330.83 s > 3336 | variant_ids.iter().copied().collect::<Vec<_>>(),
  1311. 330.83 s > | ++++++++++
  1312. 330.83 s >
  1313. 330.83 s > error[E0283]: type annotations needed
  1314. 330.83 s > --> crates/gammalooprs/src/processes/amplitude.rs:4098:59
  1315. 330.83 s > |
  1316. 330.83 s > 4098 | assert_eq!(orders, [1, 2].into_iter().collect());
  1317. 330.83 s > | ^^^^^^^ cannot infer type of the type parameter `B` declared on the method `collect`
  1318. 330.83 s > |
  1319. 330.83 s > = note: the type must implement `FromIterator<i32>`
  1320. 330.83 s > note: required by a bound in `std::iter::Iterator::collect`
  1321. 330.83 s > --> /rustc/2d8144b7880597b6e6d3dfd63a9a9efae3f533d3/library/core/src/iter/traits/iterator.rs:2077:4
  1322. 330.83 s > help: consider specifying the generic argument
  1323. 330.83 s > |
  1324. 330.83 s > 4098 | assert_eq!(orders, [1, 2].into_iter().collect::<Vec<_>>());
  1325. 330.83 s > | ++++++++++
  1326. 330.83 s >
  1327. 330.83 s > error[E0283]: type annotations needed
  1328. 330.83 s > --> crates/gammalooprs/src/processes/amplitude.rs:4098:59
  1329. 330.83 s > |
  1330. 330.83 s > 4098 | assert_eq!(orders, [1, 2].into_iter().collect());
  1331. 330.83 s > | --------------------------------------^^^^^^^---
  1332. 330.83 s > | | |
  1333. 330.83 s > | | cannot infer type of the type parameter `B` declared on the method `collect`
  1334. 330.83 s > | type must be known at this point
  1335. 330.83 s > |
  1336. 330.83 s > = note: multiple `impl`s satisfying `std::collections::BTreeSet<usize>: PartialEq<_>` found in the following crates: `alloc`, `rkyv`:
  1337. 330.83 s > - impl<K, AK> PartialEq<rkyv::collections::btree_set::ArchivedBTreeSet<AK>> for std::collections::BTreeSet<K>
  1338. 330.83 s > where AK: PartialEq<K>;
  1339. 330.83 s > - impl<T, A> PartialEq for std::collections::BTreeSet<T, A>
  1340. 330.83 s > where T: PartialEq, A: Allocator, A: Clone;
  1341. 330.83 s > help: consider specifying the generic argument
  1342. 330.83 s > |
  1343. 330.83 s > 4098 | assert_eq!(orders, [1, 2].into_iter().collect::<Vec<_>>());
  1344. 330.83 s > | ++++++++++
  1345. 330.83 s >
  1346. 330.83 s > error[E0283]: type annotations needed
  1347. 330.83 s > --> crates/gammalooprs/src/processes/amplitude.rs:4129:48
  1348. 330.83 s > |
  1349. 330.83 s > 4123 | / assert_eq!(
  1350. 330.83 s > 4124 | | evaluator
  1351. 330.83 s > 4125 | | .evaluator_stacks
  1352. 330.83 s > 4126 | | .keys()
  1353. 330.83 s > ... |
  1354. 330.83 s > 4129 | | [1, 2].into_iter().collect()
  1355. 330.83 s > | | ^^^^^^^ cannot infer type of the type parameter `B` declared on the method `collect`
  1356. 330.83 s > 4130 | | );
  1357. 330.83 s > | |_________________________- type must be known at this point
  1358. 330.83 s > |
  1359. 330.83 s > = note: multiple `impl`s satisfying `std::collections::BTreeSet<usize>: PartialEq<_>` found in the following crates: `alloc`, `rkyv`:
  1360. 330.83 s > - impl<K, AK> PartialEq<rkyv::collections::btree_set::ArchivedBTreeSet<AK>> for std::collections::BTreeSet<K>
  1361. 330.83 s > where AK: PartialEq<K>;
  1362. 330.83 s > - impl<T, A> PartialEq for std::collections::BTreeSet<T, A>
  1363. 330.83 s > where T: PartialEq, A: Allocator, A: Clone;
  1364. 330.83 s > help: consider specifying the generic argument
  1365. 330.83 s > |
  1366. 330.83 s > 4129 | [1, 2].into_iter().collect::<Vec<_>>()
  1367. 330.83 s > | ++++++++++
  1368. 330.83 s >
  1369. 330.83 s > error[E0283]: type annotations needed
  1370. 330.83 s > --> crates/gammalooprs/src/processes/amplitude.rs:4160:30
  1371. 330.83 s > |
  1372. 330.83 s > 4148 | / assert_eq!(
  1373. 330.83 s > 4149 | | registry
  1374. 330.83 s > 4150 | | .components
  1375. 330.83 s > 4151 | | .iter()
  1376. 330.83 s > ... |
  1377. 330.83 s > 4160 | | .collect()
  1378. 330.83 s > | | ^^^^^^^ cannot infer type of the type parameter `B` declared on the method `collect`
  1379. 330.83 s > 4161 | | );
  1380. 330.83 s > | |_________________________- type must be known at this point
  1381. 330.83 s > |
  1382. 330.83 s > = note: multiple `impl`s satisfying `std::collections::BTreeSet<processes::threshold_counterterms::ThresholdCountertermComponentKind>: PartialEq<_>` found in the following crates: `alloc`, `rkyv`:
  1383. 330.83 s > - impl<K, AK> PartialEq<rkyv::collections::btree_set::ArchivedBTreeSet<AK>> for std::collections::BTreeSet<K>
  1384. 330.83 s > where AK: PartialEq<K>;
  1385. 330.83 s > - impl<T, A> PartialEq for std::collections::BTreeSet<T, A>
  1386. 330.83 s > where T: PartialEq, A: Allocator, A: Clone;
  1387. 330.83 s > help: consider specifying the generic argument
  1388. 330.83 s > |
  1389. 330.83 s > 4160 | .collect::<Vec<_>>()
  1390. 330.83 s > | ++++++++++
  1391. 330.83 s >
  1392. 330.83 s > error[E0283]: type annotations needed
  1393. 330.83 s > --> crates/gammalooprs/src/processes/amplitude.rs:4214:26
  1394. 330.83 s > |
  1395. 330.83 s > 4201 | / assert_eq!(
  1396. 330.83 s > 4202 | | decomposition
  1397. 330.83 s > 4203 | | .components
  1398. 330.83 s > 4204 | | .iter()
  1399. 330.83 s > ... |
  1400. 330.83 s > 4214 | | .collect()
  1401. 330.83 s > | | ^^^^^^^ cannot infer type of the type parameter `B` declared on the method `collect`
  1402. 330.83 s > 4215 | | );
  1403. 330.83 s > | |_____________________- type must be known at this point
  1404. 330.83 s > |
  1405. 330.83 s > = note: multiple `impl`s satisfying `std::collections::BTreeSet<processes::threshold_counterterms::ThresholdCountertermComponentKind>: PartialEq<_>` found in the following crates: `alloc`, `rkyv`:
  1406. 330.83 s > - impl<K, AK> PartialEq<rkyv::collections::btree_set::ArchivedBTreeSet<AK>> for std::collections::BTreeSet<K>
  1407. 330.83 s > where AK: PartialEq<K>;
  1408. 330.83 s > - impl<T, A> PartialEq for std::collections::BTreeSet<T, A>
  1409. 330.83 s > where T: PartialEq, A: Allocator, A: Clone;
  1410. 330.83 s > help: consider specifying the generic argument
  1411. 330.83 s > |
  1412. 330.83 s > 4214 | .collect::<Vec<_>>()
  1413. 330.83 s > | ++++++++++
  1414. 330.83 s >
  1415. 330.83 s > error[E0277]: can't compare `std::option::Option<&[linnet::half_edge::involution::EdgeIndex]>` with `std::option::Option<&[linnet::half_edge::involution::EdgeIndex; 1]>`
  1416. 330.83 s > --> crates/gammalooprs/src/processes/cross_section/ir_safe_threshold_fixture_tests.rs:817:25
  1417. 330.83 s > |
  1418. 330.83 s > 816 | .any(|variant| variant.requested_subspace.as_deref()
  1419. 330.83 s > | -------------------------------------
  1420. 330.83 s > 817 | == Some(&[EdgeIndex::from(3)])),
  1421. 330.83 s > | ^^ ---------------------------
  1422. 330.83 s > | |
  1423. 330.83 s > | no implementation for `std::option::Option<&[linnet::half_edge::involution::EdgeIndex]> == std::option::Option<&[linnet::half_edge::involution::EdgeIndex; 1]>`
  1424. 330.83 s > |
  1425. 330.83 s > = help: the trait `PartialEq<std::option::Option<&[linnet::half_edge::involution::EdgeIndex; 1]>>` is not implemented for `std::option::Option<&[linnet::half_edge::involution::EdgeIndex]>`
  1426. 330.83 s > help: the following other types implement trait `PartialEq<Rhs>`
  1427. 330.83 s > --> /nix/store/8zq9ya5slh345hbylmsibxw827bi98w0-vendor-cargo-deps/c19b7c6f923b580ac259164a89f2577984ad5ab09ee9d583b888f934adbbe8d0/rkyv-0.7.46/src/impls/alloc/niche.rs:24:1
  1428. 330.83 s > |
  1429. 330.83 s > 24 | / impl<T, U> PartialEq<ArchivedOptionBox<T>> for Option<Box<U>>
  1430. 330.83 s > 25 | | where
  1431. 330.83 s > 26 | | T: ArchivePointee + PartialEq<U> + ?Sized,
  1432. 330.83 s > 27 | | U: ?Sized,
  1433. 330.83 s > | |______________^ `std::option::Option<Box<U>>` implements `PartialEq<rkyv::niche::option_box::ArchivedOptionBox<T>>`
  1434. 330.83 s > --> /rustc/2d8144b7880597b6e6d3dfd63a9a9efae3f533d3/library/core/src/option.rs:2434:0
  1435. 330.83 s > |
  1436. 330.83 s > = note: `std::option::Option<T>` implements `PartialEq`
  1437. 330.83 s > |
  1438. 330.83 s > ::: /nix/store/8zq9ya5slh345hbylmsibxw827bi98w0-vendor-cargo-deps/c19b7c6f923b580ac259164a89f2577984ad5ab09ee9d583b888f934adbbe8d0/rkyv-0.7.46/src/option.rs:210:1
  1439. 330.83 s > |
  1440. 330.83 s > 210 | impl<T: PartialEq<U>, U> PartialEq<ArchivedOption<T>> for Option<U> {
  1441. 330.83 s > | ^^^^^^^^^^^^^^^^^^^^^^^^^^^^^^^^^^^^^^^^^^^^^^^^^^^^^^^^^^^^^^^^^^^ `std::option::Option<U>` implements `PartialEq<rkyv::option::ArchivedOption<T>>`
  1442. 330.83 s >
  1443. 330.83 s > error[E0283]: type annotations needed
  1444. 330.83 s > --> crates/gammalooprs/src/processes/no_directive_equivalence_tests.rs:459:43
  1445. 330.83 s > |
  1446. 330.83 s > 459 | (0..graph.cuts.len()).collect(),
  1447. 330.83 s > | ^^^^^^^ cannot infer type of the type parameter `B` declared on the method `collect`
  1448. 330.83 s > |
  1449. 330.83 s > = note: multiple `impl`s satisfying `_: FromIterator<usize>` found in the following crates: `spenso`, `tabled`:
  1450. 330.83 s > - impl FromIterator<usize> for ExpandedIndex;
  1451. 330.83 s > - impl FromIterator<usize> for HeightList;
  1452. 330.83 s > - impl FromIterator<usize> for WidthList;
  1453. 330.83 s > note: required by a bound in `std::iter::Iterator::collect`
  1454. 330.83 s > --> /rustc/2d8144b7880597b6e6d3dfd63a9a9efae3f533d3/library/core/src/iter/traits/iterator.rs:2077:4
  1455. 330.83 s > help: consider specifying the generic argument
  1456. 330.83 s > |
  1457. 330.83 s > 459 | (0..graph.cuts.len()).collect::<Vec<_>>(),
  1458. 330.83 s > | ++++++++++
  1459. 330.83 s >
  1460. 330.83 s > error[E0283]: type annotations needed
  1461. 330.83 s > --> crates/gammalooprs/src/processes/no_directive_equivalence_tests.rs:459:43
  1462. 330.83 s > |
  1463. 330.83 s > 457 | / assert_eq!(
  1464. 330.83 s > 458 | | grouped_cut_ids,
  1465. 330.83 s > 459 | | (0..graph.cuts.len()).collect(),
  1466. 330.83 s > | | ^^^^^^^ cannot infer type of the type parameter `B` declared on the method `collect`
  1467. 330.83 s > 460 | | "every discovered process-valid cut must remain in the numerical LU evaluation",
  1468. 330.83 s > 461 | | );
  1469. 330.83 s > | |_________________- type must be known at this point
  1470. 330.83 s > |
  1471. 330.83 s > = note: multiple `impl`s satisfying `std::collections::BTreeSet<usize>: PartialEq<_>` found in the following crates: `alloc`, `rkyv`:
  1472. 330.83 s > - impl<K, AK> PartialEq<rkyv::collections::btree_set::ArchivedBTreeSet<AK>> for std::collections::BTreeSet<K>
  1473. 330.83 s > where AK: PartialEq<K>;
  1474. 330.83 s > - impl<T, A> PartialEq for std::collections::BTreeSet<T, A>
  1475. 330.83 s > where T: PartialEq, A: Allocator, A: Clone;
  1476. 330.83 s > help: consider specifying the generic argument
  1477. 330.83 s > |
  1478. 330.83 s > 459 | (0..graph.cuts.len()).collect::<Vec<_>>(),
  1479. 330.83 s > | ++++++++++
  1480. 330.83 s >
  1481. 330.83 s > error[E0283]: type annotations needed
  1482. 330.83 s > --> crates/gammalooprs/src/processes/raised_cross_section_tests.rs:150:31
  1483. 330.83 s > |
  1484. 330.83 s > 150 | (0..graph.cuts.len()).collect(),
  1485. 330.83 s > | ^^^^^^^ cannot infer type of the type parameter `B` declared on the method `collect`
  1486. 330.83 s > |
  1487. 330.83 s > = note: multiple `impl`s satisfying `_: FromIterator<usize>` found in the following crates: `spenso`, `tabled`:
  1488. 330.83 s > - impl FromIterator<usize> for ExpandedIndex;
  1489. 330.83 s > - impl FromIterator<usize> for HeightList;
  1490. 330.83 s > - impl FromIterator<usize> for WidthList;
  1491. 330.83 s > note: required by a bound in `std::iter::Iterator::collect`
  1492. 330.83 s > --> /rustc/2d8144b7880597b6e6d3dfd63a9a9efae3f533d3/library/core/src/iter/traits/iterator.rs:2077:4
  1493. 330.83 s > help: consider specifying the generic argument
  1494. 330.83 s > |
  1495. 330.83 s > 150 | (0..graph.cuts.len()).collect::<Vec<_>>(),
  1496. 330.83 s > | ++++++++++
  1497. 330.83 s >
  1498. 330.83 s > error[E0283]: type annotations needed
  1499. 330.83 s > --> crates/gammalooprs/src/processes/raised_cross_section_tests.rs:150:31
  1500. 330.83 s > |
  1501. 330.83 s > 148 | / assert_eq!(
  1502. 330.83 s > 149 | | grouped_cut_ids,
  1503. 330.83 s > 150 | | (0..graph.cuts.len()).collect(),
  1504. 330.83 s > | | ^^^^^^^ cannot infer type of the type parameter `B` declared on the method `collect`
  1505. 330.83 s > 151 | | "every discovered process-valid cut must remain in the numerical LU evaluation",
  1506. 330.83 s > 152 | | );
  1507. 330.83 s > | |_____- type must be known at this point
  1508. 330.83 s > |
  1509. 330.83 s > = note: multiple `impl`s satisfying `std::collections::BTreeSet<usize>: PartialEq<_>` found in the following crates: `alloc`, `rkyv`:
  1510. 330.83 s > - impl<K, AK> PartialEq<rkyv::collections::btree_set::ArchivedBTreeSet<AK>> for std::collections::BTreeSet<K>
  1511. 330.83 s > where AK: PartialEq<K>;
  1512. 330.83 s > - impl<T, A> PartialEq for std::collections::BTreeSet<T, A>
  1513. 330.83 s > where T: PartialEq, A: Allocator, A: Clone;
  1514. 330.83 s > help: consider specifying the generic argument
  1515. 330.83 s > |
  1516. 330.83 s > 150 | (0..graph.cuts.len()).collect::<Vec<_>>(),
  1517. 330.83 s > | ++++++++++
  1518. 330.83 s >
  1519. 330.83 s > warning: method `lu_prefactor_helper` is never used
  1520. 330.83 s > --> crates/gammalooprs/src/processes/cross_section.rs:1965:8
  1521. 330.83 s > |
  1522. 330.83 s > 1429 | impl CrossSectionGraph {
  1523. 330.83 s > | ---------------------- method in this implementation
  1524. 330.83 s > ...
  1525. 330.83 s > 1965 | fn lu_prefactor_helper(&self) -> Atom {
  1526. 330.83 s > | ^^^^^^^^^^^^^^^^^^^
  1527. 330.83 s > |
  1528. 330.83 s > = note: `#[warn(dead_code)]` (part of `#[warn(unused)]`) on by default
  1529. 330.83 s >
  1530. 330.83 s > warning: `gammalooprs` (lib) generated 1 warning
  1531. 330.83 s > Some errors have detailed explanations: E0277, E0283.
  1532. 330.83 s > For more information about an error, try `rustc --explain E0277`.
  1533. 330.83 s > error: could not compile `gammalooprs` (lib test) due to 16 previous errors
  1534. 330.83 s > warning: build failed, waiting for other jobs to finish...
  1535. 330.83 s For full logs, run:
  1536. 330.83 s nix log /nix/store/bcqc79if6hchn98779cm1bksy0kvkzh2-gammaloop-workspace-check-0.1.0.drv
  1537. 330.88 s Build failed.