build checks.x86_64-linux.gammaloop-check
0.00 s
$ /nix/store/9ypz3flqsrl5xl495mm8h645gadjsxi1-coreutils-9.11/bin/timeout --kill-after=15s 7200s /nix/store/23zk8sgzamrbmj1fday15szf7f2279s8-nix-2.34.7/bin/nix --extra-experimental-features nix-command --extra-experimental-features flakes --log-format internal-json build --no-link --print-out-paths git+https://github.com/alphal00p/gammaloop?ref=ir_safe_threshold_subtraction&rev=6c3b1ff79c34a5e34e424ddd51dd218105b48f53&shallow=1#checks.x86_64-linux.gammaloop-check --print-build-logs
0.12 s
0.40 s
Building /nix/store/bcqc79if6hchn98779cm1bksy0kvkzh2-gammaloop-workspace-check-0.1.0.drv
0.47 s
[gammaloop-workspace-check] Phase: unpackPhase
0.47 s
[gammaloop-workspace-check] unpacking source archive /nix/store/bcy0vqqk2ibk38nik2bb809ck03m92g2-source
0.63 s
[gammaloop-workspace-check] source root is source
0.66 s
[gammaloop-workspace-check] Phase: patchPhase
0.66 s
[gammaloop-workspace-check] Executing configureCargoCommonVars
0.67 s
[gammaloop-workspace-check] decompressing cargo artifacts from /nix/store/wxpx6lf642pgxp2wz1pw1lxksj5p1wb0-gammaloop-workspace-deps-deps-0.1.0/target.tar.zst to target
1.99 s
[gammaloop-workspace-check] Phase: updateAutotoolsGnuConfigScriptsPhase
2.03 s
[gammaloop-workspace-check] Phase: configurePhase
2.03 s
[gammaloop-workspace-check] will append /build/source/.cargo-home/config.toml with contents of /nix/store/8zq9ya5slh345hbylmsibxw827bi98w0-vendor-cargo-deps/config.toml
2.03 s
[gammaloop-workspace-check] default configurePhase, nothing to do
2.04 s
[gammaloop-workspace-check] Phase: buildPhase
2.04 s
[gammaloop-workspace-check] +++ command cargo --version
2.04 s
[gammaloop-workspace-check] cargo 1.97.0 (c980f4866 2026-06-30)
2.07 s
[gammaloop-workspace-check] +++ command cargo check --profile ci-optim --locked --workspace --features gammaloop-tracing-filter/clap,gammaloop-tracing-filter/symbolica,idenso/bincode,idenso/reference-cases,linnet/bincode,linnet/drawing,linnet/rkyv,linnet/serde,linnet/symbolica,spenso-macros/shadowing,spenso/shadowing,symbolica/tracing_max_level_info,three-dimensional-reps/display,three-dimensional-reps/eval,three-dimensional-reps/serde --all-targets
2.57 s
[gammaloop-workspace-check] Checking cfg-if v1.0.4
2.57 s
[gammaloop-workspace-check] Checking memchr v2.8.0
2.57 s
[gammaloop-workspace-check] Checking once_cell v1.21.4
2.58 s
[gammaloop-workspace-check] Checking either v1.15.0
2.58 s
[gammaloop-workspace-check] Checking serde_core v1.0.228
2.58 s
[gammaloop-workspace-check] Checking libc v0.2.186
2.58 s
[gammaloop-workspace-check] Checking libm v0.2.16
2.60 s
[gammaloop-workspace-check] Checking itoa v1.0.18
2.60 s
[gammaloop-workspace-check] Checking log v0.4.29
2.60 s
[gammaloop-workspace-check] Checking regex-syntax v0.8.10
2.61 s
[gammaloop-workspace-check] Checking zerocopy v0.8.48
2.61 s
[gammaloop-workspace-check] Checking crossbeam-utils v0.8.21
2.62 s
[gammaloop-workspace-check] Checking equivalent v1.0.2
2.63 s
[gammaloop-workspace-check] Checking zmij v1.0.21
2.63 s
[gammaloop-workspace-check] Checking lazy_static v1.5.0
2.63 s
[gammaloop-workspace-check] Checking bytemuck v1.25.0
2.63 s
[gammaloop-workspace-check] Compiling target-lexicon v0.13.5
2.66 s
[gammaloop-workspace-check] Checking arrayvec v0.7.6
2.68 s
[gammaloop-workspace-check] Checking powerfmt v0.2.0
2.70 s
[gammaloop-workspace-check] Checking num_threads v0.1.7
2.71 s
[gammaloop-workspace-check] Checking num-conv v0.2.1
2.71 s
[gammaloop-workspace-check] Checking time-core v0.1.8
2.73 s
[gammaloop-workspace-check] Checking itertools v0.14.0
2.74 s
[gammaloop-workspace-check] Checking safe_arch v0.7.4
2.76 s
[gammaloop-workspace-check] Checking pin-project-lite v0.2.17
2.79 s
[gammaloop-workspace-check] Checking tracing-core v0.1.36
2.80 s
[gammaloop-workspace-check] Checking deranged v0.5.8
2.80 s
[gammaloop-workspace-check] Checking foldhash v0.2.0
2.81 s
[gammaloop-workspace-check] Checking allocator-api2 v0.2.21
2.90 s
[gammaloop-workspace-check] Checking const-random v0.1.18
2.91 s
[gammaloop-workspace-check] Checking nu-ansi-term v0.50.3
2.93 s
[gammaloop-workspace-check] Checking winnow v1.0.2
2.95 s
[gammaloop-workspace-check] Checking unty v0.0.4
2.99 s
[gammaloop-workspace-check] Checking aho-corasick v1.1.4
2.99 s
[gammaloop-workspace-check] Checking static_assertions v1.1.0
3.04 s
[gammaloop-workspace-check] Checking safe_arch v1.0.0
3.09 s
[gammaloop-workspace-check] Checking hashbrown v0.16.1
3.12 s
[gammaloop-workspace-check] Checking sharded-slab v0.1.7
3.17 s
[gammaloop-workspace-check] Checking wide v0.7.33
3.19 s
[gammaloop-workspace-check] Checking crossbeam-epoch v0.9.18
3.28 s
[gammaloop-workspace-check] Checking tracing-log v0.2.0
3.39 s
[gammaloop-workspace-check] Checking tracing v0.1.44
3.41 s
[gammaloop-workspace-check] Checking crossbeam-deque v0.8.6
3.44 s
[gammaloop-workspace-check] Checking thread_local v1.1.9
3.49 s
[gammaloop-workspace-check] Checking toml_writer v1.1.1+spec-1.1.0
3.53 s
[gammaloop-workspace-check] Checking az v1.3.0
3.54 s
[gammaloop-workspace-check] Checking indenter v0.3.4
3.57 s
[gammaloop-workspace-check] Checking rayon-core v1.13.0
3.58 s
[gammaloop-workspace-check] Checking num-traits v0.2.19
3.62 s
[gammaloop-workspace-check] Checking wide v1.3.0
3.64 s
[gammaloop-workspace-check] Compiling phf_shared v0.11.3
3.71 s
[gammaloop-workspace-check] Checking anyhow v1.0.102
3.76 s
[gammaloop-workspace-check] Checking getrandom v0.3.4
3.77 s
[gammaloop-workspace-check] Checking time v0.3.47
3.81 s
[gammaloop-workspace-check] Checking toml_parser v1.1.2+spec-1.1.0
3.89 s
[gammaloop-workspace-check] Checking gmp-mpfr-sys v1.7.1
3.94 s
[gammaloop-workspace-check] Checking utf8parse v0.2.2
3.96 s
[gammaloop-workspace-check] Checking rand_core v0.9.5
3.97 s
[gammaloop-workspace-check] Checking alloc-no-stdlib v2.0.4
4.00 s
[gammaloop-workspace-check] Checking rayon v1.12.0
4.01 s
[gammaloop-workspace-check] Checking dyn-clone v1.0.20
4.03 s
[gammaloop-workspace-check] Checking rawpointer v0.2.1
4.06 s
[gammaloop-workspace-check] Checking matrixmultiply v0.3.10
4.09 s
[gammaloop-workspace-check] Checking alloc-stdlib v0.2.2
4.12 s
[gammaloop-workspace-check] Checking anstyle-parse v1.0.0
4.13 s
[gammaloop-workspace-check] Checking colorchoice v1.0.5
4.15 s
[gammaloop-workspace-check] Checking is_terminal_polyfill v1.70.2
4.15 s
[gammaloop-workspace-check] Checking approx v0.5.1
4.18 s
[gammaloop-workspace-check] Checking num-integer v0.1.46
4.19 s
[gammaloop-workspace-check] Checking anstyle v1.0.14
4.21 s
[gammaloop-workspace-check] Checking anstyle-query v1.1.5
4.22 s
[gammaloop-workspace-check] Checking colored v3.1.1
4.25 s
[gammaloop-workspace-check] Compiling phf_generator v0.11.3
4.26 s
[gammaloop-workspace-check] Checking eyre v0.6.12
4.27 s
[gammaloop-workspace-check] Checking unicode-width v0.2.2
4.28 s
[gammaloop-workspace-check] Checking regex-automata v0.4.14
4.28 s
[gammaloop-workspace-check] Checking bitflags v1.3.2
4.30 s
[gammaloop-workspace-check] Checking brotli-decompressor v5.0.0
4.32 s
[gammaloop-workspace-check] Checking region v3.0.2
4.33 s
[gammaloop-workspace-check] Checking serde v1.0.228
4.35 s
[gammaloop-workspace-check] Checking serde_json v1.0.149
4.39 s
[gammaloop-workspace-check] Checking bitflags v2.11.1
4.40 s
[gammaloop-workspace-check] Checking serde_spanned v1.1.1
4.40 s
[gammaloop-workspace-check] Checking toml_datetime v1.1.1+spec-1.1.0
4.48 s
[gammaloop-workspace-check] Checking anstream v1.0.0
4.52 s
[gammaloop-workspace-check] Compiling phf_codegen v0.11.3
4.53 s
[gammaloop-workspace-check] Compiling pyo3-build-config v0.28.3
4.54 s
[gammaloop-workspace-check] Checking wasmtime-jit-icache-coherence v34.0.2
4.55 s
[gammaloop-workspace-check] Checking hugepage-rs v0.1.1
4.56 s
[gammaloop-workspace-check] Checking inventory v0.3.24
4.60 s
[gammaloop-workspace-check] Checking spec_math v0.1.6
4.62 s
[gammaloop-workspace-check] Checking thiserror v2.0.18
4.63 s
[gammaloop-workspace-check] Compiling getopts v0.2.24
4.63 s
[gammaloop-workspace-check] Checking libloading v0.9.0
4.65 s
[gammaloop-workspace-check] Checking self_cell v1.2.2
4.66 s
[gammaloop-workspace-check] Checking toml v1.1.2+spec-1.1.0
4.70 s
[gammaloop-workspace-check] Checking tinyjson v2.5.1
4.71 s
[gammaloop-workspace-check] Checking bytes v1.11.1
4.73 s
[gammaloop-workspace-check] Checking byteorder v1.5.0
4.76 s
[gammaloop-workspace-check] Checking append-only-vec v0.1.8
4.85 s
[gammaloop-workspace-check] Checking smallvec v1.15.1
4.86 s
[gammaloop-workspace-check] Checking num-complex v0.4.6
4.87 s
[gammaloop-workspace-check] Checking tracing-serde v0.2.0
4.91 s
[gammaloop-workspace-check] Checking bincode v2.0.1
4.97 s
[gammaloop-workspace-check] Checking smartstring v1.0.1
5.00 s
[gammaloop-workspace-check] Compiling unicode_names2_generator v1.3.0
5.01 s
[gammaloop-workspace-check] Checking linux-raw-sys v0.12.1
5.03 s
[gammaloop-workspace-check] Checking brotli v8.0.2
5.07 s
[gammaloop-workspace-check] Compiling unic-common v0.9.0
5.14 s
[gammaloop-workspace-check] Compiling unic-char-range v0.9.0
5.16 s
[gammaloop-workspace-check] Checking simba v0.9.1
5.18 s
[gammaloop-workspace-check] Compiling unic-ucd-version v0.9.0
5.19 s
[gammaloop-workspace-check] Compiling is-macro v0.3.7
5.22 s
[gammaloop-workspace-check] Compiling unic-char-property v0.9.0
5.24 s
[gammaloop-workspace-check] Compiling rustpython-parser-vendored v0.4.0
5.29 s
[gammaloop-workspace-check] Checking iana-time-zone v0.1.65
5.29 s
[gammaloop-workspace-check] Compiling rustpython-parser v0.4.0
5.30 s
[gammaloop-workspace-check] Checking rustix v1.1.4
5.40 s
[gammaloop-workspace-check] Checking chrono v0.4.44
5.48 s
[gammaloop-workspace-check] Compiling phf v0.11.3
5.50 s
[gammaloop-workspace-check] Checking rustc-hash v2.1.2
5.55 s
[gammaloop-workspace-check] Compiling unic-emoji-char v0.9.0
5.58 s
[gammaloop-workspace-check] Compiling unic-ucd-ident v0.9.0
5.59 s
[gammaloop-workspace-check] Checking ndarray v0.17.2
5.62 s
[gammaloop-workspace-check] Compiling lalrpop-util v0.20.2
5.65 s
[gammaloop-workspace-check] Compiling rustc-hash v1.1.0
5.74 s
[gammaloop-workspace-check] Checking rug v1.30.0
5.75 s
[gammaloop-workspace-check] Compiling symbolica v2.2.0 (https://github.com/alphal00p/symbolica?rev=4d0a833eb8e059d1f95bdae5abed2559830b235f#4d0a833e)
5.77 s
[gammaloop-workspace-check] Checking unicode-segmentation v1.13.2
5.87 s
[gammaloop-workspace-check] Checking typenum v1.20.0
5.88 s
[gammaloop-workspace-check] Checking getrandom v0.2.17
5.98 s
[gammaloop-workspace-check] Checking scopeguard v1.2.0
6.02 s
[gammaloop-workspace-check] Checking lock_api v0.4.14
6.16 s
[gammaloop-workspace-check] Checking ppv-lite86 v0.2.21
6.17 s
[gammaloop-workspace-check] Checking ahash v0.8.12
6.21 s
[gammaloop-workspace-check] Checking parking_lot_core v0.9.12
6.31 s
[gammaloop-workspace-check] Checking hashbrown v0.17.0
6.33 s
[gammaloop-workspace-check] Checking unicode-ident v1.0.24
6.39 s
[gammaloop-workspace-check] Checking parking_lot v0.12.5
6.41 s
[gammaloop-workspace-check] Checking errno v0.3.14
6.43 s
[gammaloop-workspace-check] Checking clap_lex v1.1.0
6.49 s
[gammaloop-workspace-check] Checking rand_chacha v0.9.0
6.53 s
[gammaloop-workspace-check] Checking unicase v2.9.0
6.54 s
[gammaloop-workspace-check] Checking generic-array v0.14.7
6.55 s
[gammaloop-workspace-check] Checking matchers v0.2.0
6.56 s
[gammaloop-workspace-check] Checking regex v1.12.3
6.58 s
[gammaloop-workspace-check] Checking strsim v0.11.1
6.62 s
[gammaloop-workspace-check] Checking tracing-subscriber v0.3.23
6.65 s
[gammaloop-workspace-check] Checking signal-hook-registry v1.4.8
6.73 s
[gammaloop-workspace-check] Checking rand v0.9.4
6.78 s
[gammaloop-workspace-check] Checking vte v0.14.1
6.79 s
[gammaloop-workspace-check] Checking indexmap v2.14.0
6.82 s
[gammaloop-workspace-check] Checking terminal_size v0.4.4
6.85 s
[gammaloop-workspace-check] Checking same-file v1.0.6
6.90 s
[gammaloop-workspace-check] Checking signal-hook v0.3.18
6.91 s
[gammaloop-workspace-check] Checking half v2.7.1
6.93 s
[gammaloop-workspace-check] Checking clap_builder v4.6.0
6.96 s
[gammaloop-workspace-check] Checking walkdir v2.5.0
7.00 s
[gammaloop-workspace-check] Checking block-buffer v0.10.4
7.04 s
[gammaloop-workspace-check] Checking crypto-common v0.1.7
7.11 s
[gammaloop-workspace-check] Checking mio v1.2.0
7.13 s
[gammaloop-workspace-check] Checking ciborium-io v0.2.2
7.19 s
[gammaloop-workspace-check] Checking minimal-lexical v0.2.1
7.33 s
[gammaloop-workspace-check] Checking ciborium-ll v0.2.2
7.34 s
[gammaloop-workspace-check] Checking digest v0.10.7
7.39 s
[gammaloop-workspace-check] Checking symjit v2.21.0
7.45 s
[gammaloop-workspace-check] Checking derive_more v2.1.1
7.50 s
[gammaloop-workspace-check] Checking nom v7.1.3
7.52 s
[gammaloop-workspace-check] Checking num-bigint v0.4.6
7.55 s
[gammaloop-workspace-check] Checking signal-hook-mio v0.2.5
7.56 s
[gammaloop-workspace-check] Checking console v0.16.3
7.65 s
[gammaloop-workspace-check] Checking bstr v1.12.1
7.69 s
[gammaloop-workspace-check] Checking linux-raw-sys v0.4.15
7.70 s
[gammaloop-workspace-check] Checking cpufeatures v0.2.17
7.76 s
[gammaloop-workspace-check] Checking winnow v0.7.15
8.08 s
[gammaloop-workspace-check] Checking sha2 v0.10.9
8.19 s
[gammaloop-workspace-check] Checking globset v0.4.18
8.21 s
[gammaloop-workspace-check] Checking ciborium v0.2.2
8.36 s
[gammaloop-workspace-check] Checking rustix v0.38.44
8.73 s
[gammaloop-workspace-check] Checking getrandom v0.4.2
8.74 s
[gammaloop-workspace-check] Checking rand_core v0.6.4
8.81 s
[gammaloop-workspace-check] Checking clap v4.6.1
8.85 s
[gammaloop-workspace-check] Checking plotters-backend v0.3.7
8.95 s
[gammaloop-workspace-check] Checking fastrand v2.4.1
8.96 s
[gammaloop-workspace-check] Checking fnv v1.0.7
9.02 s
[gammaloop-workspace-check] Checking plotters-svg v0.3.7
9.06 s
[gammaloop-workspace-check] Checking rust-embed-utils v8.11.0
9.14 s
[gammaloop-workspace-check] Compiling unicode_names2 v1.3.0
9.16 s
[gammaloop-workspace-check] Checking serde_spanned v0.6.9
9.17 s
[gammaloop-workspace-check] Checking tempfile v3.27.0
9.20 s
[gammaloop-workspace-check] Checking toml_datetime v0.6.11
9.23 s
[gammaloop-workspace-check] Checking itertools v0.10.5
9.23 s
[gammaloop-workspace-check] Checking cast v0.3.0
9.27 s
[gammaloop-workspace-check] Checking toml_write v0.1.2
9.34 s
[gammaloop-workspace-check] Checking tap v1.0.1
9.43 s
[gammaloop-workspace-check] Checking plotters v0.3.7
9.45 s
[gammaloop-workspace-check] Checking crossterm v0.28.1
9.46 s
[gammaloop-workspace-check] Checking rand_chacha v0.3.1
9.48 s
[gammaloop-workspace-check] Checking wyz v0.5.1
9.58 s
[gammaloop-workspace-check] Checking radium v0.7.0
9.59 s
[gammaloop-workspace-check] Checking typeid v1.0.3
9.65 s
[gammaloop-workspace-check] Checking similar v2.7.0
9.77 s
[gammaloop-workspace-check] Checking tinytemplate v1.2.1
9.79 s
[gammaloop-workspace-check] Checking is-terminal v0.4.17
9.87 s
[gammaloop-workspace-check] Checking funty v2.0.0
9.87 s
[gammaloop-workspace-check] Checking anes v0.1.6
10.08 s
[gammaloop-workspace-check] Checking bytecount v0.6.9
10.12 s
[gammaloop-workspace-check] Checking oorandom v11.1.5
10.13 s
[gammaloop-workspace-check] Checking rand v0.8.6
10.16 s
[gammaloop-workspace-check] Checking ron v0.12.1
10.19 s
[gammaloop-workspace-check] Checking toml_edit v0.25.11+spec-1.1.0
10.35 s
[gammaloop-workspace-check] Checking bitvec v1.0.1
10.50 s
[gammaloop-workspace-check] Checking criterion-plot v0.5.0
10.75 s
[gammaloop-workspace-check] Checking ansitok v0.3.0
10.83 s
[gammaloop-workspace-check] Checking xprec v0.2.2
11.02 s
[gammaloop-workspace-check] Checking toml_edit v0.22.27
11.06 s
[gammaloop-workspace-check] Checking uncased v0.9.10
11.10 s
[gammaloop-workspace-check] Checking env_filter v1.0.1
11.14 s
[gammaloop-workspace-check] Checking criterion v0.5.1
11.19 s
[gammaloop-workspace-check] Checking jiff v0.2.24
11.19 s
[gammaloop-workspace-check] Checking ptr_meta v0.1.4
11.23 s
[gammaloop-workspace-check] Checking simdutf8 v0.1.5
11.37 s
[gammaloop-workspace-check] Checking ucd-trie v0.1.7
11.37 s
[gammaloop-workspace-check] Checking bytecheck v0.6.12
11.37 s
[gammaloop-workspace-check] Checking ahash v0.7.8
11.37 s
[gammaloop-workspace-check] Checking insta v1.47.2
11.40 s
[gammaloop-workspace-check] Checking approx v0.4.0
11.43 s
[gammaloop-workspace-check] Checking seahash v4.1.0
11.48 s
[gammaloop-workspace-check] Checking ansi-str v0.9.0
11.56 s
[gammaloop-workspace-check] Checking testing_table v0.3.0
11.59 s
[gammaloop-workspace-check] Checking pest v2.8.6
11.63 s
[gammaloop-workspace-check] Checking cgmath v0.18.0
11.65 s
[gammaloop-workspace-check] Checking num-rational v0.4.2
11.82 s
[gammaloop-workspace-check] Checking hashbrown v0.12.3
11.91 s
[gammaloop-workspace-check] Checking rend v0.4.2
12.19 s
[gammaloop-workspace-check] Checking num-iter v0.1.45
12.20 s
[gammaloop-workspace-check] Checking papergrid v0.17.0
12.29 s
[gammaloop-workspace-check] Checking ref-ops v0.2.5
12.42 s
[gammaloop-workspace-check] Checking num v0.4.3
12.46 s
[gammaloop-workspace-check] Checking rand_xoshiro v0.6.0
12.51 s
[gammaloop-workspace-check] Checking features v0.10.0
12.51 s
[gammaloop-workspace-check] Checking constcat v0.5.1
12.53 s
[gammaloop-workspace-check] Checking gat-lending-iterator v0.1.8
12.59 s
[gammaloop-workspace-check] Checking colored v2.2.0
12.60 s
[gammaloop-workspace-check] Checking constant_time_eq v0.4.2
12.68 s
[gammaloop-workspace-check] Checking arrayref v0.3.9
12.79 s
[gammaloop-workspace-check] Checking cpufeatures v0.3.0
12.81 s
[gammaloop-workspace-check] Checking base64 v0.22.1
12.86 s
[gammaloop-workspace-check] Checking blake3 v1.8.5
12.91 s
[gammaloop-workspace-check] Checking joinery v2.1.0
13.02 s
[gammaloop-workspace-check] Checking siphasher v1.0.2
13.06 s
[gammaloop-workspace-check] Checking titlecase v2.2.1
13.18 s
[gammaloop-workspace-check] Checking phf_shared v0.13.1
13.21 s
[gammaloop-workspace-check] Checking subprocess v0.2.15
13.25 s
[gammaloop-workspace-check] Checking rust_lisp v0.18.0
13.28 s
[gammaloop-workspace-check] Compiling vakint v0.1.2 (/build/source/crates/vakint)
13.32 s
[gammaloop-workspace-check] Checking version-compare v0.2.1
13.35 s
[gammaloop-workspace-check] Checking toml v0.8.23
13.40 s
[gammaloop-workspace-check] Checking phf v0.13.1
13.46 s
[gammaloop-workspace-check] Checking xpct v0.5.1
13.48 s
[gammaloop-workspace-check] Checking dot-parser v0.5.1
13.50 s
[gammaloop-workspace-check] Compiling pyo3-macros-backend v0.28.3
13.52 s
[gammaloop-workspace-check] Compiling pyo3-ffi v0.28.3
13.54 s
[gammaloop-workspace-check] Compiling pyo3 v0.28.3
13.57 s
[gammaloop-workspace-check] Compiling numpy v0.28.0
13.59 s
[gammaloop-workspace-check] Checking tabled v0.20.0
13.64 s
[gammaloop-workspace-check] Checking string-template-plus v0.4.3
13.86 s
[gammaloop-workspace-check] Checking ryu v1.0.23
13.90 s
[gammaloop-workspace-check] Checking figment v0.10.19
13.94 s
[gammaloop-workspace-check] Checking castaway v0.2.4
13.96 s
[gammaloop-workspace-check] Checking toml_datetime v0.7.5+spec-1.1.0
14.00 s
[gammaloop-workspace-check] Checking strum v0.27.2
14.02 s
[gammaloop-workspace-check] Checking compact_str v0.9.0
14.06 s
[gammaloop-workspace-check] Checking unicode-truncate v2.0.1
14.08 s
[gammaloop-workspace-check] Checking kasuari v0.4.12
14.10 s
[gammaloop-workspace-check] Checking lru v0.16.4
14.12 s
[gammaloop-workspace-check] Checking vte v0.15.0
14.13 s
[gammaloop-workspace-check] Checking toml v0.9.12+spec-1.1.0
14.18 s
[gammaloop-workspace-check] Checking portable-atomic v1.13.1
14.25 s
[gammaloop-workspace-check] Checking vt100 v0.16.2
14.27 s
[gammaloop-workspace-check] Checking unit-prefix v0.5.2
14.27 s
[gammaloop-workspace-check] Checking rand_distr v0.4.3
14.29 s
[gammaloop-workspace-check] Checking simba v0.6.0
14.35 s
[gammaloop-workspace-check] Checking line-clipping v0.3.7
14.37 s
[gammaloop-workspace-check] Compiling three-dimensional-reps v0.1.0 (/build/source/crates/three-dimensional-reps)
14.40 s
[gammaloop-workspace-check] Checking ratatui-core v0.1.0
14.45 s
[gammaloop-workspace-check] Checking gimli v0.32.3
14.47 s
[gammaloop-workspace-check] Checking adler2 v2.0.1
14.52 s
[gammaloop-workspace-check] Checking thiserror v1.0.69
14.54 s
[gammaloop-workspace-check] Checking miniz_oxide v0.8.9
14.58 s
[gammaloop-workspace-check] Checking derive_builder v0.11.2
14.59 s
[gammaloop-workspace-check] Checking crossterm v0.29.0
14.60 s
[gammaloop-workspace-check] Checking indicatif v0.18.4
14.64 s
[gammaloop-workspace-check] Checking object v0.37.3
14.72 s
[gammaloop-workspace-check] Checking owo-colors v4.3.0
14.75 s
[gammaloop-workspace-check] Checking tracing-error v0.2.1
14.77 s
[gammaloop-workspace-check] Checking env_logger v0.11.10
14.79 s
[gammaloop-workspace-check] Checking typed-index-collections v3.5.0
14.83 s
[gammaloop-workspace-check] Checking rkyv v0.7.46
14.94 s
[gammaloop-workspace-check] Checking serde-big-array v0.5.1
14.97 s
[gammaloop-workspace-check] Checking amd v0.2.2
15.04 s
[gammaloop-workspace-check] Checking itertools v0.11.0
15.11 s
[gammaloop-workspace-check] Compiling gammaloop-tracing-filter-macros v0.1.0 (/build/source/crates/gammaloop-tracing-filter-macros)
15.14 s
[gammaloop-workspace-check] Checking rustc-demangle v0.1.27
15.24 s
[gammaloop-workspace-check] Checking option-ext v0.2.0
15.27 s
[gammaloop-workspace-check] Checking ratatui-widgets v0.3.0
15.31 s
[gammaloop-workspace-check] Checking dirs-sys v0.5.0
15.42 s
[gammaloop-workspace-check] Checking ref-cast v1.0.25
15.48 s
[gammaloop-workspace-check] Checking nix v0.31.2
15.57 s
[gammaloop-workspace-check] Checking integer-sqrt v0.1.5
15.62 s
[gammaloop-workspace-check] Checking brotli-decompressor v4.0.3
15.64 s
[gammaloop-workspace-check] Checking crossbeam-channel v0.5.15
15.86 s
[gammaloop-workspace-check] Checking itertools v0.12.1
16.19 s
[gammaloop-workspace-check] Checking color-spantrace v0.3.0
16.21 s
[gammaloop-workspace-check] Checking symlink v0.1.0
16.21 s
[gammaloop-workspace-check] Checking ratatui-crossterm v0.1.0
16.29 s
[gammaloop-workspace-check] Compiling gammalooprs v0.3.4 (/build/source/crates/gammalooprs)
16.30 s
[gammaloop-workspace-check] Checking unsafe-libyaml v0.2.11
16.31 s
[gammaloop-workspace-check] Checking tracing-appender v0.2.5
16.43 s
[gammaloop-workspace-check] Compiling rustpython-parser-core v0.4.0
16.47 s
[gammaloop-workspace-check] Checking include_dir v0.7.4
16.49 s
[gammaloop-workspace-check] Checking ctrlc v3.5.2
16.54 s
[gammaloop-workspace-check] Checking tracing-indicatif v0.3.14
16.57 s
[gammaloop-workspace-check] Checking pathfinding v4.15.0
16.59 s
[gammaloop-workspace-check] Compiling rustpython-ast v0.4.0
16.64 s
[gammaloop-workspace-check] Checking schemars v1.2.1
16.71 s
[gammaloop-workspace-check] Checking slotmap v1.1.1
16.79 s
[gammaloop-workspace-check] Checking dirs v6.0.0
16.88 s
[gammaloop-workspace-check] Checking json5 v0.4.1
17.00 s
[gammaloop-workspace-check] Checking ratatui-macros v0.7.0
17.06 s
[gammaloop-workspace-check] Checking ratatui v0.30.0
17.13 s
[gammaloop-workspace-check] Checking brotli v7.0.0
17.19 s
[gammaloop-workspace-check] Checking vectorize v0.2.0
17.19 s
[gammaloop-workspace-check] Checking base62 v2.2.4
17.23 s
[gammaloop-workspace-check] Checking ringbuffer v0.16.0
17.34 s
[gammaloop-workspace-check] Checking clarabel v0.11.1
17.35 s
[gammaloop-workspace-check] Checking rust-embed v8.11.0
17.36 s
[gammaloop-workspace-check] Checking clap_complete v4.6.3
17.41 s
[gammaloop-workspace-check] Checking strip-ansi-escapes v0.2.1
17.43 s
[gammaloop-workspace-check] Checking fd-lock v4.0.4
17.49 s
[gammaloop-workspace-check] Compiling gammaloop-api v0.1.0 (/build/source/crates/gammaloop-api)
17.54 s
[gammaloop-workspace-check] Checking itertools v0.13.0
17.57 s
[gammaloop-workspace-check] Checking serde_yaml v0.9.34+deprecated
17.62 s
[gammaloop-workspace-check] Checking strum v0.26.3
17.79 s
[gammaloop-workspace-check] Checking sysinfo v0.33.1
17.94 s
[gammaloop-workspace-check] Checking shlex v1.3.0
18.05 s
[gammaloop-workspace-check] Checking clap_complete_nushell v4.6.0
18.12 s
[gammaloop-workspace-check] Checking slab v0.4.12
18.23 s
[gammaloop-workspace-check] Checking futures-task v0.3.32
18.25 s
[gammaloop-workspace-check] Checking futures-core v0.3.32
18.33 s
[gammaloop-workspace-check] Checking sdd v3.0.10
18.35 s
[gammaloop-workspace-check] Compiling gammaloop-integration-tests v0.1.0 (/build/source/tests)
18.39 s
[gammaloop-workspace-check] Compiling test-log-core v0.2.20
18.47 s
[gammaloop-workspace-check] Checking futures-util v0.3.32
18.86 s
[gammaloop-workspace-check] Checking scc v2.4.0
18.91 s
[gammaloop-workspace-check] Compiling rustc_version v0.4.1
18.93 s
[gammaloop-workspace-check] Checking which v8.0.2
19.18 s
[gammaloop-workspace-check] Checking bincode v1.3.3
19.26 s
[gammaloop-workspace-check] Checking reedline v0.42.0
19.27 s
[gammaloop-workspace-check] Checking addr2line v0.25.1
19.69 s
[gammaloop-workspace-check] Compiling numerica v2.2.0 (https://github.com/alphal00p/symbolica?rev=4d0a833eb8e059d1f95bdae5abed2559830b235f#4d0a833e)
19.89 s
[gammaloop-workspace-check] Checking backtrace v0.3.76
19.91 s
[gammaloop-workspace-check] Compiling gungraun-runner v0.18.2
20.19 s
[gammaloop-workspace-check] Compiling gungraun-macros v0.8.0
20.41 s
[gammaloop-workspace-check] Checking nalgebra v0.29.0
21.22 s
[gammaloop-workspace-check] Checking color-eyre v0.6.5
21.40 s
[gammaloop-workspace-check] Checking proc-macro2 v1.0.106
21.73 s
[gammaloop-workspace-check] Checking quote v1.0.45
21.81 s
[gammaloop-workspace-check] Checking base64 v0.21.7
21.86 s
[gammaloop-workspace-check] Checking maplit v1.0.2
21.92 s
[gammaloop-workspace-check] Compiling iai-callgrind-runner v0.14.2
21.93 s
[gammaloop-workspace-check] Checking kurbo v0.13.0
22.01 s
[gammaloop-workspace-check] Checking wait-timeout v0.2.1
22.11 s
[gammaloop-workspace-check] Compiling iai-callgrind v0.14.2
22.16 s
[gammaloop-workspace-check] Checking bit-vec v0.8.0
22.20 s
[gammaloop-workspace-check] Checking quick-error v1.2.3
22.29 s
[gammaloop-workspace-check] Checking ron v0.8.1
22.29 s
[gammaloop-workspace-check] Checking rusty-fork v0.3.1
22.46 s
[gammaloop-workspace-check] Checking syn v2.0.117
22.46 s
[gammaloop-workspace-check] Compiling iai-callgrind-macros v0.5.1
22.53 s
[gammaloop-workspace-check] Checking bit-set v0.8.0
22.73 s
[gammaloop-workspace-check] Compiling test-log-macros v0.2.20
22.86 s
[gammaloop-workspace-check] Checking futures-executor v0.3.32
22.96 s
[gammaloop-workspace-check] Checking rand_xorshift v0.4.0
23.04 s
[gammaloop-workspace-check] Checking serial_test v3.4.0
23.11 s
[gammaloop-workspace-check] Checking console v0.15.11
23.15 s
[gammaloop-workspace-check] Checking pathdiff v0.2.3
23.20 s
[gammaloop-workspace-check] Checking unarray v0.1.4
23.29 s
[gammaloop-workspace-check] Checking proptest v1.11.0
23.67 s
[gammaloop-workspace-check] Checking similar-asserts v1.7.0
23.85 s
[gammaloop-workspace-check] Checking clinnet v0.1.8 (/build/source/crates/clinnet)
24.36 s
[gammaloop-workspace-check] Checking kurvst v0.1.0 (/build/source/crates/kurvst)
26.42 s
[gammaloop-workspace-check] Compiling graphica v2.1.0 (https://github.com/alphal00p/symbolica?rev=4d0a833eb8e059d1f95bdae5abed2559830b235f#4d0a833e)
26.66 s
[gammaloop-workspace-check] Checking test-log v0.2.20
31.88 s
[gammaloop-workspace-check] Checking statrs v0.16.1
32.83 s
[gammaloop-workspace-check] Checking gungraun v0.18.2
33.33 s
[gammaloop-workspace-check] Checking momtrop v0.3.0
36.62 s
[gammaloop-workspace-check] Compiling pyo3-macros v0.28.3
38.74 s
[gammaloop-workspace-check] Compiling pyo3-stub-gen-derive v0.17.2
45.51 s
[gammaloop-workspace-check] Checking pyo3-stub-gen v0.17.2
54.88 s
[gammaloop-workspace-check] Checking symbolica-utils v0.1.0 (/build/source/crates/symbolica-utils)
54.88 s
[gammaloop-workspace-check] Checking spenso-macros v0.3.2 (/build/source/crates/spenso-macros)
241.07 s
[gammaloop-workspace-check] Compiling gammaloop-workspace-hack v0.1.0 (/build/source/crates/gammaloop-workspace-hack)
241.40 s
[gammaloop-workspace-check] Checking linnet v0.17.0 (/build/source/crates/linnet)
244.85 s
[gammaloop-workspace-check] Checking spenso v0.6.0 (/build/source/crates/spenso)
244.92 s
[gammaloop-workspace-check] Checking linnet-py v0.1.0 (/build/source/crates/linnet-py)
244.92 s
[gammaloop-workspace-check] Checking linnest v0.1.0 (/build/source/crates/linnest)
252.73 s
[gammaloop-workspace-check] Checking idenso v0.3.0 (/build/source/crates/idenso)
252.73 s
[gammaloop-workspace-check] Checking gammaloop-tracing-filter v0.1.0 (/build/source/crates/gammaloop-tracing-filter)
254.79 s
[gammaloop-workspace-check] Checking spenso-hep-lib v0.1.7 (/build/source/crates/spenso-hep-lib)
255.02 s
[gammaloop-workspace-check] Checking spynso3 v0.1.2 (/build/source/crates/spynso3)
267.93 s
[gammaloop-workspace-check] error[E0283] : type annotations needed
267.93 s
[gammaloop-workspace-check] --> crates/gammalooprs/src/momentum/sample.rs:1165:35
267.93 s
[gammaloop-workspace-check] |
267.93 s
[gammaloop-workspace-check] 1165 | requested.into_iter().collect(),
267.93 s
[gammaloop-workspace-check] | ^^^^^^^ cannot infer type of the type parameter `B` declared on the method `collect`
267.93 s
[gammaloop-workspace-check] |
267.93 s
[gammaloop-workspace-check] = note : the type must implement `FromIterator<linnet::half_edge::involution::EdgeIndex>`
267.93 s
[gammaloop-workspace-check] note : required by a bound in `std::iter::Iterator::collect`
267.93 s
[gammaloop-workspace-check] --> /rustc/2d8144b7880597b6e6d3dfd63a9a9efae3f533d3/library/core/src/iter/traits/iterator.rs:2077:4
267.93 s
[gammaloop-workspace-check] help : consider specifying the generic argument
267.93 s
[gammaloop-workspace-check] |
267.93 s
[gammaloop-workspace-check] 1165 | requested.into_iter().collect::<Vec<_>> (),
267.93 s
[gammaloop-workspace-check] | ++++++++++
267.93 s
[gammaloop-workspace-check]
267.94 s
[gammaloop-workspace-check] error[E0283] : type annotations needed
267.94 s
[gammaloop-workspace-check] --> crates/gammalooprs/src/momentum/sample.rs:1165:35
267.94 s
[gammaloop-workspace-check] |
267.94 s
[gammaloop-workspace-check] 1161 | / assert_eq!(
267.94 s
[gammaloop-workspace-check] 1162 | | subspace
267.94 s
[gammaloop-workspace-check] 1163 | | .iter_basis_edges(&all_lmbs)
267.94 s
[gammaloop-workspace-check] 1164 | | .collect::<std::collections::BTreeSet<_>>(),
267.94 s
[gammaloop-workspace-check] 1165 | | requested.into_iter().collect(),
267.94 s
[gammaloop-workspace-check] | | ^^^^^^^ cannot infer type of the type parameter `B` declared on the method `collect`
267.94 s
[gammaloop-workspace-check] 1166 | | );
267.94 s
[gammaloop-workspace-check] | |_________- type must be known at this point
267.94 s
[gammaloop-workspace-check] |
267.94 s
[gammaloop-workspace-check] = note : multiple `impl`s satisfying `std::collections::BTreeSet<linnet::half_edge::involution::EdgeIndex>: PartialEq<_>` found in the following crates: `alloc`, `rkyv`:
267.94 s
[gammaloop-workspace-check] - impl<K, AK> PartialEq<rkyv::collections::btree_set::ArchivedBTreeSet<AK>> for std::collections::BTreeSet<K>
267.94 s
[gammaloop-workspace-check] where AK: PartialEq<K>;
267.94 s
[gammaloop-workspace-check] - impl<T, A> PartialEq for std::collections::BTreeSet<T, A>
267.94 s
[gammaloop-workspace-check] where T: PartialEq, A: Allocator, A: Clone;
267.94 s
[gammaloop-workspace-check] help : consider specifying the generic argument
267.94 s
[gammaloop-workspace-check] |
267.94 s
[gammaloop-workspace-check] 1165 | requested.into_iter().collect::<Vec<_>> (),
267.94 s
[gammaloop-workspace-check] | ++++++++++
267.94 s
[gammaloop-workspace-check]
268.67 s
[gammaloop-workspace-check] error[E0283] : type annotations needed
268.67 s
[gammaloop-workspace-check] --> crates/gammalooprs/src/momentum/sample.rs:1182:35
268.67 s
[gammaloop-workspace-check] |
268.67 s
[gammaloop-workspace-check] 1178 | / assert_eq!(
268.67 s
[gammaloop-workspace-check] 1179 | | common_subspace
268.67 s
[gammaloop-workspace-check] 1180 | | .iter_basis_edges(&all_lmbs)
268.67 s
[gammaloop-workspace-check] 1181 | | .collect::<std::collections::BTreeSet<_>>(),
268.67 s
[gammaloop-workspace-check] 1182 | | requested.into_iter().collect(),
268.67 s
[gammaloop-workspace-check] | | ^^^^^^^ cannot infer type of the type parameter `B` declared on the method `collect`
268.67 s
[gammaloop-workspace-check] 1183 | | );
268.67 s
[gammaloop-workspace-check] | |_________- type must be known at this point
268.67 s
[gammaloop-workspace-check] |
268.67 s
[gammaloop-workspace-check] = note : multiple `impl`s satisfying `std::collections::BTreeSet<linnet::half_edge::involution::EdgeIndex>: PartialEq<_>` found in the following crates: `alloc`, `rkyv`:
268.67 s
[gammaloop-workspace-check] - impl<K, AK> PartialEq<rkyv::collections::btree_set::ArchivedBTreeSet<AK>> for std::collections::BTreeSet<K>
268.67 s
[gammaloop-workspace-check] where AK: PartialEq<K>;
268.67 s
[gammaloop-workspace-check] - impl<T, A> PartialEq for std::collections::BTreeSet<T, A>
268.67 s
[gammaloop-workspace-check] where T: PartialEq, A: Allocator, A: Clone;
268.67 s
[gammaloop-workspace-check] help : consider specifying the generic argument
268.67 s
[gammaloop-workspace-check] |
268.67 s
[gammaloop-workspace-check] 1182 | requested.into_iter().collect::<Vec<_>> (),
268.67 s
[gammaloop-workspace-check] | ++++++++++
268.67 s
[gammaloop-workspace-check]
268.69 s
[gammaloop-workspace-check] error[E0283] : type annotations needed
268.69 s
[gammaloop-workspace-check] --> crates/gammalooprs/src/momentum/sample.rs:1203:35
268.69 s
[gammaloop-workspace-check] |
268.69 s
[gammaloop-workspace-check] 1199 | / assert_eq!(
268.69 s
[gammaloop-workspace-check] 1200 | | sparse_common_subspace
268.69 s
[gammaloop-workspace-check] 1201 | | .iter_basis_edges(&all_lmbs)
268.69 s
[gammaloop-workspace-check] 1202 | | .collect::<std::collections::BTreeSet<_>>(),
268.69 s
[gammaloop-workspace-check] 1203 | | requested.into_iter().collect(),
268.69 s
[gammaloop-workspace-check] | | ^^^^^^^ cannot infer type of the type parameter `B` declared on the method `collect`
268.69 s
[gammaloop-workspace-check] 1204 | | );
268.69 s
[gammaloop-workspace-check] | |_________- type must be known at this point
268.69 s
[gammaloop-workspace-check] |
268.69 s
[gammaloop-workspace-check] = note : multiple `impl`s satisfying `std::collections::BTreeSet<linnet::half_edge::involution::EdgeIndex>: PartialEq<_>` found in the following crates: `alloc`, `rkyv`:
268.69 s
[gammaloop-workspace-check] - impl<K, AK> PartialEq<rkyv::collections::btree_set::ArchivedBTreeSet<AK>> for std::collections::BTreeSet<K>
268.69 s
[gammaloop-workspace-check] where AK: PartialEq<K>;
268.69 s
[gammaloop-workspace-check] - impl<T, A> PartialEq for std::collections::BTreeSet<T, A>
268.69 s
[gammaloop-workspace-check] where T: PartialEq, A: Allocator, A: Clone;
268.69 s
[gammaloop-workspace-check] help : consider specifying the generic argument
268.69 s
[gammaloop-workspace-check] |
268.69 s
[gammaloop-workspace-check] 1203 | requested.into_iter().collect::<Vec<_>> (),
268.69 s
[gammaloop-workspace-check] | ++++++++++
268.69 s
[gammaloop-workspace-check]
270.41 s
[gammaloop-workspace-check] error[E0283] : type annotations needed
270.41 s
[gammaloop-workspace-check] --> crates/gammalooprs/src/processes/amplitude.rs:3336:49
270.41 s
[gammaloop-workspace-check] |
270.41 s
[gammaloop-workspace-check] 3336 | variant_ids.iter().copied().collect(),
270.41 s
[gammaloop-workspace-check] | ^^^^^^^ cannot infer type of the type parameter `B` declared on the method `collect`
270.41 s
[gammaloop-workspace-check] |
270.41 s
[gammaloop-workspace-check] = note : the type must implement `FromIterator<processes::threshold_counterterms::ThresholdCountertermVariantId>`
270.41 s
[gammaloop-workspace-check] note : required by a bound in `std::iter::Iterator::collect`
270.41 s
[gammaloop-workspace-check] --> /rustc/2d8144b7880597b6e6d3dfd63a9a9efae3f533d3/library/core/src/iter/traits/iterator.rs:2077:4
270.41 s
[gammaloop-workspace-check] help : consider specifying the generic argument
270.41 s
[gammaloop-workspace-check] |
270.41 s
[gammaloop-workspace-check] 3336 | variant_ids.iter().copied().collect::<Vec<_>> (),
270.41 s
[gammaloop-workspace-check] | ++++++++++
270.41 s
[gammaloop-workspace-check]
270.42 s
[gammaloop-workspace-check] error[E0283] : type annotations needed
270.42 s
[gammaloop-workspace-check] --> crates/gammalooprs/src/processes/amplitude.rs:3336:49
270.42 s
[gammaloop-workspace-check] |
270.42 s
[gammaloop-workspace-check] 3334 | / assert_eq!(
270.42 s
[gammaloop-workspace-check] 3335 | | referenced_variants,
270.42 s
[gammaloop-workspace-check] 3336 | | variant_ids.iter().copied().collect(),
270.42 s
[gammaloop-workspace-check] | | ^^^^^^^ cannot infer type of the type parameter `B` declared on the method `collect`
270.42 s
[gammaloop-workspace-check] 3337 | | "overlap groups must retain every semantic duplicate independently",
270.42 s
[gammaloop-workspace-check] 3338 | | );
270.42 s
[gammaloop-workspace-check] | |_________________- type must be known at this point
270.42 s
[gammaloop-workspace-check] |
270.42 s
[gammaloop-workspace-check] = note : multiple `impl`s satisfying `std::collections::BTreeSet<processes::threshold_counterterms::ThresholdCountertermVariantId>: PartialEq<_>` found in the following crates: `alloc`, `rkyv`:
270.42 s
[gammaloop-workspace-check] - impl<K, AK> PartialEq<rkyv::collections::btree_set::ArchivedBTreeSet<AK>> for std::collections::BTreeSet<K>
270.42 s
[gammaloop-workspace-check] where AK: PartialEq<K>;
270.42 s
[gammaloop-workspace-check] - impl<T, A> PartialEq for std::collections::BTreeSet<T, A>
270.42 s
[gammaloop-workspace-check] where T: PartialEq, A: Allocator, A: Clone;
270.42 s
[gammaloop-workspace-check] help : consider specifying the generic argument
270.42 s
[gammaloop-workspace-check] |
270.42 s
[gammaloop-workspace-check] 3336 | variant_ids.iter().copied().collect::<Vec<_>> (),
270.42 s
[gammaloop-workspace-check] | ++++++++++
270.42 s
[gammaloop-workspace-check]
270.62 s
[gammaloop-workspace-check] error[E0283] : type annotations needed
270.62 s
[gammaloop-workspace-check] --> crates/gammalooprs/src/processes/amplitude.rs:4098:59
270.62 s
[gammaloop-workspace-check] |
270.62 s
[gammaloop-workspace-check] 4098 | assert_eq!(orders, [1, 2].into_iter().collect());
270.62 s
[gammaloop-workspace-check] | ^^^^^^^ cannot infer type of the type parameter `B` declared on the method `collect`
270.62 s
[gammaloop-workspace-check] |
270.62 s
[gammaloop-workspace-check] = note : the type must implement `FromIterator<i32>`
270.62 s
[gammaloop-workspace-check] note : required by a bound in `std::iter::Iterator::collect`
270.62 s
[gammaloop-workspace-check] --> /rustc/2d8144b7880597b6e6d3dfd63a9a9efae3f533d3/library/core/src/iter/traits/iterator.rs:2077:4
270.62 s
[gammaloop-workspace-check] help : consider specifying the generic argument
270.62 s
[gammaloop-workspace-check] |
270.62 s
[gammaloop-workspace-check] 4098 | assert_eq!(orders, [1, 2].into_iter().collect::<Vec<_>> ());
270.62 s
[gammaloop-workspace-check] | ++++++++++
270.62 s
[gammaloop-workspace-check]
270.63 s
[gammaloop-workspace-check] error[E0283] : type annotations needed
270.63 s
[gammaloop-workspace-check] --> crates/gammalooprs/src/processes/amplitude.rs:4098:59
270.63 s
[gammaloop-workspace-check] |
270.63 s
[gammaloop-workspace-check] 4098 | assert_eq!(orders, [1, 2].into_iter().collect());
270.63 s
[gammaloop-workspace-check] | -------------------------------------- ^^^^^^^ ---
270.63 s
[gammaloop-workspace-check] | | |
270.63 s
[gammaloop-workspace-check] | | cannot infer type of the type parameter `B` declared on the method `collect`
270.63 s
[gammaloop-workspace-check] | type must be known at this point
270.63 s
[gammaloop-workspace-check] |
270.63 s
[gammaloop-workspace-check] = note : multiple `impl`s satisfying `std::collections::BTreeSet<usize>: PartialEq<_>` found in the following crates: `alloc`, `rkyv`:
270.63 s
[gammaloop-workspace-check] - impl<K, AK> PartialEq<rkyv::collections::btree_set::ArchivedBTreeSet<AK>> for std::collections::BTreeSet<K>
270.63 s
[gammaloop-workspace-check] where AK: PartialEq<K>;
270.63 s
[gammaloop-workspace-check] - impl<T, A> PartialEq for std::collections::BTreeSet<T, A>
270.63 s
[gammaloop-workspace-check] where T: PartialEq, A: Allocator, A: Clone;
270.63 s
[gammaloop-workspace-check] help : consider specifying the generic argument
270.63 s
[gammaloop-workspace-check] |
270.63 s
[gammaloop-workspace-check] 4098 | assert_eq!(orders, [1, 2].into_iter().collect::<Vec<_>> ());
270.63 s
[gammaloop-workspace-check] | ++++++++++
270.63 s
[gammaloop-workspace-check]
270.65 s
[gammaloop-workspace-check] error[E0283] : type annotations needed
270.65 s
[gammaloop-workspace-check] --> crates/gammalooprs/src/processes/amplitude.rs:4129:48
270.65 s
[gammaloop-workspace-check] |
270.65 s
[gammaloop-workspace-check] 4123 | / assert_eq!(
270.65 s
[gammaloop-workspace-check] 4124 | | evaluator
270.65 s
[gammaloop-workspace-check] 4125 | | .evaluator_stacks
270.65 s
[gammaloop-workspace-check] 4126 | | .keys()
270.65 s
[gammaloop-workspace-check] ... |
270.65 s
[gammaloop-workspace-check] 4129 | | [1, 2].into_iter().collect()
270.65 s
[gammaloop-workspace-check] | | ^^^^^^^ cannot infer type of the type parameter `B` declared on the method `collect`
270.65 s
[gammaloop-workspace-check] 4130 | | );
270.65 s
[gammaloop-workspace-check] | |_________________________- type must be known at this point
270.65 s
[gammaloop-workspace-check] |
270.65 s
[gammaloop-workspace-check] = note : multiple `impl`s satisfying `std::collections::BTreeSet<usize>: PartialEq<_>` found in the following crates: `alloc`, `rkyv`:
270.65 s
[gammaloop-workspace-check] - impl<K, AK> PartialEq<rkyv::collections::btree_set::ArchivedBTreeSet<AK>> for std::collections::BTreeSet<K>
270.65 s
[gammaloop-workspace-check] where AK: PartialEq<K>;
270.65 s
[gammaloop-workspace-check] - impl<T, A> PartialEq for std::collections::BTreeSet<T, A>
270.65 s
[gammaloop-workspace-check] where T: PartialEq, A: Allocator, A: Clone;
270.65 s
[gammaloop-workspace-check] help : consider specifying the generic argument
270.65 s
[gammaloop-workspace-check] |
270.65 s
[gammaloop-workspace-check] 4129 | [1, 2].into_iter().collect::<Vec<_>> ()
270.65 s
[gammaloop-workspace-check] | ++++++++++
270.65 s
[gammaloop-workspace-check]
270.74 s
[gammaloop-workspace-check] error[E0283] : type annotations needed
270.74 s
[gammaloop-workspace-check] --> crates/gammalooprs/src/processes/amplitude.rs:4160:30
270.74 s
[gammaloop-workspace-check] |
270.74 s
[gammaloop-workspace-check] 4148 | / assert_eq!(
270.74 s
[gammaloop-workspace-check] 4149 | | registry
270.74 s
[gammaloop-workspace-check] 4150 | | .components
270.74 s
[gammaloop-workspace-check] 4151 | | .iter()
270.74 s
[gammaloop-workspace-check] ... |
270.74 s
[gammaloop-workspace-check] 4160 | | .collect()
270.74 s
[gammaloop-workspace-check] | | ^^^^^^^ cannot infer type of the type parameter `B` declared on the method `collect`
270.74 s
[gammaloop-workspace-check] 4161 | | );
270.74 s
[gammaloop-workspace-check] | |_________________________- type must be known at this point
270.74 s
[gammaloop-workspace-check] |
270.74 s
[gammaloop-workspace-check] = note : multiple `impl`s satisfying `std::collections::BTreeSet<processes::threshold_counterterms::ThresholdCountertermComponentKind>: PartialEq<_>` found in the following crates: `alloc`, `rkyv`:
270.74 s
[gammaloop-workspace-check] - impl<K, AK> PartialEq<rkyv::collections::btree_set::ArchivedBTreeSet<AK>> for std::collections::BTreeSet<K>
270.74 s
[gammaloop-workspace-check] where AK: PartialEq<K>;
270.74 s
[gammaloop-workspace-check] - impl<T, A> PartialEq for std::collections::BTreeSet<T, A>
270.74 s
[gammaloop-workspace-check] where T: PartialEq, A: Allocator, A: Clone;
270.74 s
[gammaloop-workspace-check] help : consider specifying the generic argument
270.74 s
[gammaloop-workspace-check] |
270.74 s
[gammaloop-workspace-check] 4160 | .collect::<Vec<_>> ()
270.74 s
[gammaloop-workspace-check] | ++++++++++
270.74 s
[gammaloop-workspace-check]
270.76 s
[gammaloop-workspace-check] error[E0283] : type annotations needed
270.76 s
[gammaloop-workspace-check] --> crates/gammalooprs/src/processes/amplitude.rs:4214:26
270.76 s
[gammaloop-workspace-check] |
270.76 s
[gammaloop-workspace-check] 4201 | / assert_eq!(
270.76 s
[gammaloop-workspace-check] 4202 | | decomposition
270.76 s
[gammaloop-workspace-check] 4203 | | .components
270.76 s
[gammaloop-workspace-check] 4204 | | .iter()
270.76 s
[gammaloop-workspace-check] ... |
270.76 s
[gammaloop-workspace-check] 4214 | | .collect()
270.76 s
[gammaloop-workspace-check] | | ^^^^^^^ cannot infer type of the type parameter `B` declared on the method `collect`
270.76 s
[gammaloop-workspace-check] 4215 | | );
270.76 s
[gammaloop-workspace-check] | |_____________________- type must be known at this point
270.76 s
[gammaloop-workspace-check] |
270.76 s
[gammaloop-workspace-check] = note : multiple `impl`s satisfying `std::collections::BTreeSet<processes::threshold_counterterms::ThresholdCountertermComponentKind>: PartialEq<_>` found in the following crates: `alloc`, `rkyv`:
270.76 s
[gammaloop-workspace-check] - impl<K, AK> PartialEq<rkyv::collections::btree_set::ArchivedBTreeSet<AK>> for std::collections::BTreeSet<K>
270.76 s
[gammaloop-workspace-check] where AK: PartialEq<K>;
270.76 s
[gammaloop-workspace-check] - impl<T, A> PartialEq for std::collections::BTreeSet<T, A>
270.76 s
[gammaloop-workspace-check] where T: PartialEq, A: Allocator, A: Clone;
270.76 s
[gammaloop-workspace-check] help : consider specifying the generic argument
270.76 s
[gammaloop-workspace-check] |
270.76 s
[gammaloop-workspace-check] 4214 | .collect::<Vec<_>> ()
270.76 s
[gammaloop-workspace-check] | ++++++++++
270.76 s
[gammaloop-workspace-check]
270.88 s
[gammaloop-workspace-check] error[E0277] : can't compare `std::option::Option<&[linnet::half_edge::involution::EdgeIndex]>` with `std::option::Option<&[linnet::half_edge::involution::EdgeIndex; 1]>`
270.88 s
[gammaloop-workspace-check] --> crates/gammalooprs/src/processes/cross_section/ir_safe_threshold_fixture_tests.rs:817:25
270.88 s
[gammaloop-workspace-check] |
270.88 s
[gammaloop-workspace-check] 816 | .any(|variant| variant.requested_subspace.as_deref()
270.88 s
[gammaloop-workspace-check] | -------------------------------------
270.88 s
[gammaloop-workspace-check] 817 | == Some(&[EdgeIndex::from(3)])),
270.88 s
[gammaloop-workspace-check] | ^^ ---------------------------
270.88 s
[gammaloop-workspace-check] | |
270.88 s
[gammaloop-workspace-check] | no implementation for `std::option::Option<&[linnet::half_edge::involution::EdgeIndex]> == std::option::Option<&[linnet::half_edge::involution::EdgeIndex; 1]>`
270.88 s
[gammaloop-workspace-check] |
270.88 s
[gammaloop-workspace-check] = help : the trait `PartialEq<std::option::Option<&[linnet::half_edge::involution::EdgeIndex; 1]>>` is not implemented for `std::option::Option<&[linnet::half_edge::involution::EdgeIndex]>`
270.88 s
[gammaloop-workspace-check] help : the following other types implement trait `PartialEq<Rhs>`
270.88 s
[gammaloop-workspace-check] --> /nix/store/8zq9ya5slh345hbylmsibxw827bi98w0-vendor-cargo-deps/c19b7c6f923b580ac259164a89f2577984ad5ab09ee9d583b888f934adbbe8d0/rkyv-0.7.46/src/impls/alloc/niche.rs:24:1
270.88 s
[gammaloop-workspace-check] |
270.88 s
[gammaloop-workspace-check] 24 | / impl<T, U> PartialEq<ArchivedOptionBox<T>> for Option<Box<U>>
270.88 s
[gammaloop-workspace-check] 25 | | where
270.88 s
[gammaloop-workspace-check] 26 | | T: ArchivePointee + PartialEq<U> + ?Sized,
270.88 s
[gammaloop-workspace-check] 27 | | U: ?Sized,
270.88 s
[gammaloop-workspace-check] | |______________^ `std::option::Option<Box<U>>` implements `PartialEq<rkyv::niche::option_box::ArchivedOptionBox<T>>`
270.88 s
[gammaloop-workspace-check] --> /rustc/2d8144b7880597b6e6d3dfd63a9a9efae3f533d3/library/core/src/option.rs:2434:0
270.88 s
[gammaloop-workspace-check] |
270.88 s
[gammaloop-workspace-check] = note : `std::option::Option<T>` implements `PartialEq`
270.88 s
[gammaloop-workspace-check] |
270.88 s
[gammaloop-workspace-check] ::: /nix/store/8zq9ya5slh345hbylmsibxw827bi98w0-vendor-cargo-deps/c19b7c6f923b580ac259164a89f2577984ad5ab09ee9d583b888f934adbbe8d0/rkyv-0.7.46/src/option.rs:210:1
270.88 s
[gammaloop-workspace-check] |
270.88 s
[gammaloop-workspace-check] 210 | impl<T: PartialEq<U>, U> PartialEq<ArchivedOption<T>> for Option<U> {
270.88 s
[gammaloop-workspace-check] | ^^^^^^^^^^^^^^^^^^^^^^^^^^^^^^^^^^^^^^^^^^^^^^^^^^^^^^^^^^^^^^^^^^^ `std::option::Option<U>` implements `PartialEq<rkyv::option::ArchivedOption<T>>`
270.88 s
[gammaloop-workspace-check]
271.45 s
[gammaloop-workspace-check] error[E0283] : type annotations needed
271.45 s
[gammaloop-workspace-check] --> crates/gammalooprs/src/processes/no_directive_equivalence_tests.rs:459:43
271.45 s
[gammaloop-workspace-check] |
271.45 s
[gammaloop-workspace-check] 459 | (0..graph.cuts.len()).collect(),
271.45 s
[gammaloop-workspace-check] | ^^^^^^^ cannot infer type of the type parameter `B` declared on the method `collect`
271.45 s
[gammaloop-workspace-check] |
271.45 s
[gammaloop-workspace-check] = note : multiple `impl`s satisfying `_: FromIterator<usize>` found in the following crates: `spenso`, `tabled`:
271.45 s
[gammaloop-workspace-check] - impl FromIterator<usize> for ExpandedIndex;
271.45 s
[gammaloop-workspace-check] - impl FromIterator<usize> for HeightList;
271.45 s
[gammaloop-workspace-check] - impl FromIterator<usize> for WidthList;
271.45 s
[gammaloop-workspace-check] note : required by a bound in `std::iter::Iterator::collect`
271.45 s
[gammaloop-workspace-check] --> /rustc/2d8144b7880597b6e6d3dfd63a9a9efae3f533d3/library/core/src/iter/traits/iterator.rs:2077:4
271.45 s
[gammaloop-workspace-check] help : consider specifying the generic argument
271.45 s
[gammaloop-workspace-check] |
271.45 s
[gammaloop-workspace-check] 459 | (0..graph.cuts.len()).collect::<Vec<_>> (),
271.45 s
[gammaloop-workspace-check] | ++++++++++
271.45 s
[gammaloop-workspace-check]
271.46 s
[gammaloop-workspace-check] error[E0283] : type annotations needed
271.46 s
[gammaloop-workspace-check] --> crates/gammalooprs/src/processes/no_directive_equivalence_tests.rs:459:43
271.46 s
[gammaloop-workspace-check] |
271.46 s
[gammaloop-workspace-check] 457 | / assert_eq!(
271.46 s
[gammaloop-workspace-check] 458 | | grouped_cut_ids,
271.46 s
[gammaloop-workspace-check] 459 | | (0..graph.cuts.len()).collect(),
271.46 s
[gammaloop-workspace-check] | | ^^^^^^^ cannot infer type of the type parameter `B` declared on the method `collect`
271.46 s
[gammaloop-workspace-check] 460 | | "every discovered process-valid cut must remain in the numerical LU evaluation",
271.46 s
[gammaloop-workspace-check] 461 | | );
271.46 s
[gammaloop-workspace-check] | |_________________- type must be known at this point
271.46 s
[gammaloop-workspace-check] |
271.46 s
[gammaloop-workspace-check] = note : multiple `impl`s satisfying `std::collections::BTreeSet<usize>: PartialEq<_>` found in the following crates: `alloc`, `rkyv`:
271.46 s
[gammaloop-workspace-check] - impl<K, AK> PartialEq<rkyv::collections::btree_set::ArchivedBTreeSet<AK>> for std::collections::BTreeSet<K>
271.46 s
[gammaloop-workspace-check] where AK: PartialEq<K>;
271.46 s
[gammaloop-workspace-check] - impl<T, A> PartialEq for std::collections::BTreeSet<T, A>
271.46 s
[gammaloop-workspace-check] where T: PartialEq, A: Allocator, A: Clone;
271.46 s
[gammaloop-workspace-check] help : consider specifying the generic argument
271.46 s
[gammaloop-workspace-check] |
271.46 s
[gammaloop-workspace-check] 459 | (0..graph.cuts.len()).collect::<Vec<_>> (),
271.46 s
[gammaloop-workspace-check] | ++++++++++
271.46 s
[gammaloop-workspace-check]
271.48 s
[gammaloop-workspace-check] error[E0283] : type annotations needed
271.48 s
[gammaloop-workspace-check] --> crates/gammalooprs/src/processes/raised_cross_section_tests.rs:150:31
271.48 s
[gammaloop-workspace-check] |
271.48 s
[gammaloop-workspace-check] 150 | (0..graph.cuts.len()).collect(),
271.48 s
[gammaloop-workspace-check] | ^^^^^^^ cannot infer type of the type parameter `B` declared on the method `collect`
271.48 s
[gammaloop-workspace-check] |
271.48 s
[gammaloop-workspace-check] = note : multiple `impl`s satisfying `_: FromIterator<usize>` found in the following crates: `spenso`, `tabled`:
271.48 s
[gammaloop-workspace-check] - impl FromIterator<usize> for ExpandedIndex;
271.48 s
[gammaloop-workspace-check] - impl FromIterator<usize> for HeightList;
271.48 s
[gammaloop-workspace-check] - impl FromIterator<usize> for WidthList;
271.48 s
[gammaloop-workspace-check] note : required by a bound in `std::iter::Iterator::collect`
271.48 s
[gammaloop-workspace-check] --> /rustc/2d8144b7880597b6e6d3dfd63a9a9efae3f533d3/library/core/src/iter/traits/iterator.rs:2077:4
271.48 s
[gammaloop-workspace-check] help : consider specifying the generic argument
271.48 s
[gammaloop-workspace-check] |
271.48 s
[gammaloop-workspace-check] 150 | (0..graph.cuts.len()).collect::<Vec<_>> (),
271.48 s
[gammaloop-workspace-check] | ++++++++++
271.48 s
[gammaloop-workspace-check]
271.48 s
[gammaloop-workspace-check] error[E0283] : type annotations needed
271.48 s
[gammaloop-workspace-check] --> crates/gammalooprs/src/processes/raised_cross_section_tests.rs:150:31
271.48 s
[gammaloop-workspace-check] |
271.48 s
[gammaloop-workspace-check] 148 | / assert_eq!(
271.48 s
[gammaloop-workspace-check] 149 | | grouped_cut_ids,
271.48 s
[gammaloop-workspace-check] 150 | | (0..graph.cuts.len()).collect(),
271.48 s
[gammaloop-workspace-check] | | ^^^^^^^ cannot infer type of the type parameter `B` declared on the method `collect`
271.48 s
[gammaloop-workspace-check] 151 | | "every discovered process-valid cut must remain in the numerical LU evaluation",
271.48 s
[gammaloop-workspace-check] 152 | | );
271.48 s
[gammaloop-workspace-check] | |_____- type must be known at this point
271.48 s
[gammaloop-workspace-check] |
271.48 s
[gammaloop-workspace-check] = note : multiple `impl`s satisfying `std::collections::BTreeSet<usize>: PartialEq<_>` found in the following crates: `alloc`, `rkyv`:
271.48 s
[gammaloop-workspace-check] - impl<K, AK> PartialEq<rkyv::collections::btree_set::ArchivedBTreeSet<AK>> for std::collections::BTreeSet<K>
271.48 s
[gammaloop-workspace-check] where AK: PartialEq<K>;
271.48 s
[gammaloop-workspace-check] - impl<T, A> PartialEq for std::collections::BTreeSet<T, A>
271.48 s
[gammaloop-workspace-check] where T: PartialEq, A: Allocator, A: Clone;
271.48 s
[gammaloop-workspace-check] help : consider specifying the generic argument
271.48 s
[gammaloop-workspace-check] |
271.48 s
[gammaloop-workspace-check] 150 | (0..graph.cuts.len()).collect::<Vec<_>> (),
271.48 s
[gammaloop-workspace-check] | ++++++++++
271.48 s
[gammaloop-workspace-check]
279.04 s
[gammaloop-workspace-check] warning : method `lu_prefactor_helper` is never used
279.04 s
[gammaloop-workspace-check] --> crates/gammalooprs/src/processes/cross_section.rs:1965:8
279.04 s
[gammaloop-workspace-check] |
279.04 s
[gammaloop-workspace-check] 1429 | impl CrossSectionGraph {
279.04 s
[gammaloop-workspace-check] | ---------------------- method in this implementation
279.04 s
[gammaloop-workspace-check] ...
279.04 s
[gammaloop-workspace-check] 1965 | fn lu_prefactor_helper(&self) -> Atom {
279.04 s
[gammaloop-workspace-check] | ^^^^^^^^^^^^^^^^^^^
279.04 s
[gammaloop-workspace-check] |
279.04 s
[gammaloop-workspace-check] = note : `#[warn(dead_code)]` (part of `#[warn(unused)]`) on by default
279.04 s
[gammaloop-workspace-check]
282.47 s
[gammaloop-workspace-check] warning : `gammalooprs` (lib) generated 1 warning
286.99 s
[gammaloop-workspace-check] Some errors have detailed explanations: E0277, E0283.
286.99 s
[gammaloop-workspace-check] For more information about an error, try `rustc --explain E0277`.
287.13 s
[gammaloop-workspace-check] error : could not compile `gammalooprs` (lib test) due to 16 previous errors
287.13 s
[gammaloop-workspace-check] warning : build failed, waiting for other jobs to finish...
292.37 s
Progress: 0 of 1 built (1 failed)
292.37 s
Failed to build gammaloop-workspace-check after 4m51s
292.44 s
Cannot build ' /nix/store/bcqc79if6hchn98779cm1bksy0kvkzh2-gammaloop-workspace-check-0.1.0.drv '.
292.44 s
Reason: builder failed with exit code 101 .
292.44 s
Output paths:
292.44 s
/nix/store/5icl4qp5m7zfzfy0j18qvwvxghnximcs-gammaloop-workspace-check-0.1.0
292.44 s
Last 762 log lines:
292.44 s
> Running phase: unpackPhase
292.44 s
> unpacking source archive /nix/store/bcy0vqqk2ibk38nik2bb809ck03m92g2-source
292.44 s
> source root is source
292.44 s
> Running phase: patchPhase
292.44 s
> Executing configureCargoCommonVars
292.44 s
> decompressing cargo artifacts from /nix/store/wxpx6lf642pgxp2wz1pw1lxksj5p1wb0-gammaloop-workspace-deps-deps-0.1.0/target.tar.zst to target
292.44 s
> Running phase: updateAutotoolsGnuConfigScriptsPhase
292.44 s
> Running phase: configurePhase
292.44 s
> will append /build/source/.cargo-home/config.toml with contents of /nix/store/8zq9ya5slh345hbylmsibxw827bi98w0-vendor-cargo-deps/config.toml
292.44 s
> default configurePhase, nothing to do
292.44 s
> Running phase: buildPhase
292.44 s
> +++ command cargo --version
292.44 s
> cargo 1.97.0 (c980f4866 2026-06-30)
292.44 s
> +++ command cargo check --profile ci-optim --locked --workspace --features gammaloop-tracing-filter/clap,gammaloop-tracing-filter/symbolica,idenso/bincode,idenso/reference-cases,linnet/bincode,linnet/drawing,linnet/rkyv,linnet/serde,linnet/symbolica,spenso-macros/shadowing,spenso/shadowing,symbolica/tracing_max_level_info,three-dimensional-reps/display,three-dimensional-reps/eval,three-dimensional-reps/serde --all-targets
292.44 s
> Checking cfg-if v1.0.4
292.44 s
> Checking memchr v2.8.0
292.44 s
> Checking once_cell v1.21.4
292.44 s
> Checking either v1.15.0
292.44 s
> Checking serde_core v1.0.228
292.44 s
> Checking libc v0.2.186
292.44 s
> Checking libm v0.2.16
292.44 s
> Checking itoa v1.0.18
292.44 s
> Checking log v0.4.29
292.44 s
> Checking regex-syntax v0.8.10
292.44 s
> Checking zerocopy v0.8.48
292.44 s
> Checking crossbeam-utils v0.8.21
292.44 s
> Checking equivalent v1.0.2
292.44 s
> Checking zmij v1.0.21
292.44 s
> Checking lazy_static v1.5.0
292.44 s
> Checking bytemuck v1.25.0
292.44 s
> Compiling target-lexicon v0.13.5
292.44 s
> Checking arrayvec v0.7.6
292.44 s
> Checking powerfmt v0.2.0
292.44 s
> Checking num_threads v0.1.7
292.44 s
> Checking num-conv v0.2.1
292.44 s
> Checking time-core v0.1.8
292.44 s
> Checking itertools v0.14.0
292.44 s
> Checking safe_arch v0.7.4
292.44 s
> Checking pin-project-lite v0.2.17
292.44 s
> Checking tracing-core v0.1.36
292.44 s
> Checking deranged v0.5.8
292.44 s
> Checking foldhash v0.2.0
292.44 s
> Checking allocator-api2 v0.2.21
292.44 s
> Checking const-random v0.1.18
292.44 s
> Checking nu-ansi-term v0.50.3
292.44 s
> Checking winnow v1.0.2
292.44 s
> Checking unty v0.0.4
292.44 s
> Checking aho-corasick v1.1.4
292.44 s
> Checking static_assertions v1.1.0
292.44 s
> Checking safe_arch v1.0.0
292.44 s
> Checking hashbrown v0.16.1
292.44 s
> Checking sharded-slab v0.1.7
292.44 s
> Checking wide v0.7.33
292.44 s
> Checking crossbeam-epoch v0.9.18
292.44 s
> Checking tracing-log v0.2.0
292.44 s
> Checking tracing v0.1.44
292.44 s
> Checking crossbeam-deque v0.8.6
292.44 s
> Checking thread_local v1.1.9
292.44 s
> Checking toml_writer v1.1.1+spec-1.1.0
292.44 s
> Checking az v1.3.0
292.44 s
> Checking indenter v0.3.4
292.44 s
> Checking rayon-core v1.13.0
292.44 s
> Checking num-traits v0.2.19
292.44 s
> Checking wide v1.3.0
292.44 s
> Compiling phf_shared v0.11.3
292.44 s
> Checking anyhow v1.0.102
292.44 s
> Checking getrandom v0.3.4
292.44 s
> Checking time v0.3.47
292.44 s
> Checking toml_parser v1.1.2+spec-1.1.0
292.44 s
> Checking gmp-mpfr-sys v1.7.1
292.44 s
> Checking utf8parse v0.2.2
292.44 s
> Checking rand_core v0.9.5
292.44 s
> Checking alloc-no-stdlib v2.0.4
292.44 s
> Checking rayon v1.12.0
292.44 s
> Checking dyn-clone v1.0.20
292.44 s
> Checking rawpointer v0.2.1
292.44 s
> Checking matrixmultiply v0.3.10
292.44 s
> Checking alloc-stdlib v0.2.2
292.44 s
> Checking anstyle-parse v1.0.0
292.44 s
> Checking colorchoice v1.0.5
292.44 s
> Checking is_terminal_polyfill v1.70.2
292.44 s
> Checking approx v0.5.1
292.44 s
> Checking num-integer v0.1.46
292.44 s
> Checking anstyle v1.0.14
292.44 s
> Checking anstyle-query v1.1.5
292.44 s
> Checking colored v3.1.1
292.44 s
> Compiling phf_generator v0.11.3
292.44 s
> Checking eyre v0.6.12
292.44 s
> Checking unicode-width v0.2.2
292.44 s
> Checking regex-automata v0.4.14
292.44 s
> Checking bitflags v1.3.2
292.44 s
> Checking brotli-decompressor v5.0.0
292.44 s
> Checking region v3.0.2
292.44 s
> Checking serde v1.0.228
292.44 s
> Checking serde_json v1.0.149
292.44 s
> Checking bitflags v2.11.1
292.44 s
> Checking serde_spanned v1.1.1
292.44 s
> Checking toml_datetime v1.1.1+spec-1.1.0
292.44 s
> Checking anstream v1.0.0
292.44 s
> Compiling phf_codegen v0.11.3
292.44 s
> Compiling pyo3-build-config v0.28.3
292.44 s
> Checking wasmtime-jit-icache-coherence v34.0.2
292.44 s
> Checking hugepage-rs v0.1.1
292.44 s
> Checking inventory v0.3.24
292.44 s
> Checking spec_math v0.1.6
292.44 s
> Checking thiserror v2.0.18
292.44 s
> Compiling getopts v0.2.24
292.44 s
> Checking libloading v0.9.0
292.44 s
> Checking self_cell v1.2.2
292.44 s
> Checking toml v1.1.2+spec-1.1.0
292.44 s
> Checking tinyjson v2.5.1
292.44 s
> Checking bytes v1.11.1
292.44 s
> Checking byteorder v1.5.0
292.44 s
> Checking append-only-vec v0.1.8
292.44 s
> Checking smallvec v1.15.1
292.44 s
> Checking num-complex v0.4.6
292.44 s
> Checking tracing-serde v0.2.0
292.44 s
> Checking bincode v2.0.1
292.44 s
> Checking smartstring v1.0.1
292.44 s
> Compiling unicode_names2_generator v1.3.0
292.44 s
> Checking linux-raw-sys v0.12.1
292.44 s
> Checking brotli v8.0.2
292.44 s
> Compiling unic-common v0.9.0
292.44 s
> Compiling unic-char-range v0.9.0
292.44 s
> Checking simba v0.9.1
292.44 s
> Compiling unic-ucd-version v0.9.0
292.44 s
> Compiling is-macro v0.3.7
292.44 s
> Compiling unic-char-property v0.9.0
292.44 s
> Compiling rustpython-parser-vendored v0.4.0
292.44 s
> Checking iana-time-zone v0.1.65
292.44 s
> Compiling rustpython-parser v0.4.0
292.44 s
> Checking rustix v1.1.4
292.44 s
> Checking chrono v0.4.44
292.44 s
> Compiling phf v0.11.3
292.44 s
> Checking rustc-hash v2.1.2
292.44 s
> Compiling unic-emoji-char v0.9.0
292.44 s
> Compiling unic-ucd-ident v0.9.0
292.44 s
> Checking ndarray v0.17.2
292.44 s
> Compiling lalrpop-util v0.20.2
292.44 s
> Compiling rustc-hash v1.1.0
292.44 s
> Checking rug v1.30.0
292.44 s
> Compiling symbolica v2.2.0 (https://github.com/alphal00p/symbolica?rev=4d0a833eb8e059d1f95bdae5abed2559830b235f#4d0a833e)
292.44 s
> Checking unicode-segmentation v1.13.2
292.44 s
> Checking typenum v1.20.0
292.44 s
> Checking getrandom v0.2.17
292.44 s
> Checking scopeguard v1.2.0
292.44 s
> Checking lock_api v0.4.14
292.44 s
> Checking ppv-lite86 v0.2.21
292.44 s
> Checking ahash v0.8.12
292.44 s
> Checking parking_lot_core v0.9.12
292.44 s
> Checking hashbrown v0.17.0
292.44 s
> Checking unicode-ident v1.0.24
292.44 s
> Checking parking_lot v0.12.5
292.44 s
> Checking errno v0.3.14
292.44 s
> Checking clap_lex v1.1.0
292.44 s
> Checking rand_chacha v0.9.0
292.44 s
> Checking unicase v2.9.0
292.44 s
> Checking generic-array v0.14.7
292.44 s
> Checking matchers v0.2.0
292.44 s
> Checking regex v1.12.3
292.44 s
> Checking strsim v0.11.1
292.44 s
> Checking tracing-subscriber v0.3.23
292.44 s
> Checking signal-hook-registry v1.4.8
292.44 s
> Checking rand v0.9.4
292.44 s
> Checking vte v0.14.1
292.44 s
> Checking indexmap v2.14.0
292.44 s
> Checking terminal_size v0.4.4
292.44 s
> Checking same-file v1.0.6
292.44 s
> Checking signal-hook v0.3.18
292.44 s
> Checking half v2.7.1
292.44 s
> Checking clap_builder v4.6.0
292.44 s
> Checking walkdir v2.5.0
292.44 s
> Checking block-buffer v0.10.4
292.44 s
> Checking crypto-common v0.1.7
292.44 s
> Checking mio v1.2.0
292.44 s
> Checking ciborium-io v0.2.2
292.44 s
> Checking minimal-lexical v0.2.1
292.44 s
> Checking ciborium-ll v0.2.2
292.44 s
> Checking digest v0.10.7
292.44 s
> Checking symjit v2.21.0
292.44 s
> Checking derive_more v2.1.1
292.44 s
> Checking nom v7.1.3
292.44 s
> Checking num-bigint v0.4.6
292.44 s
> Checking signal-hook-mio v0.2.5
292.44 s
> Checking console v0.16.3
292.44 s
> Checking bstr v1.12.1
292.44 s
> Checking linux-raw-sys v0.4.15
292.44 s
> Checking cpufeatures v0.2.17
292.44 s
> Checking winnow v0.7.15
292.44 s
> Checking sha2 v0.10.9
292.44 s
> Checking globset v0.4.18
292.44 s
> Checking ciborium v0.2.2
292.44 s
> Checking rustix v0.38.44
292.44 s
> Checking getrandom v0.4.2
292.44 s
> Checking rand_core v0.6.4
292.44 s
> Checking clap v4.6.1
292.44 s
> Checking plotters-backend v0.3.7
292.44 s
> Checking fastrand v2.4.1
292.44 s
> Checking fnv v1.0.7
292.44 s
> Checking plotters-svg v0.3.7
292.44 s
> Checking rust-embed-utils v8.11.0
292.44 s
> Compiling unicode_names2 v1.3.0
292.44 s
> Checking serde_spanned v0.6.9
292.44 s
> Checking tempfile v3.27.0
292.44 s
> Checking toml_datetime v0.6.11
292.44 s
> Checking itertools v0.10.5
292.44 s
> Checking cast v0.3.0
292.44 s
> Checking toml_write v0.1.2
292.44 s
> Checking tap v1.0.1
292.44 s
> Checking plotters v0.3.7
292.44 s
> Checking crossterm v0.28.1
292.44 s
> Checking rand_chacha v0.3.1
292.44 s
> Checking wyz v0.5.1
292.44 s
> Checking radium v0.7.0
292.44 s
> Checking typeid v1.0.3
292.44 s
> Checking similar v2.7.0
292.44 s
> Checking tinytemplate v1.2.1
292.44 s
> Checking is-terminal v0.4.17
292.44 s
> Checking funty v2.0.0
292.44 s
> Checking anes v0.1.6
292.44 s
> Checking bytecount v0.6.9
292.44 s
> Checking oorandom v11.1.5
292.44 s
> Checking rand v0.8.6
292.44 s
> Checking ron v0.12.1
292.44 s
> Checking toml_edit v0.25.11+spec-1.1.0
292.44 s
> Checking bitvec v1.0.1
292.44 s
> Checking criterion-plot v0.5.0
292.44 s
> Checking ansitok v0.3.0
292.44 s
> Checking xprec v0.2.2
292.44 s
> Checking toml_edit v0.22.27
292.44 s
> Checking uncased v0.9.10
292.44 s
> Checking env_filter v1.0.1
292.44 s
> Checking criterion v0.5.1
292.44 s
> Checking jiff v0.2.24
292.44 s
> Checking ptr_meta v0.1.4
292.44 s
> Checking simdutf8 v0.1.5
292.44 s
> Checking ucd-trie v0.1.7
292.44 s
> Checking bytecheck v0.6.12
292.44 s
> Checking ahash v0.7.8
292.44 s
> Checking insta v1.47.2
292.44 s
> Checking approx v0.4.0
292.44 s
> Checking seahash v4.1.0
292.44 s
> Checking ansi-str v0.9.0
292.44 s
> Checking testing_table v0.3.0
292.44 s
> Checking pest v2.8.6
292.44 s
> Checking cgmath v0.18.0
292.44 s
> Checking num-rational v0.4.2
292.44 s
> Checking hashbrown v0.12.3
292.44 s
> Checking rend v0.4.2
292.44 s
> Checking num-iter v0.1.45
292.44 s
> Checking papergrid v0.17.0
292.44 s
> Checking ref-ops v0.2.5
292.44 s
> Checking num v0.4.3
292.44 s
> Checking rand_xoshiro v0.6.0
292.44 s
> Checking features v0.10.0
292.44 s
> Checking constcat v0.5.1
292.44 s
> Checking gat-lending-iterator v0.1.8
292.44 s
> Checking colored v2.2.0
292.44 s
> Checking constant_time_eq v0.4.2
292.44 s
> Checking arrayref v0.3.9
292.44 s
> Checking cpufeatures v0.3.0
292.44 s
> Checking base64 v0.22.1
292.44 s
> Checking blake3 v1.8.5
292.44 s
> Checking joinery v2.1.0
292.44 s
> Checking siphasher v1.0.2
292.44 s
> Checking titlecase v2.2.1
292.44 s
> Checking phf_shared v0.13.1
292.44 s
> Checking subprocess v0.2.15
292.44 s
> Checking rust_lisp v0.18.0
292.44 s
> Compiling vakint v0.1.2 (/build/source/crates/vakint)
292.44 s
> Checking version-compare v0.2.1
292.44 s
> Checking toml v0.8.23
292.44 s
> Checking phf v0.13.1
292.44 s
> Checking xpct v0.5.1
292.44 s
> Checking dot-parser v0.5.1
292.44 s
> Compiling pyo3-macros-backend v0.28.3
292.44 s
> Compiling pyo3-ffi v0.28.3
292.44 s
> Compiling pyo3 v0.28.3
292.44 s
> Compiling numpy v0.28.0
292.44 s
> Checking tabled v0.20.0
292.44 s
> Checking string-template-plus v0.4.3
292.44 s
> Checking ryu v1.0.23
292.44 s
> Checking figment v0.10.19
292.44 s
> Checking castaway v0.2.4
292.44 s
> Checking toml_datetime v0.7.5+spec-1.1.0
292.44 s
> Checking strum v0.27.2
292.44 s
> Checking compact_str v0.9.0
292.44 s
> Checking unicode-truncate v2.0.1
292.44 s
> Checking kasuari v0.4.12
292.44 s
> Checking lru v0.16.4
292.44 s
> Checking vte v0.15.0
292.44 s
> Checking toml v0.9.12+spec-1.1.0
292.44 s
> Checking portable-atomic v1.13.1
292.44 s
> Checking vt100 v0.16.2
292.44 s
> Checking unit-prefix v0.5.2
292.44 s
> Checking rand_distr v0.4.3
292.44 s
> Checking simba v0.6.0
292.44 s
> Checking line-clipping v0.3.7
292.44 s
> Compiling three-dimensional-reps v0.1.0 (/build/source/crates/three-dimensional-reps)
292.44 s
> Checking ratatui-core v0.1.0
292.44 s
> Checking gimli v0.32.3
292.44 s
> Checking adler2 v2.0.1
292.44 s
> Checking thiserror v1.0.69
292.44 s
> Checking miniz_oxide v0.8.9
292.44 s
> Checking derive_builder v0.11.2
292.44 s
> Checking crossterm v0.29.0
292.44 s
> Checking indicatif v0.18.4
292.44 s
> Checking object v0.37.3
292.44 s
> Checking owo-colors v4.3.0
292.44 s
> Checking tracing-error v0.2.1
292.44 s
> Checking env_logger v0.11.10
292.44 s
> Checking typed-index-collections v3.5.0
292.44 s
> Checking rkyv v0.7.46
292.44 s
> Checking serde-big-array v0.5.1
292.44 s
> Checking amd v0.2.2
292.44 s
> Checking itertools v0.11.0
292.44 s
> Compiling gammaloop-tracing-filter-macros v0.1.0 (/build/source/crates/gammaloop-tracing-filter-macros)
292.44 s
> Checking rustc-demangle v0.1.27
292.44 s
> Checking option-ext v0.2.0
292.44 s
> Checking ratatui-widgets v0.3.0
292.44 s
> Checking dirs-sys v0.5.0
292.44 s
> Checking ref-cast v1.0.25
292.44 s
> Checking nix v0.31.2
292.44 s
> Checking integer-sqrt v0.1.5
292.44 s
> Checking brotli-decompressor v4.0.3
292.44 s
> Checking crossbeam-channel v0.5.15
292.44 s
> Checking itertools v0.12.1
292.44 s
> Checking color-spantrace v0.3.0
292.44 s
> Checking symlink v0.1.0
292.44 s
> Checking ratatui-crossterm v0.1.0
292.44 s
> Compiling gammalooprs v0.3.4 (/build/source/crates/gammalooprs)
292.44 s
> Checking unsafe-libyaml v0.2.11
292.44 s
> Checking tracing-appender v0.2.5
292.44 s
> Compiling rustpython-parser-core v0.4.0
292.44 s
> Checking include_dir v0.7.4
292.44 s
> Checking ctrlc v3.5.2
292.44 s
> Checking tracing-indicatif v0.3.14
292.44 s
> Checking pathfinding v4.15.0
292.44 s
> Compiling rustpython-ast v0.4.0
292.44 s
> Checking schemars v1.2.1
292.44 s
> Checking slotmap v1.1.1
292.44 s
> Checking dirs v6.0.0
292.44 s
> Checking json5 v0.4.1
292.44 s
> Checking ratatui-macros v0.7.0
292.44 s
> Checking ratatui v0.30.0
292.44 s
> Checking brotli v7.0.0
292.44 s
> Checking vectorize v0.2.0
292.44 s
> Checking base62 v2.2.4
292.44 s
> Checking ringbuffer v0.16.0
292.44 s
> Checking clarabel v0.11.1
292.44 s
> Checking rust-embed v8.11.0
292.44 s
> Checking clap_complete v4.6.3
292.44 s
> Checking strip-ansi-escapes v0.2.1
292.44 s
> Checking fd-lock v4.0.4
292.44 s
> Compiling gammaloop-api v0.1.0 (/build/source/crates/gammaloop-api)
292.44 s
> Checking itertools v0.13.0
292.44 s
> Checking serde_yaml v0.9.34+deprecated
292.44 s
> Checking strum v0.26.3
292.44 s
> Checking sysinfo v0.33.1
292.44 s
> Checking shlex v1.3.0
292.44 s
> Checking clap_complete_nushell v4.6.0
292.44 s
> Checking slab v0.4.12
292.44 s
> Checking futures-task v0.3.32
292.44 s
> Checking futures-core v0.3.32
292.44 s
> Checking sdd v3.0.10
292.44 s
> Compiling gammaloop-integration-tests v0.1.0 (/build/source/tests)
292.44 s
> Compiling test-log-core v0.2.20
292.44 s
> Checking futures-util v0.3.32
292.44 s
> Checking scc v2.4.0
292.44 s
> Compiling rustc_version v0.4.1
292.44 s
> Checking which v8.0.2
292.44 s
> Checking bincode v1.3.3
292.44 s
> Checking reedline v0.42.0
292.44 s
> Checking addr2line v0.25.1
292.44 s
> Compiling numerica v2.2.0 (https://github.com/alphal00p/symbolica?rev=4d0a833eb8e059d1f95bdae5abed2559830b235f#4d0a833e)
292.44 s
> Checking backtrace v0.3.76
292.44 s
> Compiling gungraun-runner v0.18.2
292.44 s
> Compiling gungraun-macros v0.8.0
292.44 s
> Checking nalgebra v0.29.0
292.44 s
> Checking color-eyre v0.6.5
292.44 s
> Checking proc-macro2 v1.0.106
292.44 s
> Checking quote v1.0.45
292.44 s
> Checking base64 v0.21.7
292.44 s
> Checking maplit v1.0.2
292.44 s
> Compiling iai-callgrind-runner v0.14.2
292.44 s
> Checking kurbo v0.13.0
292.44 s
> Checking wait-timeout v0.2.1
292.44 s
> Compiling iai-callgrind v0.14.2
292.44 s
> Checking bit-vec v0.8.0
292.44 s
> Checking quick-error v1.2.3
292.44 s
> Checking ron v0.8.1
292.44 s
> Checking rusty-fork v0.3.1
292.44 s
> Checking syn v2.0.117
292.44 s
> Compiling iai-callgrind-macros v0.5.1
292.44 s
> Checking bit-set v0.8.0
292.44 s
> Compiling test-log-macros v0.2.20
292.44 s
> Checking futures-executor v0.3.32
292.44 s
> Checking rand_xorshift v0.4.0
292.44 s
> Checking serial_test v3.4.0
292.44 s
> Checking console v0.15.11
292.44 s
> Checking pathdiff v0.2.3
292.44 s
> Checking unarray v0.1.4
292.44 s
> Checking proptest v1.11.0
292.44 s
> Checking similar-asserts v1.7.0
292.44 s
> Checking clinnet v0.1.8 (/build/source/crates/clinnet)
292.44 s
> Checking kurvst v0.1.0 (/build/source/crates/kurvst)
292.44 s
> Compiling graphica v2.1.0 (https://github.com/alphal00p/symbolica?rev=4d0a833eb8e059d1f95bdae5abed2559830b235f#4d0a833e)
292.44 s
> Checking test-log v0.2.20
292.44 s
> Checking statrs v0.16.1
292.44 s
> Checking gungraun v0.18.2
292.44 s
> Checking momtrop v0.3.0
292.44 s
> Compiling pyo3-macros v0.28.3
292.44 s
> Compiling pyo3-stub-gen-derive v0.17.2
292.44 s
> Checking pyo3-stub-gen v0.17.2
292.44 s
> Checking symbolica-utils v0.1.0 (/build/source/crates/symbolica-utils)
292.44 s
> Checking spenso-macros v0.3.2 (/build/source/crates/spenso-macros)
292.44 s
> Compiling gammaloop-workspace-hack v0.1.0 (/build/source/crates/gammaloop-workspace-hack)
292.44 s
> Checking linnet v0.17.0 (/build/source/crates/linnet)
292.44 s
> Checking spenso v0.6.0 (/build/source/crates/spenso)
292.44 s
> Checking linnet-py v0.1.0 (/build/source/crates/linnet-py)
292.44 s
> Checking linnest v0.1.0 (/build/source/crates/linnest)
292.44 s
> Checking idenso v0.3.0 (/build/source/crates/idenso)
292.44 s
> Checking gammaloop-tracing-filter v0.1.0 (/build/source/crates/gammaloop-tracing-filter)
292.44 s
> Checking spenso-hep-lib v0.1.7 (/build/source/crates/spenso-hep-lib)
292.44 s
> Checking spynso3 v0.1.2 (/build/source/crates/spynso3)
292.44 s
> error[E0283] : type annotations needed
292.44 s
> --> crates/gammalooprs/src/momentum/sample.rs:1165:35
292.44 s
> |
292.44 s
> 1165 | requested.into_iter().collect(),
292.44 s
> | ^^^^^^^ cannot infer type of the type parameter `B` declared on the method `collect`
292.44 s
> |
292.44 s
> = note : the type must implement `FromIterator<linnet::half_edge::involution::EdgeIndex>`
292.44 s
> note : required by a bound in `std::iter::Iterator::collect`
292.44 s
> --> /rustc/2d8144b7880597b6e6d3dfd63a9a9efae3f533d3/library/core/src/iter/traits/iterator.rs:2077:4
292.44 s
> help : consider specifying the generic argument
292.44 s
> |
292.44 s
> 1165 | requested.into_iter().collect::<Vec<_>> (),
292.44 s
> | ++++++++++
292.44 s
>
292.44 s
> error[E0283] : type annotations needed
292.44 s
> --> crates/gammalooprs/src/momentum/sample.rs:1165:35
292.44 s
> |
292.44 s
> 1161 | / assert_eq!(
292.44 s
> 1162 | | subspace
292.44 s
> 1163 | | .iter_basis_edges(&all_lmbs)
292.44 s
> 1164 | | .collect::<std::collections::BTreeSet<_>>(),
292.44 s
> 1165 | | requested.into_iter().collect(),
292.44 s
> | | ^^^^^^^ cannot infer type of the type parameter `B` declared on the method `collect`
292.44 s
> 1166 | | );
292.44 s
> | |_________- type must be known at this point
292.44 s
> |
292.44 s
> = note : multiple `impl`s satisfying `std::collections::BTreeSet<linnet::half_edge::involution::EdgeIndex>: PartialEq<_>` found in the following crates: `alloc`, `rkyv`:
292.44 s
> - impl<K, AK> PartialEq<rkyv::collections::btree_set::ArchivedBTreeSet<AK>> for std::collections::BTreeSet<K>
292.44 s
> where AK: PartialEq<K>;
292.44 s
> - impl<T, A> PartialEq for std::collections::BTreeSet<T, A>
292.44 s
> where T: PartialEq, A: Allocator, A: Clone;
292.44 s
> help : consider specifying the generic argument
292.44 s
> |
292.44 s
> 1165 | requested.into_iter().collect::<Vec<_>> (),
292.44 s
> | ++++++++++
292.44 s
>
292.44 s
> error[E0283] : type annotations needed
292.44 s
> --> crates/gammalooprs/src/momentum/sample.rs:1182:35
292.44 s
> |
292.44 s
> 1178 | / assert_eq!(
292.44 s
> 1179 | | common_subspace
292.44 s
> 1180 | | .iter_basis_edges(&all_lmbs)
292.44 s
> 1181 | | .collect::<std::collections::BTreeSet<_>>(),
292.44 s
> 1182 | | requested.into_iter().collect(),
292.44 s
> | | ^^^^^^^ cannot infer type of the type parameter `B` declared on the method `collect`
292.44 s
> 1183 | | );
292.44 s
> | |_________- type must be known at this point
292.44 s
> |
292.44 s
> = note : multiple `impl`s satisfying `std::collections::BTreeSet<linnet::half_edge::involution::EdgeIndex>: PartialEq<_>` found in the following crates: `alloc`, `rkyv`:
292.44 s
> - impl<K, AK> PartialEq<rkyv::collections::btree_set::ArchivedBTreeSet<AK>> for std::collections::BTreeSet<K>
292.44 s
> where AK: PartialEq<K>;
292.44 s
> - impl<T, A> PartialEq for std::collections::BTreeSet<T, A>
292.44 s
> where T: PartialEq, A: Allocator, A: Clone;
292.44 s
> help : consider specifying the generic argument
292.44 s
> |
292.44 s
> 1182 | requested.into_iter().collect::<Vec<_>> (),
292.44 s
> | ++++++++++
292.44 s
>
292.44 s
> error[E0283] : type annotations needed
292.44 s
> --> crates/gammalooprs/src/momentum/sample.rs:1203:35
292.44 s
> |
292.44 s
> 1199 | / assert_eq!(
292.44 s
> 1200 | | sparse_common_subspace
292.44 s
> 1201 | | .iter_basis_edges(&all_lmbs)
292.44 s
> 1202 | | .collect::<std::collections::BTreeSet<_>>(),
292.44 s
> 1203 | | requested.into_iter().collect(),
292.44 s
> | | ^^^^^^^ cannot infer type of the type parameter `B` declared on the method `collect`
292.44 s
> 1204 | | );
292.44 s
> | |_________- type must be known at this point
292.44 s
> |
292.44 s
> = note : multiple `impl`s satisfying `std::collections::BTreeSet<linnet::half_edge::involution::EdgeIndex>: PartialEq<_>` found in the following crates: `alloc`, `rkyv`:
292.44 s
> - impl<K, AK> PartialEq<rkyv::collections::btree_set::ArchivedBTreeSet<AK>> for std::collections::BTreeSet<K>
292.44 s
> where AK: PartialEq<K>;
292.44 s
> - impl<T, A> PartialEq for std::collections::BTreeSet<T, A>
292.44 s
> where T: PartialEq, A: Allocator, A: Clone;
292.44 s
> help : consider specifying the generic argument
292.44 s
> |
292.44 s
> 1203 | requested.into_iter().collect::<Vec<_>> (),
292.44 s
> | ++++++++++
292.44 s
>
292.44 s
> error[E0283] : type annotations needed
292.44 s
> --> crates/gammalooprs/src/processes/amplitude.rs:3336:49
292.44 s
> |
292.44 s
> 3336 | variant_ids.iter().copied().collect(),
292.44 s
> | ^^^^^^^ cannot infer type of the type parameter `B` declared on the method `collect`
292.44 s
> |
292.44 s
> = note : the type must implement `FromIterator<processes::threshold_counterterms::ThresholdCountertermVariantId>`
292.44 s
> note : required by a bound in `std::iter::Iterator::collect`
292.44 s
> --> /rustc/2d8144b7880597b6e6d3dfd63a9a9efae3f533d3/library/core/src/iter/traits/iterator.rs:2077:4
292.44 s
> help : consider specifying the generic argument
292.44 s
> |
292.44 s
> 3336 | variant_ids.iter().copied().collect::<Vec<_>> (),
292.44 s
> | ++++++++++
292.44 s
>
292.44 s
> error[E0283] : type annotations needed
292.44 s
> --> crates/gammalooprs/src/processes/amplitude.rs:3336:49
292.44 s
> |
292.44 s
> 3334 | / assert_eq!(
292.44 s
> 3335 | | referenced_variants,
292.44 s
> 3336 | | variant_ids.iter().copied().collect(),
292.44 s
> | | ^^^^^^^ cannot infer type of the type parameter `B` declared on the method `collect`
292.44 s
> 3337 | | "overlap groups must retain every semantic duplicate independently",
292.44 s
> 3338 | | );
292.44 s
> | |_________________- type must be known at this point
292.44 s
> |
292.44 s
> = note : multiple `impl`s satisfying `std::collections::BTreeSet<processes::threshold_counterterms::ThresholdCountertermVariantId>: PartialEq<_>` found in the following crates: `alloc`, `rkyv`:
292.44 s
> - impl<K, AK> PartialEq<rkyv::collections::btree_set::ArchivedBTreeSet<AK>> for std::collections::BTreeSet<K>
292.44 s
> where AK: PartialEq<K>;
292.44 s
> - impl<T, A> PartialEq for std::collections::BTreeSet<T, A>
292.44 s
> where T: PartialEq, A: Allocator, A: Clone;
292.44 s
> help : consider specifying the generic argument
292.44 s
> |
292.44 s
> 3336 | variant_ids.iter().copied().collect::<Vec<_>> (),
292.44 s
> | ++++++++++
292.44 s
>
292.44 s
> error[E0283] : type annotations needed
292.44 s
> --> crates/gammalooprs/src/processes/amplitude.rs:4098:59
292.44 s
> |
292.44 s
> 4098 | assert_eq!(orders, [1, 2].into_iter().collect());
292.44 s
> | ^^^^^^^ cannot infer type of the type parameter `B` declared on the method `collect`
292.44 s
> |
292.44 s
> = note : the type must implement `FromIterator<i32>`
292.44 s
> note : required by a bound in `std::iter::Iterator::collect`
292.44 s
> --> /rustc/2d8144b7880597b6e6d3dfd63a9a9efae3f533d3/library/core/src/iter/traits/iterator.rs:2077:4
292.44 s
> help : consider specifying the generic argument
292.44 s
> |
292.44 s
> 4098 | assert_eq!(orders, [1, 2].into_iter().collect::<Vec<_>> ());
292.44 s
> | ++++++++++
292.44 s
>
292.44 s
> error[E0283] : type annotations needed
292.44 s
> --> crates/gammalooprs/src/processes/amplitude.rs:4098:59
292.44 s
> |
292.44 s
> 4098 | assert_eq!(orders, [1, 2].into_iter().collect());
292.44 s
> | -------------------------------------- ^^^^^^^ ---
292.44 s
> | | |
292.44 s
> | | cannot infer type of the type parameter `B` declared on the method `collect`
292.44 s
> | type must be known at this point
292.44 s
> |
292.44 s
> = note : multiple `impl`s satisfying `std::collections::BTreeSet<usize>: PartialEq<_>` found in the following crates: `alloc`, `rkyv`:
292.44 s
> - impl<K, AK> PartialEq<rkyv::collections::btree_set::ArchivedBTreeSet<AK>> for std::collections::BTreeSet<K>
292.44 s
> where AK: PartialEq<K>;
292.44 s
> - impl<T, A> PartialEq for std::collections::BTreeSet<T, A>
292.44 s
> where T: PartialEq, A: Allocator, A: Clone;
292.44 s
> help : consider specifying the generic argument
292.44 s
> |
292.44 s
> 4098 | assert_eq!(orders, [1, 2].into_iter().collect::<Vec<_>> ());
292.44 s
> | ++++++++++
292.44 s
>
292.44 s
> error[E0283] : type annotations needed
292.44 s
> --> crates/gammalooprs/src/processes/amplitude.rs:4129:48
292.44 s
> |
292.44 s
> 4123 | / assert_eq!(
292.44 s
> 4124 | | evaluator
292.44 s
> 4125 | | .evaluator_stacks
292.44 s
> 4126 | | .keys()
292.44 s
> ... |
292.44 s
> 4129 | | [1, 2].into_iter().collect()
292.44 s
> | | ^^^^^^^ cannot infer type of the type parameter `B` declared on the method `collect`
292.44 s
> 4130 | | );
292.44 s
> | |_________________________- type must be known at this point
292.44 s
> |
292.44 s
> = note : multiple `impl`s satisfying `std::collections::BTreeSet<usize>: PartialEq<_>` found in the following crates: `alloc`, `rkyv`:
292.44 s
> - impl<K, AK> PartialEq<rkyv::collections::btree_set::ArchivedBTreeSet<AK>> for std::collections::BTreeSet<K>
292.44 s
> where AK: PartialEq<K>;
292.44 s
> - impl<T, A> PartialEq for std::collections::BTreeSet<T, A>
292.44 s
> where T: PartialEq, A: Allocator, A: Clone;
292.44 s
> help : consider specifying the generic argument
292.44 s
> |
292.44 s
> 4129 | [1, 2].into_iter().collect::<Vec<_>> ()
292.44 s
> | ++++++++++
292.44 s
>
292.44 s
> error[E0283] : type annotations needed
292.44 s
> --> crates/gammalooprs/src/processes/amplitude.rs:4160:30
292.44 s
> |
292.44 s
> 4148 | / assert_eq!(
292.44 s
> 4149 | | registry
292.44 s
> 4150 | | .components
292.44 s
> 4151 | | .iter()
292.44 s
> ... |
292.44 s
> 4160 | | .collect()
292.44 s
> | | ^^^^^^^ cannot infer type of the type parameter `B` declared on the method `collect`
292.44 s
> 4161 | | );
292.44 s
> | |_________________________- type must be known at this point
292.44 s
> |
292.44 s
> = note : multiple `impl`s satisfying `std::collections::BTreeSet<processes::threshold_counterterms::ThresholdCountertermComponentKind>: PartialEq<_>` found in the following crates: `alloc`, `rkyv`:
292.44 s
> - impl<K, AK> PartialEq<rkyv::collections::btree_set::ArchivedBTreeSet<AK>> for std::collections::BTreeSet<K>
292.44 s
> where AK: PartialEq<K>;
292.44 s
> - impl<T, A> PartialEq for std::collections::BTreeSet<T, A>
292.44 s
> where T: PartialEq, A: Allocator, A: Clone;
292.44 s
> help : consider specifying the generic argument
292.44 s
> |
292.44 s
> 4160 | .collect::<Vec<_>> ()
292.44 s
> | ++++++++++
292.44 s
>
292.44 s
> error[E0283] : type annotations needed
292.44 s
> --> crates/gammalooprs/src/processes/amplitude.rs:4214:26
292.44 s
> |
292.44 s
> 4201 | / assert_eq!(
292.44 s
> 4202 | | decomposition
292.44 s
> 4203 | | .components
292.44 s
> 4204 | | .iter()
292.44 s
> ... |
292.44 s
> 4214 | | .collect()
292.44 s
> | | ^^^^^^^ cannot infer type of the type parameter `B` declared on the method `collect`
292.44 s
> 4215 | | );
292.44 s
> | |_____________________- type must be known at this point
292.44 s
> |
292.44 s
> = note : multiple `impl`s satisfying `std::collections::BTreeSet<processes::threshold_counterterms::ThresholdCountertermComponentKind>: PartialEq<_>` found in the following crates: `alloc`, `rkyv`:
292.44 s
> - impl<K, AK> PartialEq<rkyv::collections::btree_set::ArchivedBTreeSet<AK>> for std::collections::BTreeSet<K>
292.44 s
> where AK: PartialEq<K>;
292.44 s
> - impl<T, A> PartialEq for std::collections::BTreeSet<T, A>
292.44 s
> where T: PartialEq, A: Allocator, A: Clone;
292.44 s
> help : consider specifying the generic argument
292.44 s
> |
292.44 s
> 4214 | .collect::<Vec<_>> ()
292.44 s
> | ++++++++++
292.44 s
>
292.44 s
> error[E0277] : can't compare `std::option::Option<&[linnet::half_edge::involution::EdgeIndex]>` with `std::option::Option<&[linnet::half_edge::involution::EdgeIndex; 1]>`
292.44 s
> --> crates/gammalooprs/src/processes/cross_section/ir_safe_threshold_fixture_tests.rs:817:25
292.44 s
> |
292.44 s
> 816 | .any(|variant| variant.requested_subspace.as_deref()
292.44 s
> | -------------------------------------
292.44 s
> 817 | == Some(&[EdgeIndex::from(3)])),
292.44 s
> | ^^ ---------------------------
292.44 s
> | |
292.44 s
> | no implementation for `std::option::Option<&[linnet::half_edge::involution::EdgeIndex]> == std::option::Option<&[linnet::half_edge::involution::EdgeIndex; 1]>`
292.44 s
> |
292.44 s
> = help : the trait `PartialEq<std::option::Option<&[linnet::half_edge::involution::EdgeIndex; 1]>>` is not implemented for `std::option::Option<&[linnet::half_edge::involution::EdgeIndex]>`
292.44 s
> help : the following other types implement trait `PartialEq<Rhs>`
292.44 s
> --> /nix/store/8zq9ya5slh345hbylmsibxw827bi98w0-vendor-cargo-deps/c19b7c6f923b580ac259164a89f2577984ad5ab09ee9d583b888f934adbbe8d0/rkyv-0.7.46/src/impls/alloc/niche.rs:24:1
292.44 s
> |
292.44 s
> 24 | / impl<T, U> PartialEq<ArchivedOptionBox<T>> for Option<Box<U>>
292.44 s
> 25 | | where
292.44 s
> 26 | | T: ArchivePointee + PartialEq<U> + ?Sized,
292.44 s
> 27 | | U: ?Sized,
292.44 s
> | |______________^ `std::option::Option<Box<U>>` implements `PartialEq<rkyv::niche::option_box::ArchivedOptionBox<T>>`
292.44 s
> --> /rustc/2d8144b7880597b6e6d3dfd63a9a9efae3f533d3/library/core/src/option.rs:2434:0
292.44 s
> |
292.44 s
> = note : `std::option::Option<T>` implements `PartialEq`
292.44 s
> |
292.44 s
> ::: /nix/store/8zq9ya5slh345hbylmsibxw827bi98w0-vendor-cargo-deps/c19b7c6f923b580ac259164a89f2577984ad5ab09ee9d583b888f934adbbe8d0/rkyv-0.7.46/src/option.rs:210:1
292.44 s
> |
292.44 s
> 210 | impl<T: PartialEq<U>, U> PartialEq<ArchivedOption<T>> for Option<U> {
292.44 s
> | ^^^^^^^^^^^^^^^^^^^^^^^^^^^^^^^^^^^^^^^^^^^^^^^^^^^^^^^^^^^^^^^^^^^ `std::option::Option<U>` implements `PartialEq<rkyv::option::ArchivedOption<T>>`
292.44 s
>
292.44 s
> error[E0283] : type annotations needed
292.44 s
> --> crates/gammalooprs/src/processes/no_directive_equivalence_tests.rs:459:43
292.44 s
> |
292.44 s
> 459 | (0..graph.cuts.len()).collect(),
292.44 s
> | ^^^^^^^ cannot infer type of the type parameter `B` declared on the method `collect`
292.44 s
> |
292.44 s
> = note : multiple `impl`s satisfying `_: FromIterator<usize>` found in the following crates: `spenso`, `tabled`:
292.44 s
> - impl FromIterator<usize> for ExpandedIndex;
292.44 s
> - impl FromIterator<usize> for HeightList;
292.44 s
> - impl FromIterator<usize> for WidthList;
292.44 s
> note : required by a bound in `std::iter::Iterator::collect`
292.44 s
> --> /rustc/2d8144b7880597b6e6d3dfd63a9a9efae3f533d3/library/core/src/iter/traits/iterator.rs:2077:4
292.44 s
> help : consider specifying the generic argument
292.44 s
> |
292.44 s
> 459 | (0..graph.cuts.len()).collect::<Vec<_>> (),
292.44 s
> | ++++++++++
292.44 s
>
292.44 s
> error[E0283] : type annotations needed
292.44 s
> --> crates/gammalooprs/src/processes/no_directive_equivalence_tests.rs:459:43
292.44 s
> |
292.44 s
> 457 | / assert_eq!(
292.44 s
> 458 | | grouped_cut_ids,
292.44 s
> 459 | | (0..graph.cuts.len()).collect(),
292.44 s
> | | ^^^^^^^ cannot infer type of the type parameter `B` declared on the method `collect`
292.44 s
> 460 | | "every discovered process-valid cut must remain in the numerical LU evaluation",
292.44 s
> 461 | | );
292.44 s
> | |_________________- type must be known at this point
292.44 s
> |
292.44 s
> = note : multiple `impl`s satisfying `std::collections::BTreeSet<usize>: PartialEq<_>` found in the following crates: `alloc`, `rkyv`:
292.44 s
> - impl<K, AK> PartialEq<rkyv::collections::btree_set::ArchivedBTreeSet<AK>> for std::collections::BTreeSet<K>
292.44 s
> where AK: PartialEq<K>;
292.44 s
> - impl<T, A> PartialEq for std::collections::BTreeSet<T, A>
292.44 s
> where T: PartialEq, A: Allocator, A: Clone;
292.44 s
> help : consider specifying the generic argument
292.44 s
> |
292.44 s
> 459 | (0..graph.cuts.len()).collect::<Vec<_>> (),
292.44 s
> | ++++++++++
292.44 s
>
292.44 s
> error[E0283] : type annotations needed
292.44 s
> --> crates/gammalooprs/src/processes/raised_cross_section_tests.rs:150:31
292.44 s
> |
292.44 s
> 150 | (0..graph.cuts.len()).collect(),
292.44 s
> | ^^^^^^^ cannot infer type of the type parameter `B` declared on the method `collect`
292.44 s
> |
292.44 s
> = note : multiple `impl`s satisfying `_: FromIterator<usize>` found in the following crates: `spenso`, `tabled`:
292.44 s
> - impl FromIterator<usize> for ExpandedIndex;
292.44 s
> - impl FromIterator<usize> for HeightList;
292.44 s
> - impl FromIterator<usize> for WidthList;
292.44 s
> note : required by a bound in `std::iter::Iterator::collect`
292.44 s
> --> /rustc/2d8144b7880597b6e6d3dfd63a9a9efae3f533d3/library/core/src/iter/traits/iterator.rs:2077:4
292.44 s
> help : consider specifying the generic argument
292.44 s
> |
292.44 s
> 150 | (0..graph.cuts.len()).collect::<Vec<_>> (),
292.44 s
> | ++++++++++
292.44 s
>
292.44 s
> error[E0283] : type annotations needed
292.44 s
> --> crates/gammalooprs/src/processes/raised_cross_section_tests.rs:150:31
292.44 s
> |
292.44 s
> 148 | / assert_eq!(
292.44 s
> 149 | | grouped_cut_ids,
292.44 s
> 150 | | (0..graph.cuts.len()).collect(),
292.44 s
> | | ^^^^^^^ cannot infer type of the type parameter `B` declared on the method `collect`
292.44 s
> 151 | | "every discovered process-valid cut must remain in the numerical LU evaluation",
292.44 s
> 152 | | );
292.44 s
> | |_____- type must be known at this point
292.44 s
> |
292.44 s
> = note : multiple `impl`s satisfying `std::collections::BTreeSet<usize>: PartialEq<_>` found in the following crates: `alloc`, `rkyv`:
292.44 s
> - impl<K, AK> PartialEq<rkyv::collections::btree_set::ArchivedBTreeSet<AK>> for std::collections::BTreeSet<K>
292.44 s
> where AK: PartialEq<K>;
292.44 s
> - impl<T, A> PartialEq for std::collections::BTreeSet<T, A>
292.44 s
> where T: PartialEq, A: Allocator, A: Clone;
292.44 s
> help : consider specifying the generic argument
292.44 s
> |
292.44 s
> 150 | (0..graph.cuts.len()).collect::<Vec<_>> (),
292.44 s
> | ++++++++++
292.44 s
>
292.44 s
> warning : method `lu_prefactor_helper` is never used
292.44 s
> --> crates/gammalooprs/src/processes/cross_section.rs:1965:8
292.44 s
> |
292.44 s
> 1429 | impl CrossSectionGraph {
292.44 s
> | ---------------------- method in this implementation
292.44 s
> ...
292.44 s
> 1965 | fn lu_prefactor_helper(&self) -> Atom {
292.44 s
> | ^^^^^^^^^^^^^^^^^^^
292.44 s
> |
292.44 s
> = note : `#[warn(dead_code)]` (part of `#[warn(unused)]`) on by default
292.44 s
>
292.44 s
> warning : `gammalooprs` (lib) generated 1 warning
292.44 s
> Some errors have detailed explanations: E0277, E0283.
292.44 s
> For more information about an error, try `rustc --explain E0277`.
292.44 s
> error : could not compile `gammalooprs` (lib test) due to 16 previous errors
292.44 s
> warning : build failed, waiting for other jobs to finish...
292.44 s
For full logs, run:
292.44 s
nix log /nix/store/bcqc79if6hchn98779cm1bksy0kvkzh2-gammaloop-workspace-check-0.1.0.drv
292.51 s
Build failed.