build checks.x86_64-linux.gammaloop-clippy

Reproduce this run
Original Run
  1. 0.01 s $ /nix/store/9ypz3flqsrl5xl495mm8h645gadjsxi1-coreutils-9.11/bin/timeout --kill-after=15s 7200s /nix/store/23zk8sgzamrbmj1fday15szf7f2279s8-nix-2.34.7/bin/nix --extra-experimental-features nix-command --extra-experimental-features flakes --log-format internal-json build --no-link --print-out-paths git+https://github.com/alphal00p/gammaloop?ref=ir_safe_threshold_subtraction&rev=6c3b1ff79c34a5e34e424ddd51dd218105b48f53&shallow=1#checks.x86_64-linux.gammaloop-clippy --print-build-logs
  2. 3.97 s
  3. 4.73 s Building /nix/store/bfvd4racaxf8cd9mpzlpz54h91n6g02c-gammaloop-workspace-clippy-0.1.0.drv
  4. 4.83 s [gammaloop-workspace-clippy] Phase: unpackPhase
  5. 4.84 s [gammaloop-workspace-clippy] unpacking source archive /nix/store/bcy0vqqk2ibk38nik2bb809ck03m92g2-source
  6. 7.57 s [gammaloop-workspace-clippy] source root is source
  7. 7.63 s [gammaloop-workspace-clippy] Phase: patchPhase
  8. 7.65 s [gammaloop-workspace-clippy] Executing configureCargoCommonVars
  9. 7.66 s [gammaloop-workspace-clippy] decompressing cargo artifacts from /nix/store/wxpx6lf642pgxp2wz1pw1lxksj5p1wb0-gammaloop-workspace-deps-deps-0.1.0/target.tar.zst to target
  10. 10.58 s [gammaloop-workspace-clippy] Phase: updateAutotoolsGnuConfigScriptsPhase
  11. 10.63 s [gammaloop-workspace-clippy] Phase: configurePhase
  12. 10.63 s [gammaloop-workspace-clippy] will append /build/source/.cargo-home/config.toml with contents of /nix/store/8zq9ya5slh345hbylmsibxw827bi98w0-vendor-cargo-deps/config.toml
  13. 10.63 s [gammaloop-workspace-clippy] default configurePhase, nothing to do
  14. 10.63 s [gammaloop-workspace-clippy] Phase: buildPhase
  15. 10.64 s [gammaloop-workspace-clippy] +++ command cargo --version
  16. 10.64 s [gammaloop-workspace-clippy] cargo 1.97.0 (c980f4866 2026-06-30)
  17. 10.68 s [gammaloop-workspace-clippy] +++ command cargo clippy --profile ci-optim --locked --workspace --features gammaloop-tracing-filter/clap,gammaloop-tracing-filter/symbolica,idenso/bincode,idenso/reference-cases,linnet/bincode,linnet/drawing,linnet/rkyv,linnet/serde,linnet/symbolica,spenso-macros/shadowing,spenso/shadowing,symbolica/tracing_max_level_info,three-dimensional-reps/display,three-dimensional-reps/eval,three-dimensional-reps/serde --all-targets --no-deps -- --deny warnings
  18. 11.35 s [gammaloop-workspace-clippy] Checking cfg-if v1.0.4
  19. 11.35 s [gammaloop-workspace-clippy] Checking memchr v2.8.0
  20. 11.35 s [gammaloop-workspace-clippy] Checking once_cell v1.21.4
  21. 11.35 s [gammaloop-workspace-clippy] Checking either v1.15.0
  22. 11.35 s [gammaloop-workspace-clippy] Checking serde_core v1.0.228
  23. 11.36 s [gammaloop-workspace-clippy] Checking libc v0.2.186
  24. 11.36 s [gammaloop-workspace-clippy] Checking libm v0.2.16
  25. 11.40 s [gammaloop-workspace-clippy] Checking itoa v1.0.18
  26. 11.40 s [gammaloop-workspace-clippy] Checking log v0.4.29
  27. 11.40 s [gammaloop-workspace-clippy] Checking regex-syntax v0.8.10
  28. 11.42 s [gammaloop-workspace-clippy] Checking zerocopy v0.8.48
  29. 11.42 s [gammaloop-workspace-clippy] Checking crossbeam-utils v0.8.21
  30. 11.42 s [gammaloop-workspace-clippy] Checking equivalent v1.0.2
  31. 11.43 s [gammaloop-workspace-clippy] Checking zmij v1.0.21
  32. 11.46 s [gammaloop-workspace-clippy] Checking bytemuck v1.25.0
  33. 11.46 s [gammaloop-workspace-clippy] Checking lazy_static v1.5.0
  34. 11.46 s [gammaloop-workspace-clippy] Compiling target-lexicon v0.13.5
  35. 11.47 s [gammaloop-workspace-clippy] Checking arrayvec v0.7.6
  36. 11.53 s [gammaloop-workspace-clippy] Checking powerfmt v0.2.0
  37. 11.57 s [gammaloop-workspace-clippy] Checking num-conv v0.2.1
  38. 11.60 s [gammaloop-workspace-clippy] Checking pin-project-lite v0.2.17
  39. 11.65 s [gammaloop-workspace-clippy] Checking deranged v0.5.8
  40. 11.67 s [gammaloop-workspace-clippy] Checking time-core v0.1.8
  41. 11.68 s [gammaloop-workspace-clippy] Checking num_threads v0.1.7
  42. 11.71 s [gammaloop-workspace-clippy] Checking tracing-core v0.1.36
  43. 11.71 s [gammaloop-workspace-clippy] Checking foldhash v0.2.0
  44. 11.75 s [gammaloop-workspace-clippy] Checking allocator-api2 v0.2.21
  45. 11.75 s [gammaloop-workspace-clippy] Checking const-random v0.1.18
  46. 11.78 s [gammaloop-workspace-clippy] Checking itertools v0.14.0
  47. 11.82 s [gammaloop-workspace-clippy] Checking winnow v1.0.2
  48. 11.83 s [gammaloop-workspace-clippy] Checking static_assertions v1.1.0
  49. 11.85 s [gammaloop-workspace-clippy] Checking unty v0.0.4
  50. 11.93 s [gammaloop-workspace-clippy] Checking nu-ansi-term v0.50.3
  51. 11.98 s [gammaloop-workspace-clippy] Checking sharded-slab v0.1.7
  52. 12.00 s [gammaloop-workspace-clippy] Checking safe_arch v0.7.4
  53. 12.00 s [gammaloop-workspace-clippy] Checking crossbeam-epoch v0.9.18
  54. 12.04 s [gammaloop-workspace-clippy] Checking hashbrown v0.16.1
  55. 12.16 s [gammaloop-workspace-clippy] Checking tracing v0.1.44
  56. 12.25 s [gammaloop-workspace-clippy] Checking tracing-log v0.2.0
  57. 12.35 s [gammaloop-workspace-clippy] Checking safe_arch v1.0.0
  58. 12.38 s [gammaloop-workspace-clippy] Checking crossbeam-deque v0.8.6
  59. 12.62 s [gammaloop-workspace-clippy] Checking rayon-core v1.13.0
  60. 12.68 s [gammaloop-workspace-clippy] Checking thread_local v1.1.9
  61. 12.74 s [gammaloop-workspace-clippy] Checking toml_writer v1.1.1+spec-1.1.0
  62. 12.79 s [gammaloop-workspace-clippy] Checking indenter v0.3.4
  63. 12.80 s [gammaloop-workspace-clippy] Checking aho-corasick v1.1.4
  64. 12.87 s [gammaloop-workspace-clippy] Checking az v1.3.0
  65. 12.89 s [gammaloop-workspace-clippy] Checking wide v1.3.0
  66. 12.90 s [gammaloop-workspace-clippy] Compiling phf_shared v0.11.3
  67. 13.09 s [gammaloop-workspace-clippy] Checking anyhow v1.0.102
  68. 13.09 s [gammaloop-workspace-clippy] Checking rawpointer v0.2.1
  69. 13.14 s [gammaloop-workspace-clippy] Checking wide v0.7.33
  70. 13.16 s [gammaloop-workspace-clippy] Checking dyn-clone v1.0.20
  71. 13.23 s [gammaloop-workspace-clippy] Checking alloc-no-stdlib v2.0.4
  72. 13.29 s [gammaloop-workspace-clippy] Checking utf8parse v0.2.2
  73. 13.35 s [gammaloop-workspace-clippy] Checking anstyle-parse v1.0.0
  74. 13.51 s [gammaloop-workspace-clippy] Checking alloc-stdlib v0.2.2
  75. 13.66 s [gammaloop-workspace-clippy] Checking matrixmultiply v0.3.10
  76. 13.71 s [gammaloop-workspace-clippy] Checking rayon v1.12.0
  77. 13.77 s [gammaloop-workspace-clippy] Checking is_terminal_polyfill v1.70.2
  78. 13.95 s [gammaloop-workspace-clippy] Checking colored v3.1.1
  79. 13.97 s [gammaloop-workspace-clippy] Checking serde v1.0.228
  80. 14.05 s [gammaloop-workspace-clippy] Checking serde_json v1.0.149
  81. 14.11 s [gammaloop-workspace-clippy] Checking bitflags v2.11.1
  82. 14.16 s [gammaloop-workspace-clippy] Checking serde_spanned v1.1.1
  83. 14.39 s [gammaloop-workspace-clippy] Checking toml_datetime v1.1.1+spec-1.1.0
  84. 14.67 s [gammaloop-workspace-clippy] Checking anstyle-query v1.1.5
  85. 14.69 s [gammaloop-workspace-clippy] Compiling pyo3-build-config v0.28.3
  86. 14.70 s [gammaloop-workspace-clippy] Checking anstyle v1.0.14
  87. 14.73 s [gammaloop-workspace-clippy] Checking colorchoice v1.0.5
  88. 14.75 s [gammaloop-workspace-clippy] Compiling phf_generator v0.11.3
  89. 14.78 s [gammaloop-workspace-clippy] Checking eyre v0.6.12
  90. 14.88 s [gammaloop-workspace-clippy] Checking anstream v1.0.0
  91. 14.91 s [gammaloop-workspace-clippy] Checking smallvec v1.15.1
  92. 15.03 s [gammaloop-workspace-clippy] Checking tracing-serde v0.2.0
  93. 15.06 s [gammaloop-workspace-clippy] Checking bincode v2.0.1
  94. 15.09 s [gammaloop-workspace-clippy] Checking unicode-width v0.2.2
  95. 15.14 s [gammaloop-workspace-clippy] Checking bitflags v1.3.2
  96. 15.19 s [gammaloop-workspace-clippy] Compiling phf_codegen v0.11.3
  97. 15.21 s [gammaloop-workspace-clippy] Checking brotli-decompressor v5.0.0
  98. 15.22 s [gammaloop-workspace-clippy] Checking inventory v0.3.24
  99. 15.28 s [gammaloop-workspace-clippy] Checking spec_math v0.1.6
  100. 15.31 s [gammaloop-workspace-clippy] Checking thiserror v2.0.18
  101. 15.32 s [gammaloop-workspace-clippy] Checking smartstring v1.0.1
  102. 15.39 s [gammaloop-workspace-clippy] Compiling getopts v0.2.24
  103. 15.41 s [gammaloop-workspace-clippy] Checking num-traits v0.2.19
  104. 15.51 s [gammaloop-workspace-clippy] Checking libloading v0.9.0
  105. 15.54 s [gammaloop-workspace-clippy] Checking tinyjson v2.5.1
  106. 15.70 s [gammaloop-workspace-clippy] Checking bytes v1.11.1
  107. 15.76 s [gammaloop-workspace-clippy] Checking toml_parser v1.1.2+spec-1.1.0
  108. 15.82 s [gammaloop-workspace-clippy] Checking append-only-vec v0.1.8
  109. 16.04 s [gammaloop-workspace-clippy] Checking byteorder v1.5.0
  110. 16.13 s [gammaloop-workspace-clippy] Checking toml v1.1.2+spec-1.1.0
  111. 16.24 s [gammaloop-workspace-clippy] Checking brotli v8.0.2
  112. 16.35 s [gammaloop-workspace-clippy] Checking num-complex v0.4.6
  113. 16.53 s [gammaloop-workspace-clippy] Checking approx v0.5.1
  114. 16.66 s [gammaloop-workspace-clippy] Checking num-integer v0.1.46
  115. 16.68 s [gammaloop-workspace-clippy] Checking self_cell v1.2.2
  116. 16.69 s [gammaloop-workspace-clippy] Compiling unicode_names2_generator v1.3.0
  117. 16.70 s [gammaloop-workspace-clippy] Checking simba v0.9.1
  118. 16.75 s [gammaloop-workspace-clippy] Checking regex-automata v0.4.14
  119. 16.75 s [gammaloop-workspace-clippy] Compiling unic-common v0.9.0
  120. 16.79 s [gammaloop-workspace-clippy] Checking linux-raw-sys v0.12.1
  121. 16.86 s [gammaloop-workspace-clippy] Compiling unic-char-range v0.9.0
  122. 16.92 s [gammaloop-workspace-clippy] Compiling is-macro v0.3.7
  123. 17.00 s [gammaloop-workspace-clippy] Compiling unic-char-property v0.9.0
  124. 17.11 s [gammaloop-workspace-clippy] Compiling unic-ucd-version v0.9.0
  125. 17.11 s [gammaloop-workspace-clippy] Compiling rustpython-parser-vendored v0.4.0
  126. 17.16 s [gammaloop-workspace-clippy] Checking iana-time-zone v0.1.65
  127. 17.20 s [gammaloop-workspace-clippy] Checking rustix v1.1.4
  128. 17.27 s [gammaloop-workspace-clippy] Checking chrono v0.4.44
  129. 17.46 s [gammaloop-workspace-clippy] Compiling rustpython-parser v0.4.0
  130. 17.81 s [gammaloop-workspace-clippy] Compiling phf v0.11.3
  131. 17.83 s [gammaloop-workspace-clippy] Checking getrandom v0.3.4
  132. 18.00 s [gammaloop-workspace-clippy] Checking rand_core v0.9.5
  133. 18.04 s [gammaloop-workspace-clippy] Checking time v0.3.47
  134. 18.08 s [gammaloop-workspace-clippy] Checking gmp-mpfr-sys v1.7.1
  135. 18.10 s [gammaloop-workspace-clippy] Checking hugepage-rs v0.1.1
  136. 18.14 s [gammaloop-workspace-clippy] Checking wasmtime-jit-icache-coherence v34.0.2
  137. 18.19 s [gammaloop-workspace-clippy] Checking region v3.0.2
  138. 18.19 s [gammaloop-workspace-clippy] Checking rustc-hash v2.1.2
  139. 18.26 s [gammaloop-workspace-clippy] Compiling unic-ucd-ident v0.9.0
  140. 18.34 s [gammaloop-workspace-clippy] Compiling unic-emoji-char v0.9.0
  141. 18.43 s [gammaloop-workspace-clippy] Checking ndarray v0.17.2
  142. 18.45 s [gammaloop-workspace-clippy] Compiling lalrpop-util v0.20.2
  143. 18.52 s [gammaloop-workspace-clippy] Compiling rustc-hash v1.1.0
  144. 18.59 s [gammaloop-workspace-clippy] Checking rug v1.30.0
  145. 18.62 s [gammaloop-workspace-clippy] Checking unicode-segmentation v1.13.2
  146. 18.66 s [gammaloop-workspace-clippy] Compiling symbolica v2.2.0 (https://github.com/alphal00p/symbolica?rev=4d0a833eb8e059d1f95bdae5abed2559830b235f#4d0a833e)
  147. 18.80 s [gammaloop-workspace-clippy] Checking typenum v1.20.0
  148. 19.30 s [gammaloop-workspace-clippy] Checking getrandom v0.2.17
  149. 19.36 s [gammaloop-workspace-clippy] Checking scopeguard v1.2.0
  150. 19.45 s [gammaloop-workspace-clippy] Checking parking_lot_core v0.9.12
  151. 19.48 s [gammaloop-workspace-clippy] Checking lock_api v0.4.14
  152. 19.54 s [gammaloop-workspace-clippy] Checking hashbrown v0.17.0
  153. 19.75 s [gammaloop-workspace-clippy] Checking unicode-ident v1.0.24
  154. 19.86 s [gammaloop-workspace-clippy] Checking parking_lot v0.12.5
  155. 19.90 s [gammaloop-workspace-clippy] Checking generic-array v0.14.7
  156. 20.07 s [gammaloop-workspace-clippy] Checking errno v0.3.14
  157. 20.09 s [gammaloop-workspace-clippy] Checking terminal_size v0.4.4
  158. 20.15 s [gammaloop-workspace-clippy] Checking strsim v0.11.1
  159. 20.19 s [gammaloop-workspace-clippy] Checking clap_lex v1.1.0
  160. 20.20 s [gammaloop-workspace-clippy] Checking unicase v2.9.0
  161. 20.22 s [gammaloop-workspace-clippy] Checking signal-hook-registry v1.4.8
  162. 20.30 s [gammaloop-workspace-clippy] Checking vte v0.14.1
  163. 20.33 s [gammaloop-workspace-clippy] Checking same-file v1.0.6
  164. 20.37 s [gammaloop-workspace-clippy] Checking indexmap v2.14.0
  165. 20.43 s [gammaloop-workspace-clippy] Checking walkdir v2.5.0
  166. 20.44 s [gammaloop-workspace-clippy] Checking clap_builder v4.6.0
  167. 20.52 s [gammaloop-workspace-clippy] Checking mio v1.2.0
  168. 20.53 s [gammaloop-workspace-clippy] Checking signal-hook v0.3.18
  169. 20.76 s [gammaloop-workspace-clippy] Checking minimal-lexical v0.2.1
  170. 20.91 s [gammaloop-workspace-clippy] Checking ciborium-io v0.2.2
  171. 21.01 s [gammaloop-workspace-clippy] Checking derive_more v2.1.1
  172. 21.11 s [gammaloop-workspace-clippy] Checking console v0.16.3
  173. 21.12 s [gammaloop-workspace-clippy] Checking num-bigint v0.4.6
  174. 21.21 s [gammaloop-workspace-clippy] Checking matchers v0.2.0
  175. 21.24 s [gammaloop-workspace-clippy] Checking regex v1.12.3
  176. 21.34 s [gammaloop-workspace-clippy] Checking nom v7.1.3
  177. 21.36 s [gammaloop-workspace-clippy] Checking signal-hook-mio v0.2.5
  178. 21.43 s [gammaloop-workspace-clippy] Checking tracing-subscriber v0.3.23
  179. 21.49 s [gammaloop-workspace-clippy] Checking crypto-common v0.1.7
  180. 21.52 s [gammaloop-workspace-clippy] Checking block-buffer v0.10.4
  181. 21.65 s [gammaloop-workspace-clippy] Checking bstr v1.12.1
  182. 21.72 s [gammaloop-workspace-clippy] Checking ppv-lite86 v0.2.21
  183. 21.73 s [gammaloop-workspace-clippy] Checking ahash v0.8.12
  184. 21.76 s [gammaloop-workspace-clippy] Checking half v2.7.1
  185. 21.78 s [gammaloop-workspace-clippy] Checking digest v0.10.7
  186. 21.92 s [gammaloop-workspace-clippy] Checking linux-raw-sys v0.4.15
  187. 22.03 s [gammaloop-workspace-clippy] Checking cpufeatures v0.2.17
  188. 22.09 s [gammaloop-workspace-clippy] Checking rand_chacha v0.9.0
  189. 22.10 s [gammaloop-workspace-clippy] Checking winnow v0.7.15
  190. 22.19 s [gammaloop-workspace-clippy] Checking ciborium-ll v0.2.2
  191. 22.24 s [gammaloop-workspace-clippy] Checking rustix v0.38.44
  192. 22.30 s [gammaloop-workspace-clippy] Checking clap v4.6.1
  193. 22.36 s [gammaloop-workspace-clippy] Checking ciborium v0.2.2
  194. 22.39 s [gammaloop-workspace-clippy] Checking sha2 v0.10.9
  195. 22.40 s [gammaloop-workspace-clippy] Checking rand_core v0.6.4
  196. 22.47 s [gammaloop-workspace-clippy] Checking rand v0.9.4
  197. 22.67 s [gammaloop-workspace-clippy] Checking getrandom v0.4.2
  198. 22.81 s [gammaloop-workspace-clippy] Checking xprec v0.2.2
  199. 22.87 s [gammaloop-workspace-clippy] Checking fastrand v2.4.1
  200. 22.91 s [gammaloop-workspace-clippy] Checking fnv v1.0.7
  201. 22.95 s [gammaloop-workspace-clippy] Checking plotters-backend v0.3.7
  202. 22.97 s [gammaloop-workspace-clippy] Checking globset v0.4.18
  203. 23.04 s [gammaloop-workspace-clippy] Checking toml_datetime v0.6.11
  204. 23.12 s [gammaloop-workspace-clippy] Checking serde_spanned v0.6.9
  205. 23.13 s [gammaloop-workspace-clippy] Checking itertools v0.10.5
  206. 23.16 s [gammaloop-workspace-clippy] Checking crossterm v0.28.1
  207. 23.17 s [gammaloop-workspace-clippy] Checking symjit v2.21.0
  208. 23.26 s [gammaloop-workspace-clippy] Checking tap v1.0.1
  209. 23.29 s [gammaloop-workspace-clippy] Checking tempfile v3.27.0
  210. 23.31 s [gammaloop-workspace-clippy] Checking cast v0.3.0
  211. 23.33 s [gammaloop-workspace-clippy] Checking toml_write v0.1.2
  212. 23.42 s [gammaloop-workspace-clippy] Checking wyz v0.5.1
  213. 23.43 s [gammaloop-workspace-clippy] Checking plotters-svg v0.3.7
  214. 23.53 s [gammaloop-workspace-clippy] Checking rand_chacha v0.3.1
  215. 23.60 s [gammaloop-workspace-clippy] Checking rust-embed-utils v8.11.0
  216. 23.62 s [gammaloop-workspace-clippy] Checking radium v0.7.0
  217. 23.64 s [gammaloop-workspace-clippy] Checking plotters v0.3.7
  218. 23.78 s [gammaloop-workspace-clippy] Compiling unicode_names2 v1.3.0
  219. 23.79 s [gammaloop-workspace-clippy] Checking typeid v1.0.3
  220. 23.84 s [gammaloop-workspace-clippy] Checking similar v2.7.0
  221. 23.89 s [gammaloop-workspace-clippy] Checking tinytemplate v1.2.1
  222. 23.89 s [gammaloop-workspace-clippy] Checking is-terminal v0.4.17
  223. 23.92 s [gammaloop-workspace-clippy] Checking anes v0.1.6
  224. 23.95 s [gammaloop-workspace-clippy] Checking bytecount v0.6.9
  225. 23.97 s [gammaloop-workspace-clippy] Checking oorandom v11.1.5
  226. 23.98 s [gammaloop-workspace-clippy] Checking toml_edit v0.22.27
  227. 24.07 s [gammaloop-workspace-clippy] Checking funty v2.0.0
  228. 24.09 s [gammaloop-workspace-clippy] Checking ron v0.12.1
  229. 24.12 s [gammaloop-workspace-clippy] Checking ansitok v0.3.0
  230. 24.25 s [gammaloop-workspace-clippy] Checking rand v0.8.6
  231. 24.28 s [gammaloop-workspace-clippy] Checking env_filter v1.0.1
  232. 24.48 s [gammaloop-workspace-clippy] Checking bitvec v1.0.1
  233. 24.53 s [gammaloop-workspace-clippy] Checking toml_edit v0.25.11+spec-1.1.0
  234. 24.66 s [gammaloop-workspace-clippy] Checking uncased v0.9.10
  235. 24.67 s [gammaloop-workspace-clippy] Checking criterion-plot v0.5.0
  236. 24.74 s [gammaloop-workspace-clippy] Checking jiff v0.2.24
  237. 24.78 s [gammaloop-workspace-clippy] Checking ansi-str v0.9.0
  238. 24.80 s [gammaloop-workspace-clippy] Checking testing_table v0.3.0
  239. 24.86 s [gammaloop-workspace-clippy] Checking ptr_meta v0.1.4
  240. 24.87 s [gammaloop-workspace-clippy] Checking ucd-trie v0.1.7
  241. 24.95 s [gammaloop-workspace-clippy] Checking simdutf8 v0.1.5
  242. 24.97 s [gammaloop-workspace-clippy] Checking pest v2.8.6
  243. 24.99 s [gammaloop-workspace-clippy] Checking ahash v0.7.8
  244. 25.02 s [gammaloop-workspace-clippy] Checking criterion v0.5.1
  245. 25.06 s [gammaloop-workspace-clippy] Checking bytecheck v0.6.12
  246. 25.10 s [gammaloop-workspace-clippy] Checking papergrid v0.17.0
  247. 25.12 s [gammaloop-workspace-clippy] Checking hashbrown v0.12.3
  248. 25.21 s [gammaloop-workspace-clippy] Checking approx v0.4.0
  249. 25.31 s [gammaloop-workspace-clippy] Checking seahash v4.1.0
  250. 25.42 s [gammaloop-workspace-clippy] Checking insta v1.47.2
  251. 25.45 s [gammaloop-workspace-clippy] Checking cgmath v0.18.0
  252. 25.49 s [gammaloop-workspace-clippy] Checking rend v0.4.2
  253. 25.50 s [gammaloop-workspace-clippy] Checking toml v0.8.23
  254. 25.55 s [gammaloop-workspace-clippy] Checking num-rational v0.4.2
  255. 25.85 s [gammaloop-workspace-clippy] Compiling pyo3-macros-backend v0.28.3
  256. 25.94 s [gammaloop-workspace-clippy] Compiling pyo3-ffi v0.28.3
  257. 26.07 s [gammaloop-workspace-clippy] Compiling pyo3 v0.28.3
  258. 26.17 s [gammaloop-workspace-clippy] Compiling numpy v0.28.0
  259. 26.23 s [gammaloop-workspace-clippy] Checking tabled v0.20.0
  260. 26.24 s [gammaloop-workspace-clippy] Checking figment v0.10.19
  261. 26.38 s [gammaloop-workspace-clippy] Checking dot-parser v0.5.1
  262. 26.50 s [gammaloop-workspace-clippy] Checking num-iter v0.1.45
  263. 26.57 s [gammaloop-workspace-clippy] Checking ref-ops v0.2.5
  264. 26.61 s [gammaloop-workspace-clippy] Checking num v0.4.3
  265. 26.62 s [gammaloop-workspace-clippy] Checking rand_xoshiro v0.6.0
  266. 26.67 s [gammaloop-workspace-clippy] Checking features v0.10.0
  267. 26.69 s [gammaloop-workspace-clippy] Checking constcat v0.5.1
  268. 26.75 s [gammaloop-workspace-clippy] Checking gat-lending-iterator v0.1.8
  269. 26.76 s [gammaloop-workspace-clippy] Checking colored v2.2.0
  270. 26.80 s [gammaloop-workspace-clippy] Checking arrayref v0.3.9
  271. 26.83 s [gammaloop-workspace-clippy] Checking cpufeatures v0.3.0
  272. 26.85 s [gammaloop-workspace-clippy] Checking constant_time_eq v0.4.2
  273. 26.88 s [gammaloop-workspace-clippy] Checking base64 v0.22.1
  274. 26.89 s [gammaloop-workspace-clippy] Checking joinery v2.1.0
  275. 26.96 s [gammaloop-workspace-clippy] Checking siphasher v1.0.2
  276. 26.97 s [gammaloop-workspace-clippy] Checking titlecase v2.2.1
  277. 26.98 s [gammaloop-workspace-clippy] Checking subprocess v0.2.15
  278. 26.99 s [gammaloop-workspace-clippy] Checking rust_lisp v0.18.0
  279. 27.00 s [gammaloop-workspace-clippy] Checking blake3 v1.8.5
  280. 27.04 s [gammaloop-workspace-clippy] Compiling vakint v0.1.2 (/build/source/crates/vakint)
  281. 27.05 s [gammaloop-workspace-clippy] Checking version-compare v0.2.1
  282. 27.07 s [gammaloop-workspace-clippy] Checking phf_shared v0.13.1
  283. 27.12 s [gammaloop-workspace-clippy] Checking xpct v0.5.1
  284. 27.18 s [gammaloop-workspace-clippy] Checking ryu v1.0.23
  285. 27.21 s [gammaloop-workspace-clippy] Checking castaway v0.2.4
  286. 27.25 s [gammaloop-workspace-clippy] Checking env_logger v0.11.10
  287. 27.26 s [gammaloop-workspace-clippy] Checking toml_datetime v0.7.5+spec-1.1.0
  288. 27.28 s [gammaloop-workspace-clippy] Checking strum v0.27.2
  289. 27.29 s [gammaloop-workspace-clippy] Checking unicode-truncate v2.0.1
  290. 27.32 s [gammaloop-workspace-clippy] Checking phf v0.13.1
  291. 27.34 s [gammaloop-workspace-clippy] Checking kasuari v0.4.12
  292. 27.36 s [gammaloop-workspace-clippy] Checking compact_str v0.9.0
  293. 27.39 s [gammaloop-workspace-clippy] Checking lru v0.16.4
  294. 27.40 s [gammaloop-workspace-clippy] Checking string-template-plus v0.4.3
  295. 27.42 s [gammaloop-workspace-clippy] Checking vte v0.15.0
  296. 27.47 s [gammaloop-workspace-clippy] Checking portable-atomic v1.13.1
  297. 27.47 s [gammaloop-workspace-clippy] Checking toml v0.9.12+spec-1.1.0
  298. 27.51 s [gammaloop-workspace-clippy] Checking unit-prefix v0.5.2
  299. 27.52 s [gammaloop-workspace-clippy] Checking rand_distr v0.4.3
  300. 27.52 s [gammaloop-workspace-clippy] Checking simba v0.6.0
  301. 27.57 s [gammaloop-workspace-clippy] Checking vt100 v0.16.2
  302. 27.59 s [gammaloop-workspace-clippy] Checking line-clipping v0.3.7
  303. 27.63 s [gammaloop-workspace-clippy] Checking adler2 v2.0.1
  304. 27.72 s [gammaloop-workspace-clippy] Compiling three-dimensional-reps v0.1.0 (/build/source/crates/three-dimensional-reps)
  305. 27.74 s [gammaloop-workspace-clippy] Checking gimli v0.32.3
  306. 27.76 s [gammaloop-workspace-clippy] Checking miniz_oxide v0.8.9
  307. 27.79 s [gammaloop-workspace-clippy] Checking ratatui-core v0.1.0
  308. 27.80 s [gammaloop-workspace-clippy] Checking thiserror v1.0.69
  309. 27.87 s [gammaloop-workspace-clippy] Checking derive_builder v0.11.2
  310. 27.89 s [gammaloop-workspace-clippy] Checking owo-colors v4.3.0
  311. 27.96 s [gammaloop-workspace-clippy] Checking crossterm v0.29.0
  312. 28.02 s [gammaloop-workspace-clippy] Checking object v0.37.3
  313. 28.03 s [gammaloop-workspace-clippy] Checking tracing-error v0.2.1
  314. 28.03 s [gammaloop-workspace-clippy] Checking typed-index-collections v3.5.0
  315. 28.08 s [gammaloop-workspace-clippy] Checking amd v0.2.2
  316. 28.16 s [gammaloop-workspace-clippy] Checking serde-big-array v0.5.1
  317. 28.18 s [gammaloop-workspace-clippy] Checking indicatif v0.18.4
  318. 28.21 s [gammaloop-workspace-clippy] Checking itertools v0.11.0
  319. 28.24 s [gammaloop-workspace-clippy] Compiling gammaloop-tracing-filter-macros v0.1.0 (/build/source/crates/gammaloop-tracing-filter-macros)
  320. 28.25 s [gammaloop-workspace-clippy] Checking option-ext v0.2.0
  321. 28.26 s [gammaloop-workspace-clippy] Checking rkyv v0.7.46
  322. 28.31 s [gammaloop-workspace-clippy] Checking rustc-demangle v0.1.27
  323. 28.32 s [gammaloop-workspace-clippy] Checking dirs-sys v0.5.0
  324. 28.43 s [gammaloop-workspace-clippy] Checking ref-cast v1.0.25
  325. 28.49 s [gammaloop-workspace-clippy] Checking nix v0.31.2
  326. 28.50 s [gammaloop-workspace-clippy] Checking integer-sqrt v0.1.5
  327. 28.52 s [gammaloop-workspace-clippy] Checking brotli-decompressor v4.0.3
  328. 28.56 s [gammaloop-workspace-clippy] Compiling rustpython-parser-core v0.4.0
  329. 28.57 s [gammaloop-workspace-clippy] Checking crossbeam-channel v0.5.15
  330. 28.61 s [gammaloop-workspace-clippy] Checking color-spantrace v0.3.0
  331. 28.62 s [gammaloop-workspace-clippy] Checking itertools v0.12.1
  332. 28.63 s [gammaloop-workspace-clippy] Compiling gammalooprs v0.3.4 (/build/source/crates/gammalooprs)
  333. 28.63 s [gammaloop-workspace-clippy] Checking ratatui-widgets v0.3.0
  334. 28.67 s [gammaloop-workspace-clippy] Checking ratatui-crossterm v0.1.0
  335. 28.77 s [gammaloop-workspace-clippy] Compiling rustpython-ast v0.4.0
  336. 28.78 s [gammaloop-workspace-clippy] Checking unsafe-libyaml v0.2.11
  337. 28.81 s [gammaloop-workspace-clippy] Checking symlink v0.1.0
  338. 28.86 s [gammaloop-workspace-clippy] Checking include_dir v0.7.4
  339. 28.88 s [gammaloop-workspace-clippy] Checking tracing-appender v0.2.5
  340. 28.88 s [gammaloop-workspace-clippy] Checking tracing-indicatif v0.3.14
  341. 28.98 s [gammaloop-workspace-clippy] Compiling numerica v2.2.0 (https://github.com/alphal00p/symbolica?rev=4d0a833eb8e059d1f95bdae5abed2559830b235f#4d0a833e)
  342. 28.99 s [gammaloop-workspace-clippy] Checking ctrlc v3.5.2
  343. 29.03 s [gammaloop-workspace-clippy] Checking pathfinding v4.15.0
  344. 29.08 s [gammaloop-workspace-clippy] Checking schemars v1.2.1
  345. 29.09 s [gammaloop-workspace-clippy] Checking slotmap v1.1.1
  346. 29.17 s [gammaloop-workspace-clippy] Checking brotli v7.0.0
  347. 29.23 s [gammaloop-workspace-clippy] Checking clarabel v0.11.1
  348. 29.34 s [gammaloop-workspace-clippy] Checking serde_yaml v0.9.34+deprecated
  349. 29.43 s [gammaloop-workspace-clippy] Checking ratatui-macros v0.7.0
  350. 29.44 s [gammaloop-workspace-clippy] Checking dirs v6.0.0
  351. 29.45 s [gammaloop-workspace-clippy] Checking addr2line v0.25.1
  352. 29.48 s [gammaloop-workspace-clippy] Checking ratatui v0.30.0
  353. 29.49 s [gammaloop-workspace-clippy] Checking json5 v0.4.1
  354. 29.55 s [gammaloop-workspace-clippy] Checking vectorize v0.2.0
  355. 29.58 s [gammaloop-workspace-clippy] Checking base62 v2.2.4
  356. 29.61 s [gammaloop-workspace-clippy] Checking ringbuffer v0.16.0
  357. 29.62 s [gammaloop-workspace-clippy] Checking rust-embed v8.11.0
  358. 29.65 s [gammaloop-workspace-clippy] Checking clap_complete v4.6.3
  359. 29.66 s [gammaloop-workspace-clippy] Checking strip-ansi-escapes v0.2.1
  360. 29.71 s [gammaloop-workspace-clippy] Checking fd-lock v4.0.4
  361. 29.74 s [gammaloop-workspace-clippy] Compiling gammaloop-api v0.1.0 (/build/source/crates/gammaloop-api)
  362. 29.76 s [gammaloop-workspace-clippy] Checking itertools v0.13.0
  363. 29.77 s [gammaloop-workspace-clippy] Checking strum v0.26.3
  364. 29.79 s [gammaloop-workspace-clippy] Checking sysinfo v0.33.1
  365. 29.81 s [gammaloop-workspace-clippy] Checking shlex v1.3.0
  366. 29.83 s [gammaloop-workspace-clippy] Checking futures-task v0.3.32
  367. 29.89 s [gammaloop-workspace-clippy] Checking futures-core v0.3.32
  368. 29.90 s [gammaloop-workspace-clippy] Checking clap_complete_nushell v4.6.0
  369. 29.92 s [gammaloop-workspace-clippy] Checking slab v0.4.12
  370. 29.94 s [gammaloop-workspace-clippy] Checking sdd v3.0.10
  371. 29.97 s [gammaloop-workspace-clippy] Compiling gammaloop-integration-tests v0.1.0 (/build/source/tests)
  372. 30.00 s [gammaloop-workspace-clippy] Compiling test-log-core v0.2.20
  373. 30.03 s [gammaloop-workspace-clippy] Checking futures-util v0.3.32
  374. 30.07 s [gammaloop-workspace-clippy] Compiling rustc_version v0.4.1
  375. 30.09 s [gammaloop-workspace-clippy] Checking scc v2.4.0
  376. 30.17 s [gammaloop-workspace-clippy] Checking which v8.0.2
  377. 30.30 s [gammaloop-workspace-clippy] Checking bincode v1.3.3
  378. 30.35 s [gammaloop-workspace-clippy] Compiling gungraun-runner v0.18.2
  379. 30.39 s [gammaloop-workspace-clippy] Checking backtrace v0.3.76
  380. 30.53 s [gammaloop-workspace-clippy] Checking nalgebra v0.29.0
  381. 30.62 s [gammaloop-workspace-clippy] Checking proc-macro2 v1.0.106
  382. 30.67 s [gammaloop-workspace-clippy] Checking color-eyre v0.6.5
  383. 30.68 s [gammaloop-workspace-clippy] Compiling gungraun-macros v0.8.0
  384. 30.81 s [gammaloop-workspace-clippy] Checking reedline v0.42.0
  385. 30.94 s [gammaloop-workspace-clippy] Checking quote v1.0.45
  386. 30.95 s [gammaloop-workspace-clippy] Checking maplit v1.0.2
  387. 31.02 s [gammaloop-workspace-clippy] Checking base64 v0.21.7
  388. 31.11 s [gammaloop-workspace-clippy] Compiling iai-callgrind-runner v0.14.2
  389. 31.16 s [gammaloop-workspace-clippy] Checking wait-timeout v0.2.1
  390. 31.25 s [gammaloop-workspace-clippy] Checking kurbo v0.13.0
  391. 31.30 s [gammaloop-workspace-clippy] Checking ron v0.8.1
  392. 31.40 s [gammaloop-workspace-clippy] Checking quick-error v1.2.3
  393. 31.42 s [gammaloop-workspace-clippy] Compiling iai-callgrind v0.14.2
  394. 31.43 s [gammaloop-workspace-clippy] Checking futures-executor v0.3.32
  395. 31.46 s [gammaloop-workspace-clippy] Checking bit-vec v0.8.0
  396. 31.56 s [gammaloop-workspace-clippy] Checking serial_test v3.4.0
  397. 31.63 s [gammaloop-workspace-clippy] Checking rusty-fork v0.3.1
  398. 31.64 s [gammaloop-workspace-clippy] Checking bit-set v0.8.0
  399. 31.71 s [gammaloop-workspace-clippy] Checking syn v2.0.117
  400. 31.72 s [gammaloop-workspace-clippy] Compiling test-log-macros v0.2.20
  401. 31.73 s [gammaloop-workspace-clippy] Compiling iai-callgrind-macros v0.5.1
  402. 31.76 s [gammaloop-workspace-clippy] Checking rand_xorshift v0.4.0
  403. 31.81 s [gammaloop-workspace-clippy] Checking console v0.15.11
  404. 31.82 s [gammaloop-workspace-clippy] Compiling graphica v2.1.0 (https://github.com/alphal00p/symbolica?rev=4d0a833eb8e059d1f95bdae5abed2559830b235f#4d0a833e)
  405. 31.96 s [gammaloop-workspace-clippy] Checking pathdiff v0.2.3
  406. 32.01 s [gammaloop-workspace-clippy] Checking unarray v0.1.4
  407. 32.03 s [gammaloop-workspace-clippy] Checking similar-asserts v1.7.0
  408. 32.08 s [gammaloop-workspace-clippy] Checking proptest v1.11.0
  409. 32.16 s [gammaloop-workspace-clippy] Checking clinnet v0.1.8 (/build/source/crates/clinnet)
  410. 32.69 s [gammaloop-workspace-clippy] Checking kurvst v0.1.0 (/build/source/crates/kurvst)
  411. 33.76 s [gammaloop-workspace-clippy] Checking test-log v0.2.20
  412. 35.10 s [gammaloop-workspace-clippy] Checking statrs v0.16.1
  413. 35.69 s [gammaloop-workspace-clippy] Checking momtrop v0.3.0
  414. 36.66 s [gammaloop-workspace-clippy] Checking gungraun v0.18.2
  415. 38.36 s [gammaloop-workspace-clippy] Compiling pyo3-macros v0.28.3
  416. 38.50 s [gammaloop-workspace-clippy] Compiling pyo3-stub-gen-derive v0.17.2
  417. 43.91 s [gammaloop-workspace-clippy] Checking pyo3-stub-gen v0.17.2
  418. 50.88 s [gammaloop-workspace-clippy] Checking symbolica-utils v0.1.0 (/build/source/crates/symbolica-utils)
  419. 50.88 s [gammaloop-workspace-clippy] Checking spenso-macros v0.3.2 (/build/source/crates/spenso-macros)
  420. 354.72 s [gammaloop-workspace-clippy] Compiling gammaloop-workspace-hack v0.1.0 (/build/source/crates/gammaloop-workspace-hack)
  421. 355.00 s [gammaloop-workspace-clippy] Checking linnet v0.17.0 (/build/source/crates/linnet)
  422. 361.07 s [gammaloop-workspace-clippy] Checking spenso v0.6.0 (/build/source/crates/spenso)
  423. 361.07 s [gammaloop-workspace-clippy] Checking linnet-py v0.1.0 (/build/source/crates/linnet-py)
  424. 361.07 s [gammaloop-workspace-clippy] Checking linnest v0.1.0 (/build/source/crates/linnest)
  425. 371.58 s [gammaloop-workspace-clippy] Checking idenso v0.3.0 (/build/source/crates/idenso)
  426. 371.58 s [gammaloop-workspace-clippy] Checking gammaloop-tracing-filter v0.1.0 (/build/source/crates/gammaloop-tracing-filter)
  427. 375.82 s [gammaloop-workspace-clippy] Checking spenso-hep-lib v0.1.7 (/build/source/crates/spenso-hep-lib)
  428. 376.53 s [gammaloop-workspace-clippy] Checking spynso3 v0.1.2 (/build/source/crates/spynso3)
  429. 395.84 s [gammaloop-workspace-clippy] error[E0283]: type annotations needed
  430. 395.84 s [gammaloop-workspace-clippy] --> crates/gammalooprs/src/momentum/sample.rs:1165:35
  431. 395.84 s [gammaloop-workspace-clippy] |
  432. 395.84 s [gammaloop-workspace-clippy] 1165 | requested.into_iter().collect(),
  433. 395.84 s [gammaloop-workspace-clippy] | ^^^^^^^ cannot infer type of the type parameter `B` declared on the method `collect`
  434. 395.84 s [gammaloop-workspace-clippy] |
  435. 395.84 s [gammaloop-workspace-clippy] = note: the type must implement `std::iter::FromIterator<linnet::half_edge::involution::EdgeIndex>`
  436. 395.84 s [gammaloop-workspace-clippy] note: required by a bound in `std::iter::Iterator::collect`
  437. 395.84 s [gammaloop-workspace-clippy] --> /rustc/2d8144b7880597b6e6d3dfd63a9a9efae3f533d3/library/core/src/iter/traits/iterator.rs:2077:4
  438. 395.84 s [gammaloop-workspace-clippy] help: consider specifying the generic argument
  439. 395.84 s [gammaloop-workspace-clippy] |
  440. 395.84 s [gammaloop-workspace-clippy] 1165 | requested.into_iter().collect::<Vec<_>>(),
  441. 395.84 s [gammaloop-workspace-clippy] | ++++++++++
  442. 395.84 s [gammaloop-workspace-clippy]
  443. 395.85 s [gammaloop-workspace-clippy] error[E0283]: type annotations needed
  444. 395.85 s [gammaloop-workspace-clippy] --> crates/gammalooprs/src/momentum/sample.rs:1165:35
  445. 395.85 s [gammaloop-workspace-clippy] |
  446. 395.85 s [gammaloop-workspace-clippy] 1161 | / assert_eq!(
  447. 395.85 s [gammaloop-workspace-clippy] 1162 | | subspace
  448. 395.85 s [gammaloop-workspace-clippy] 1163 | | .iter_basis_edges(&all_lmbs)
  449. 395.85 s [gammaloop-workspace-clippy] 1164 | | .collect::<std::collections::BTreeSet<_>>(),
  450. 395.85 s [gammaloop-workspace-clippy] 1165 | | requested.into_iter().collect(),
  451. 395.85 s [gammaloop-workspace-clippy] | | ^^^^^^^ cannot infer type of the type parameter `B` declared on the method `collect`
  452. 395.85 s [gammaloop-workspace-clippy] 1166 | | );
  453. 395.85 s [gammaloop-workspace-clippy] | |_________- type must be known at this point
  454. 395.85 s [gammaloop-workspace-clippy] |
  455. 395.85 s [gammaloop-workspace-clippy] = note: multiple `impl`s satisfying `std::collections::BTreeSet<linnet::half_edge::involution::EdgeIndex>: std::cmp::PartialEq<_>` found in the following crates: `alloc`, `rkyv`:
  456. 395.85 s [gammaloop-workspace-clippy] - impl<K, AK> std::cmp::PartialEq<rkyv::collections::btree_set::ArchivedBTreeSet<AK>> for std::collections::BTreeSet<K>
  457. 395.85 s [gammaloop-workspace-clippy] where AK: std::cmp::PartialEq<K>;
  458. 395.85 s [gammaloop-workspace-clippy] - impl<T, A> std::cmp::PartialEq for std::collections::BTreeSet<T, A>
  459. 395.85 s [gammaloop-workspace-clippy] where T: std::cmp::PartialEq, A: std::alloc::Allocator, A: std::clone::Clone;
  460. 395.85 s [gammaloop-workspace-clippy] help: consider specifying the generic argument
  461. 395.85 s [gammaloop-workspace-clippy] |
  462. 395.85 s [gammaloop-workspace-clippy] 1165 | requested.into_iter().collect::<Vec<_>>(),
  463. 395.85 s [gammaloop-workspace-clippy] | ++++++++++
  464. 395.85 s [gammaloop-workspace-clippy]
  465. 397.18 s [gammaloop-workspace-clippy] error[E0283]: type annotations needed
  466. 397.18 s [gammaloop-workspace-clippy] --> crates/gammalooprs/src/momentum/sample.rs:1182:35
  467. 397.18 s [gammaloop-workspace-clippy] |
  468. 397.18 s [gammaloop-workspace-clippy] 1178 | / assert_eq!(
  469. 397.18 s [gammaloop-workspace-clippy] 1179 | | common_subspace
  470. 397.18 s [gammaloop-workspace-clippy] 1180 | | .iter_basis_edges(&all_lmbs)
  471. 397.18 s [gammaloop-workspace-clippy] 1181 | | .collect::<std::collections::BTreeSet<_>>(),
  472. 397.18 s [gammaloop-workspace-clippy] 1182 | | requested.into_iter().collect(),
  473. 397.18 s [gammaloop-workspace-clippy] | | ^^^^^^^ cannot infer type of the type parameter `B` declared on the method `collect`
  474. 397.18 s [gammaloop-workspace-clippy] 1183 | | );
  475. 397.18 s [gammaloop-workspace-clippy] | |_________- type must be known at this point
  476. 397.18 s [gammaloop-workspace-clippy] |
  477. 397.18 s [gammaloop-workspace-clippy] = note: multiple `impl`s satisfying `std::collections::BTreeSet<linnet::half_edge::involution::EdgeIndex>: std::cmp::PartialEq<_>` found in the following crates: `alloc`, `rkyv`:
  478. 397.18 s [gammaloop-workspace-clippy] - impl<K, AK> std::cmp::PartialEq<rkyv::collections::btree_set::ArchivedBTreeSet<AK>> for std::collections::BTreeSet<K>
  479. 397.18 s [gammaloop-workspace-clippy] where AK: std::cmp::PartialEq<K>;
  480. 397.18 s [gammaloop-workspace-clippy] - impl<T, A> std::cmp::PartialEq for std::collections::BTreeSet<T, A>
  481. 397.18 s [gammaloop-workspace-clippy] where T: std::cmp::PartialEq, A: std::alloc::Allocator, A: std::clone::Clone;
  482. 397.18 s [gammaloop-workspace-clippy] help: consider specifying the generic argument
  483. 397.18 s [gammaloop-workspace-clippy] |
  484. 397.18 s [gammaloop-workspace-clippy] 1182 | requested.into_iter().collect::<Vec<_>>(),
  485. 397.18 s [gammaloop-workspace-clippy] | ++++++++++
  486. 397.18 s [gammaloop-workspace-clippy]
  487. 397.22 s [gammaloop-workspace-clippy] error[E0283]: type annotations needed
  488. 397.22 s [gammaloop-workspace-clippy] --> crates/gammalooprs/src/momentum/sample.rs:1203:35
  489. 397.22 s [gammaloop-workspace-clippy] |
  490. 397.22 s [gammaloop-workspace-clippy] 1199 | / assert_eq!(
  491. 397.22 s [gammaloop-workspace-clippy] 1200 | | sparse_common_subspace
  492. 397.22 s [gammaloop-workspace-clippy] 1201 | | .iter_basis_edges(&all_lmbs)
  493. 397.22 s [gammaloop-workspace-clippy] 1202 | | .collect::<std::collections::BTreeSet<_>>(),
  494. 397.22 s [gammaloop-workspace-clippy] 1203 | | requested.into_iter().collect(),
  495. 397.22 s [gammaloop-workspace-clippy] | | ^^^^^^^ cannot infer type of the type parameter `B` declared on the method `collect`
  496. 397.22 s [gammaloop-workspace-clippy] 1204 | | );
  497. 397.22 s [gammaloop-workspace-clippy] | |_________- type must be known at this point
  498. 397.22 s [gammaloop-workspace-clippy] |
  499. 397.22 s [gammaloop-workspace-clippy] = note: multiple `impl`s satisfying `std::collections::BTreeSet<linnet::half_edge::involution::EdgeIndex>: std::cmp::PartialEq<_>` found in the following crates: `alloc`, `rkyv`:
  500. 397.22 s [gammaloop-workspace-clippy] - impl<K, AK> std::cmp::PartialEq<rkyv::collections::btree_set::ArchivedBTreeSet<AK>> for std::collections::BTreeSet<K>
  501. 397.22 s [gammaloop-workspace-clippy] where AK: std::cmp::PartialEq<K>;
  502. 397.22 s [gammaloop-workspace-clippy] - impl<T, A> std::cmp::PartialEq for std::collections::BTreeSet<T, A>
  503. 397.22 s [gammaloop-workspace-clippy] where T: std::cmp::PartialEq, A: std::alloc::Allocator, A: std::clone::Clone;
  504. 397.22 s [gammaloop-workspace-clippy] help: consider specifying the generic argument
  505. 397.22 s [gammaloop-workspace-clippy] |
  506. 397.22 s [gammaloop-workspace-clippy] 1203 | requested.into_iter().collect::<Vec<_>>(),
  507. 397.22 s [gammaloop-workspace-clippy] | ++++++++++
  508. 397.22 s [gammaloop-workspace-clippy]
  509. 399.81 s [gammaloop-workspace-clippy] error[E0283]: type annotations needed
  510. 399.81 s [gammaloop-workspace-clippy] --> crates/gammalooprs/src/processes/amplitude.rs:3336:49
  511. 399.81 s [gammaloop-workspace-clippy] |
  512. 399.81 s [gammaloop-workspace-clippy] 3336 | variant_ids.iter().copied().collect(),
  513. 399.81 s [gammaloop-workspace-clippy] | ^^^^^^^ cannot infer type of the type parameter `B` declared on the method `collect`
  514. 399.81 s [gammaloop-workspace-clippy] |
  515. 399.81 s [gammaloop-workspace-clippy] = note: the type must implement `std::iter::FromIterator<processes::threshold_counterterms::ThresholdCountertermVariantId>`
  516. 399.81 s [gammaloop-workspace-clippy] note: required by a bound in `std::iter::Iterator::collect`
  517. 399.81 s [gammaloop-workspace-clippy] --> /rustc/2d8144b7880597b6e6d3dfd63a9a9efae3f533d3/library/core/src/iter/traits/iterator.rs:2077:4
  518. 399.81 s [gammaloop-workspace-clippy] help: consider specifying the generic argument
  519. 399.81 s [gammaloop-workspace-clippy] |
  520. 399.81 s [gammaloop-workspace-clippy] 3336 | variant_ids.iter().copied().collect::<Vec<_>>(),
  521. 399.81 s [gammaloop-workspace-clippy] | ++++++++++
  522. 399.81 s [gammaloop-workspace-clippy]
  523. 399.82 s [gammaloop-workspace-clippy] error[E0283]: type annotations needed
  524. 399.82 s [gammaloop-workspace-clippy] --> crates/gammalooprs/src/processes/amplitude.rs:3336:49
  525. 399.82 s [gammaloop-workspace-clippy] |
  526. 399.82 s [gammaloop-workspace-clippy] 3334 | / assert_eq!(
  527. 399.82 s [gammaloop-workspace-clippy] 3335 | | referenced_variants,
  528. 399.82 s [gammaloop-workspace-clippy] 3336 | | variant_ids.iter().copied().collect(),
  529. 399.82 s [gammaloop-workspace-clippy] | | ^^^^^^^ cannot infer type of the type parameter `B` declared on the method `collect`
  530. 399.82 s [gammaloop-workspace-clippy] 3337 | | "overlap groups must retain every semantic duplicate independently",
  531. 399.82 s [gammaloop-workspace-clippy] 3338 | | );
  532. 399.82 s [gammaloop-workspace-clippy] | |_________________- type must be known at this point
  533. 399.82 s [gammaloop-workspace-clippy] |
  534. 399.82 s [gammaloop-workspace-clippy] = note: multiple `impl`s satisfying `std::collections::BTreeSet<processes::threshold_counterterms::ThresholdCountertermVariantId>: std::cmp::PartialEq<_>` found in the following crates: `alloc`, `rkyv`:
  535. 399.82 s [gammaloop-workspace-clippy] - impl<K, AK> std::cmp::PartialEq<rkyv::collections::btree_set::ArchivedBTreeSet<AK>> for std::collections::BTreeSet<K>
  536. 399.82 s [gammaloop-workspace-clippy] where AK: std::cmp::PartialEq<K>;
  537. 399.82 s [gammaloop-workspace-clippy] - impl<T, A> std::cmp::PartialEq for std::collections::BTreeSet<T, A>
  538. 399.82 s [gammaloop-workspace-clippy] where T: std::cmp::PartialEq, A: std::alloc::Allocator, A: std::clone::Clone;
  539. 399.82 s [gammaloop-workspace-clippy] help: consider specifying the generic argument
  540. 399.82 s [gammaloop-workspace-clippy] |
  541. 399.82 s [gammaloop-workspace-clippy] 3336 | variant_ids.iter().copied().collect::<Vec<_>>(),
  542. 399.82 s [gammaloop-workspace-clippy] | ++++++++++
  543. 399.82 s [gammaloop-workspace-clippy]
  544. 400.14 s [gammaloop-workspace-clippy] error[E0283]: type annotations needed
  545. 400.14 s [gammaloop-workspace-clippy] --> crates/gammalooprs/src/processes/amplitude.rs:4098:59
  546. 400.14 s [gammaloop-workspace-clippy] |
  547. 400.14 s [gammaloop-workspace-clippy] 4098 | assert_eq!(orders, [1, 2].into_iter().collect());
  548. 400.14 s [gammaloop-workspace-clippy] | ^^^^^^^ cannot infer type of the type parameter `B` declared on the method `collect`
  549. 400.14 s [gammaloop-workspace-clippy] |
  550. 400.14 s [gammaloop-workspace-clippy] = note: the type must implement `std::iter::FromIterator<i32>`
  551. 400.14 s [gammaloop-workspace-clippy] note: required by a bound in `std::iter::Iterator::collect`
  552. 400.14 s [gammaloop-workspace-clippy] --> /rustc/2d8144b7880597b6e6d3dfd63a9a9efae3f533d3/library/core/src/iter/traits/iterator.rs:2077:4
  553. 400.14 s [gammaloop-workspace-clippy] help: consider specifying the generic argument
  554. 400.14 s [gammaloop-workspace-clippy] |
  555. 400.14 s [gammaloop-workspace-clippy] 4098 | assert_eq!(orders, [1, 2].into_iter().collect::<Vec<_>>());
  556. 400.14 s [gammaloop-workspace-clippy] | ++++++++++
  557. 400.14 s [gammaloop-workspace-clippy]
  558. 400.15 s [gammaloop-workspace-clippy] error[E0283]: type annotations needed
  559. 400.15 s [gammaloop-workspace-clippy] --> crates/gammalooprs/src/processes/amplitude.rs:4098:59
  560. 400.15 s [gammaloop-workspace-clippy] |
  561. 400.15 s [gammaloop-workspace-clippy] 4098 | assert_eq!(orders, [1, 2].into_iter().collect());
  562. 400.15 s [gammaloop-workspace-clippy] | --------------------------------------^^^^^^^---
  563. 400.15 s [gammaloop-workspace-clippy] | | |
  564. 400.15 s [gammaloop-workspace-clippy] | | cannot infer type of the type parameter `B` declared on the method `collect`
  565. 400.15 s [gammaloop-workspace-clippy] | type must be known at this point
  566. 400.15 s [gammaloop-workspace-clippy] |
  567. 400.15 s [gammaloop-workspace-clippy] = note: multiple `impl`s satisfying `std::collections::BTreeSet<usize>: std::cmp::PartialEq<_>` found in the following crates: `alloc`, `rkyv`:
  568. 400.15 s [gammaloop-workspace-clippy] - impl<K, AK> std::cmp::PartialEq<rkyv::collections::btree_set::ArchivedBTreeSet<AK>> for std::collections::BTreeSet<K>
  569. 400.15 s [gammaloop-workspace-clippy] where AK: std::cmp::PartialEq<K>;
  570. 400.15 s [gammaloop-workspace-clippy] - impl<T, A> std::cmp::PartialEq for std::collections::BTreeSet<T, A>
  571. 400.15 s [gammaloop-workspace-clippy] where T: std::cmp::PartialEq, A: std::alloc::Allocator, A: std::clone::Clone;
  572. 400.15 s [gammaloop-workspace-clippy] help: consider specifying the generic argument
  573. 400.15 s [gammaloop-workspace-clippy] |
  574. 400.15 s [gammaloop-workspace-clippy] 4098 | assert_eq!(orders, [1, 2].into_iter().collect::<Vec<_>>());
  575. 400.15 s [gammaloop-workspace-clippy] | ++++++++++
  576. 400.15 s [gammaloop-workspace-clippy]
  577. 400.29 s [gammaloop-workspace-clippy] error[E0283]: type annotations needed
  578. 400.29 s [gammaloop-workspace-clippy] --> crates/gammalooprs/src/processes/amplitude.rs:4129:48
  579. 400.29 s [gammaloop-workspace-clippy] |
  580. 400.29 s [gammaloop-workspace-clippy] 4123 | / assert_eq!(
  581. 400.29 s [gammaloop-workspace-clippy] 4124 | | evaluator
  582. 400.29 s [gammaloop-workspace-clippy] 4125 | | .evaluator_stacks
  583. 400.29 s [gammaloop-workspace-clippy] 4126 | | .keys()
  584. 400.29 s [gammaloop-workspace-clippy] ... |
  585. 400.29 s [gammaloop-workspace-clippy] 4129 | | [1, 2].into_iter().collect()
  586. 400.29 s [gammaloop-workspace-clippy] | | ^^^^^^^ cannot infer type of the type parameter `B` declared on the method `collect`
  587. 400.29 s [gammaloop-workspace-clippy] 4130 | | );
  588. 400.29 s [gammaloop-workspace-clippy] | |_________________________- type must be known at this point
  589. 400.29 s [gammaloop-workspace-clippy] |
  590. 400.29 s [gammaloop-workspace-clippy] = note: multiple `impl`s satisfying `std::collections::BTreeSet<usize>: std::cmp::PartialEq<_>` found in the following crates: `alloc`, `rkyv`:
  591. 400.29 s [gammaloop-workspace-clippy] - impl<K, AK> std::cmp::PartialEq<rkyv::collections::btree_set::ArchivedBTreeSet<AK>> for std::collections::BTreeSet<K>
  592. 400.29 s [gammaloop-workspace-clippy] where AK: std::cmp::PartialEq<K>;
  593. 400.29 s [gammaloop-workspace-clippy] - impl<T, A> std::cmp::PartialEq for std::collections::BTreeSet<T, A>
  594. 400.29 s [gammaloop-workspace-clippy] where T: std::cmp::PartialEq, A: std::alloc::Allocator, A: std::clone::Clone;
  595. 400.29 s [gammaloop-workspace-clippy] help: consider specifying the generic argument
  596. 400.29 s [gammaloop-workspace-clippy] |
  597. 400.29 s [gammaloop-workspace-clippy] 4129 | [1, 2].into_iter().collect::<Vec<_>>()
  598. 400.29 s [gammaloop-workspace-clippy] | ++++++++++
  599. 400.29 s [gammaloop-workspace-clippy]
  600. 400.33 s [gammaloop-workspace-clippy] error[E0283]: type annotations needed
  601. 400.33 s [gammaloop-workspace-clippy] --> crates/gammalooprs/src/processes/amplitude.rs:4160:30
  602. 400.33 s [gammaloop-workspace-clippy] |
  603. 400.33 s [gammaloop-workspace-clippy] 4148 | / assert_eq!(
  604. 400.33 s [gammaloop-workspace-clippy] 4149 | | registry
  605. 400.33 s [gammaloop-workspace-clippy] 4150 | | .components
  606. 400.33 s [gammaloop-workspace-clippy] 4151 | | .iter()
  607. 400.33 s [gammaloop-workspace-clippy] ... |
  608. 400.33 s [gammaloop-workspace-clippy] 4160 | | .collect()
  609. 400.33 s [gammaloop-workspace-clippy] | | ^^^^^^^ cannot infer type of the type parameter `B` declared on the method `collect`
  610. 400.33 s [gammaloop-workspace-clippy] 4161 | | );
  611. 400.33 s [gammaloop-workspace-clippy] | |_________________________- type must be known at this point
  612. 400.33 s [gammaloop-workspace-clippy] |
  613. 400.33 s [gammaloop-workspace-clippy] = note: multiple `impl`s satisfying `std::collections::BTreeSet<processes::threshold_counterterms::ThresholdCountertermComponentKind>: std::cmp::PartialEq<_>` found in the following crates: `alloc`, `rkyv`:
  614. 400.33 s [gammaloop-workspace-clippy] - impl<K, AK> std::cmp::PartialEq<rkyv::collections::btree_set::ArchivedBTreeSet<AK>> for std::collections::BTreeSet<K>
  615. 400.33 s [gammaloop-workspace-clippy] where AK: std::cmp::PartialEq<K>;
  616. 400.33 s [gammaloop-workspace-clippy] - impl<T, A> std::cmp::PartialEq for std::collections::BTreeSet<T, A>
  617. 400.33 s [gammaloop-workspace-clippy] where T: std::cmp::PartialEq, A: std::alloc::Allocator, A: std::clone::Clone;
  618. 400.33 s [gammaloop-workspace-clippy] help: consider specifying the generic argument
  619. 400.33 s [gammaloop-workspace-clippy] |
  620. 400.33 s [gammaloop-workspace-clippy] 4160 | .collect::<Vec<_>>()
  621. 400.33 s [gammaloop-workspace-clippy] | ++++++++++
  622. 400.33 s [gammaloop-workspace-clippy]
  623. 400.36 s [gammaloop-workspace-clippy] error[E0283]: type annotations needed
  624. 400.36 s [gammaloop-workspace-clippy] --> crates/gammalooprs/src/processes/amplitude.rs:4214:26
  625. 400.36 s [gammaloop-workspace-clippy] |
  626. 400.36 s [gammaloop-workspace-clippy] 4201 | / assert_eq!(
  627. 400.36 s [gammaloop-workspace-clippy] 4202 | | decomposition
  628. 400.36 s [gammaloop-workspace-clippy] 4203 | | .components
  629. 400.36 s [gammaloop-workspace-clippy] 4204 | | .iter()
  630. 400.36 s [gammaloop-workspace-clippy] ... |
  631. 400.36 s [gammaloop-workspace-clippy] 4214 | | .collect()
  632. 400.36 s [gammaloop-workspace-clippy] | | ^^^^^^^ cannot infer type of the type parameter `B` declared on the method `collect`
  633. 400.36 s [gammaloop-workspace-clippy] 4215 | | );
  634. 400.36 s [gammaloop-workspace-clippy] | |_____________________- type must be known at this point
  635. 400.36 s [gammaloop-workspace-clippy] |
  636. 400.36 s [gammaloop-workspace-clippy] = note: multiple `impl`s satisfying `std::collections::BTreeSet<processes::threshold_counterterms::ThresholdCountertermComponentKind>: std::cmp::PartialEq<_>` found in the following crates: `alloc`, `rkyv`:
  637. 400.37 s [gammaloop-workspace-clippy] - impl<K, AK> std::cmp::PartialEq<rkyv::collections::btree_set::ArchivedBTreeSet<AK>> for std::collections::BTreeSet<K>
  638. 400.37 s [gammaloop-workspace-clippy] where AK: std::cmp::PartialEq<K>;
  639. 400.37 s [gammaloop-workspace-clippy] - impl<T, A> std::cmp::PartialEq for std::collections::BTreeSet<T, A>
  640. 400.37 s [gammaloop-workspace-clippy] where T: std::cmp::PartialEq, A: std::alloc::Allocator, A: std::clone::Clone;
  641. 400.37 s [gammaloop-workspace-clippy] help: consider specifying the generic argument
  642. 400.37 s [gammaloop-workspace-clippy] |
  643. 400.37 s [gammaloop-workspace-clippy] 4214 | .collect::<Vec<_>>()
  644. 400.37 s [gammaloop-workspace-clippy] | ++++++++++
  645. 400.37 s [gammaloop-workspace-clippy]
  646. 400.54 s [gammaloop-workspace-clippy] error[E0277]: can't compare `std::option::Option<&[linnet::half_edge::involution::EdgeIndex]>` with `std::option::Option<&[linnet::half_edge::involution::EdgeIndex; 1]>`
  647. 400.54 s [gammaloop-workspace-clippy] --> crates/gammalooprs/src/processes/cross_section/ir_safe_threshold_fixture_tests.rs:817:25
  648. 400.54 s [gammaloop-workspace-clippy] |
  649. 400.54 s [gammaloop-workspace-clippy] 816 | .any(|variant| variant.requested_subspace.as_deref()
  650. 400.54 s [gammaloop-workspace-clippy] | -------------------------------------
  651. 400.54 s [gammaloop-workspace-clippy] 817 | == Some(&[EdgeIndex::from(3)])),
  652. 400.54 s [gammaloop-workspace-clippy] | ^^ ---------------------------
  653. 400.54 s [gammaloop-workspace-clippy] | |
  654. 400.54 s [gammaloop-workspace-clippy] | no implementation for `std::option::Option<&[linnet::half_edge::involution::EdgeIndex]> == std::option::Option<&[linnet::half_edge::involution::EdgeIndex; 1]>`
  655. 400.54 s [gammaloop-workspace-clippy] |
  656. 400.54 s [gammaloop-workspace-clippy] = help: the trait `std::cmp::PartialEq<std::option::Option<&[linnet::half_edge::involution::EdgeIndex; 1]>>` is not implemented for `std::option::Option<&[linnet::half_edge::involution::EdgeIndex]>`
  657. 400.54 s [gammaloop-workspace-clippy] help: the following other types implement trait `std::cmp::PartialEq<Rhs>`
  658. 400.54 s [gammaloop-workspace-clippy] --> /rustc/2d8144b7880597b6e6d3dfd63a9a9efae3f533d3/library/core/src/option.rs:2434:0
  659. 400.54 s [gammaloop-workspace-clippy] |
  660. 400.54 s [gammaloop-workspace-clippy] = note: `std::option::Option<T>` implements `std::cmp::PartialEq`
  661. 400.54 s [gammaloop-workspace-clippy] |
  662. 400.54 s [gammaloop-workspace-clippy] ::: /nix/store/8zq9ya5slh345hbylmsibxw827bi98w0-vendor-cargo-deps/c19b7c6f923b580ac259164a89f2577984ad5ab09ee9d583b888f934adbbe8d0/rkyv-0.7.46/src/option.rs:210:1
  663. 400.54 s [gammaloop-workspace-clippy] |
  664. 400.54 s [gammaloop-workspace-clippy] 210 | impl<T: PartialEq<U>, U> PartialEq<ArchivedOption<T>> for Option<U> {
  665. 400.54 s [gammaloop-workspace-clippy] | ^^^^^^^^^^^^^^^^^^^^^^^^^^^^^^^^^^^^^^^^^^^^^^^^^^^^^^^^^^^^^^^^^^^ `std::option::Option<U>` implements `std::cmp::PartialEq<rkyv::option::ArchivedOption<T>>`
  666. 400.54 s [gammaloop-workspace-clippy] |
  667. 400.54 s [gammaloop-workspace-clippy] ::: /nix/store/8zq9ya5slh345hbylmsibxw827bi98w0-vendor-cargo-deps/c19b7c6f923b580ac259164a89f2577984ad5ab09ee9d583b888f934adbbe8d0/rkyv-0.7.46/src/impls/alloc/niche.rs:24:1
  668. 400.54 s [gammaloop-workspace-clippy] |
  669. 400.54 s [gammaloop-workspace-clippy] 24 | / impl<T, U> PartialEq<ArchivedOptionBox<T>> for Option<Box<U>>
  670. 400.54 s [gammaloop-workspace-clippy] 25 | | where
  671. 400.54 s [gammaloop-workspace-clippy] 26 | | T: ArchivePointee + PartialEq<U> + ?Sized,
  672. 400.54 s [gammaloop-workspace-clippy] 27 | | U: ?Sized,
  673. 400.54 s [gammaloop-workspace-clippy] | |______________^ `std::option::Option<std::boxed::Box<U>>` implements `std::cmp::PartialEq<rkyv::niche::option_box::ArchivedOptionBox<T>>`
  674. 400.54 s [gammaloop-workspace-clippy]
  675. 401.32 s [gammaloop-workspace-clippy] error[E0283]: type annotations needed
  676. 401.32 s [gammaloop-workspace-clippy] --> crates/gammalooprs/src/processes/no_directive_equivalence_tests.rs:459:43
  677. 401.32 s [gammaloop-workspace-clippy] |
  678. 401.32 s [gammaloop-workspace-clippy] 459 | (0..graph.cuts.len()).collect(),
  679. 401.32 s [gammaloop-workspace-clippy] | ^^^^^^^ cannot infer type of the type parameter `B` declared on the method `collect`
  680. 401.32 s [gammaloop-workspace-clippy] |
  681. 401.32 s [gammaloop-workspace-clippy] = note: multiple `impl`s satisfying `_: std::iter::FromIterator<usize>` found in the following crates: `spenso`, `tabled`:
  682. 401.32 s [gammaloop-workspace-clippy] - impl std::iter::FromIterator<usize> for spenso::structure::concrete_index::ExpandedIndex;
  683. 401.32 s [gammaloop-workspace-clippy] - impl std::iter::FromIterator<usize> for tabled::settings::height::HeightList;
  684. 401.32 s [gammaloop-workspace-clippy] - impl std::iter::FromIterator<usize> for tabled::settings::width::WidthList;
  685. 401.32 s [gammaloop-workspace-clippy] note: required by a bound in `std::iter::Iterator::collect`
  686. 401.32 s [gammaloop-workspace-clippy] --> /rustc/2d8144b7880597b6e6d3dfd63a9a9efae3f533d3/library/core/src/iter/traits/iterator.rs:2077:4
  687. 401.32 s [gammaloop-workspace-clippy] help: consider specifying the generic argument
  688. 401.32 s [gammaloop-workspace-clippy] |
  689. 401.32 s [gammaloop-workspace-clippy] 459 | (0..graph.cuts.len()).collect::<Vec<_>>(),
  690. 401.32 s [gammaloop-workspace-clippy] | ++++++++++
  691. 401.32 s [gammaloop-workspace-clippy]
  692. 401.32 s [gammaloop-workspace-clippy] error[E0283]: type annotations needed
  693. 401.32 s [gammaloop-workspace-clippy] --> crates/gammalooprs/src/processes/no_directive_equivalence_tests.rs:459:43
  694. 401.32 s [gammaloop-workspace-clippy] |
  695. 401.32 s [gammaloop-workspace-clippy] 457 | / assert_eq!(
  696. 401.32 s [gammaloop-workspace-clippy] 458 | | grouped_cut_ids,
  697. 401.32 s [gammaloop-workspace-clippy] 459 | | (0..graph.cuts.len()).collect(),
  698. 401.32 s [gammaloop-workspace-clippy] | | ^^^^^^^ cannot infer type of the type parameter `B` declared on the method `collect`
  699. 401.32 s [gammaloop-workspace-clippy] 460 | | "every discovered process-valid cut must remain in the numerical LU evaluation",
  700. 401.32 s [gammaloop-workspace-clippy] 461 | | );
  701. 401.32 s [gammaloop-workspace-clippy] | |_________________- type must be known at this point
  702. 401.32 s [gammaloop-workspace-clippy] |
  703. 401.32 s [gammaloop-workspace-clippy] = note: multiple `impl`s satisfying `std::collections::BTreeSet<usize>: std::cmp::PartialEq<_>` found in the following crates: `alloc`, `rkyv`:
  704. 401.32 s [gammaloop-workspace-clippy] - impl<K, AK> std::cmp::PartialEq<rkyv::collections::btree_set::ArchivedBTreeSet<AK>> for std::collections::BTreeSet<K>
  705. 401.32 s [gammaloop-workspace-clippy] where AK: std::cmp::PartialEq<K>;
  706. 401.32 s [gammaloop-workspace-clippy] - impl<T, A> std::cmp::PartialEq for std::collections::BTreeSet<T, A>
  707. 401.32 s [gammaloop-workspace-clippy] where T: std::cmp::PartialEq, A: std::alloc::Allocator, A: std::clone::Clone;
  708. 401.32 s [gammaloop-workspace-clippy] help: consider specifying the generic argument
  709. 401.32 s [gammaloop-workspace-clippy] |
  710. 401.32 s [gammaloop-workspace-clippy] 459 | (0..graph.cuts.len()).collect::<Vec<_>>(),
  711. 401.32 s [gammaloop-workspace-clippy] | ++++++++++
  712. 401.32 s [gammaloop-workspace-clippy]
  713. 401.36 s [gammaloop-workspace-clippy] error[E0283]: type annotations needed
  714. 401.36 s [gammaloop-workspace-clippy] --> crates/gammalooprs/src/processes/raised_cross_section_tests.rs:150:31
  715. 401.36 s [gammaloop-workspace-clippy] |
  716. 401.36 s [gammaloop-workspace-clippy] 150 | (0..graph.cuts.len()).collect(),
  717. 401.36 s [gammaloop-workspace-clippy] | ^^^^^^^ cannot infer type of the type parameter `B` declared on the method `collect`
  718. 401.36 s [gammaloop-workspace-clippy] |
  719. 401.36 s [gammaloop-workspace-clippy] = note: multiple `impl`s satisfying `_: std::iter::FromIterator<usize>` found in the following crates: `spenso`, `tabled`:
  720. 401.36 s [gammaloop-workspace-clippy] - impl std::iter::FromIterator<usize> for spenso::structure::concrete_index::ExpandedIndex;
  721. 401.36 s [gammaloop-workspace-clippy] - impl std::iter::FromIterator<usize> for tabled::settings::height::HeightList;
  722. 401.36 s [gammaloop-workspace-clippy] - impl std::iter::FromIterator<usize> for tabled::settings::width::WidthList;
  723. 401.36 s [gammaloop-workspace-clippy] note: required by a bound in `std::iter::Iterator::collect`
  724. 401.36 s [gammaloop-workspace-clippy] --> /rustc/2d8144b7880597b6e6d3dfd63a9a9efae3f533d3/library/core/src/iter/traits/iterator.rs:2077:4
  725. 401.36 s [gammaloop-workspace-clippy] help: consider specifying the generic argument
  726. 401.36 s [gammaloop-workspace-clippy] |
  727. 401.36 s [gammaloop-workspace-clippy] 150 | (0..graph.cuts.len()).collect::<Vec<_>>(),
  728. 401.36 s [gammaloop-workspace-clippy] | ++++++++++
  729. 401.36 s [gammaloop-workspace-clippy]
  730. 401.37 s [gammaloop-workspace-clippy] error[E0283]: type annotations needed
  731. 401.37 s [gammaloop-workspace-clippy] --> crates/gammalooprs/src/processes/raised_cross_section_tests.rs:150:31
  732. 401.37 s [gammaloop-workspace-clippy] |
  733. 401.37 s [gammaloop-workspace-clippy] 148 | / assert_eq!(
  734. 401.37 s [gammaloop-workspace-clippy] 149 | | grouped_cut_ids,
  735. 401.37 s [gammaloop-workspace-clippy] 150 | | (0..graph.cuts.len()).collect(),
  736. 401.37 s [gammaloop-workspace-clippy] | | ^^^^^^^ cannot infer type of the type parameter `B` declared on the method `collect`
  737. 401.37 s [gammaloop-workspace-clippy] 151 | | "every discovered process-valid cut must remain in the numerical LU evaluation",
  738. 401.37 s [gammaloop-workspace-clippy] 152 | | );
  739. 401.37 s [gammaloop-workspace-clippy] | |_____- type must be known at this point
  740. 401.37 s [gammaloop-workspace-clippy] |
  741. 401.37 s [gammaloop-workspace-clippy] = note: multiple `impl`s satisfying `std::collections::BTreeSet<usize>: std::cmp::PartialEq<_>` found in the following crates: `alloc`, `rkyv`:
  742. 401.37 s [gammaloop-workspace-clippy] - impl<K, AK> std::cmp::PartialEq<rkyv::collections::btree_set::ArchivedBTreeSet<AK>> for std::collections::BTreeSet<K>
  743. 401.37 s [gammaloop-workspace-clippy] where AK: std::cmp::PartialEq<K>;
  744. 401.37 s [gammaloop-workspace-clippy] - impl<T, A> std::cmp::PartialEq for std::collections::BTreeSet<T, A>
  745. 401.37 s [gammaloop-workspace-clippy] where T: std::cmp::PartialEq, A: std::alloc::Allocator, A: std::clone::Clone;
  746. 401.37 s [gammaloop-workspace-clippy] help: consider specifying the generic argument
  747. 401.37 s [gammaloop-workspace-clippy] |
  748. 401.37 s [gammaloop-workspace-clippy] 150 | (0..graph.cuts.len()).collect::<Vec<_>>(),
  749. 401.37 s [gammaloop-workspace-clippy] | ++++++++++
  750. 401.37 s [gammaloop-workspace-clippy]
  751. 407.07 s [gammaloop-workspace-clippy] error: method `lu_prefactor_helper` is never used
  752. 407.07 s [gammaloop-workspace-clippy] --> crates/gammalooprs/src/processes/cross_section.rs:1965:8
  753. 407.07 s [gammaloop-workspace-clippy] |
  754. 407.07 s [gammaloop-workspace-clippy] 1429 | impl CrossSectionGraph {
  755. 407.07 s [gammaloop-workspace-clippy] | ---------------------- method in this implementation
  756. 407.07 s [gammaloop-workspace-clippy] ...
  757. 407.07 s [gammaloop-workspace-clippy] 1965 | fn lu_prefactor_helper(&self) -> Atom {
  758. 407.07 s [gammaloop-workspace-clippy] | ^^^^^^^^^^^^^^^^^^^
  759. 407.07 s [gammaloop-workspace-clippy] |
  760. 407.07 s [gammaloop-workspace-clippy] = note: `-D dead-code` implied by `-D warnings`
  761. 407.07 s [gammaloop-workspace-clippy] = help: to override `-D warnings` add `#[expect(dead_code)]` or `#[allow(dead_code)]`
  762. 407.07 s [gammaloop-workspace-clippy]
  763. 412.77 s [gammaloop-workspace-clippy] error: this `if` statement can be collapsed
  764. 412.77 s [gammaloop-workspace-clippy] --> crates/gammalooprs/src/subtraction/amplitude_counterterm.rs:938:17
  765. 412.77 s [gammaloop-workspace-clippy] |
  766. 412.77 s [gammaloop-workspace-clippy] 938 | / if let Some(group_id) = metadata.group_id {
  767. 412.77 s [gammaloop-workspace-clippy] 939 | | if let Some((_, members)) = groups.iter().find(|(id, _)| *id == Some(group_id))
  768. 412.77 s [gammaloop-workspace-clippy] 940 | | {
  769. 412.77 s [gammaloop-workspace-clippy] 941 | | let first = members[0];
  770. 412.77 s [gammaloop-workspace-clippy] ... |
  771. 412.77 s [gammaloop-workspace-clippy] 956 | | }
  772. 412.77 s [gammaloop-workspace-clippy] | |_________________^
  773. 412.77 s [gammaloop-workspace-clippy] |
  774. 412.77 s [gammaloop-workspace-clippy] = help: for further information visit https://rust-lang.github.io/rust-clippy/rust-1.97.0/index.html#collapsible_if
  775. 412.77 s [gammaloop-workspace-clippy] = note: `-D clippy::collapsible-if` implied by `-D warnings`
  776. 412.77 s [gammaloop-workspace-clippy] = help: to override `-D warnings` add `#[allow(clippy::collapsible_if)]`
  777. 412.77 s [gammaloop-workspace-clippy] help: collapse nested if block
  778. 412.77 s [gammaloop-workspace-clippy] |
  779. 412.77 s [gammaloop-workspace-clippy] 938 ~ if let Some(group_id) = metadata.group_id
  780. 412.77 s [gammaloop-workspace-clippy] 939 ~ && let Some((_, members)) = groups.iter().find(|(id, _)| *id == Some(group_id))
  781. 412.77 s [gammaloop-workspace-clippy] 940 | {
  782. 412.77 s [gammaloop-workspace-clippy] ...
  783. 412.77 s [gammaloop-workspace-clippy] 954 | ));
  784. 412.77 s [gammaloop-workspace-clippy] 955 ~ }
  785. 412.77 s [gammaloop-workspace-clippy] |
  786. 412.77 s [gammaloop-workspace-clippy]
  787. 412.77 s [gammaloop-workspace-clippy] error: this function has too many arguments (13/7)
  788. 412.77 s [gammaloop-workspace-clippy] --> crates/gammalooprs/src/subtraction/amplitude_counterterm.rs:994:5
  789. 412.77 s [gammaloop-workspace-clippy] |
  790. 412.77 s [gammaloop-workspace-clippy] 994 | / fn evaluate_variant_group<T: FloatLike>(
  791. 412.77 s [gammaloop-workspace-clippy] 995 | | &mut self,
  792. 412.77 s [gammaloop-workspace-clippy] 996 | | momentum_sample: &MomentumSample<T>,
  793. 412.77 s [gammaloop-workspace-clippy] 997 | | graph: &Graph,
  794. 412.77 s [gammaloop-workspace-clippy] ... |
  795. 412.77 s [gammaloop-workspace-clippy] 1007 | | allowed_variant_ids: Option<&[ThresholdCountertermVariantId]>,
  796. 412.77 s [gammaloop-workspace-clippy] 1008 | | ) -> Result<AmplitudeCountertermEvaluation<T>> {
  797. 412.77 s [gammaloop-workspace-clippy] | |__________________________________________________^
  798. 412.77 s [gammaloop-workspace-clippy] |
  799. 412.77 s [gammaloop-workspace-clippy] = help: for further information visit https://rust-lang.github.io/rust-clippy/rust-1.97.0/index.html#too_many_arguments
  800. 412.77 s [gammaloop-workspace-clippy] = note: `-D clippy::too-many-arguments` implied by `-D warnings`
  801. 412.77 s [gammaloop-workspace-clippy] = help: to override `-D warnings` add `#[allow(clippy::too_many_arguments)]`
  802. 412.77 s [gammaloop-workspace-clippy]
  803. 412.78 s [gammaloop-workspace-clippy] error: this `if` statement can be collapsed
  804. 412.78 s [gammaloop-workspace-clippy] --> crates/gammalooprs/src/subtraction/amplitude_counterterm.rs:1359:17
  805. 412.78 s [gammaloop-workspace-clippy] |
  806. 412.78 s [gammaloop-workspace-clippy] 1359 | / if let Some(group_id) = metadata.group_id {
  807. 412.78 s [gammaloop-workspace-clippy] 1360 | | if let Some((_, _, members)) =
  808. 412.78 s [gammaloop-workspace-clippy] 1361 | | groups.iter().find(|(id, _, _)| *id == Some(group_id))
  809. 412.78 s [gammaloop-workspace-clippy] ... |
  810. 412.78 s [gammaloop-workspace-clippy] 1378 | | }
  811. 412.78 s [gammaloop-workspace-clippy] | |_________________^
  812. 412.78 s [gammaloop-workspace-clippy] |
  813. 412.78 s [gammaloop-workspace-clippy] = help: for further information visit https://rust-lang.github.io/rust-clippy/rust-1.97.0/index.html#collapsible_if
  814. 412.78 s [gammaloop-workspace-clippy] help: collapse nested if block
  815. 412.78 s [gammaloop-workspace-clippy] |
  816. 412.78 s [gammaloop-workspace-clippy] 1359 ~ if let Some(group_id) = metadata.group_id
  817. 412.78 s [gammaloop-workspace-clippy] 1360 ~ && let Some((_, _, members)) =
  818. 412.78 s [gammaloop-workspace-clippy] 1361 | groups.iter().find(|(id, _, _)| *id == Some(group_id))
  819. 412.78 s [gammaloop-workspace-clippy] ...
  820. 412.78 s [gammaloop-workspace-clippy] 1376 | ));
  821. 412.78 s [gammaloop-workspace-clippy] 1377 ~ }
  822. 412.78 s [gammaloop-workspace-clippy] |
  823. 412.78 s [gammaloop-workspace-clippy]
  824. 412.92 s [gammaloop-workspace-clippy] error: this function has too many arguments (8/7)
  825. 412.92 s [gammaloop-workspace-clippy] --> crates/gammalooprs/src/subtraction/lu_counterterm.rs:1197:5
  826. 412.92 s [gammaloop-workspace-clippy] |
  827. 412.92 s [gammaloop-workspace-clippy] 1197 | / pub fn from_atoms(
  828. 412.92 s [gammaloop-workspace-clippy] 1198 | | counterterm_data: &LUCounterTermData,
  829. 412.92 s [gammaloop-workspace-clippy] 1199 | | max_cut_order: usize,
  830. 412.92 s [gammaloop-workspace-clippy] 1200 | | threshold_helpers: LUThresholdHelperEvaluators,
  831. 412.92 s [gammaloop-workspace-clippy] ... |
  832. 412.92 s [gammaloop-workspace-clippy] 1205 | | production_orientation_ids: &[OrientationID],
  833. 412.92 s [gammaloop-workspace-clippy] 1206 | | ) -> (Self, EvaluatorBuildTimings) {
  834. 412.92 s [gammaloop-workspace-clippy] | |______________________________________^
  835. 412.92 s [gammaloop-workspace-clippy] |
  836. 412.92 s [gammaloop-workspace-clippy] = help: for further information visit https://rust-lang.github.io/rust-clippy/rust-1.97.0/index.html#too_many_arguments
  837. 412.92 s [gammaloop-workspace-clippy]
  838. 415.93 s [gammaloop-workspace-clippy] error: could not compile `gammalooprs` (lib) due to 5 previous errors
  839. 415.93 s [gammaloop-workspace-clippy] warning: build failed, waiting for other jobs to finish...
  840. 419.63 s [gammaloop-workspace-clippy] Some errors have detailed explanations: E0277, E0283.
  841. 419.63 s [gammaloop-workspace-clippy] For more information about an error, try `rustc --explain E0277`.
  842. 419.85 s [gammaloop-workspace-clippy] error: could not compile `gammalooprs` (lib test) due to 16 previous errors
  843. 420.45 s Progress: 0 of 1 built (1 failed)
  844. 420.45 s Failed to build gammaloop-workspace-clippy after 6m55s
  845. 420.50 s Cannot build '/nix/store/bfvd4racaxf8cd9mpzlpz54h91n6g02c-gammaloop-workspace-clippy-0.1.0.drv'.
  846. 420.50 s Reason: builder failed with exit code 101.
  847. 420.50 s Output paths:
  848. 420.50 s /nix/store/q9icfkcxyilyy0y4bfigad3kv8g0svbq-gammaloop-workspace-clippy-0.1.0
  849. 420.50 s Last 839 log lines:
  850. 420.50 s > Running phase: unpackPhase
  851. 420.50 s > unpacking source archive /nix/store/bcy0vqqk2ibk38nik2bb809ck03m92g2-source
  852. 420.50 s > source root is source
  853. 420.50 s > Running phase: patchPhase
  854. 420.50 s > Executing configureCargoCommonVars
  855. 420.50 s > decompressing cargo artifacts from /nix/store/wxpx6lf642pgxp2wz1pw1lxksj5p1wb0-gammaloop-workspace-deps-deps-0.1.0/target.tar.zst to target
  856. 420.50 s > Running phase: updateAutotoolsGnuConfigScriptsPhase
  857. 420.50 s > Running phase: configurePhase
  858. 420.50 s > will append /build/source/.cargo-home/config.toml with contents of /nix/store/8zq9ya5slh345hbylmsibxw827bi98w0-vendor-cargo-deps/config.toml
  859. 420.50 s > default configurePhase, nothing to do
  860. 420.50 s > Running phase: buildPhase
  861. 420.50 s > +++ command cargo --version
  862. 420.50 s > cargo 1.97.0 (c980f4866 2026-06-30)
  863. 420.50 s > +++ command cargo clippy --profile ci-optim --locked --workspace --features gammaloop-tracing-filter/clap,gammaloop-tracing-filter/symbolica,idenso/bincode,idenso/reference-cases,linnet/bincode,linnet/drawing,linnet/rkyv,linnet/serde,linnet/symbolica,spenso-macros/shadowing,spenso/shadowing,symbolica/tracing_max_level_info,three-dimensional-reps/display,three-dimensional-reps/eval,three-dimensional-reps/serde --all-targets --no-deps -- --deny warnings
  864. 420.50 s > Checking cfg-if v1.0.4
  865. 420.50 s > Checking memchr v2.8.0
  866. 420.50 s > Checking once_cell v1.21.4
  867. 420.50 s > Checking either v1.15.0
  868. 420.50 s > Checking serde_core v1.0.228
  869. 420.50 s > Checking libc v0.2.186
  870. 420.50 s > Checking libm v0.2.16
  871. 420.50 s > Checking itoa v1.0.18
  872. 420.50 s > Checking log v0.4.29
  873. 420.50 s > Checking regex-syntax v0.8.10
  874. 420.50 s > Checking zerocopy v0.8.48
  875. 420.50 s > Checking crossbeam-utils v0.8.21
  876. 420.50 s > Checking equivalent v1.0.2
  877. 420.50 s > Checking zmij v1.0.21
  878. 420.50 s > Checking bytemuck v1.25.0
  879. 420.50 s > Checking lazy_static v1.5.0
  880. 420.50 s > Compiling target-lexicon v0.13.5
  881. 420.50 s > Checking arrayvec v0.7.6
  882. 420.50 s > Checking powerfmt v0.2.0
  883. 420.50 s > Checking num-conv v0.2.1
  884. 420.50 s > Checking pin-project-lite v0.2.17
  885. 420.50 s > Checking deranged v0.5.8
  886. 420.50 s > Checking time-core v0.1.8
  887. 420.50 s > Checking num_threads v0.1.7
  888. 420.50 s > Checking tracing-core v0.1.36
  889. 420.50 s > Checking foldhash v0.2.0
  890. 420.50 s > Checking allocator-api2 v0.2.21
  891. 420.50 s > Checking const-random v0.1.18
  892. 420.50 s > Checking itertools v0.14.0
  893. 420.50 s > Checking winnow v1.0.2
  894. 420.50 s > Checking static_assertions v1.1.0
  895. 420.50 s > Checking unty v0.0.4
  896. 420.50 s > Checking nu-ansi-term v0.50.3
  897. 420.50 s > Checking sharded-slab v0.1.7
  898. 420.50 s > Checking safe_arch v0.7.4
  899. 420.50 s > Checking crossbeam-epoch v0.9.18
  900. 420.50 s > Checking hashbrown v0.16.1
  901. 420.50 s > Checking tracing v0.1.44
  902. 420.50 s > Checking tracing-log v0.2.0
  903. 420.50 s > Checking safe_arch v1.0.0
  904. 420.50 s > Checking crossbeam-deque v0.8.6
  905. 420.50 s > Checking rayon-core v1.13.0
  906. 420.50 s > Checking thread_local v1.1.9
  907. 420.50 s > Checking toml_writer v1.1.1+spec-1.1.0
  908. 420.50 s > Checking indenter v0.3.4
  909. 420.50 s > Checking aho-corasick v1.1.4
  910. 420.50 s > Checking az v1.3.0
  911. 420.50 s > Checking wide v1.3.0
  912. 420.50 s > Compiling phf_shared v0.11.3
  913. 420.50 s > Checking anyhow v1.0.102
  914. 420.50 s > Checking rawpointer v0.2.1
  915. 420.50 s > Checking wide v0.7.33
  916. 420.50 s > Checking dyn-clone v1.0.20
  917. 420.50 s > Checking alloc-no-stdlib v2.0.4
  918. 420.50 s > Checking utf8parse v0.2.2
  919. 420.50 s > Checking anstyle-parse v1.0.0
  920. 420.50 s > Checking alloc-stdlib v0.2.2
  921. 420.50 s > Checking matrixmultiply v0.3.10
  922. 420.50 s > Checking rayon v1.12.0
  923. 420.50 s > Checking is_terminal_polyfill v1.70.2
  924. 420.50 s > Checking colored v3.1.1
  925. 420.50 s > Checking serde v1.0.228
  926. 420.50 s > Checking serde_json v1.0.149
  927. 420.50 s > Checking bitflags v2.11.1
  928. 420.50 s > Checking serde_spanned v1.1.1
  929. 420.50 s > Checking toml_datetime v1.1.1+spec-1.1.0
  930. 420.50 s > Checking anstyle-query v1.1.5
  931. 420.50 s > Compiling pyo3-build-config v0.28.3
  932. 420.50 s > Checking anstyle v1.0.14
  933. 420.50 s > Checking colorchoice v1.0.5
  934. 420.50 s > Compiling phf_generator v0.11.3
  935. 420.50 s > Checking eyre v0.6.12
  936. 420.50 s > Checking anstream v1.0.0
  937. 420.50 s > Checking smallvec v1.15.1
  938. 420.50 s > Checking tracing-serde v0.2.0
  939. 420.50 s > Checking bincode v2.0.1
  940. 420.50 s > Checking unicode-width v0.2.2
  941. 420.50 s > Checking bitflags v1.3.2
  942. 420.50 s > Compiling phf_codegen v0.11.3
  943. 420.50 s > Checking brotli-decompressor v5.0.0
  944. 420.50 s > Checking inventory v0.3.24
  945. 420.50 s > Checking spec_math v0.1.6
  946. 420.50 s > Checking thiserror v2.0.18
  947. 420.50 s > Checking smartstring v1.0.1
  948. 420.50 s > Compiling getopts v0.2.24
  949. 420.50 s > Checking num-traits v0.2.19
  950. 420.50 s > Checking libloading v0.9.0
  951. 420.50 s > Checking tinyjson v2.5.1
  952. 420.50 s > Checking bytes v1.11.1
  953. 420.50 s > Checking toml_parser v1.1.2+spec-1.1.0
  954. 420.50 s > Checking append-only-vec v0.1.8
  955. 420.50 s > Checking byteorder v1.5.0
  956. 420.50 s > Checking toml v1.1.2+spec-1.1.0
  957. 420.50 s > Checking brotli v8.0.2
  958. 420.50 s > Checking num-complex v0.4.6
  959. 420.50 s > Checking approx v0.5.1
  960. 420.50 s > Checking num-integer v0.1.46
  961. 420.50 s > Checking self_cell v1.2.2
  962. 420.50 s > Compiling unicode_names2_generator v1.3.0
  963. 420.50 s > Checking simba v0.9.1
  964. 420.50 s > Checking regex-automata v0.4.14
  965. 420.50 s > Compiling unic-common v0.9.0
  966. 420.50 s > Checking linux-raw-sys v0.12.1
  967. 420.50 s > Compiling unic-char-range v0.9.0
  968. 420.50 s > Compiling is-macro v0.3.7
  969. 420.50 s > Compiling unic-char-property v0.9.0
  970. 420.50 s > Compiling unic-ucd-version v0.9.0
  971. 420.50 s > Compiling rustpython-parser-vendored v0.4.0
  972. 420.50 s > Checking iana-time-zone v0.1.65
  973. 420.50 s > Checking rustix v1.1.4
  974. 420.50 s > Checking chrono v0.4.44
  975. 420.50 s > Compiling rustpython-parser v0.4.0
  976. 420.50 s > Compiling phf v0.11.3
  977. 420.50 s > Checking getrandom v0.3.4
  978. 420.50 s > Checking rand_core v0.9.5
  979. 420.50 s > Checking time v0.3.47
  980. 420.50 s > Checking gmp-mpfr-sys v1.7.1
  981. 420.50 s > Checking hugepage-rs v0.1.1
  982. 420.50 s > Checking wasmtime-jit-icache-coherence v34.0.2
  983. 420.50 s > Checking region v3.0.2
  984. 420.50 s > Checking rustc-hash v2.1.2
  985. 420.50 s > Compiling unic-ucd-ident v0.9.0
  986. 420.50 s > Compiling unic-emoji-char v0.9.0
  987. 420.50 s > Checking ndarray v0.17.2
  988. 420.50 s > Compiling lalrpop-util v0.20.2
  989. 420.50 s > Compiling rustc-hash v1.1.0
  990. 420.50 s > Checking rug v1.30.0
  991. 420.50 s > Checking unicode-segmentation v1.13.2
  992. 420.50 s > Compiling symbolica v2.2.0 (https://github.com/alphal00p/symbolica?rev=4d0a833eb8e059d1f95bdae5abed2559830b235f#4d0a833e)
  993. 420.50 s > Checking typenum v1.20.0
  994. 420.50 s > Checking getrandom v0.2.17
  995. 420.50 s > Checking scopeguard v1.2.0
  996. 420.50 s > Checking parking_lot_core v0.9.12
  997. 420.50 s > Checking lock_api v0.4.14
  998. 420.50 s > Checking hashbrown v0.17.0
  999. 420.50 s > Checking unicode-ident v1.0.24
  1000. 420.50 s > Checking parking_lot v0.12.5
  1001. 420.50 s > Checking generic-array v0.14.7
  1002. 420.50 s > Checking errno v0.3.14
  1003. 420.50 s > Checking terminal_size v0.4.4
  1004. 420.50 s > Checking strsim v0.11.1
  1005. 420.50 s > Checking clap_lex v1.1.0
  1006. 420.50 s > Checking unicase v2.9.0
  1007. 420.50 s > Checking signal-hook-registry v1.4.8
  1008. 420.50 s > Checking vte v0.14.1
  1009. 420.50 s > Checking same-file v1.0.6
  1010. 420.50 s > Checking indexmap v2.14.0
  1011. 420.50 s > Checking walkdir v2.5.0
  1012. 420.50 s > Checking clap_builder v4.6.0
  1013. 420.50 s > Checking mio v1.2.0
  1014. 420.50 s > Checking signal-hook v0.3.18
  1015. 420.50 s > Checking minimal-lexical v0.2.1
  1016. 420.50 s > Checking ciborium-io v0.2.2
  1017. 420.50 s > Checking derive_more v2.1.1
  1018. 420.50 s > Checking console v0.16.3
  1019. 420.50 s > Checking num-bigint v0.4.6
  1020. 420.50 s > Checking matchers v0.2.0
  1021. 420.50 s > Checking regex v1.12.3
  1022. 420.50 s > Checking nom v7.1.3
  1023. 420.50 s > Checking signal-hook-mio v0.2.5
  1024. 420.50 s > Checking tracing-subscriber v0.3.23
  1025. 420.50 s > Checking crypto-common v0.1.7
  1026. 420.50 s > Checking block-buffer v0.10.4
  1027. 420.50 s > Checking bstr v1.12.1
  1028. 420.50 s > Checking ppv-lite86 v0.2.21
  1029. 420.50 s > Checking ahash v0.8.12
  1030. 420.50 s > Checking half v2.7.1
  1031. 420.50 s > Checking digest v0.10.7
  1032. 420.50 s > Checking linux-raw-sys v0.4.15
  1033. 420.50 s > Checking cpufeatures v0.2.17
  1034. 420.50 s > Checking rand_chacha v0.9.0
  1035. 420.50 s > Checking winnow v0.7.15
  1036. 420.50 s > Checking ciborium-ll v0.2.2
  1037. 420.50 s > Checking rustix v0.38.44
  1038. 420.50 s > Checking clap v4.6.1
  1039. 420.50 s > Checking ciborium v0.2.2
  1040. 420.50 s > Checking sha2 v0.10.9
  1041. 420.50 s > Checking rand_core v0.6.4
  1042. 420.50 s > Checking rand v0.9.4
  1043. 420.50 s > Checking getrandom v0.4.2
  1044. 420.50 s > Checking xprec v0.2.2
  1045. 420.50 s > Checking fastrand v2.4.1
  1046. 420.50 s > Checking fnv v1.0.7
  1047. 420.50 s > Checking plotters-backend v0.3.7
  1048. 420.50 s > Checking globset v0.4.18
  1049. 420.50 s > Checking toml_datetime v0.6.11
  1050. 420.50 s > Checking serde_spanned v0.6.9
  1051. 420.50 s > Checking itertools v0.10.5
  1052. 420.50 s > Checking crossterm v0.28.1
  1053. 420.50 s > Checking symjit v2.21.0
  1054. 420.50 s > Checking tap v1.0.1
  1055. 420.50 s > Checking tempfile v3.27.0
  1056. 420.50 s > Checking cast v0.3.0
  1057. 420.50 s > Checking toml_write v0.1.2
  1058. 420.50 s > Checking wyz v0.5.1
  1059. 420.50 s > Checking plotters-svg v0.3.7
  1060. 420.50 s > Checking rand_chacha v0.3.1
  1061. 420.50 s > Checking rust-embed-utils v8.11.0
  1062. 420.50 s > Checking radium v0.7.0
  1063. 420.50 s > Checking plotters v0.3.7
  1064. 420.50 s > Compiling unicode_names2 v1.3.0
  1065. 420.50 s > Checking typeid v1.0.3
  1066. 420.50 s > Checking similar v2.7.0
  1067. 420.50 s > Checking tinytemplate v1.2.1
  1068. 420.50 s > Checking is-terminal v0.4.17
  1069. 420.50 s > Checking anes v0.1.6
  1070. 420.50 s > Checking bytecount v0.6.9
  1071. 420.50 s > Checking oorandom v11.1.5
  1072. 420.50 s > Checking toml_edit v0.22.27
  1073. 420.50 s > Checking funty v2.0.0
  1074. 420.50 s > Checking ron v0.12.1
  1075. 420.50 s > Checking ansitok v0.3.0
  1076. 420.50 s > Checking rand v0.8.6
  1077. 420.50 s > Checking env_filter v1.0.1
  1078. 420.50 s > Checking bitvec v1.0.1
  1079. 420.50 s > Checking toml_edit v0.25.11+spec-1.1.0
  1080. 420.50 s > Checking uncased v0.9.10
  1081. 420.50 s > Checking criterion-plot v0.5.0
  1082. 420.50 s > Checking jiff v0.2.24
  1083. 420.50 s > Checking ansi-str v0.9.0
  1084. 420.50 s > Checking testing_table v0.3.0
  1085. 420.50 s > Checking ptr_meta v0.1.4
  1086. 420.50 s > Checking ucd-trie v0.1.7
  1087. 420.50 s > Checking simdutf8 v0.1.5
  1088. 420.50 s > Checking pest v2.8.6
  1089. 420.50 s > Checking ahash v0.7.8
  1090. 420.50 s > Checking criterion v0.5.1
  1091. 420.50 s > Checking bytecheck v0.6.12
  1092. 420.50 s > Checking papergrid v0.17.0
  1093. 420.50 s > Checking hashbrown v0.12.3
  1094. 420.50 s > Checking approx v0.4.0
  1095. 420.50 s > Checking seahash v4.1.0
  1096. 420.50 s > Checking insta v1.47.2
  1097. 420.50 s > Checking cgmath v0.18.0
  1098. 420.50 s > Checking rend v0.4.2
  1099. 420.50 s > Checking toml v0.8.23
  1100. 420.50 s > Checking num-rational v0.4.2
  1101. 420.50 s > Compiling pyo3-macros-backend v0.28.3
  1102. 420.50 s > Compiling pyo3-ffi v0.28.3
  1103. 420.50 s > Compiling pyo3 v0.28.3
  1104. 420.50 s > Compiling numpy v0.28.0
  1105. 420.50 s > Checking tabled v0.20.0
  1106. 420.50 s > Checking figment v0.10.19
  1107. 420.50 s > Checking dot-parser v0.5.1
  1108. 420.50 s > Checking num-iter v0.1.45
  1109. 420.50 s > Checking ref-ops v0.2.5
  1110. 420.50 s > Checking num v0.4.3
  1111. 420.50 s > Checking rand_xoshiro v0.6.0
  1112. 420.50 s > Checking features v0.10.0
  1113. 420.50 s > Checking constcat v0.5.1
  1114. 420.50 s > Checking gat-lending-iterator v0.1.8
  1115. 420.50 s > Checking colored v2.2.0
  1116. 420.50 s > Checking arrayref v0.3.9
  1117. 420.50 s > Checking cpufeatures v0.3.0
  1118. 420.50 s > Checking constant_time_eq v0.4.2
  1119. 420.50 s > Checking base64 v0.22.1
  1120. 420.50 s > Checking joinery v2.1.0
  1121. 420.50 s > Checking siphasher v1.0.2
  1122. 420.50 s > Checking titlecase v2.2.1
  1123. 420.50 s > Checking subprocess v0.2.15
  1124. 420.50 s > Checking rust_lisp v0.18.0
  1125. 420.50 s > Checking blake3 v1.8.5
  1126. 420.50 s > Compiling vakint v0.1.2 (/build/source/crates/vakint)
  1127. 420.50 s > Checking version-compare v0.2.1
  1128. 420.50 s > Checking phf_shared v0.13.1
  1129. 420.50 s > Checking xpct v0.5.1
  1130. 420.50 s > Checking ryu v1.0.23
  1131. 420.50 s > Checking castaway v0.2.4
  1132. 420.50 s > Checking env_logger v0.11.10
  1133. 420.50 s > Checking toml_datetime v0.7.5+spec-1.1.0
  1134. 420.50 s > Checking strum v0.27.2
  1135. 420.50 s > Checking unicode-truncate v2.0.1
  1136. 420.50 s > Checking phf v0.13.1
  1137. 420.50 s > Checking kasuari v0.4.12
  1138. 420.50 s > Checking compact_str v0.9.0
  1139. 420.50 s > Checking lru v0.16.4
  1140. 420.50 s > Checking string-template-plus v0.4.3
  1141. 420.50 s > Checking vte v0.15.0
  1142. 420.50 s > Checking portable-atomic v1.13.1
  1143. 420.50 s > Checking toml v0.9.12+spec-1.1.0
  1144. 420.50 s > Checking unit-prefix v0.5.2
  1145. 420.50 s > Checking rand_distr v0.4.3
  1146. 420.50 s > Checking simba v0.6.0
  1147. 420.50 s > Checking vt100 v0.16.2
  1148. 420.50 s > Checking line-clipping v0.3.7
  1149. 420.50 s > Checking adler2 v2.0.1
  1150. 420.50 s > Compiling three-dimensional-reps v0.1.0 (/build/source/crates/three-dimensional-reps)
  1151. 420.50 s > Checking gimli v0.32.3
  1152. 420.50 s > Checking miniz_oxide v0.8.9
  1153. 420.50 s > Checking ratatui-core v0.1.0
  1154. 420.50 s > Checking thiserror v1.0.69
  1155. 420.50 s > Checking derive_builder v0.11.2
  1156. 420.50 s > Checking owo-colors v4.3.0
  1157. 420.50 s > Checking crossterm v0.29.0
  1158. 420.50 s > Checking object v0.37.3
  1159. 420.50 s > Checking tracing-error v0.2.1
  1160. 420.50 s > Checking typed-index-collections v3.5.0
  1161. 420.50 s > Checking amd v0.2.2
  1162. 420.50 s > Checking serde-big-array v0.5.1
  1163. 420.50 s > Checking indicatif v0.18.4
  1164. 420.50 s > Checking itertools v0.11.0
  1165. 420.50 s > Compiling gammaloop-tracing-filter-macros v0.1.0 (/build/source/crates/gammaloop-tracing-filter-macros)
  1166. 420.50 s > Checking option-ext v0.2.0
  1167. 420.50 s > Checking rkyv v0.7.46
  1168. 420.50 s > Checking rustc-demangle v0.1.27
  1169. 420.50 s > Checking dirs-sys v0.5.0
  1170. 420.50 s > Checking ref-cast v1.0.25
  1171. 420.50 s > Checking nix v0.31.2
  1172. 420.50 s > Checking integer-sqrt v0.1.5
  1173. 420.50 s > Checking brotli-decompressor v4.0.3
  1174. 420.50 s > Compiling rustpython-parser-core v0.4.0
  1175. 420.50 s > Checking crossbeam-channel v0.5.15
  1176. 420.50 s > Checking color-spantrace v0.3.0
  1177. 420.50 s > Checking itertools v0.12.1
  1178. 420.50 s > Compiling gammalooprs v0.3.4 (/build/source/crates/gammalooprs)
  1179. 420.50 s > Checking ratatui-widgets v0.3.0
  1180. 420.50 s > Checking ratatui-crossterm v0.1.0
  1181. 420.50 s > Compiling rustpython-ast v0.4.0
  1182. 420.50 s > Checking unsafe-libyaml v0.2.11
  1183. 420.50 s > Checking symlink v0.1.0
  1184. 420.50 s > Checking include_dir v0.7.4
  1185. 420.50 s > Checking tracing-appender v0.2.5
  1186. 420.50 s > Checking tracing-indicatif v0.3.14
  1187. 420.50 s > Compiling numerica v2.2.0 (https://github.com/alphal00p/symbolica?rev=4d0a833eb8e059d1f95bdae5abed2559830b235f#4d0a833e)
  1188. 420.50 s > Checking ctrlc v3.5.2
  1189. 420.50 s > Checking pathfinding v4.15.0
  1190. 420.50 s > Checking schemars v1.2.1
  1191. 420.50 s > Checking slotmap v1.1.1
  1192. 420.50 s > Checking brotli v7.0.0
  1193. 420.50 s > Checking clarabel v0.11.1
  1194. 420.50 s > Checking serde_yaml v0.9.34+deprecated
  1195. 420.50 s > Checking ratatui-macros v0.7.0
  1196. 420.50 s > Checking dirs v6.0.0
  1197. 420.50 s > Checking addr2line v0.25.1
  1198. 420.50 s > Checking ratatui v0.30.0
  1199. 420.50 s > Checking json5 v0.4.1
  1200. 420.50 s > Checking vectorize v0.2.0
  1201. 420.50 s > Checking base62 v2.2.4
  1202. 420.50 s > Checking ringbuffer v0.16.0
  1203. 420.50 s > Checking rust-embed v8.11.0
  1204. 420.50 s > Checking clap_complete v4.6.3
  1205. 420.50 s > Checking strip-ansi-escapes v0.2.1
  1206. 420.50 s > Checking fd-lock v4.0.4
  1207. 420.50 s > Compiling gammaloop-api v0.1.0 (/build/source/crates/gammaloop-api)
  1208. 420.50 s > Checking itertools v0.13.0
  1209. 420.50 s > Checking strum v0.26.3
  1210. 420.50 s > Checking sysinfo v0.33.1
  1211. 420.50 s > Checking shlex v1.3.0
  1212. 420.50 s > Checking futures-task v0.3.32
  1213. 420.50 s > Checking futures-core v0.3.32
  1214. 420.50 s > Checking clap_complete_nushell v4.6.0
  1215. 420.50 s > Checking slab v0.4.12
  1216. 420.50 s > Checking sdd v3.0.10
  1217. 420.50 s > Compiling gammaloop-integration-tests v0.1.0 (/build/source/tests)
  1218. 420.50 s > Compiling test-log-core v0.2.20
  1219. 420.50 s > Checking futures-util v0.3.32
  1220. 420.50 s > Compiling rustc_version v0.4.1
  1221. 420.50 s > Checking scc v2.4.0
  1222. 420.50 s > Checking which v8.0.2
  1223. 420.50 s > Checking bincode v1.3.3
  1224. 420.50 s > Compiling gungraun-runner v0.18.2
  1225. 420.50 s > Checking backtrace v0.3.76
  1226. 420.50 s > Checking nalgebra v0.29.0
  1227. 420.50 s > Checking proc-macro2 v1.0.106
  1228. 420.50 s > Checking color-eyre v0.6.5
  1229. 420.50 s > Compiling gungraun-macros v0.8.0
  1230. 420.50 s > Checking reedline v0.42.0
  1231. 420.50 s > Checking quote v1.0.45
  1232. 420.50 s > Checking maplit v1.0.2
  1233. 420.50 s > Checking base64 v0.21.7
  1234. 420.50 s > Compiling iai-callgrind-runner v0.14.2
  1235. 420.50 s > Checking wait-timeout v0.2.1
  1236. 420.50 s > Checking kurbo v0.13.0
  1237. 420.50 s > Checking ron v0.8.1
  1238. 420.50 s > Checking quick-error v1.2.3
  1239. 420.50 s > Compiling iai-callgrind v0.14.2
  1240. 420.50 s > Checking futures-executor v0.3.32
  1241. 420.50 s > Checking bit-vec v0.8.0
  1242. 420.50 s > Checking serial_test v3.4.0
  1243. 420.50 s > Checking rusty-fork v0.3.1
  1244. 420.50 s > Checking bit-set v0.8.0
  1245. 420.50 s > Checking syn v2.0.117
  1246. 420.50 s > Compiling test-log-macros v0.2.20
  1247. 420.50 s > Compiling iai-callgrind-macros v0.5.1
  1248. 420.50 s > Checking rand_xorshift v0.4.0
  1249. 420.50 s > Checking console v0.15.11
  1250. 420.50 s > Compiling graphica v2.1.0 (https://github.com/alphal00p/symbolica?rev=4d0a833eb8e059d1f95bdae5abed2559830b235f#4d0a833e)
  1251. 420.50 s > Checking pathdiff v0.2.3
  1252. 420.50 s > Checking unarray v0.1.4
  1253. 420.50 s > Checking similar-asserts v1.7.0
  1254. 420.50 s > Checking proptest v1.11.0
  1255. 420.50 s > Checking clinnet v0.1.8 (/build/source/crates/clinnet)
  1256. 420.50 s > Checking kurvst v0.1.0 (/build/source/crates/kurvst)
  1257. 420.50 s > Checking test-log v0.2.20
  1258. 420.50 s > Checking statrs v0.16.1
  1259. 420.50 s > Checking momtrop v0.3.0
  1260. 420.50 s > Checking gungraun v0.18.2
  1261. 420.50 s > Compiling pyo3-macros v0.28.3
  1262. 420.50 s > Compiling pyo3-stub-gen-derive v0.17.2
  1263. 420.50 s > Checking pyo3-stub-gen v0.17.2
  1264. 420.50 s > Checking symbolica-utils v0.1.0 (/build/source/crates/symbolica-utils)
  1265. 420.50 s > Checking spenso-macros v0.3.2 (/build/source/crates/spenso-macros)
  1266. 420.50 s > Compiling gammaloop-workspace-hack v0.1.0 (/build/source/crates/gammaloop-workspace-hack)
  1267. 420.50 s > Checking linnet v0.17.0 (/build/source/crates/linnet)
  1268. 420.50 s > Checking spenso v0.6.0 (/build/source/crates/spenso)
  1269. 420.50 s > Checking linnet-py v0.1.0 (/build/source/crates/linnet-py)
  1270. 420.50 s > Checking linnest v0.1.0 (/build/source/crates/linnest)
  1271. 420.50 s > Checking idenso v0.3.0 (/build/source/crates/idenso)
  1272. 420.50 s > Checking gammaloop-tracing-filter v0.1.0 (/build/source/crates/gammaloop-tracing-filter)
  1273. 420.50 s > Checking spenso-hep-lib v0.1.7 (/build/source/crates/spenso-hep-lib)
  1274. 420.50 s > Checking spynso3 v0.1.2 (/build/source/crates/spynso3)
  1275. 420.50 s > error[E0283]: type annotations needed
  1276. 420.50 s > --> crates/gammalooprs/src/momentum/sample.rs:1165:35
  1277. 420.50 s > |
  1278. 420.50 s > 1165 | requested.into_iter().collect(),
  1279. 420.50 s > | ^^^^^^^ cannot infer type of the type parameter `B` declared on the method `collect`
  1280. 420.50 s > |
  1281. 420.50 s > = note: the type must implement `std::iter::FromIterator<linnet::half_edge::involution::EdgeIndex>`
  1282. 420.50 s > note: required by a bound in `std::iter::Iterator::collect`
  1283. 420.50 s > --> /rustc/2d8144b7880597b6e6d3dfd63a9a9efae3f533d3/library/core/src/iter/traits/iterator.rs:2077:4
  1284. 420.50 s > help: consider specifying the generic argument
  1285. 420.50 s > |
  1286. 420.50 s > 1165 | requested.into_iter().collect::<Vec<_>>(),
  1287. 420.50 s > | ++++++++++
  1288. 420.50 s >
  1289. 420.50 s > error[E0283]: type annotations needed
  1290. 420.50 s > --> crates/gammalooprs/src/momentum/sample.rs:1165:35
  1291. 420.50 s > |
  1292. 420.50 s > 1161 | / assert_eq!(
  1293. 420.50 s > 1162 | | subspace
  1294. 420.50 s > 1163 | | .iter_basis_edges(&all_lmbs)
  1295. 420.50 s > 1164 | | .collect::<std::collections::BTreeSet<_>>(),
  1296. 420.50 s > 1165 | | requested.into_iter().collect(),
  1297. 420.50 s > | | ^^^^^^^ cannot infer type of the type parameter `B` declared on the method `collect`
  1298. 420.50 s > 1166 | | );
  1299. 420.50 s > | |_________- type must be known at this point
  1300. 420.50 s > |
  1301. 420.50 s > = note: multiple `impl`s satisfying `std::collections::BTreeSet<linnet::half_edge::involution::EdgeIndex>: std::cmp::PartialEq<_>` found in the following crates: `alloc`, `rkyv`:
  1302. 420.50 s > - impl<K, AK> std::cmp::PartialEq<rkyv::collections::btree_set::ArchivedBTreeSet<AK>> for std::collections::BTreeSet<K>
  1303. 420.50 s > where AK: std::cmp::PartialEq<K>;
  1304. 420.50 s > - impl<T, A> std::cmp::PartialEq for std::collections::BTreeSet<T, A>
  1305. 420.50 s > where T: std::cmp::PartialEq, A: std::alloc::Allocator, A: std::clone::Clone;
  1306. 420.50 s > help: consider specifying the generic argument
  1307. 420.50 s > |
  1308. 420.50 s > 1165 | requested.into_iter().collect::<Vec<_>>(),
  1309. 420.50 s > | ++++++++++
  1310. 420.50 s >
  1311. 420.50 s > error[E0283]: type annotations needed
  1312. 420.50 s > --> crates/gammalooprs/src/momentum/sample.rs:1182:35
  1313. 420.50 s > |
  1314. 420.50 s > 1178 | / assert_eq!(
  1315. 420.50 s > 1179 | | common_subspace
  1316. 420.50 s > 1180 | | .iter_basis_edges(&all_lmbs)
  1317. 420.50 s > 1181 | | .collect::<std::collections::BTreeSet<_>>(),
  1318. 420.50 s > 1182 | | requested.into_iter().collect(),
  1319. 420.50 s > | | ^^^^^^^ cannot infer type of the type parameter `B` declared on the method `collect`
  1320. 420.50 s > 1183 | | );
  1321. 420.50 s > | |_________- type must be known at this point
  1322. 420.50 s > |
  1323. 420.50 s > = note: multiple `impl`s satisfying `std::collections::BTreeSet<linnet::half_edge::involution::EdgeIndex>: std::cmp::PartialEq<_>` found in the following crates: `alloc`, `rkyv`:
  1324. 420.50 s > - impl<K, AK> std::cmp::PartialEq<rkyv::collections::btree_set::ArchivedBTreeSet<AK>> for std::collections::BTreeSet<K>
  1325. 420.50 s > where AK: std::cmp::PartialEq<K>;
  1326. 420.50 s > - impl<T, A> std::cmp::PartialEq for std::collections::BTreeSet<T, A>
  1327. 420.50 s > where T: std::cmp::PartialEq, A: std::alloc::Allocator, A: std::clone::Clone;
  1328. 420.50 s > help: consider specifying the generic argument
  1329. 420.50 s > |
  1330. 420.50 s > 1182 | requested.into_iter().collect::<Vec<_>>(),
  1331. 420.50 s > | ++++++++++
  1332. 420.50 s >
  1333. 420.50 s > error[E0283]: type annotations needed
  1334. 420.50 s > --> crates/gammalooprs/src/momentum/sample.rs:1203:35
  1335. 420.50 s > |
  1336. 420.50 s > 1199 | / assert_eq!(
  1337. 420.50 s > 1200 | | sparse_common_subspace
  1338. 420.50 s > 1201 | | .iter_basis_edges(&all_lmbs)
  1339. 420.50 s > 1202 | | .collect::<std::collections::BTreeSet<_>>(),
  1340. 420.50 s > 1203 | | requested.into_iter().collect(),
  1341. 420.50 s > | | ^^^^^^^ cannot infer type of the type parameter `B` declared on the method `collect`
  1342. 420.50 s > 1204 | | );
  1343. 420.50 s > | |_________- type must be known at this point
  1344. 420.50 s > |
  1345. 420.50 s > = note: multiple `impl`s satisfying `std::collections::BTreeSet<linnet::half_edge::involution::EdgeIndex>: std::cmp::PartialEq<_>` found in the following crates: `alloc`, `rkyv`:
  1346. 420.50 s > - impl<K, AK> std::cmp::PartialEq<rkyv::collections::btree_set::ArchivedBTreeSet<AK>> for std::collections::BTreeSet<K>
  1347. 420.50 s > where AK: std::cmp::PartialEq<K>;
  1348. 420.50 s > - impl<T, A> std::cmp::PartialEq for std::collections::BTreeSet<T, A>
  1349. 420.50 s > where T: std::cmp::PartialEq, A: std::alloc::Allocator, A: std::clone::Clone;
  1350. 420.50 s > help: consider specifying the generic argument
  1351. 420.50 s > |
  1352. 420.50 s > 1203 | requested.into_iter().collect::<Vec<_>>(),
  1353. 420.50 s > | ++++++++++
  1354. 420.50 s >
  1355. 420.50 s > error[E0283]: type annotations needed
  1356. 420.50 s > --> crates/gammalooprs/src/processes/amplitude.rs:3336:49
  1357. 420.50 s > |
  1358. 420.50 s > 3336 | variant_ids.iter().copied().collect(),
  1359. 420.50 s > | ^^^^^^^ cannot infer type of the type parameter `B` declared on the method `collect`
  1360. 420.50 s > |
  1361. 420.50 s > = note: the type must implement `std::iter::FromIterator<processes::threshold_counterterms::ThresholdCountertermVariantId>`
  1362. 420.50 s > note: required by a bound in `std::iter::Iterator::collect`
  1363. 420.50 s > --> /rustc/2d8144b7880597b6e6d3dfd63a9a9efae3f533d3/library/core/src/iter/traits/iterator.rs:2077:4
  1364. 420.50 s > help: consider specifying the generic argument
  1365. 420.50 s > |
  1366. 420.50 s > 3336 | variant_ids.iter().copied().collect::<Vec<_>>(),
  1367. 420.50 s > | ++++++++++
  1368. 420.50 s >
  1369. 420.50 s > error[E0283]: type annotations needed
  1370. 420.50 s > --> crates/gammalooprs/src/processes/amplitude.rs:3336:49
  1371. 420.50 s > |
  1372. 420.50 s > 3334 | / assert_eq!(
  1373. 420.50 s > 3335 | | referenced_variants,
  1374. 420.50 s > 3336 | | variant_ids.iter().copied().collect(),
  1375. 420.50 s > | | ^^^^^^^ cannot infer type of the type parameter `B` declared on the method `collect`
  1376. 420.50 s > 3337 | | "overlap groups must retain every semantic duplicate independently",
  1377. 420.50 s > 3338 | | );
  1378. 420.50 s > | |_________________- type must be known at this point
  1379. 420.50 s > |
  1380. 420.50 s > = note: multiple `impl`s satisfying `std::collections::BTreeSet<processes::threshold_counterterms::ThresholdCountertermVariantId>: std::cmp::PartialEq<_>` found in the following crates: `alloc`, `rkyv`:
  1381. 420.50 s > - impl<K, AK> std::cmp::PartialEq<rkyv::collections::btree_set::ArchivedBTreeSet<AK>> for std::collections::BTreeSet<K>
  1382. 420.50 s > where AK: std::cmp::PartialEq<K>;
  1383. 420.50 s > - impl<T, A> std::cmp::PartialEq for std::collections::BTreeSet<T, A>
  1384. 420.50 s > where T: std::cmp::PartialEq, A: std::alloc::Allocator, A: std::clone::Clone;
  1385. 420.50 s > help: consider specifying the generic argument
  1386. 420.50 s > |
  1387. 420.50 s > 3336 | variant_ids.iter().copied().collect::<Vec<_>>(),
  1388. 420.50 s > | ++++++++++
  1389. 420.50 s >
  1390. 420.50 s > error[E0283]: type annotations needed
  1391. 420.50 s > --> crates/gammalooprs/src/processes/amplitude.rs:4098:59
  1392. 420.50 s > |
  1393. 420.50 s > 4098 | assert_eq!(orders, [1, 2].into_iter().collect());
  1394. 420.50 s > | ^^^^^^^ cannot infer type of the type parameter `B` declared on the method `collect`
  1395. 420.50 s > |
  1396. 420.50 s > = note: the type must implement `std::iter::FromIterator<i32>`
  1397. 420.50 s > note: required by a bound in `std::iter::Iterator::collect`
  1398. 420.50 s > --> /rustc/2d8144b7880597b6e6d3dfd63a9a9efae3f533d3/library/core/src/iter/traits/iterator.rs:2077:4
  1399. 420.50 s > help: consider specifying the generic argument
  1400. 420.50 s > |
  1401. 420.50 s > 4098 | assert_eq!(orders, [1, 2].into_iter().collect::<Vec<_>>());
  1402. 420.50 s > | ++++++++++
  1403. 420.50 s >
  1404. 420.50 s > error[E0283]: type annotations needed
  1405. 420.50 s > --> crates/gammalooprs/src/processes/amplitude.rs:4098:59
  1406. 420.50 s > |
  1407. 420.50 s > 4098 | assert_eq!(orders, [1, 2].into_iter().collect());
  1408. 420.50 s > | --------------------------------------^^^^^^^---
  1409. 420.50 s > | | |
  1410. 420.50 s > | | cannot infer type of the type parameter `B` declared on the method `collect`
  1411. 420.50 s > | type must be known at this point
  1412. 420.50 s > |
  1413. 420.50 s > = note: multiple `impl`s satisfying `std::collections::BTreeSet<usize>: std::cmp::PartialEq<_>` found in the following crates: `alloc`, `rkyv`:
  1414. 420.50 s > - impl<K, AK> std::cmp::PartialEq<rkyv::collections::btree_set::ArchivedBTreeSet<AK>> for std::collections::BTreeSet<K>
  1415. 420.50 s > where AK: std::cmp::PartialEq<K>;
  1416. 420.50 s > - impl<T, A> std::cmp::PartialEq for std::collections::BTreeSet<T, A>
  1417. 420.50 s > where T: std::cmp::PartialEq, A: std::alloc::Allocator, A: std::clone::Clone;
  1418. 420.50 s > help: consider specifying the generic argument
  1419. 420.50 s > |
  1420. 420.50 s > 4098 | assert_eq!(orders, [1, 2].into_iter().collect::<Vec<_>>());
  1421. 420.50 s > | ++++++++++
  1422. 420.50 s >
  1423. 420.50 s > error[E0283]: type annotations needed
  1424. 420.50 s > --> crates/gammalooprs/src/processes/amplitude.rs:4129:48
  1425. 420.50 s > |
  1426. 420.50 s > 4123 | / assert_eq!(
  1427. 420.50 s > 4124 | | evaluator
  1428. 420.50 s > 4125 | | .evaluator_stacks
  1429. 420.50 s > 4126 | | .keys()
  1430. 420.50 s > ... |
  1431. 420.50 s > 4129 | | [1, 2].into_iter().collect()
  1432. 420.50 s > | | ^^^^^^^ cannot infer type of the type parameter `B` declared on the method `collect`
  1433. 420.50 s > 4130 | | );
  1434. 420.50 s > | |_________________________- type must be known at this point
  1435. 420.50 s > |
  1436. 420.50 s > = note: multiple `impl`s satisfying `std::collections::BTreeSet<usize>: std::cmp::PartialEq<_>` found in the following crates: `alloc`, `rkyv`:
  1437. 420.50 s > - impl<K, AK> std::cmp::PartialEq<rkyv::collections::btree_set::ArchivedBTreeSet<AK>> for std::collections::BTreeSet<K>
  1438. 420.50 s > where AK: std::cmp::PartialEq<K>;
  1439. 420.50 s > - impl<T, A> std::cmp::PartialEq for std::collections::BTreeSet<T, A>
  1440. 420.50 s > where T: std::cmp::PartialEq, A: std::alloc::Allocator, A: std::clone::Clone;
  1441. 420.50 s > help: consider specifying the generic argument
  1442. 420.50 s > |
  1443. 420.50 s > 4129 | [1, 2].into_iter().collect::<Vec<_>>()
  1444. 420.50 s > | ++++++++++
  1445. 420.50 s >
  1446. 420.50 s > error[E0283]: type annotations needed
  1447. 420.50 s > --> crates/gammalooprs/src/processes/amplitude.rs:4160:30
  1448. 420.50 s > |
  1449. 420.50 s > 4148 | / assert_eq!(
  1450. 420.50 s > 4149 | | registry
  1451. 420.50 s > 4150 | | .components
  1452. 420.50 s > 4151 | | .iter()
  1453. 420.50 s > ... |
  1454. 420.50 s > 4160 | | .collect()
  1455. 420.50 s > | | ^^^^^^^ cannot infer type of the type parameter `B` declared on the method `collect`
  1456. 420.50 s > 4161 | | );
  1457. 420.50 s > | |_________________________- type must be known at this point
  1458. 420.50 s > |
  1459. 420.50 s > = note: multiple `impl`s satisfying `std::collections::BTreeSet<processes::threshold_counterterms::ThresholdCountertermComponentKind>: std::cmp::PartialEq<_>` found in the following crates: `alloc`, `rkyv`:
  1460. 420.50 s > - impl<K, AK> std::cmp::PartialEq<rkyv::collections::btree_set::ArchivedBTreeSet<AK>> for std::collections::BTreeSet<K>
  1461. 420.50 s > where AK: std::cmp::PartialEq<K>;
  1462. 420.50 s > - impl<T, A> std::cmp::PartialEq for std::collections::BTreeSet<T, A>
  1463. 420.50 s > where T: std::cmp::PartialEq, A: std::alloc::Allocator, A: std::clone::Clone;
  1464. 420.50 s > help: consider specifying the generic argument
  1465. 420.50 s > |
  1466. 420.50 s > 4160 | .collect::<Vec<_>>()
  1467. 420.50 s > | ++++++++++
  1468. 420.50 s >
  1469. 420.50 s > error[E0283]: type annotations needed
  1470. 420.50 s > --> crates/gammalooprs/src/processes/amplitude.rs:4214:26
  1471. 420.50 s > |
  1472. 420.50 s > 4201 | / assert_eq!(
  1473. 420.50 s > 4202 | | decomposition
  1474. 420.50 s > 4203 | | .components
  1475. 420.50 s > 4204 | | .iter()
  1476. 420.50 s > ... |
  1477. 420.50 s > 4214 | | .collect()
  1478. 420.50 s > | | ^^^^^^^ cannot infer type of the type parameter `B` declared on the method `collect`
  1479. 420.50 s > 4215 | | );
  1480. 420.50 s > | |_____________________- type must be known at this point
  1481. 420.50 s > |
  1482. 420.50 s > = note: multiple `impl`s satisfying `std::collections::BTreeSet<processes::threshold_counterterms::ThresholdCountertermComponentKind>: std::cmp::PartialEq<_>` found in the following crates: `alloc`, `rkyv`:
  1483. 420.50 s > - impl<K, AK> std::cmp::PartialEq<rkyv::collections::btree_set::ArchivedBTreeSet<AK>> for std::collections::BTreeSet<K>
  1484. 420.50 s > where AK: std::cmp::PartialEq<K>;
  1485. 420.50 s > - impl<T, A> std::cmp::PartialEq for std::collections::BTreeSet<T, A>
  1486. 420.50 s > where T: std::cmp::PartialEq, A: std::alloc::Allocator, A: std::clone::Clone;
  1487. 420.50 s > help: consider specifying the generic argument
  1488. 420.50 s > |
  1489. 420.50 s > 4214 | .collect::<Vec<_>>()
  1490. 420.50 s > | ++++++++++
  1491. 420.50 s >
  1492. 420.50 s > error[E0277]: can't compare `std::option::Option<&[linnet::half_edge::involution::EdgeIndex]>` with `std::option::Option<&[linnet::half_edge::involution::EdgeIndex; 1]>`
  1493. 420.50 s > --> crates/gammalooprs/src/processes/cross_section/ir_safe_threshold_fixture_tests.rs:817:25
  1494. 420.50 s > |
  1495. 420.50 s > 816 | .any(|variant| variant.requested_subspace.as_deref()
  1496. 420.50 s > | -------------------------------------
  1497. 420.50 s > 817 | == Some(&[EdgeIndex::from(3)])),
  1498. 420.50 s > | ^^ ---------------------------
  1499. 420.50 s > | |
  1500. 420.50 s > | no implementation for `std::option::Option<&[linnet::half_edge::involution::EdgeIndex]> == std::option::Option<&[linnet::half_edge::involution::EdgeIndex; 1]>`
  1501. 420.50 s > |
  1502. 420.50 s > = help: the trait `std::cmp::PartialEq<std::option::Option<&[linnet::half_edge::involution::EdgeIndex; 1]>>` is not implemented for `std::option::Option<&[linnet::half_edge::involution::EdgeIndex]>`
  1503. 420.50 s > help: the following other types implement trait `std::cmp::PartialEq<Rhs>`
  1504. 420.50 s > --> /rustc/2d8144b7880597b6e6d3dfd63a9a9efae3f533d3/library/core/src/option.rs:2434:0
  1505. 420.50 s > |
  1506. 420.50 s > = note: `std::option::Option<T>` implements `std::cmp::PartialEq`
  1507. 420.50 s > |
  1508. 420.50 s > ::: /nix/store/8zq9ya5slh345hbylmsibxw827bi98w0-vendor-cargo-deps/c19b7c6f923b580ac259164a89f2577984ad5ab09ee9d583b888f934adbbe8d0/rkyv-0.7.46/src/option.rs:210:1
  1509. 420.50 s > |
  1510. 420.50 s > 210 | impl<T: PartialEq<U>, U> PartialEq<ArchivedOption<T>> for Option<U> {
  1511. 420.50 s > | ^^^^^^^^^^^^^^^^^^^^^^^^^^^^^^^^^^^^^^^^^^^^^^^^^^^^^^^^^^^^^^^^^^^ `std::option::Option<U>` implements `std::cmp::PartialEq<rkyv::option::ArchivedOption<T>>`
  1512. 420.50 s > |
  1513. 420.50 s > ::: /nix/store/8zq9ya5slh345hbylmsibxw827bi98w0-vendor-cargo-deps/c19b7c6f923b580ac259164a89f2577984ad5ab09ee9d583b888f934adbbe8d0/rkyv-0.7.46/src/impls/alloc/niche.rs:24:1
  1514. 420.50 s > |
  1515. 420.50 s > 24 | / impl<T, U> PartialEq<ArchivedOptionBox<T>> for Option<Box<U>>
  1516. 420.50 s > 25 | | where
  1517. 420.50 s > 26 | | T: ArchivePointee + PartialEq<U> + ?Sized,
  1518. 420.50 s > 27 | | U: ?Sized,
  1519. 420.50 s > | |______________^ `std::option::Option<std::boxed::Box<U>>` implements `std::cmp::PartialEq<rkyv::niche::option_box::ArchivedOptionBox<T>>`
  1520. 420.50 s >
  1521. 420.50 s > error[E0283]: type annotations needed
  1522. 420.50 s > --> crates/gammalooprs/src/processes/no_directive_equivalence_tests.rs:459:43
  1523. 420.50 s > |
  1524. 420.50 s > 459 | (0..graph.cuts.len()).collect(),
  1525. 420.50 s > | ^^^^^^^ cannot infer type of the type parameter `B` declared on the method `collect`
  1526. 420.50 s > |
  1527. 420.50 s > = note: multiple `impl`s satisfying `_: std::iter::FromIterator<usize>` found in the following crates: `spenso`, `tabled`:
  1528. 420.50 s > - impl std::iter::FromIterator<usize> for spenso::structure::concrete_index::ExpandedIndex;
  1529. 420.50 s > - impl std::iter::FromIterator<usize> for tabled::settings::height::HeightList;
  1530. 420.50 s > - impl std::iter::FromIterator<usize> for tabled::settings::width::WidthList;
  1531. 420.50 s > note: required by a bound in `std::iter::Iterator::collect`
  1532. 420.50 s > --> /rustc/2d8144b7880597b6e6d3dfd63a9a9efae3f533d3/library/core/src/iter/traits/iterator.rs:2077:4
  1533. 420.50 s > help: consider specifying the generic argument
  1534. 420.50 s > |
  1535. 420.50 s > 459 | (0..graph.cuts.len()).collect::<Vec<_>>(),
  1536. 420.50 s > | ++++++++++
  1537. 420.50 s >
  1538. 420.50 s > error[E0283]: type annotations needed
  1539. 420.50 s > --> crates/gammalooprs/src/processes/no_directive_equivalence_tests.rs:459:43
  1540. 420.50 s > |
  1541. 420.50 s > 457 | / assert_eq!(
  1542. 420.50 s > 458 | | grouped_cut_ids,
  1543. 420.50 s > 459 | | (0..graph.cuts.len()).collect(),
  1544. 420.50 s > | | ^^^^^^^ cannot infer type of the type parameter `B` declared on the method `collect`
  1545. 420.50 s > 460 | | "every discovered process-valid cut must remain in the numerical LU evaluation",
  1546. 420.50 s > 461 | | );
  1547. 420.50 s > | |_________________- type must be known at this point
  1548. 420.50 s > |
  1549. 420.50 s > = note: multiple `impl`s satisfying `std::collections::BTreeSet<usize>: std::cmp::PartialEq<_>` found in the following crates: `alloc`, `rkyv`:
  1550. 420.50 s > - impl<K, AK> std::cmp::PartialEq<rkyv::collections::btree_set::ArchivedBTreeSet<AK>> for std::collections::BTreeSet<K>
  1551. 420.50 s > where AK: std::cmp::PartialEq<K>;
  1552. 420.50 s > - impl<T, A> std::cmp::PartialEq for std::collections::BTreeSet<T, A>
  1553. 420.50 s > where T: std::cmp::PartialEq, A: std::alloc::Allocator, A: std::clone::Clone;
  1554. 420.50 s > help: consider specifying the generic argument
  1555. 420.50 s > |
  1556. 420.50 s > 459 | (0..graph.cuts.len()).collect::<Vec<_>>(),
  1557. 420.50 s > | ++++++++++
  1558. 420.50 s >
  1559. 420.50 s > error[E0283]: type annotations needed
  1560. 420.50 s > --> crates/gammalooprs/src/processes/raised_cross_section_tests.rs:150:31
  1561. 420.50 s > |
  1562. 420.50 s > 150 | (0..graph.cuts.len()).collect(),
  1563. 420.50 s > | ^^^^^^^ cannot infer type of the type parameter `B` declared on the method `collect`
  1564. 420.50 s > |
  1565. 420.50 s > = note: multiple `impl`s satisfying `_: std::iter::FromIterator<usize>` found in the following crates: `spenso`, `tabled`:
  1566. 420.50 s > - impl std::iter::FromIterator<usize> for spenso::structure::concrete_index::ExpandedIndex;
  1567. 420.50 s > - impl std::iter::FromIterator<usize> for tabled::settings::height::HeightList;
  1568. 420.50 s > - impl std::iter::FromIterator<usize> for tabled::settings::width::WidthList;
  1569. 420.50 s > note: required by a bound in `std::iter::Iterator::collect`
  1570. 420.50 s > --> /rustc/2d8144b7880597b6e6d3dfd63a9a9efae3f533d3/library/core/src/iter/traits/iterator.rs:2077:4
  1571. 420.50 s > help: consider specifying the generic argument
  1572. 420.50 s > |
  1573. 420.50 s > 150 | (0..graph.cuts.len()).collect::<Vec<_>>(),
  1574. 420.50 s > | ++++++++++
  1575. 420.50 s >
  1576. 420.50 s > error[E0283]: type annotations needed
  1577. 420.50 s > --> crates/gammalooprs/src/processes/raised_cross_section_tests.rs:150:31
  1578. 420.50 s > |
  1579. 420.50 s > 148 | / assert_eq!(
  1580. 420.50 s > 149 | | grouped_cut_ids,
  1581. 420.50 s > 150 | | (0..graph.cuts.len()).collect(),
  1582. 420.50 s > | | ^^^^^^^ cannot infer type of the type parameter `B` declared on the method `collect`
  1583. 420.50 s > 151 | | "every discovered process-valid cut must remain in the numerical LU evaluation",
  1584. 420.50 s > 152 | | );
  1585. 420.50 s > | |_____- type must be known at this point
  1586. 420.50 s > |
  1587. 420.50 s > = note: multiple `impl`s satisfying `std::collections::BTreeSet<usize>: std::cmp::PartialEq<_>` found in the following crates: `alloc`, `rkyv`:
  1588. 420.50 s > - impl<K, AK> std::cmp::PartialEq<rkyv::collections::btree_set::ArchivedBTreeSet<AK>> for std::collections::BTreeSet<K>
  1589. 420.50 s > where AK: std::cmp::PartialEq<K>;
  1590. 420.50 s > - impl<T, A> std::cmp::PartialEq for std::collections::BTreeSet<T, A>
  1591. 420.50 s > where T: std::cmp::PartialEq, A: std::alloc::Allocator, A: std::clone::Clone;
  1592. 420.50 s > help: consider specifying the generic argument
  1593. 420.50 s > |
  1594. 420.50 s > 150 | (0..graph.cuts.len()).collect::<Vec<_>>(),
  1595. 420.50 s > | ++++++++++
  1596. 420.50 s >
  1597. 420.50 s > error: method `lu_prefactor_helper` is never used
  1598. 420.50 s > --> crates/gammalooprs/src/processes/cross_section.rs:1965:8
  1599. 420.50 s > |
  1600. 420.50 s > 1429 | impl CrossSectionGraph {
  1601. 420.50 s > | ---------------------- method in this implementation
  1602. 420.50 s > ...
  1603. 420.50 s > 1965 | fn lu_prefactor_helper(&self) -> Atom {
  1604. 420.50 s > | ^^^^^^^^^^^^^^^^^^^
  1605. 420.50 s > |
  1606. 420.50 s > = note: `-D dead-code` implied by `-D warnings`
  1607. 420.50 s > = help: to override `-D warnings` add `#[expect(dead_code)]` or `#[allow(dead_code)]`
  1608. 420.50 s >
  1609. 420.50 s > error: this `if` statement can be collapsed
  1610. 420.50 s > --> crates/gammalooprs/src/subtraction/amplitude_counterterm.rs:938:17
  1611. 420.50 s > |
  1612. 420.50 s > 938 | / if let Some(group_id) = metadata.group_id {
  1613. 420.50 s > 939 | | if let Some((_, members)) = groups.iter().find(|(id, _)| *id == Some(group_id))
  1614. 420.50 s > 940 | | {
  1615. 420.50 s > 941 | | let first = members[0];
  1616. 420.50 s > ... |
  1617. 420.50 s > 956 | | }
  1618. 420.50 s > | |_________________^
  1619. 420.50 s > |
  1620. 420.50 s > = help: for further information visit https://rust-lang.github.io/rust-clippy/rust-1.97.0/index.html#collapsible_if
  1621. 420.50 s > = note: `-D clippy::collapsible-if` implied by `-D warnings`
  1622. 420.50 s > = help: to override `-D warnings` add `#[allow(clippy::collapsible_if)]`
  1623. 420.50 s > help: collapse nested if block
  1624. 420.50 s > |
  1625. 420.50 s > 938 ~ if let Some(group_id) = metadata.group_id
  1626. 420.50 s > 939 ~ && let Some((_, members)) = groups.iter().find(|(id, _)| *id == Some(group_id))
  1627. 420.50 s > 940 | {
  1628. 420.50 s > ...
  1629. 420.50 s > 954 | ));
  1630. 420.50 s > 955 ~ }
  1631. 420.50 s > |
  1632. 420.50 s >
  1633. 420.50 s > error: this function has too many arguments (13/7)
  1634. 420.50 s > --> crates/gammalooprs/src/subtraction/amplitude_counterterm.rs:994:5
  1635. 420.50 s > |
  1636. 420.50 s > 994 | / fn evaluate_variant_group<T: FloatLike>(
  1637. 420.50 s > 995 | | &mut self,
  1638. 420.50 s > 996 | | momentum_sample: &MomentumSample<T>,
  1639. 420.50 s > 997 | | graph: &Graph,
  1640. 420.50 s > ... |
  1641. 420.50 s > 1007 | | allowed_variant_ids: Option<&[ThresholdCountertermVariantId]>,
  1642. 420.50 s > 1008 | | ) -> Result<AmplitudeCountertermEvaluation<T>> {
  1643. 420.50 s > | |__________________________________________________^
  1644. 420.50 s > |
  1645. 420.50 s > = help: for further information visit https://rust-lang.github.io/rust-clippy/rust-1.97.0/index.html#too_many_arguments
  1646. 420.50 s > = note: `-D clippy::too-many-arguments` implied by `-D warnings`
  1647. 420.50 s > = help: to override `-D warnings` add `#[allow(clippy::too_many_arguments)]`
  1648. 420.50 s >
  1649. 420.50 s > error: this `if` statement can be collapsed
  1650. 420.50 s > --> crates/gammalooprs/src/subtraction/amplitude_counterterm.rs:1359:17
  1651. 420.50 s > |
  1652. 420.50 s > 1359 | / if let Some(group_id) = metadata.group_id {
  1653. 420.50 s > 1360 | | if let Some((_, _, members)) =
  1654. 420.50 s > 1361 | | groups.iter().find(|(id, _, _)| *id == Some(group_id))
  1655. 420.50 s > ... |
  1656. 420.50 s > 1378 | | }
  1657. 420.50 s > | |_________________^
  1658. 420.50 s > |
  1659. 420.50 s > = help: for further information visit https://rust-lang.github.io/rust-clippy/rust-1.97.0/index.html#collapsible_if
  1660. 420.50 s > help: collapse nested if block
  1661. 420.50 s > |
  1662. 420.50 s > 1359 ~ if let Some(group_id) = metadata.group_id
  1663. 420.50 s > 1360 ~ && let Some((_, _, members)) =
  1664. 420.50 s > 1361 | groups.iter().find(|(id, _, _)| *id == Some(group_id))
  1665. 420.50 s > ...
  1666. 420.50 s > 1376 | ));
  1667. 420.50 s > 1377 ~ }
  1668. 420.50 s > |
  1669. 420.50 s >
  1670. 420.50 s > error: this function has too many arguments (8/7)
  1671. 420.50 s > --> crates/gammalooprs/src/subtraction/lu_counterterm.rs:1197:5
  1672. 420.50 s > |
  1673. 420.50 s > 1197 | / pub fn from_atoms(
  1674. 420.50 s > 1198 | | counterterm_data: &LUCounterTermData,
  1675. 420.50 s > 1199 | | max_cut_order: usize,
  1676. 420.50 s > 1200 | | threshold_helpers: LUThresholdHelperEvaluators,
  1677. 420.50 s > ... |
  1678. 420.50 s > 1205 | | production_orientation_ids: &[OrientationID],
  1679. 420.50 s > 1206 | | ) -> (Self, EvaluatorBuildTimings) {
  1680. 420.50 s > | |______________________________________^
  1681. 420.50 s > |
  1682. 420.50 s > = help: for further information visit https://rust-lang.github.io/rust-clippy/rust-1.97.0/index.html#too_many_arguments
  1683. 420.50 s >
  1684. 420.50 s > error: could not compile `gammalooprs` (lib) due to 5 previous errors
  1685. 420.50 s > warning: build failed, waiting for other jobs to finish...
  1686. 420.50 s > Some errors have detailed explanations: E0277, E0283.
  1687. 420.50 s > For more information about an error, try `rustc --explain E0277`.
  1688. 420.50 s > error: could not compile `gammalooprs` (lib test) due to 16 previous errors
  1689. 420.50 s For full logs, run:
  1690. 420.50 s nix log /nix/store/bfvd4racaxf8cd9mpzlpz54h91n6g02c-gammaloop-workspace-clippy-0.1.0.drv
  1691. 420.53 s Build failed.