build checks.x86_64-linux.gammaloop-clippy

Reproduce this run
Retry Run
  1. 0.00 s $ /nix/store/9ypz3flqsrl5xl495mm8h645gadjsxi1-coreutils-9.11/bin/timeout --kill-after=15s 7200s /nix/store/23zk8sgzamrbmj1fday15szf7f2279s8-nix-2.34.7/bin/nix --extra-experimental-features nix-command --extra-experimental-features flakes --log-format internal-json build --no-link --print-out-paths git+https://github.com/alphal00p/gammaloop?ref=ir_safe_threshold_subtraction&rev=6c3b1ff79c34a5e34e424ddd51dd218105b48f53&shallow=1#checks.x86_64-linux.gammaloop-clippy --print-build-logs
  2. 4.98 s
  3. 5.55 s Building /nix/store/bfvd4racaxf8cd9mpzlpz54h91n6g02c-gammaloop-workspace-clippy-0.1.0.drv
  4. 5.64 s [gammaloop-workspace-clippy] Phase: unpackPhase
  5. 5.65 s [gammaloop-workspace-clippy] unpacking source archive /nix/store/bcy0vqqk2ibk38nik2bb809ck03m92g2-source
  6. 6.29 s [gammaloop-workspace-clippy] source root is source
  7. 6.34 s [gammaloop-workspace-clippy] Phase: patchPhase
  8. 6.35 s [gammaloop-workspace-clippy] Executing configureCargoCommonVars
  9. 6.35 s [gammaloop-workspace-clippy] decompressing cargo artifacts from /nix/store/wxpx6lf642pgxp2wz1pw1lxksj5p1wb0-gammaloop-workspace-deps-deps-0.1.0/target.tar.zst to target
  10. 8.55 s [gammaloop-workspace-clippy] Phase: updateAutotoolsGnuConfigScriptsPhase
  11. 8.60 s [gammaloop-workspace-clippy] Phase: configurePhase
  12. 8.61 s [gammaloop-workspace-clippy] will append /build/source/.cargo-home/config.toml with contents of /nix/store/8zq9ya5slh345hbylmsibxw827bi98w0-vendor-cargo-deps/config.toml
  13. 8.62 s [gammaloop-workspace-clippy] default configurePhase, nothing to do
  14. 8.62 s [gammaloop-workspace-clippy] Phase: buildPhase
  15. 8.67 s [gammaloop-workspace-clippy] +++ command cargo --version
  16. 8.68 s [gammaloop-workspace-clippy] cargo 1.97.0 (c980f4866 2026-06-30)
  17. 8.73 s [gammaloop-workspace-clippy] +++ command cargo clippy --profile ci-optim --locked --workspace --features gammaloop-tracing-filter/clap,gammaloop-tracing-filter/symbolica,idenso/bincode,idenso/reference-cases,linnet/bincode,linnet/drawing,linnet/rkyv,linnet/serde,linnet/symbolica,spenso-macros/shadowing,spenso/shadowing,symbolica/tracing_max_level_info,three-dimensional-reps/display,three-dimensional-reps/eval,three-dimensional-reps/serde --all-targets --no-deps -- --deny warnings
  18. 11.00 s [gammaloop-workspace-clippy] Checking cfg-if v1.0.4
  19. 11.00 s [gammaloop-workspace-clippy] Checking memchr v2.8.0
  20. 11.00 s [gammaloop-workspace-clippy] Checking once_cell v1.21.4
  21. 11.00 s [gammaloop-workspace-clippy] Checking either v1.15.0
  22. 11.01 s [gammaloop-workspace-clippy] Checking itoa v1.0.18
  23. 11.05 s [gammaloop-workspace-clippy] Checking serde_core v1.0.228
  24. 11.05 s [gammaloop-workspace-clippy] Checking libc v0.2.186
  25. 11.05 s [gammaloop-workspace-clippy] Checking libm v0.2.16
  26. 11.07 s [gammaloop-workspace-clippy] Checking log v0.4.29
  27. 11.09 s [gammaloop-workspace-clippy] Checking zerocopy v0.8.48
  28. 11.09 s [gammaloop-workspace-clippy] Checking regex-syntax v0.8.10
  29. 11.10 s [gammaloop-workspace-clippy] Checking crossbeam-utils v0.8.21
  30. 11.14 s [gammaloop-workspace-clippy] Checking equivalent v1.0.2
  31. 11.15 s [gammaloop-workspace-clippy] Checking zmij v1.0.21
  32. 11.15 s [gammaloop-workspace-clippy] Checking lazy_static v1.5.0
  33. 11.15 s [gammaloop-workspace-clippy] Checking bytemuck v1.25.0
  34. 11.15 s [gammaloop-workspace-clippy] Compiling target-lexicon v0.13.5
  35. 11.21 s [gammaloop-workspace-clippy] Checking arrayvec v0.7.6
  36. 11.24 s [gammaloop-workspace-clippy] Checking powerfmt v0.2.0
  37. 11.32 s [gammaloop-workspace-clippy] Checking time-core v0.1.8
  38. 11.38 s [gammaloop-workspace-clippy] Checking itertools v0.14.0
  39. 11.41 s [gammaloop-workspace-clippy] Checking pin-project-lite v0.2.17
  40. 11.42 s [gammaloop-workspace-clippy] Checking num_threads v0.1.7
  41. 11.46 s [gammaloop-workspace-clippy] Checking deranged v0.5.8
  42. 11.53 s [gammaloop-workspace-clippy] Checking num-conv v0.2.1
  43. 11.55 s [gammaloop-workspace-clippy] Checking tracing-core v0.1.36
  44. 11.60 s [gammaloop-workspace-clippy] Checking foldhash v0.2.0
  45. 11.60 s [gammaloop-workspace-clippy] Checking allocator-api2 v0.2.21
  46. 11.77 s [gammaloop-workspace-clippy] Checking crossbeam-epoch v0.9.18
  47. 11.79 s [gammaloop-workspace-clippy] Checking const-random v0.1.18
  48. 11.81 s [gammaloop-workspace-clippy] Checking unty v0.0.4
  49. 11.83 s [gammaloop-workspace-clippy] Checking safe_arch v0.7.4
  50. 11.84 s [gammaloop-workspace-clippy] Checking nu-ansi-term v0.50.3
  51. 11.84 s [gammaloop-workspace-clippy] Checking winnow v1.0.2
  52. 11.87 s [gammaloop-workspace-clippy] Checking static_assertions v1.1.0
  53. 11.89 s [gammaloop-workspace-clippy] Checking aho-corasick v1.1.4
  54. 11.96 s [gammaloop-workspace-clippy] Checking safe_arch v1.0.0
  55. 11.99 s [gammaloop-workspace-clippy] Checking hashbrown v0.16.1
  56. 12.01 s [gammaloop-workspace-clippy] Checking tracing v0.1.44
  57. 12.06 s [gammaloop-workspace-clippy] Checking crossbeam-deque v0.8.6
  58. 12.14 s [gammaloop-workspace-clippy] Checking tracing-log v0.2.0
  59. 12.24 s [gammaloop-workspace-clippy] Checking wide v0.7.33
  60. 12.26 s [gammaloop-workspace-clippy] Checking rayon-core v1.13.0
  61. 12.27 s [gammaloop-workspace-clippy] Checking sharded-slab v0.1.7
  62. 12.33 s [gammaloop-workspace-clippy] Checking thread_local v1.1.9
  63. 12.48 s [gammaloop-workspace-clippy] Checking toml_writer v1.1.1+spec-1.1.0
  64. 12.56 s [gammaloop-workspace-clippy] Checking num-traits v0.2.19
  65. 12.60 s [gammaloop-workspace-clippy] Checking az v1.3.0
  66. 12.70 s [gammaloop-workspace-clippy] Checking indenter v0.3.4
  67. 12.72 s [gammaloop-workspace-clippy] Checking rayon v1.12.0
  68. 12.81 s [gammaloop-workspace-clippy] Checking wide v1.3.0
  69. 12.83 s [gammaloop-workspace-clippy] Compiling phf_shared v0.11.3
  70. 12.90 s [gammaloop-workspace-clippy] Checking anyhow v1.0.102
  71. 12.92 s [gammaloop-workspace-clippy] Checking rawpointer v0.2.1
  72. 12.99 s [gammaloop-workspace-clippy] Checking utf8parse v0.2.2
  73. 13.08 s [gammaloop-workspace-clippy] Checking dyn-clone v1.0.20
  74. 13.11 s [gammaloop-workspace-clippy] Checking alloc-no-stdlib v2.0.4
  75. 13.13 s [gammaloop-workspace-clippy] Checking anstyle-parse v1.0.0
  76. 13.21 s [gammaloop-workspace-clippy] Checking matrixmultiply v0.3.10
  77. 13.27 s [gammaloop-workspace-clippy] Checking colorchoice v1.0.5
  78. 13.28 s [gammaloop-workspace-clippy] Checking alloc-stdlib v0.2.2
  79. 13.35 s [gammaloop-workspace-clippy] Checking colored v3.1.1
  80. 13.36 s [gammaloop-workspace-clippy] Checking anstyle-query v1.1.5
  81. 13.39 s [gammaloop-workspace-clippy] Checking toml_parser v1.1.2+spec-1.1.0
  82. 13.43 s [gammaloop-workspace-clippy] Checking anstyle v1.0.14
  83. 13.44 s [gammaloop-workspace-clippy] Checking is_terminal_polyfill v1.70.2
  84. 13.46 s [gammaloop-workspace-clippy] Compiling phf_generator v0.11.3
  85. 13.54 s [gammaloop-workspace-clippy] Checking eyre v0.6.12
  86. 13.54 s [gammaloop-workspace-clippy] Checking approx v0.5.1
  87. 13.62 s [gammaloop-workspace-clippy] Checking getrandom v0.3.4
  88. 13.69 s [gammaloop-workspace-clippy] Checking time v0.3.47
  89. 13.71 s [gammaloop-workspace-clippy] Checking num-integer v0.1.46
  90. 13.73 s [gammaloop-workspace-clippy] Checking gmp-mpfr-sys v1.7.1
  91. 13.79 s [gammaloop-workspace-clippy] Checking anstream v1.0.0
  92. 13.84 s [gammaloop-workspace-clippy] Checking regex-automata v0.4.14
  93. 13.87 s [gammaloop-workspace-clippy] Checking unicode-width v0.2.2
  94. 13.90 s [gammaloop-workspace-clippy] Checking bitflags v1.3.2
  95. 13.94 s [gammaloop-workspace-clippy] Checking serde v1.0.228
  96. 13.99 s [gammaloop-workspace-clippy] Checking serde_json v1.0.149
  97. 14.07 s [gammaloop-workspace-clippy] Compiling pyo3-build-config v0.28.3
  98. 14.08 s [gammaloop-workspace-clippy] Checking bitflags v2.11.1
  99. 14.11 s [gammaloop-workspace-clippy] Checking serde_spanned v1.1.1
  100. 14.81 s [gammaloop-workspace-clippy] Checking toml_datetime v1.1.1+spec-1.1.0
  101. 15.11 s [gammaloop-workspace-clippy] Compiling phf_codegen v0.11.3
  102. 15.17 s [gammaloop-workspace-clippy] Checking region v3.0.2
  103. 15.19 s [gammaloop-workspace-clippy] Checking rand_core v0.9.5
  104. 15.21 s [gammaloop-workspace-clippy] Checking hugepage-rs v0.1.1
  105. 15.22 s [gammaloop-workspace-clippy] Checking wasmtime-jit-icache-coherence v34.0.2
  106. 15.25 s [gammaloop-workspace-clippy] Checking brotli-decompressor v5.0.0
  107. 15.28 s [gammaloop-workspace-clippy] Checking toml v1.1.2+spec-1.1.0
  108. 15.28 s [gammaloop-workspace-clippy] Checking spec_math v0.1.6
  109. 15.30 s [gammaloop-workspace-clippy] Checking inventory v0.3.24
  110. 15.31 s [gammaloop-workspace-clippy] Checking thiserror v2.0.18
  111. 15.31 s [gammaloop-workspace-clippy] Compiling getopts v0.2.24
  112. 15.33 s [gammaloop-workspace-clippy] Checking libloading v0.9.0
  113. 15.37 s [gammaloop-workspace-clippy] Checking tinyjson v2.5.1
  114. 15.40 s [gammaloop-workspace-clippy] Checking append-only-vec v0.1.8
  115. 15.41 s [gammaloop-workspace-clippy] Checking byteorder v1.5.0
  116. 15.41 s [gammaloop-workspace-clippy] Checking self_cell v1.2.2
  117. 15.43 s [gammaloop-workspace-clippy] Checking bytes v1.11.1
  118. 15.49 s [gammaloop-workspace-clippy] Compiling unic-common v0.9.0
  119. 15.50 s [gammaloop-workspace-clippy] Compiling unic-char-range v0.9.0
  120. 15.50 s [gammaloop-workspace-clippy] Checking linux-raw-sys v0.12.1
  121. 15.59 s [gammaloop-workspace-clippy] Checking smallvec v1.15.1
  122. 15.63 s [gammaloop-workspace-clippy] Checking num-complex v0.4.6
  123. 15.64 s [gammaloop-workspace-clippy] Checking tracing-serde v0.2.0
  124. 15.68 s [gammaloop-workspace-clippy] Checking bincode v2.0.1
  125. 15.68 s [gammaloop-workspace-clippy] Checking smartstring v1.0.1
  126. 15.80 s [gammaloop-workspace-clippy] Compiling unicode_names2_generator v1.3.0
  127. 15.87 s [gammaloop-workspace-clippy] Compiling unic-ucd-version v0.9.0
  128. 15.96 s [gammaloop-workspace-clippy] Compiling unic-char-property v0.9.0
  129. 15.99 s [gammaloop-workspace-clippy] Checking rustix v1.1.4
  130. 15.99 s [gammaloop-workspace-clippy] Compiling is-macro v0.3.7
  131. 16.07 s [gammaloop-workspace-clippy] Compiling rustpython-parser-vendored v0.4.0
  132. 16.12 s [gammaloop-workspace-clippy] Checking ppv-lite86 v0.2.21
  133. 16.15 s [gammaloop-workspace-clippy] Checking ahash v0.8.12
  134. 16.15 s [gammaloop-workspace-clippy] Checking iana-time-zone v0.1.65
  135. 16.23 s [gammaloop-workspace-clippy] Compiling rustpython-parser v0.4.0
  136. 16.38 s [gammaloop-workspace-clippy] Checking chrono v0.4.44
  137. 16.41 s [gammaloop-workspace-clippy] Compiling phf v0.11.3
  138. 16.50 s [gammaloop-workspace-clippy] Checking simba v0.9.1
  139. 16.58 s [gammaloop-workspace-clippy] Checking rustc-hash v2.1.2
  140. 16.78 s [gammaloop-workspace-clippy] Checking ndarray v0.17.2
  141. 16.80 s [gammaloop-workspace-clippy] Checking brotli v8.0.2
  142. 16.90 s [gammaloop-workspace-clippy] Compiling unic-emoji-char v0.9.0
  143. 16.95 s [gammaloop-workspace-clippy] Checking rand_chacha v0.9.0
  144. 17.01 s [gammaloop-workspace-clippy] Compiling unic-ucd-ident v0.9.0
  145. 17.41 s [gammaloop-workspace-clippy] Checking rand v0.9.4
  146. 17.43 s [gammaloop-workspace-clippy] Compiling lalrpop-util v0.20.2
  147. 17.43 s [gammaloop-workspace-clippy] Compiling rustc-hash v1.1.0
  148. 17.56 s [gammaloop-workspace-clippy] Checking rug v1.30.0
  149. 17.62 s [gammaloop-workspace-clippy] Checking unicode-segmentation v1.13.2
  150. 17.95 s [gammaloop-workspace-clippy] Compiling symbolica v2.2.0 (https://github.com/alphal00p/symbolica?rev=4d0a833eb8e059d1f95bdae5abed2559830b235f#4d0a833e)
  151. 18.12 s [gammaloop-workspace-clippy] Checking typenum v1.20.0
  152. 18.24 s [gammaloop-workspace-clippy] Checking getrandom v0.2.17
  153. 18.35 s [gammaloop-workspace-clippy] Checking scopeguard v1.2.0
  154. 18.47 s [gammaloop-workspace-clippy] Checking lock_api v0.4.14
  155. 18.53 s [gammaloop-workspace-clippy] Checking parking_lot_core v0.9.12
  156. 18.63 s [gammaloop-workspace-clippy] Checking symjit v2.21.0
  157. 18.86 s [gammaloop-workspace-clippy] Checking hashbrown v0.17.0
  158. 18.91 s [gammaloop-workspace-clippy] Checking unicode-ident v1.0.24
  159. 18.93 s [gammaloop-workspace-clippy] Checking parking_lot v0.12.5
  160. 18.96 s [gammaloop-workspace-clippy] Checking errno v0.3.14
  161. 19.01 s [gammaloop-workspace-clippy] Checking clap_lex v1.1.0
  162. 19.09 s [gammaloop-workspace-clippy] Checking strsim v0.11.1
  163. 19.15 s [gammaloop-workspace-clippy] Checking unicase v2.9.0
  164. 19.27 s [gammaloop-workspace-clippy] Checking terminal_size v0.4.4
  165. 19.29 s [gammaloop-workspace-clippy] Checking signal-hook-registry v1.4.8
  166. 19.37 s [gammaloop-workspace-clippy] Checking vte v0.14.1
  167. 19.37 s [gammaloop-workspace-clippy] Checking same-file v1.0.6
  168. 19.47 s [gammaloop-workspace-clippy] Checking clap_builder v4.6.0
  169. 19.53 s [gammaloop-workspace-clippy] Checking half v2.7.1
  170. 19.59 s [gammaloop-workspace-clippy] Checking signal-hook v0.3.18
  171. 19.62 s [gammaloop-workspace-clippy] Checking walkdir v2.5.0
  172. 19.82 s [gammaloop-workspace-clippy] Checking mio v1.2.0
  173. 20.03 s [gammaloop-workspace-clippy] Checking minimal-lexical v0.2.1
  174. 20.18 s [gammaloop-workspace-clippy] Checking ciborium-io v0.2.2
  175. 20.27 s [gammaloop-workspace-clippy] Checking generic-array v0.14.7
  176. 20.29 s [gammaloop-workspace-clippy] Checking ciborium-ll v0.2.2
  177. 20.46 s [gammaloop-workspace-clippy] Checking indexmap v2.14.0
  178. 20.51 s [gammaloop-workspace-clippy] Checking derive_more v2.1.1
  179. 20.61 s [gammaloop-workspace-clippy] Checking num-bigint v0.4.6
  180. 20.69 s [gammaloop-workspace-clippy] Checking nom v7.1.3
  181. 20.88 s [gammaloop-workspace-clippy] Checking signal-hook-mio v0.2.5
  182. 20.96 s [gammaloop-workspace-clippy] Checking console v0.16.3
  183. 21.02 s [gammaloop-workspace-clippy] Checking matchers v0.2.0
  184. 21.15 s [gammaloop-workspace-clippy] Checking tracing-subscriber v0.3.23
  185. 21.44 s [gammaloop-workspace-clippy] Checking regex v1.12.3
  186. 21.52 s [gammaloop-workspace-clippy] Checking crypto-common v0.1.7
  187. 21.59 s [gammaloop-workspace-clippy] Checking block-buffer v0.10.4
  188. 21.69 s [gammaloop-workspace-clippy] Checking digest v0.10.7
  189. 21.72 s [gammaloop-workspace-clippy] Checking bstr v1.12.1
  190. 21.79 s [gammaloop-workspace-clippy] Checking cpufeatures v0.2.17
  191. 21.88 s [gammaloop-workspace-clippy] Checking winnow v0.7.15
  192. 21.99 s [gammaloop-workspace-clippy] Checking linux-raw-sys v0.4.15
  193. 22.22 s [gammaloop-workspace-clippy] Compiling unicode_names2 v1.3.0
  194. 22.45 s [gammaloop-workspace-clippy] Checking rustix v0.38.44
  195. 22.55 s [gammaloop-workspace-clippy] Checking sha2 v0.10.9
  196. 22.57 s [gammaloop-workspace-clippy] Checking globset v0.4.18
  197. 22.86 s [gammaloop-workspace-clippy] Checking clap v4.6.1
  198. 22.93 s [gammaloop-workspace-clippy] Checking ansitok v0.3.0
  199. 22.94 s [gammaloop-workspace-clippy] Checking ciborium v0.2.2
  200. 22.96 s [gammaloop-workspace-clippy] Checking rand_core v0.6.4
  201. 23.00 s [gammaloop-workspace-clippy] Checking getrandom v0.4.2
  202. 23.02 s [gammaloop-workspace-clippy] Checking fastrand v2.4.1
  203. 23.16 s [gammaloop-workspace-clippy] Checking plotters-backend v0.3.7
  204. 23.17 s [gammaloop-workspace-clippy] Checking fnv v1.0.7
  205. 23.19 s [gammaloop-workspace-clippy] Checking rust-embed-utils v8.11.0
  206. 23.21 s [gammaloop-workspace-clippy] Checking serde_spanned v0.6.9
  207. 23.24 s [gammaloop-workspace-clippy] Checking tempfile v3.27.0
  208. 23.24 s [gammaloop-workspace-clippy] Checking toml_datetime v0.6.11
  209. 23.25 s [gammaloop-workspace-clippy] Checking crossterm v0.28.1
  210. 23.31 s [gammaloop-workspace-clippy] Checking itertools v0.10.5
  211. 23.35 s [gammaloop-workspace-clippy] Checking tap v1.0.1
  212. 23.38 s [gammaloop-workspace-clippy] Checking cast v0.3.0
  213. 23.40 s [gammaloop-workspace-clippy] Checking plotters-svg v0.3.7
  214. 23.44 s [gammaloop-workspace-clippy] Checking toml_write v0.1.2
  215. 23.45 s [gammaloop-workspace-clippy] Checking wyz v0.5.1
  216. 23.47 s [gammaloop-workspace-clippy] Checking ansi-str v0.9.0
  217. 23.50 s [gammaloop-workspace-clippy] Checking rand_chacha v0.3.1
  218. 23.52 s [gammaloop-workspace-clippy] Checking radium v0.7.0
  219. 23.55 s [gammaloop-workspace-clippy] Checking typeid v1.0.3
  220. 23.57 s [gammaloop-workspace-clippy] Checking plotters v0.3.7
  221. 23.66 s [gammaloop-workspace-clippy] Checking similar v2.7.0
  222. 23.68 s [gammaloop-workspace-clippy] Checking tinytemplate v1.2.1
  223. 23.69 s [gammaloop-workspace-clippy] Checking is-terminal v0.4.17
  224. 23.74 s [gammaloop-workspace-clippy] Checking bytecount v0.6.9
  225. 23.75 s [gammaloop-workspace-clippy] Checking anes v0.1.6
  226. 23.78 s [gammaloop-workspace-clippy] Checking funty v2.0.0
  227. 23.80 s [gammaloop-workspace-clippy] Checking oorandom v11.1.5
  228. 23.85 s [gammaloop-workspace-clippy] Checking papergrid v0.17.0
  229. 23.90 s [gammaloop-workspace-clippy] Checking toml_edit v0.22.27
  230. 23.93 s [gammaloop-workspace-clippy] Checking rand v0.8.6
  231. 23.97 s [gammaloop-workspace-clippy] Checking ron v0.12.1
  232. 24.01 s [gammaloop-workspace-clippy] Checking testing_table v0.3.0
  233. 24.13 s [gammaloop-workspace-clippy] Checking env_filter v1.0.1
  234. 24.15 s [gammaloop-workspace-clippy] Checking xprec v0.2.2
  235. 24.33 s [gammaloop-workspace-clippy] Checking bitvec v1.0.1
  236. 24.38 s [gammaloop-workspace-clippy] Checking toml_edit v0.25.11+spec-1.1.0
  237. 24.42 s [gammaloop-workspace-clippy] Checking uncased v0.9.10
  238. 24.54 s [gammaloop-workspace-clippy] Checking jiff v0.2.24
  239. 24.58 s [gammaloop-workspace-clippy] Checking ptr_meta v0.1.4
  240. 24.60 s [gammaloop-workspace-clippy] Checking ucd-trie v0.1.7
  241. 24.62 s [gammaloop-workspace-clippy] Checking criterion-plot v0.5.0
  242. 24.70 s [gammaloop-workspace-clippy] Checking simdutf8 v0.1.5
  243. 24.73 s [gammaloop-workspace-clippy] Checking ahash v0.7.8
  244. 24.75 s [gammaloop-workspace-clippy] Checking pest v2.8.6
  245. 24.83 s [gammaloop-workspace-clippy] Checking approx v0.4.0
  246. 24.93 s [gammaloop-workspace-clippy] Checking hashbrown v0.12.3
  247. 24.95 s [gammaloop-workspace-clippy] Checking bytecheck v0.6.12
  248. 24.96 s [gammaloop-workspace-clippy] Checking criterion v0.5.1
  249. 24.99 s [gammaloop-workspace-clippy] Checking seahash v4.1.0
  250. 25.12 s [gammaloop-workspace-clippy] Checking cgmath v0.18.0
  251. 25.25 s [gammaloop-workspace-clippy] Compiling pyo3-ffi v0.28.3
  252. 25.35 s [gammaloop-workspace-clippy] Compiling pyo3-macros-backend v0.28.3
  253. 25.42 s [gammaloop-workspace-clippy] Compiling pyo3 v0.28.3
  254. 25.42 s [gammaloop-workspace-clippy] Compiling numpy v0.28.0
  255. 25.51 s [gammaloop-workspace-clippy] Checking insta v1.47.2
  256. 25.57 s [gammaloop-workspace-clippy] Checking tabled v0.20.0
  257. 25.58 s [gammaloop-workspace-clippy] Checking rend v0.4.2
  258. 25.84 s [gammaloop-workspace-clippy] Checking num-rational v0.4.2
  259. 25.85 s [gammaloop-workspace-clippy] Checking num-iter v0.1.45
  260. 26.01 s [gammaloop-workspace-clippy] Checking ref-ops v0.2.5
  261. 26.06 s [gammaloop-workspace-clippy] Checking toml v0.8.23
  262. 26.18 s [gammaloop-workspace-clippy] Checking rand_xoshiro v0.6.0
  263. 26.27 s [gammaloop-workspace-clippy] Checking num v0.4.3
  264. 26.37 s [gammaloop-workspace-clippy] Checking features v0.10.0
  265. 26.48 s [gammaloop-workspace-clippy] Checking gat-lending-iterator v0.1.8
  266. 26.51 s [gammaloop-workspace-clippy] Checking constcat v0.5.1
  267. 26.58 s [gammaloop-workspace-clippy] Checking colored v2.2.0
  268. 26.61 s [gammaloop-workspace-clippy] Checking dot-parser v0.5.1
  269. 26.63 s [gammaloop-workspace-clippy] Checking constant_time_eq v0.4.2
  270. 26.75 s [gammaloop-workspace-clippy] Checking arrayref v0.3.9
  271. 26.83 s [gammaloop-workspace-clippy] Checking cpufeatures v0.3.0
  272. 26.85 s [gammaloop-workspace-clippy] Checking base64 v0.22.1
  273. 26.92 s [gammaloop-workspace-clippy] Checking blake3 v1.8.5
  274. 27.02 s [gammaloop-workspace-clippy] Checking figment v0.10.19
  275. 27.04 s [gammaloop-workspace-clippy] Checking siphasher v1.0.2
  276. 27.06 s [gammaloop-workspace-clippy] Checking joinery v2.1.0
  277. 27.28 s [gammaloop-workspace-clippy] Checking phf_shared v0.13.1
  278. 27.30 s [gammaloop-workspace-clippy] Checking titlecase v2.2.1
  279. 27.32 s [gammaloop-workspace-clippy] Checking subprocess v0.2.15
  280. 27.36 s [gammaloop-workspace-clippy] Checking rust_lisp v0.18.0
  281. 27.51 s [gammaloop-workspace-clippy] Compiling vakint v0.1.2 (/build/source/crates/vakint)
  282. 27.60 s [gammaloop-workspace-clippy] Compiling rustpython-parser-core v0.4.0
  283. 27.70 s [gammaloop-workspace-clippy] Checking version-compare v0.2.1
  284. 27.72 s [gammaloop-workspace-clippy] Checking phf v0.13.1
  285. 27.82 s [gammaloop-workspace-clippy] Checking xpct v0.5.1
  286. 27.86 s [gammaloop-workspace-clippy] Checking ryu v1.0.23
  287. 27.90 s [gammaloop-workspace-clippy] Compiling rustpython-ast v0.4.0
  288. 27.94 s [gammaloop-workspace-clippy] Checking string-template-plus v0.4.3
  289. 27.97 s [gammaloop-workspace-clippy] Checking castaway v0.2.4
  290. 27.99 s [gammaloop-workspace-clippy] Checking toml_datetime v0.7.5+spec-1.1.0
  291. 28.06 s [gammaloop-workspace-clippy] Checking strum v0.27.2
  292. 28.08 s [gammaloop-workspace-clippy] Checking unicode-truncate v2.0.1
  293. 28.10 s [gammaloop-workspace-clippy] Checking kasuari v0.4.12
  294. 28.10 s [gammaloop-workspace-clippy] Checking lru v0.16.4
  295. 28.12 s [gammaloop-workspace-clippy] Checking compact_str v0.9.0
  296. 28.19 s [gammaloop-workspace-clippy] Checking vte v0.15.0
  297. 28.23 s [gammaloop-workspace-clippy] Checking portable-atomic v1.13.1
  298. 28.30 s [gammaloop-workspace-clippy] Checking unit-prefix v0.5.2
  299. 28.37 s [gammaloop-workspace-clippy] Checking vt100 v0.16.2
  300. 28.42 s [gammaloop-workspace-clippy] Checking toml v0.9.12+spec-1.1.0
  301. 28.49 s [gammaloop-workspace-clippy] Checking rand_distr v0.4.3
  302. 28.51 s [gammaloop-workspace-clippy] Checking simba v0.6.0
  303. 28.60 s [gammaloop-workspace-clippy] Checking line-clipping v0.3.7
  304. 28.62 s [gammaloop-workspace-clippy] Checking gimli v0.32.3
  305. 28.74 s [gammaloop-workspace-clippy] Checking adler2 v2.0.1
  306. 28.77 s [gammaloop-workspace-clippy] Compiling three-dimensional-reps v0.1.0 (/build/source/crates/three-dimensional-reps)
  307. 28.79 s [gammaloop-workspace-clippy] Checking thiserror v1.0.69
  308. 28.88 s [gammaloop-workspace-clippy] Checking indicatif v0.18.4
  309. 28.89 s [gammaloop-workspace-clippy] Checking miniz_oxide v0.8.9
  310. 28.91 s [gammaloop-workspace-clippy] Checking derive_builder v0.11.2
  311. 28.92 s [gammaloop-workspace-clippy] Checking owo-colors v4.3.0
  312. 28.98 s [gammaloop-workspace-clippy] Checking ratatui-core v0.1.0
  313. 29.00 s [gammaloop-workspace-clippy] Checking crossterm v0.29.0
  314. 29.15 s [gammaloop-workspace-clippy] Checking object v0.37.3
  315. 29.20 s [gammaloop-workspace-clippy] Checking tracing-error v0.2.1
  316. 29.26 s [gammaloop-workspace-clippy] Checking typed-index-collections v3.5.0
  317. 29.52 s [gammaloop-workspace-clippy] Checking serde-big-array v0.5.1
  318. 29.58 s [gammaloop-workspace-clippy] Checking env_logger v0.11.10
  319. 29.68 s [gammaloop-workspace-clippy] Checking amd v0.2.2
  320. 29.70 s [gammaloop-workspace-clippy] Checking itertools v0.11.0
  321. 29.85 s [gammaloop-workspace-clippy] Compiling gammaloop-tracing-filter-macros v0.1.0 (/build/source/crates/gammaloop-tracing-filter-macros)
  322. 29.89 s [gammaloop-workspace-clippy] Checking rustc-demangle v0.1.27
  323. 30.03 s [gammaloop-workspace-clippy] Checking option-ext v0.2.0
  324. 30.06 s [gammaloop-workspace-clippy] Checking ref-cast v1.0.25
  325. 30.12 s [gammaloop-workspace-clippy] Checking dirs-sys v0.5.0
  326. 30.18 s [gammaloop-workspace-clippy] Checking nix v0.31.2
  327. 30.36 s [gammaloop-workspace-clippy] Checking integer-sqrt v0.1.5
  328. 30.40 s [gammaloop-workspace-clippy] Checking brotli-decompressor v4.0.3
  329. 30.46 s [gammaloop-workspace-clippy] Checking crossbeam-channel v0.5.15
  330. 30.47 s [gammaloop-workspace-clippy] Checking color-spantrace v0.3.0
  331. 30.50 s [gammaloop-workspace-clippy] Checking itertools v0.12.1
  332. 30.52 s [gammaloop-workspace-clippy] Checking unsafe-libyaml v0.2.11
  333. 30.54 s [gammaloop-workspace-clippy] Checking symlink v0.1.0
  334. 30.56 s [gammaloop-workspace-clippy] Checking rkyv v0.7.46
  335. 30.63 s [gammaloop-workspace-clippy] Compiling gammalooprs v0.3.4 (/build/source/crates/gammalooprs)
  336. 31.04 s [gammaloop-workspace-clippy] Checking ratatui-widgets v0.3.0
  337. 31.19 s [gammaloop-workspace-clippy] Checking ratatui-crossterm v0.1.0
  338. 31.24 s [gammaloop-workspace-clippy] Checking tracing-appender v0.2.5
  339. 31.33 s [gammaloop-workspace-clippy] Checking ctrlc v3.5.2
  340. 31.54 s [gammaloop-workspace-clippy] Checking include_dir v0.7.4
  341. 31.55 s [gammaloop-workspace-clippy] Checking pathfinding v4.15.0
  342. 31.57 s [gammaloop-workspace-clippy] Checking dirs v6.0.0
  343. 31.70 s [gammaloop-workspace-clippy] Checking schemars v1.2.1
  344. 31.75 s [gammaloop-workspace-clippy] Checking slotmap v1.1.1
  345. 32.00 s [gammaloop-workspace-clippy] Checking serde_yaml v0.9.34+deprecated
  346. 32.08 s [gammaloop-workspace-clippy] Checking brotli v7.0.0
  347. 32.67 s [gammaloop-workspace-clippy] Compiling numerica v2.2.0 (https://github.com/alphal00p/symbolica?rev=4d0a833eb8e059d1f95bdae5abed2559830b235f#4d0a833e)
  348. 32.85 s [gammaloop-workspace-clippy] Checking clarabel v0.11.1
  349. 32.99 s [gammaloop-workspace-clippy] Checking tracing-indicatif v0.3.14
  350. 33.06 s [gammaloop-workspace-clippy] Checking addr2line v0.25.1
  351. 33.13 s [gammaloop-workspace-clippy] Checking json5 v0.4.1
  352. 33.20 s [gammaloop-workspace-clippy] Checking vectorize v0.2.0
  353. 33.25 s [gammaloop-workspace-clippy] Checking ringbuffer v0.16.0
  354. 33.65 s [gammaloop-workspace-clippy] Checking base62 v2.2.4
  355. 33.71 s [gammaloop-workspace-clippy] Checking rust-embed v8.11.0
  356. 33.72 s [gammaloop-workspace-clippy] Checking clap_complete v4.6.3
  357. 33.81 s [gammaloop-workspace-clippy] Checking strip-ansi-escapes v0.2.1
  358. 33.83 s [gammaloop-workspace-clippy] Checking ratatui-macros v0.7.0
  359. 33.85 s [gammaloop-workspace-clippy] Checking fd-lock v4.0.4
  360. 33.86 s [gammaloop-workspace-clippy] Compiling gammaloop-api v0.1.0 (/build/source/crates/gammaloop-api)
  361. 33.95 s [gammaloop-workspace-clippy] Checking ratatui v0.30.0
  362. 33.97 s [gammaloop-workspace-clippy] Checking itertools v0.13.0
  363. 33.97 s [gammaloop-workspace-clippy] Checking strum v0.26.3
  364. 33.97 s [gammaloop-workspace-clippy] Checking sysinfo v0.33.1
  365. 34.17 s [gammaloop-workspace-clippy] Checking shlex v1.3.0
  366. 34.23 s [gammaloop-workspace-clippy] Checking slab v0.4.12
  367. 34.43 s [gammaloop-workspace-clippy] Checking futures-core v0.3.32
  368. 34.57 s [gammaloop-workspace-clippy] Checking futures-task v0.3.32
  369. 34.58 s [gammaloop-workspace-clippy] Checking clap_complete_nushell v4.6.0
  370. 34.66 s [gammaloop-workspace-clippy] Checking sdd v3.0.10
  371. 34.68 s [gammaloop-workspace-clippy] Compiling gammaloop-integration-tests v0.1.0 (/build/source/tests)
  372. 34.84 s [gammaloop-workspace-clippy] Compiling test-log-core v0.2.20
  373. 34.86 s [gammaloop-workspace-clippy] Checking futures-util v0.3.32
  374. 34.88 s [gammaloop-workspace-clippy] Compiling rustc_version v0.4.1
  375. 34.92 s [gammaloop-workspace-clippy] Checking which v8.0.2
  376. 35.05 s [gammaloop-workspace-clippy] Checking scc v2.4.0
  377. 35.41 s [gammaloop-workspace-clippy] Checking bincode v1.3.3
  378. 35.85 s [gammaloop-workspace-clippy] Compiling gungraun-runner v0.18.2
  379. 36.18 s [gammaloop-workspace-clippy] Checking backtrace v0.3.76
  380. 36.21 s [gammaloop-workspace-clippy] Checking nalgebra v0.29.0
  381. 36.30 s [gammaloop-workspace-clippy] Checking proc-macro2 v1.0.106
  382. 36.60 s [gammaloop-workspace-clippy] Compiling gungraun-macros v0.8.0
  383. 36.76 s [gammaloop-workspace-clippy] Checking color-eyre v0.6.5
  384. 37.13 s [gammaloop-workspace-clippy] Checking quote v1.0.45
  385. 37.16 s [gammaloop-workspace-clippy] Checking reedline v0.42.0
  386. 37.52 s [gammaloop-workspace-clippy] Checking maplit v1.0.2
  387. 37.54 s [gammaloop-workspace-clippy] Checking base64 v0.21.7
  388. 37.60 s [gammaloop-workspace-clippy] Compiling iai-callgrind-runner v0.14.2
  389. 37.63 s [gammaloop-workspace-clippy] Checking kurbo v0.13.0
  390. 38.03 s [gammaloop-workspace-clippy] Checking ron v0.8.1
  391. 38.20 s [gammaloop-workspace-clippy] Checking wait-timeout v0.2.1
  392. 38.44 s [gammaloop-workspace-clippy] Compiling iai-callgrind v0.14.2
  393. 38.46 s [gammaloop-workspace-clippy] Checking futures-executor v0.3.32
  394. 38.54 s [gammaloop-workspace-clippy] Checking quick-error v1.2.3
  395. 38.58 s [gammaloop-workspace-clippy] Checking bit-vec v0.8.0
  396. 38.66 s [gammaloop-workspace-clippy] Checking serial_test v3.4.0
  397. 38.68 s [gammaloop-workspace-clippy] Checking rusty-fork v0.3.1
  398. 39.00 s [gammaloop-workspace-clippy] Checking bit-set v0.8.0
  399. 39.06 s [gammaloop-workspace-clippy] Checking syn v2.0.117
  400. 39.11 s [gammaloop-workspace-clippy] Compiling iai-callgrind-macros v0.5.1
  401. 39.24 s [gammaloop-workspace-clippy] Compiling graphica v2.1.0 (https://github.com/alphal00p/symbolica?rev=4d0a833eb8e059d1f95bdae5abed2559830b235f#4d0a833e)
  402. 39.26 s [gammaloop-workspace-clippy] Checking rand_xorshift v0.4.0
  403. 39.38 s [gammaloop-workspace-clippy] Checking console v0.15.11
  404. 39.43 s [gammaloop-workspace-clippy] Checking unarray v0.1.4
  405. 39.51 s [gammaloop-workspace-clippy] Compiling test-log-macros v0.2.20
  406. 39.54 s [gammaloop-workspace-clippy] Checking pathdiff v0.2.3
  407. 39.62 s [gammaloop-workspace-clippy] Checking proptest v1.11.0
  408. 40.44 s [gammaloop-workspace-clippy] Checking similar-asserts v1.7.0
  409. 40.67 s [gammaloop-workspace-clippy] Checking clinnet v0.1.8 (/build/source/crates/clinnet)
  410. 40.86 s [gammaloop-workspace-clippy] Checking kurvst v0.1.0 (/build/source/crates/kurvst)
  411. 43.56 s [gammaloop-workspace-clippy] Checking test-log v0.2.20
  412. 47.17 s [gammaloop-workspace-clippy] Checking statrs v0.16.1
  413. 48.35 s [gammaloop-workspace-clippy] Checking momtrop v0.3.0
  414. 49.33 s [gammaloop-workspace-clippy] Checking gungraun v0.18.2
  415. 49.91 s [gammaloop-workspace-clippy] Compiling pyo3-macros v0.28.3
  416. 50.20 s [gammaloop-workspace-clippy] Compiling pyo3-stub-gen-derive v0.17.2
  417. 56.31 s [gammaloop-workspace-clippy] Checking pyo3-stub-gen v0.17.2
  418. 65.54 s [gammaloop-workspace-clippy] Checking symbolica-utils v0.1.0 (/build/source/crates/symbolica-utils)
  419. 65.54 s [gammaloop-workspace-clippy] Checking spenso-macros v0.3.2 (/build/source/crates/spenso-macros)
  420. 264.71 s [gammaloop-workspace-clippy] Compiling gammaloop-workspace-hack v0.1.0 (/build/source/crates/gammaloop-workspace-hack)
  421. 265.00 s [gammaloop-workspace-clippy] Checking linnet v0.17.0 (/build/source/crates/linnet)
  422. 270.40 s [gammaloop-workspace-clippy] Checking spenso v0.6.0 (/build/source/crates/spenso)
  423. 271.74 s [gammaloop-workspace-clippy] Checking linnet-py v0.1.0 (/build/source/crates/linnet-py)
  424. 271.74 s [gammaloop-workspace-clippy] Checking linnest v0.1.0 (/build/source/crates/linnest)
  425. 280.62 s [gammaloop-workspace-clippy] Checking idenso v0.3.0 (/build/source/crates/idenso)
  426. 280.62 s [gammaloop-workspace-clippy] Checking gammaloop-tracing-filter v0.1.0 (/build/source/crates/gammaloop-tracing-filter)
  427. 284.19 s [gammaloop-workspace-clippy] Checking spenso-hep-lib v0.1.7 (/build/source/crates/spenso-hep-lib)
  428. 284.46 s [gammaloop-workspace-clippy] Checking spynso3 v0.1.2 (/build/source/crates/spynso3)
  429. 300.77 s [gammaloop-workspace-clippy] error[E0283]: type annotations needed
  430. 300.77 s [gammaloop-workspace-clippy] --> crates/gammalooprs/src/momentum/sample.rs:1165:35
  431. 300.77 s [gammaloop-workspace-clippy] |
  432. 300.77 s [gammaloop-workspace-clippy] 1165 | requested.into_iter().collect(),
  433. 300.77 s [gammaloop-workspace-clippy] | ^^^^^^^ cannot infer type of the type parameter `B` declared on the method `collect`
  434. 300.77 s [gammaloop-workspace-clippy] |
  435. 300.77 s [gammaloop-workspace-clippy] = note: the type must implement `std::iter::FromIterator<linnet::half_edge::involution::EdgeIndex>`
  436. 300.77 s [gammaloop-workspace-clippy] note: required by a bound in `std::iter::Iterator::collect`
  437. 300.77 s [gammaloop-workspace-clippy] --> /rustc/2d8144b7880597b6e6d3dfd63a9a9efae3f533d3/library/core/src/iter/traits/iterator.rs:2077:4
  438. 300.77 s [gammaloop-workspace-clippy] help: consider specifying the generic argument
  439. 300.77 s [gammaloop-workspace-clippy] |
  440. 300.77 s [gammaloop-workspace-clippy] 1165 | requested.into_iter().collect::<Vec<_>>(),
  441. 300.77 s [gammaloop-workspace-clippy] | ++++++++++
  442. 300.77 s [gammaloop-workspace-clippy]
  443. 300.77 s [gammaloop-workspace-clippy] error[E0283]: type annotations needed
  444. 300.77 s [gammaloop-workspace-clippy] --> crates/gammalooprs/src/momentum/sample.rs:1165:35
  445. 300.77 s [gammaloop-workspace-clippy] |
  446. 300.77 s [gammaloop-workspace-clippy] 1161 | / assert_eq!(
  447. 300.77 s [gammaloop-workspace-clippy] 1162 | | subspace
  448. 300.77 s [gammaloop-workspace-clippy] 1163 | | .iter_basis_edges(&all_lmbs)
  449. 300.77 s [gammaloop-workspace-clippy] 1164 | | .collect::<std::collections::BTreeSet<_>>(),
  450. 300.77 s [gammaloop-workspace-clippy] 1165 | | requested.into_iter().collect(),
  451. 300.77 s [gammaloop-workspace-clippy] | | ^^^^^^^ cannot infer type of the type parameter `B` declared on the method `collect`
  452. 300.77 s [gammaloop-workspace-clippy] 1166 | | );
  453. 300.77 s [gammaloop-workspace-clippy] | |_________- type must be known at this point
  454. 300.77 s [gammaloop-workspace-clippy] |
  455. 300.77 s [gammaloop-workspace-clippy] = note: multiple `impl`s satisfying `std::collections::BTreeSet<linnet::half_edge::involution::EdgeIndex>: std::cmp::PartialEq<_>` found in the following crates: `alloc`, `rkyv`:
  456. 300.77 s [gammaloop-workspace-clippy] - impl<K, AK> std::cmp::PartialEq<rkyv::collections::btree_set::ArchivedBTreeSet<AK>> for std::collections::BTreeSet<K>
  457. 300.77 s [gammaloop-workspace-clippy] where AK: std::cmp::PartialEq<K>;
  458. 300.77 s [gammaloop-workspace-clippy] - impl<T, A> std::cmp::PartialEq for std::collections::BTreeSet<T, A>
  459. 300.77 s [gammaloop-workspace-clippy] where T: std::cmp::PartialEq, A: std::alloc::Allocator, A: std::clone::Clone;
  460. 300.77 s [gammaloop-workspace-clippy] help: consider specifying the generic argument
  461. 300.77 s [gammaloop-workspace-clippy] |
  462. 300.77 s [gammaloop-workspace-clippy] 1165 | requested.into_iter().collect::<Vec<_>>(),
  463. 300.77 s [gammaloop-workspace-clippy] | ++++++++++
  464. 300.77 s [gammaloop-workspace-clippy]
  465. 301.44 s [gammaloop-workspace-clippy] error[E0283]: type annotations needed
  466. 301.44 s [gammaloop-workspace-clippy] --> crates/gammalooprs/src/momentum/sample.rs:1182:35
  467. 301.44 s [gammaloop-workspace-clippy] |
  468. 301.44 s [gammaloop-workspace-clippy] 1178 | / assert_eq!(
  469. 301.44 s [gammaloop-workspace-clippy] 1179 | | common_subspace
  470. 301.44 s [gammaloop-workspace-clippy] 1180 | | .iter_basis_edges(&all_lmbs)
  471. 301.44 s [gammaloop-workspace-clippy] 1181 | | .collect::<std::collections::BTreeSet<_>>(),
  472. 301.44 s [gammaloop-workspace-clippy] 1182 | | requested.into_iter().collect(),
  473. 301.44 s [gammaloop-workspace-clippy] | | ^^^^^^^ cannot infer type of the type parameter `B` declared on the method `collect`
  474. 301.44 s [gammaloop-workspace-clippy] 1183 | | );
  475. 301.44 s [gammaloop-workspace-clippy] | |_________- type must be known at this point
  476. 301.44 s [gammaloop-workspace-clippy] |
  477. 301.44 s [gammaloop-workspace-clippy] = note: multiple `impl`s satisfying `std::collections::BTreeSet<linnet::half_edge::involution::EdgeIndex>: std::cmp::PartialEq<_>` found in the following crates: `alloc`, `rkyv`:
  478. 301.44 s [gammaloop-workspace-clippy] - impl<K, AK> std::cmp::PartialEq<rkyv::collections::btree_set::ArchivedBTreeSet<AK>> for std::collections::BTreeSet<K>
  479. 301.44 s [gammaloop-workspace-clippy] where AK: std::cmp::PartialEq<K>;
  480. 301.44 s [gammaloop-workspace-clippy] - impl<T, A> std::cmp::PartialEq for std::collections::BTreeSet<T, A>
  481. 301.44 s [gammaloop-workspace-clippy] where T: std::cmp::PartialEq, A: std::alloc::Allocator, A: std::clone::Clone;
  482. 301.44 s [gammaloop-workspace-clippy] help: consider specifying the generic argument
  483. 301.44 s [gammaloop-workspace-clippy] |
  484. 301.44 s [gammaloop-workspace-clippy] 1182 | requested.into_iter().collect::<Vec<_>>(),
  485. 301.44 s [gammaloop-workspace-clippy] | ++++++++++
  486. 301.44 s [gammaloop-workspace-clippy]
  487. 301.46 s [gammaloop-workspace-clippy] error[E0283]: type annotations needed
  488. 301.46 s [gammaloop-workspace-clippy] --> crates/gammalooprs/src/momentum/sample.rs:1203:35
  489. 301.46 s [gammaloop-workspace-clippy] |
  490. 301.46 s [gammaloop-workspace-clippy] 1199 | / assert_eq!(
  491. 301.46 s [gammaloop-workspace-clippy] 1200 | | sparse_common_subspace
  492. 301.46 s [gammaloop-workspace-clippy] 1201 | | .iter_basis_edges(&all_lmbs)
  493. 301.46 s [gammaloop-workspace-clippy] 1202 | | .collect::<std::collections::BTreeSet<_>>(),
  494. 301.46 s [gammaloop-workspace-clippy] 1203 | | requested.into_iter().collect(),
  495. 301.46 s [gammaloop-workspace-clippy] | | ^^^^^^^ cannot infer type of the type parameter `B` declared on the method `collect`
  496. 301.46 s [gammaloop-workspace-clippy] 1204 | | );
  497. 301.46 s [gammaloop-workspace-clippy] | |_________- type must be known at this point
  498. 301.46 s [gammaloop-workspace-clippy] |
  499. 301.46 s [gammaloop-workspace-clippy] = note: multiple `impl`s satisfying `std::collections::BTreeSet<linnet::half_edge::involution::EdgeIndex>: std::cmp::PartialEq<_>` found in the following crates: `alloc`, `rkyv`:
  500. 301.46 s [gammaloop-workspace-clippy] - impl<K, AK> std::cmp::PartialEq<rkyv::collections::btree_set::ArchivedBTreeSet<AK>> for std::collections::BTreeSet<K>
  501. 301.46 s [gammaloop-workspace-clippy] where AK: std::cmp::PartialEq<K>;
  502. 301.46 s [gammaloop-workspace-clippy] - impl<T, A> std::cmp::PartialEq for std::collections::BTreeSet<T, A>
  503. 301.46 s [gammaloop-workspace-clippy] where T: std::cmp::PartialEq, A: std::alloc::Allocator, A: std::clone::Clone;
  504. 301.47 s [gammaloop-workspace-clippy] help: consider specifying the generic argument
  505. 301.47 s [gammaloop-workspace-clippy] |
  506. 301.47 s [gammaloop-workspace-clippy] 1203 | requested.into_iter().collect::<Vec<_>>(),
  507. 301.47 s [gammaloop-workspace-clippy] | ++++++++++
  508. 301.47 s [gammaloop-workspace-clippy]
  509. 303.21 s [gammaloop-workspace-clippy] error[E0283]: type annotations needed
  510. 303.21 s [gammaloop-workspace-clippy] --> crates/gammalooprs/src/processes/amplitude.rs:3336:49
  511. 303.21 s [gammaloop-workspace-clippy] |
  512. 303.21 s [gammaloop-workspace-clippy] 3336 | variant_ids.iter().copied().collect(),
  513. 303.21 s [gammaloop-workspace-clippy] | ^^^^^^^ cannot infer type of the type parameter `B` declared on the method `collect`
  514. 303.21 s [gammaloop-workspace-clippy] |
  515. 303.21 s [gammaloop-workspace-clippy] = note: the type must implement `std::iter::FromIterator<processes::threshold_counterterms::ThresholdCountertermVariantId>`
  516. 303.21 s [gammaloop-workspace-clippy] note: required by a bound in `std::iter::Iterator::collect`
  517. 303.21 s [gammaloop-workspace-clippy] --> /rustc/2d8144b7880597b6e6d3dfd63a9a9efae3f533d3/library/core/src/iter/traits/iterator.rs:2077:4
  518. 303.21 s [gammaloop-workspace-clippy] help: consider specifying the generic argument
  519. 303.21 s [gammaloop-workspace-clippy] |
  520. 303.21 s [gammaloop-workspace-clippy] 3336 | variant_ids.iter().copied().collect::<Vec<_>>(),
  521. 303.21 s [gammaloop-workspace-clippy] | ++++++++++
  522. 303.21 s [gammaloop-workspace-clippy]
  523. 303.21 s [gammaloop-workspace-clippy] error[E0283]: type annotations needed
  524. 303.21 s [gammaloop-workspace-clippy] --> crates/gammalooprs/src/processes/amplitude.rs:3336:49
  525. 303.21 s [gammaloop-workspace-clippy] |
  526. 303.21 s [gammaloop-workspace-clippy] 3334 | / assert_eq!(
  527. 303.21 s [gammaloop-workspace-clippy] 3335 | | referenced_variants,
  528. 303.21 s [gammaloop-workspace-clippy] 3336 | | variant_ids.iter().copied().collect(),
  529. 303.21 s [gammaloop-workspace-clippy] | | ^^^^^^^ cannot infer type of the type parameter `B` declared on the method `collect`
  530. 303.21 s [gammaloop-workspace-clippy] 3337 | | "overlap groups must retain every semantic duplicate independently",
  531. 303.21 s [gammaloop-workspace-clippy] 3338 | | );
  532. 303.21 s [gammaloop-workspace-clippy] | |_________________- type must be known at this point
  533. 303.21 s [gammaloop-workspace-clippy] |
  534. 303.21 s [gammaloop-workspace-clippy] = note: multiple `impl`s satisfying `std::collections::BTreeSet<processes::threshold_counterterms::ThresholdCountertermVariantId>: std::cmp::PartialEq<_>` found in the following crates: `alloc`, `rkyv`:
  535. 303.21 s [gammaloop-workspace-clippy] - impl<K, AK> std::cmp::PartialEq<rkyv::collections::btree_set::ArchivedBTreeSet<AK>> for std::collections::BTreeSet<K>
  536. 303.21 s [gammaloop-workspace-clippy] where AK: std::cmp::PartialEq<K>;
  537. 303.21 s [gammaloop-workspace-clippy] - impl<T, A> std::cmp::PartialEq for std::collections::BTreeSet<T, A>
  538. 303.21 s [gammaloop-workspace-clippy] where T: std::cmp::PartialEq, A: std::alloc::Allocator, A: std::clone::Clone;
  539. 303.21 s [gammaloop-workspace-clippy] help: consider specifying the generic argument
  540. 303.21 s [gammaloop-workspace-clippy] |
  541. 303.21 s [gammaloop-workspace-clippy] 3336 | variant_ids.iter().copied().collect::<Vec<_>>(),
  542. 303.21 s [gammaloop-workspace-clippy] | ++++++++++
  543. 303.21 s [gammaloop-workspace-clippy]
  544. 303.41 s [gammaloop-workspace-clippy] error[E0283]: type annotations needed
  545. 303.41 s [gammaloop-workspace-clippy] --> crates/gammalooprs/src/processes/amplitude.rs:4098:59
  546. 303.41 s [gammaloop-workspace-clippy] |
  547. 303.41 s [gammaloop-workspace-clippy] 4098 | assert_eq!(orders, [1, 2].into_iter().collect());
  548. 303.41 s [gammaloop-workspace-clippy] | ^^^^^^^ cannot infer type of the type parameter `B` declared on the method `collect`
  549. 303.41 s [gammaloop-workspace-clippy] |
  550. 303.41 s [gammaloop-workspace-clippy] = note: the type must implement `std::iter::FromIterator<i32>`
  551. 303.41 s [gammaloop-workspace-clippy] note: required by a bound in `std::iter::Iterator::collect`
  552. 303.41 s [gammaloop-workspace-clippy] --> /rustc/2d8144b7880597b6e6d3dfd63a9a9efae3f533d3/library/core/src/iter/traits/iterator.rs:2077:4
  553. 303.41 s [gammaloop-workspace-clippy] help: consider specifying the generic argument
  554. 303.41 s [gammaloop-workspace-clippy] |
  555. 303.41 s [gammaloop-workspace-clippy] 4098 | assert_eq!(orders, [1, 2].into_iter().collect::<Vec<_>>());
  556. 303.41 s [gammaloop-workspace-clippy] | ++++++++++
  557. 303.41 s [gammaloop-workspace-clippy]
  558. 303.41 s [gammaloop-workspace-clippy] error[E0283]: type annotations needed
  559. 303.41 s [gammaloop-workspace-clippy] --> crates/gammalooprs/src/processes/amplitude.rs:4098:59
  560. 303.41 s [gammaloop-workspace-clippy] |
  561. 303.41 s [gammaloop-workspace-clippy] 4098 | assert_eq!(orders, [1, 2].into_iter().collect());
  562. 303.41 s [gammaloop-workspace-clippy] | --------------------------------------^^^^^^^---
  563. 303.41 s [gammaloop-workspace-clippy] | | |
  564. 303.41 s [gammaloop-workspace-clippy] | | cannot infer type of the type parameter `B` declared on the method `collect`
  565. 303.41 s [gammaloop-workspace-clippy] | type must be known at this point
  566. 303.41 s [gammaloop-workspace-clippy] |
  567. 303.41 s [gammaloop-workspace-clippy] = note: multiple `impl`s satisfying `std::collections::BTreeSet<usize>: std::cmp::PartialEq<_>` found in the following crates: `alloc`, `rkyv`:
  568. 303.41 s [gammaloop-workspace-clippy] - impl<K, AK> std::cmp::PartialEq<rkyv::collections::btree_set::ArchivedBTreeSet<AK>> for std::collections::BTreeSet<K>
  569. 303.41 s [gammaloop-workspace-clippy] where AK: std::cmp::PartialEq<K>;
  570. 303.41 s [gammaloop-workspace-clippy] - impl<T, A> std::cmp::PartialEq for std::collections::BTreeSet<T, A>
  571. 303.42 s [gammaloop-workspace-clippy] where T: std::cmp::PartialEq, A: std::alloc::Allocator, A: std::clone::Clone;
  572. 303.42 s [gammaloop-workspace-clippy] help: consider specifying the generic argument
  573. 303.42 s [gammaloop-workspace-clippy] |
  574. 303.42 s [gammaloop-workspace-clippy] 4098 | assert_eq!(orders, [1, 2].into_iter().collect::<Vec<_>>());
  575. 303.42 s [gammaloop-workspace-clippy] | ++++++++++
  576. 303.42 s [gammaloop-workspace-clippy]
  577. 303.50 s [gammaloop-workspace-clippy] error[E0283]: type annotations needed
  578. 303.50 s [gammaloop-workspace-clippy] --> crates/gammalooprs/src/processes/amplitude.rs:4129:48
  579. 303.50 s [gammaloop-workspace-clippy] |
  580. 303.50 s [gammaloop-workspace-clippy] 4123 | / assert_eq!(
  581. 303.50 s [gammaloop-workspace-clippy] 4124 | | evaluator
  582. 303.50 s [gammaloop-workspace-clippy] 4125 | | .evaluator_stacks
  583. 303.50 s [gammaloop-workspace-clippy] 4126 | | .keys()
  584. 303.50 s [gammaloop-workspace-clippy] ... |
  585. 303.50 s [gammaloop-workspace-clippy] 4129 | | [1, 2].into_iter().collect()
  586. 303.50 s [gammaloop-workspace-clippy] | | ^^^^^^^ cannot infer type of the type parameter `B` declared on the method `collect`
  587. 303.50 s [gammaloop-workspace-clippy] 4130 | | );
  588. 303.50 s [gammaloop-workspace-clippy] | |_________________________- type must be known at this point
  589. 303.50 s [gammaloop-workspace-clippy] |
  590. 303.50 s [gammaloop-workspace-clippy] = note: multiple `impl`s satisfying `std::collections::BTreeSet<usize>: std::cmp::PartialEq<_>` found in the following crates: `alloc`, `rkyv`:
  591. 303.50 s [gammaloop-workspace-clippy] - impl<K, AK> std::cmp::PartialEq<rkyv::collections::btree_set::ArchivedBTreeSet<AK>> for std::collections::BTreeSet<K>
  592. 303.50 s [gammaloop-workspace-clippy] where AK: std::cmp::PartialEq<K>;
  593. 303.50 s [gammaloop-workspace-clippy] - impl<T, A> std::cmp::PartialEq for std::collections::BTreeSet<T, A>
  594. 303.50 s [gammaloop-workspace-clippy] where T: std::cmp::PartialEq, A: std::alloc::Allocator, A: std::clone::Clone;
  595. 303.50 s [gammaloop-workspace-clippy] help: consider specifying the generic argument
  596. 303.50 s [gammaloop-workspace-clippy] |
  597. 303.50 s [gammaloop-workspace-clippy] 4129 | [1, 2].into_iter().collect::<Vec<_>>()
  598. 303.50 s [gammaloop-workspace-clippy] | ++++++++++
  599. 303.50 s [gammaloop-workspace-clippy]
  600. 303.53 s [gammaloop-workspace-clippy] error[E0283]: type annotations needed
  601. 303.53 s [gammaloop-workspace-clippy] --> crates/gammalooprs/src/processes/amplitude.rs:4160:30
  602. 303.53 s [gammaloop-workspace-clippy] |
  603. 303.53 s [gammaloop-workspace-clippy] 4148 | / assert_eq!(
  604. 303.53 s [gammaloop-workspace-clippy] 4149 | | registry
  605. 303.53 s [gammaloop-workspace-clippy] 4150 | | .components
  606. 303.53 s [gammaloop-workspace-clippy] 4151 | | .iter()
  607. 303.53 s [gammaloop-workspace-clippy] ... |
  608. 303.53 s [gammaloop-workspace-clippy] 4160 | | .collect()
  609. 303.53 s [gammaloop-workspace-clippy] | | ^^^^^^^ cannot infer type of the type parameter `B` declared on the method `collect`
  610. 303.53 s [gammaloop-workspace-clippy] 4161 | | );
  611. 303.53 s [gammaloop-workspace-clippy] | |_________________________- type must be known at this point
  612. 303.53 s [gammaloop-workspace-clippy] |
  613. 303.53 s [gammaloop-workspace-clippy] = note: multiple `impl`s satisfying `std::collections::BTreeSet<processes::threshold_counterterms::ThresholdCountertermComponentKind>: std::cmp::PartialEq<_>` found in the following crates: `alloc`, `rkyv`:
  614. 303.53 s [gammaloop-workspace-clippy] - impl<K, AK> std::cmp::PartialEq<rkyv::collections::btree_set::ArchivedBTreeSet<AK>> for std::collections::BTreeSet<K>
  615. 303.53 s [gammaloop-workspace-clippy] where AK: std::cmp::PartialEq<K>;
  616. 303.53 s [gammaloop-workspace-clippy] - impl<T, A> std::cmp::PartialEq for std::collections::BTreeSet<T, A>
  617. 303.53 s [gammaloop-workspace-clippy] where T: std::cmp::PartialEq, A: std::alloc::Allocator, A: std::clone::Clone;
  618. 303.53 s [gammaloop-workspace-clippy] help: consider specifying the generic argument
  619. 303.53 s [gammaloop-workspace-clippy] |
  620. 303.53 s [gammaloop-workspace-clippy] 4160 | .collect::<Vec<_>>()
  621. 303.53 s [gammaloop-workspace-clippy] | ++++++++++
  622. 303.53 s [gammaloop-workspace-clippy]
  623. 303.56 s [gammaloop-workspace-clippy] error[E0283]: type annotations needed
  624. 303.56 s [gammaloop-workspace-clippy] --> crates/gammalooprs/src/processes/amplitude.rs:4214:26
  625. 303.56 s [gammaloop-workspace-clippy] |
  626. 303.56 s [gammaloop-workspace-clippy] 4201 | / assert_eq!(
  627. 303.56 s [gammaloop-workspace-clippy] 4202 | | decomposition
  628. 303.56 s [gammaloop-workspace-clippy] 4203 | | .components
  629. 303.56 s [gammaloop-workspace-clippy] 4204 | | .iter()
  630. 303.56 s [gammaloop-workspace-clippy] ... |
  631. 303.56 s [gammaloop-workspace-clippy] 4214 | | .collect()
  632. 303.56 s [gammaloop-workspace-clippy] | | ^^^^^^^ cannot infer type of the type parameter `B` declared on the method `collect`
  633. 303.56 s [gammaloop-workspace-clippy] 4215 | | );
  634. 303.56 s [gammaloop-workspace-clippy] | |_____________________- type must be known at this point
  635. 303.56 s [gammaloop-workspace-clippy] |
  636. 303.56 s [gammaloop-workspace-clippy] = note: multiple `impl`s satisfying `std::collections::BTreeSet<processes::threshold_counterterms::ThresholdCountertermComponentKind>: std::cmp::PartialEq<_>` found in the following crates: `alloc`, `rkyv`:
  637. 303.56 s [gammaloop-workspace-clippy] - impl<K, AK> std::cmp::PartialEq<rkyv::collections::btree_set::ArchivedBTreeSet<AK>> for std::collections::BTreeSet<K>
  638. 303.56 s [gammaloop-workspace-clippy] where AK: std::cmp::PartialEq<K>;
  639. 303.56 s [gammaloop-workspace-clippy] - impl<T, A> std::cmp::PartialEq for std::collections::BTreeSet<T, A>
  640. 303.56 s [gammaloop-workspace-clippy] where T: std::cmp::PartialEq, A: std::alloc::Allocator, A: std::clone::Clone;
  641. 303.56 s [gammaloop-workspace-clippy] help: consider specifying the generic argument
  642. 303.56 s [gammaloop-workspace-clippy] |
  643. 303.56 s [gammaloop-workspace-clippy] 4214 | .collect::<Vec<_>>()
  644. 303.56 s [gammaloop-workspace-clippy] | ++++++++++
  645. 303.56 s [gammaloop-workspace-clippy]
  646. 303.69 s [gammaloop-workspace-clippy] error[E0277]: can't compare `std::option::Option<&[linnet::half_edge::involution::EdgeIndex]>` with `std::option::Option<&[linnet::half_edge::involution::EdgeIndex; 1]>`
  647. 303.69 s [gammaloop-workspace-clippy] --> crates/gammalooprs/src/processes/cross_section/ir_safe_threshold_fixture_tests.rs:817:25
  648. 303.69 s [gammaloop-workspace-clippy] |
  649. 303.69 s [gammaloop-workspace-clippy] 816 | .any(|variant| variant.requested_subspace.as_deref()
  650. 303.69 s [gammaloop-workspace-clippy] | -------------------------------------
  651. 303.69 s [gammaloop-workspace-clippy] 817 | == Some(&[EdgeIndex::from(3)])),
  652. 303.69 s [gammaloop-workspace-clippy] | ^^ ---------------------------
  653. 303.69 s [gammaloop-workspace-clippy] | |
  654. 303.69 s [gammaloop-workspace-clippy] | no implementation for `std::option::Option<&[linnet::half_edge::involution::EdgeIndex]> == std::option::Option<&[linnet::half_edge::involution::EdgeIndex; 1]>`
  655. 303.69 s [gammaloop-workspace-clippy] |
  656. 303.70 s [gammaloop-workspace-clippy] = help: the trait `std::cmp::PartialEq<std::option::Option<&[linnet::half_edge::involution::EdgeIndex; 1]>>` is not implemented for `std::option::Option<&[linnet::half_edge::involution::EdgeIndex]>`
  657. 303.70 s [gammaloop-workspace-clippy] help: the following other types implement trait `std::cmp::PartialEq<Rhs>`
  658. 303.70 s [gammaloop-workspace-clippy] --> /rustc/2d8144b7880597b6e6d3dfd63a9a9efae3f533d3/library/core/src/option.rs:2434:0
  659. 303.70 s [gammaloop-workspace-clippy] |
  660. 303.70 s [gammaloop-workspace-clippy] = note: `std::option::Option<T>` implements `std::cmp::PartialEq`
  661. 303.70 s [gammaloop-workspace-clippy] |
  662. 303.70 s [gammaloop-workspace-clippy] ::: /nix/store/8zq9ya5slh345hbylmsibxw827bi98w0-vendor-cargo-deps/c19b7c6f923b580ac259164a89f2577984ad5ab09ee9d583b888f934adbbe8d0/rkyv-0.7.46/src/option.rs:210:1
  663. 303.70 s [gammaloop-workspace-clippy] |
  664. 303.70 s [gammaloop-workspace-clippy] 210 | impl<T: PartialEq<U>, U> PartialEq<ArchivedOption<T>> for Option<U> {
  665. 303.70 s [gammaloop-workspace-clippy] | ^^^^^^^^^^^^^^^^^^^^^^^^^^^^^^^^^^^^^^^^^^^^^^^^^^^^^^^^^^^^^^^^^^^ `std::option::Option<U>` implements `std::cmp::PartialEq<rkyv::option::ArchivedOption<T>>`
  666. 303.70 s [gammaloop-workspace-clippy] |
  667. 303.70 s [gammaloop-workspace-clippy] ::: /nix/store/8zq9ya5slh345hbylmsibxw827bi98w0-vendor-cargo-deps/c19b7c6f923b580ac259164a89f2577984ad5ab09ee9d583b888f934adbbe8d0/rkyv-0.7.46/src/impls/alloc/niche.rs:24:1
  668. 303.70 s [gammaloop-workspace-clippy] |
  669. 303.70 s [gammaloop-workspace-clippy] 24 | / impl<T, U> PartialEq<ArchivedOptionBox<T>> for Option<Box<U>>
  670. 303.70 s [gammaloop-workspace-clippy] 25 | | where
  671. 303.70 s [gammaloop-workspace-clippy] 26 | | T: ArchivePointee + PartialEq<U> + ?Sized,
  672. 303.70 s [gammaloop-workspace-clippy] 27 | | U: ?Sized,
  673. 303.70 s [gammaloop-workspace-clippy] | |______________^ `std::option::Option<std::boxed::Box<U>>` implements `std::cmp::PartialEq<rkyv::niche::option_box::ArchivedOptionBox<T>>`
  674. 303.70 s [gammaloop-workspace-clippy]
  675. 304.30 s [gammaloop-workspace-clippy] error[E0283]: type annotations needed
  676. 304.30 s [gammaloop-workspace-clippy] --> crates/gammalooprs/src/processes/no_directive_equivalence_tests.rs:459:43
  677. 304.30 s [gammaloop-workspace-clippy] |
  678. 304.30 s [gammaloop-workspace-clippy] 459 | (0..graph.cuts.len()).collect(),
  679. 304.30 s [gammaloop-workspace-clippy] | ^^^^^^^ cannot infer type of the type parameter `B` declared on the method `collect`
  680. 304.30 s [gammaloop-workspace-clippy] |
  681. 304.30 s [gammaloop-workspace-clippy] = note: multiple `impl`s satisfying `_: std::iter::FromIterator<usize>` found in the following crates: `spenso`, `tabled`:
  682. 304.30 s [gammaloop-workspace-clippy] - impl std::iter::FromIterator<usize> for spenso::structure::concrete_index::ExpandedIndex;
  683. 304.30 s [gammaloop-workspace-clippy] - impl std::iter::FromIterator<usize> for tabled::settings::height::HeightList;
  684. 304.30 s [gammaloop-workspace-clippy] - impl std::iter::FromIterator<usize> for tabled::settings::width::WidthList;
  685. 304.30 s [gammaloop-workspace-clippy] note: required by a bound in `std::iter::Iterator::collect`
  686. 304.30 s [gammaloop-workspace-clippy] --> /rustc/2d8144b7880597b6e6d3dfd63a9a9efae3f533d3/library/core/src/iter/traits/iterator.rs:2077:4
  687. 304.30 s [gammaloop-workspace-clippy] help: consider specifying the generic argument
  688. 304.30 s [gammaloop-workspace-clippy] |
  689. 304.30 s [gammaloop-workspace-clippy] 459 | (0..graph.cuts.len()).collect::<Vec<_>>(),
  690. 304.30 s [gammaloop-workspace-clippy] | ++++++++++
  691. 304.30 s [gammaloop-workspace-clippy]
  692. 304.30 s [gammaloop-workspace-clippy] error[E0283]: type annotations needed
  693. 304.30 s [gammaloop-workspace-clippy] --> crates/gammalooprs/src/processes/no_directive_equivalence_tests.rs:459:43
  694. 304.30 s [gammaloop-workspace-clippy] |
  695. 304.30 s [gammaloop-workspace-clippy] 457 | / assert_eq!(
  696. 304.30 s [gammaloop-workspace-clippy] 458 | | grouped_cut_ids,
  697. 304.30 s [gammaloop-workspace-clippy] 459 | | (0..graph.cuts.len()).collect(),
  698. 304.30 s [gammaloop-workspace-clippy] | | ^^^^^^^ cannot infer type of the type parameter `B` declared on the method `collect`
  699. 304.30 s [gammaloop-workspace-clippy] 460 | | "every discovered process-valid cut must remain in the numerical LU evaluation",
  700. 304.30 s [gammaloop-workspace-clippy] 461 | | );
  701. 304.30 s [gammaloop-workspace-clippy] | |_________________- type must be known at this point
  702. 304.30 s [gammaloop-workspace-clippy] |
  703. 304.30 s [gammaloop-workspace-clippy] = note: multiple `impl`s satisfying `std::collections::BTreeSet<usize>: std::cmp::PartialEq<_>` found in the following crates: `alloc`, `rkyv`:
  704. 304.30 s [gammaloop-workspace-clippy] - impl<K, AK> std::cmp::PartialEq<rkyv::collections::btree_set::ArchivedBTreeSet<AK>> for std::collections::BTreeSet<K>
  705. 304.30 s [gammaloop-workspace-clippy] where AK: std::cmp::PartialEq<K>;
  706. 304.30 s [gammaloop-workspace-clippy] - impl<T, A> std::cmp::PartialEq for std::collections::BTreeSet<T, A>
  707. 304.30 s [gammaloop-workspace-clippy] where T: std::cmp::PartialEq, A: std::alloc::Allocator, A: std::clone::Clone;
  708. 304.30 s [gammaloop-workspace-clippy] help: consider specifying the generic argument
  709. 304.30 s [gammaloop-workspace-clippy] |
  710. 304.30 s [gammaloop-workspace-clippy] 459 | (0..graph.cuts.len()).collect::<Vec<_>>(),
  711. 304.30 s [gammaloop-workspace-clippy] | ++++++++++
  712. 304.30 s [gammaloop-workspace-clippy]
  713. 304.32 s [gammaloop-workspace-clippy] error[E0283]: type annotations needed
  714. 304.32 s [gammaloop-workspace-clippy] --> crates/gammalooprs/src/processes/raised_cross_section_tests.rs:150:31
  715. 304.32 s [gammaloop-workspace-clippy] |
  716. 304.32 s [gammaloop-workspace-clippy] 150 | (0..graph.cuts.len()).collect(),
  717. 304.32 s [gammaloop-workspace-clippy] | ^^^^^^^ cannot infer type of the type parameter `B` declared on the method `collect`
  718. 304.32 s [gammaloop-workspace-clippy] |
  719. 304.32 s [gammaloop-workspace-clippy] = note: multiple `impl`s satisfying `_: std::iter::FromIterator<usize>` found in the following crates: `spenso`, `tabled`:
  720. 304.32 s [gammaloop-workspace-clippy] - impl std::iter::FromIterator<usize> for spenso::structure::concrete_index::ExpandedIndex;
  721. 304.32 s [gammaloop-workspace-clippy] - impl std::iter::FromIterator<usize> for tabled::settings::height::HeightList;
  722. 304.32 s [gammaloop-workspace-clippy] - impl std::iter::FromIterator<usize> for tabled::settings::width::WidthList;
  723. 304.32 s [gammaloop-workspace-clippy] note: required by a bound in `std::iter::Iterator::collect`
  724. 304.32 s [gammaloop-workspace-clippy] --> /rustc/2d8144b7880597b6e6d3dfd63a9a9efae3f533d3/library/core/src/iter/traits/iterator.rs:2077:4
  725. 304.32 s [gammaloop-workspace-clippy] help: consider specifying the generic argument
  726. 304.32 s [gammaloop-workspace-clippy] |
  727. 304.32 s [gammaloop-workspace-clippy] 150 | (0..graph.cuts.len()).collect::<Vec<_>>(),
  728. 304.32 s [gammaloop-workspace-clippy] | ++++++++++
  729. 304.32 s [gammaloop-workspace-clippy]
  730. 304.32 s [gammaloop-workspace-clippy] error[E0283]: type annotations needed
  731. 304.32 s [gammaloop-workspace-clippy] --> crates/gammalooprs/src/processes/raised_cross_section_tests.rs:150:31
  732. 304.32 s [gammaloop-workspace-clippy] |
  733. 304.32 s [gammaloop-workspace-clippy] 148 | / assert_eq!(
  734. 304.32 s [gammaloop-workspace-clippy] 149 | | grouped_cut_ids,
  735. 304.32 s [gammaloop-workspace-clippy] 150 | | (0..graph.cuts.len()).collect(),
  736. 304.32 s [gammaloop-workspace-clippy] | | ^^^^^^^ cannot infer type of the type parameter `B` declared on the method `collect`
  737. 304.32 s [gammaloop-workspace-clippy] 151 | | "every discovered process-valid cut must remain in the numerical LU evaluation",
  738. 304.32 s [gammaloop-workspace-clippy] 152 | | );
  739. 304.32 s [gammaloop-workspace-clippy] | |_____- type must be known at this point
  740. 304.32 s [gammaloop-workspace-clippy] |
  741. 304.32 s [gammaloop-workspace-clippy] = note: multiple `impl`s satisfying `std::collections::BTreeSet<usize>: std::cmp::PartialEq<_>` found in the following crates: `alloc`, `rkyv`:
  742. 304.32 s [gammaloop-workspace-clippy] - impl<K, AK> std::cmp::PartialEq<rkyv::collections::btree_set::ArchivedBTreeSet<AK>> for std::collections::BTreeSet<K>
  743. 304.32 s [gammaloop-workspace-clippy] where AK: std::cmp::PartialEq<K>;
  744. 304.32 s [gammaloop-workspace-clippy] - impl<T, A> std::cmp::PartialEq for std::collections::BTreeSet<T, A>
  745. 304.32 s [gammaloop-workspace-clippy] where T: std::cmp::PartialEq, A: std::alloc::Allocator, A: std::clone::Clone;
  746. 304.32 s [gammaloop-workspace-clippy] help: consider specifying the generic argument
  747. 304.32 s [gammaloop-workspace-clippy] |
  748. 304.32 s [gammaloop-workspace-clippy] 150 | (0..graph.cuts.len()).collect::<Vec<_>>(),
  749. 304.32 s [gammaloop-workspace-clippy] | ++++++++++
  750. 304.32 s [gammaloop-workspace-clippy]
  751. 310.78 s [gammaloop-workspace-clippy] error: method `lu_prefactor_helper` is never used
  752. 310.78 s [gammaloop-workspace-clippy] --> crates/gammalooprs/src/processes/cross_section.rs:1965:8
  753. 310.78 s [gammaloop-workspace-clippy] |
  754. 310.78 s [gammaloop-workspace-clippy] 1429 | impl CrossSectionGraph {
  755. 310.78 s [gammaloop-workspace-clippy] | ---------------------- method in this implementation
  756. 310.78 s [gammaloop-workspace-clippy] ...
  757. 310.78 s [gammaloop-workspace-clippy] 1965 | fn lu_prefactor_helper(&self) -> Atom {
  758. 310.78 s [gammaloop-workspace-clippy] | ^^^^^^^^^^^^^^^^^^^
  759. 310.78 s [gammaloop-workspace-clippy] |
  760. 310.78 s [gammaloop-workspace-clippy] = note: `-D dead-code` implied by `-D warnings`
  761. 310.78 s [gammaloop-workspace-clippy] = help: to override `-D warnings` add `#[expect(dead_code)]` or `#[allow(dead_code)]`
  762. 310.78 s [gammaloop-workspace-clippy]
  763. 316.50 s [gammaloop-workspace-clippy] error: this `if` statement can be collapsed
  764. 316.50 s [gammaloop-workspace-clippy] --> crates/gammalooprs/src/subtraction/amplitude_counterterm.rs:938:17
  765. 316.50 s [gammaloop-workspace-clippy] |
  766. 316.50 s [gammaloop-workspace-clippy] 938 | / if let Some(group_id) = metadata.group_id {
  767. 316.50 s [gammaloop-workspace-clippy] 939 | | if let Some((_, members)) = groups.iter().find(|(id, _)| *id == Some(group_id))
  768. 316.50 s [gammaloop-workspace-clippy] 940 | | {
  769. 316.50 s [gammaloop-workspace-clippy] 941 | | let first = members[0];
  770. 316.50 s [gammaloop-workspace-clippy] ... |
  771. 316.50 s [gammaloop-workspace-clippy] 956 | | }
  772. 316.50 s [gammaloop-workspace-clippy] | |_________________^
  773. 316.50 s [gammaloop-workspace-clippy] |
  774. 316.50 s [gammaloop-workspace-clippy] = help: for further information visit https://rust-lang.github.io/rust-clippy/rust-1.97.0/index.html#collapsible_if
  775. 316.50 s [gammaloop-workspace-clippy] = note: `-D clippy::collapsible-if` implied by `-D warnings`
  776. 316.50 s [gammaloop-workspace-clippy] = help: to override `-D warnings` add `#[allow(clippy::collapsible_if)]`
  777. 316.50 s [gammaloop-workspace-clippy] help: collapse nested if block
  778. 316.50 s [gammaloop-workspace-clippy] |
  779. 316.50 s [gammaloop-workspace-clippy] 938 ~ if let Some(group_id) = metadata.group_id
  780. 316.50 s [gammaloop-workspace-clippy] 939 ~ && let Some((_, members)) = groups.iter().find(|(id, _)| *id == Some(group_id))
  781. 316.50 s [gammaloop-workspace-clippy] 940 | {
  782. 316.50 s [gammaloop-workspace-clippy] ...
  783. 316.50 s [gammaloop-workspace-clippy] 954 | ));
  784. 316.50 s [gammaloop-workspace-clippy] 955 ~ }
  785. 316.50 s [gammaloop-workspace-clippy] |
  786. 316.50 s [gammaloop-workspace-clippy]
  787. 316.50 s [gammaloop-workspace-clippy] error: this function has too many arguments (13/7)
  788. 316.50 s [gammaloop-workspace-clippy] --> crates/gammalooprs/src/subtraction/amplitude_counterterm.rs:994:5
  789. 316.50 s [gammaloop-workspace-clippy] |
  790. 316.50 s [gammaloop-workspace-clippy] 994 | / fn evaluate_variant_group<T: FloatLike>(
  791. 316.50 s [gammaloop-workspace-clippy] 995 | | &mut self,
  792. 316.50 s [gammaloop-workspace-clippy] 996 | | momentum_sample: &MomentumSample<T>,
  793. 316.50 s [gammaloop-workspace-clippy] 997 | | graph: &Graph,
  794. 316.50 s [gammaloop-workspace-clippy] ... |
  795. 316.50 s [gammaloop-workspace-clippy] 1007 | | allowed_variant_ids: Option<&[ThresholdCountertermVariantId]>,
  796. 316.50 s [gammaloop-workspace-clippy] 1008 | | ) -> Result<AmplitudeCountertermEvaluation<T>> {
  797. 316.50 s [gammaloop-workspace-clippy] | |__________________________________________________^
  798. 316.50 s [gammaloop-workspace-clippy] |
  799. 316.50 s [gammaloop-workspace-clippy] = help: for further information visit https://rust-lang.github.io/rust-clippy/rust-1.97.0/index.html#too_many_arguments
  800. 316.50 s [gammaloop-workspace-clippy] = note: `-D clippy::too-many-arguments` implied by `-D warnings`
  801. 316.50 s [gammaloop-workspace-clippy] = help: to override `-D warnings` add `#[allow(clippy::too_many_arguments)]`
  802. 316.50 s [gammaloop-workspace-clippy]
  803. 316.51 s [gammaloop-workspace-clippy] error: this `if` statement can be collapsed
  804. 316.51 s [gammaloop-workspace-clippy] --> crates/gammalooprs/src/subtraction/amplitude_counterterm.rs:1359:17
  805. 316.51 s [gammaloop-workspace-clippy] |
  806. 316.51 s [gammaloop-workspace-clippy] 1359 | / if let Some(group_id) = metadata.group_id {
  807. 316.51 s [gammaloop-workspace-clippy] 1360 | | if let Some((_, _, members)) =
  808. 316.51 s [gammaloop-workspace-clippy] 1361 | | groups.iter().find(|(id, _, _)| *id == Some(group_id))
  809. 316.51 s [gammaloop-workspace-clippy] ... |
  810. 316.51 s [gammaloop-workspace-clippy] 1378 | | }
  811. 316.51 s [gammaloop-workspace-clippy] | |_________________^
  812. 316.51 s [gammaloop-workspace-clippy] |
  813. 316.51 s [gammaloop-workspace-clippy] = help: for further information visit https://rust-lang.github.io/rust-clippy/rust-1.97.0/index.html#collapsible_if
  814. 316.51 s [gammaloop-workspace-clippy] help: collapse nested if block
  815. 316.51 s [gammaloop-workspace-clippy] |
  816. 316.51 s [gammaloop-workspace-clippy] 1359 ~ if let Some(group_id) = metadata.group_id
  817. 316.51 s [gammaloop-workspace-clippy] 1360 ~ && let Some((_, _, members)) =
  818. 316.51 s [gammaloop-workspace-clippy] 1361 | groups.iter().find(|(id, _, _)| *id == Some(group_id))
  819. 316.51 s [gammaloop-workspace-clippy] ...
  820. 316.51 s [gammaloop-workspace-clippy] 1376 | ));
  821. 316.51 s [gammaloop-workspace-clippy] 1377 ~ }
  822. 316.51 s [gammaloop-workspace-clippy] |
  823. 316.51 s [gammaloop-workspace-clippy]
  824. 316.63 s [gammaloop-workspace-clippy] error: this function has too many arguments (8/7)
  825. 316.63 s [gammaloop-workspace-clippy] --> crates/gammalooprs/src/subtraction/lu_counterterm.rs:1197:5
  826. 316.63 s [gammaloop-workspace-clippy] |
  827. 316.63 s [gammaloop-workspace-clippy] 1197 | / pub fn from_atoms(
  828. 316.63 s [gammaloop-workspace-clippy] 1198 | | counterterm_data: &LUCounterTermData,
  829. 316.63 s [gammaloop-workspace-clippy] 1199 | | max_cut_order: usize,
  830. 316.63 s [gammaloop-workspace-clippy] 1200 | | threshold_helpers: LUThresholdHelperEvaluators,
  831. 316.63 s [gammaloop-workspace-clippy] ... |
  832. 316.63 s [gammaloop-workspace-clippy] 1205 | | production_orientation_ids: &[OrientationID],
  833. 316.63 s [gammaloop-workspace-clippy] 1206 | | ) -> (Self, EvaluatorBuildTimings) {
  834. 316.63 s [gammaloop-workspace-clippy] | |______________________________________^
  835. 316.63 s [gammaloop-workspace-clippy] |
  836. 316.63 s [gammaloop-workspace-clippy] = help: for further information visit https://rust-lang.github.io/rust-clippy/rust-1.97.0/index.html#too_many_arguments
  837. 316.63 s [gammaloop-workspace-clippy]
  838. 318.75 s [gammaloop-workspace-clippy] Some errors have detailed explanations: E0277, E0283.
  839. 318.75 s [gammaloop-workspace-clippy] For more information about an error, try `rustc --explain E0277`.
  840. 318.77 s [gammaloop-workspace-clippy] error: could not compile `gammalooprs` (lib) due to 5 previous errors
  841. 318.77 s [gammaloop-workspace-clippy] warning: build failed, waiting for other jobs to finish...
  842. 318.87 s [gammaloop-workspace-clippy] error: could not compile `gammalooprs` (lib test) due to 16 previous errors
  843. 319.46 s Progress: 0 of 1 built (1 failed)
  844. 319.46 s Failed to build gammaloop-workspace-clippy after 5m13s
  845. 319.47 s Cannot build '/nix/store/bfvd4racaxf8cd9mpzlpz54h91n6g02c-gammaloop-workspace-clippy-0.1.0.drv'.
  846. 319.47 s Reason: builder failed with exit code 101.
  847. 319.47 s Output paths:
  848. 319.47 s /nix/store/q9icfkcxyilyy0y4bfigad3kv8g0svbq-gammaloop-workspace-clippy-0.1.0
  849. 319.47 s Last 839 log lines:
  850. 319.47 s > Running phase: unpackPhase
  851. 319.47 s > unpacking source archive /nix/store/bcy0vqqk2ibk38nik2bb809ck03m92g2-source
  852. 319.47 s > source root is source
  853. 319.47 s > Running phase: patchPhase
  854. 319.47 s > Executing configureCargoCommonVars
  855. 319.47 s > decompressing cargo artifacts from /nix/store/wxpx6lf642pgxp2wz1pw1lxksj5p1wb0-gammaloop-workspace-deps-deps-0.1.0/target.tar.zst to target
  856. 319.47 s > Running phase: updateAutotoolsGnuConfigScriptsPhase
  857. 319.47 s > Running phase: configurePhase
  858. 319.47 s > will append /build/source/.cargo-home/config.toml with contents of /nix/store/8zq9ya5slh345hbylmsibxw827bi98w0-vendor-cargo-deps/config.toml
  859. 319.47 s > default configurePhase, nothing to do
  860. 319.47 s > Running phase: buildPhase
  861. 319.47 s > +++ command cargo --version
  862. 319.47 s > cargo 1.97.0 (c980f4866 2026-06-30)
  863. 319.47 s > +++ command cargo clippy --profile ci-optim --locked --workspace --features gammaloop-tracing-filter/clap,gammaloop-tracing-filter/symbolica,idenso/bincode,idenso/reference-cases,linnet/bincode,linnet/drawing,linnet/rkyv,linnet/serde,linnet/symbolica,spenso-macros/shadowing,spenso/shadowing,symbolica/tracing_max_level_info,three-dimensional-reps/display,three-dimensional-reps/eval,three-dimensional-reps/serde --all-targets --no-deps -- --deny warnings
  864. 319.47 s > Checking cfg-if v1.0.4
  865. 319.47 s > Checking memchr v2.8.0
  866. 319.47 s > Checking once_cell v1.21.4
  867. 319.47 s > Checking either v1.15.0
  868. 319.47 s > Checking itoa v1.0.18
  869. 319.47 s > Checking serde_core v1.0.228
  870. 319.47 s > Checking libc v0.2.186
  871. 319.47 s > Checking libm v0.2.16
  872. 319.47 s > Checking log v0.4.29
  873. 319.47 s > Checking zerocopy v0.8.48
  874. 319.47 s > Checking regex-syntax v0.8.10
  875. 319.47 s > Checking crossbeam-utils v0.8.21
  876. 319.47 s > Checking equivalent v1.0.2
  877. 319.47 s > Checking zmij v1.0.21
  878. 319.47 s > Checking lazy_static v1.5.0
  879. 319.47 s > Checking bytemuck v1.25.0
  880. 319.47 s > Compiling target-lexicon v0.13.5
  881. 319.47 s > Checking arrayvec v0.7.6
  882. 319.47 s > Checking powerfmt v0.2.0
  883. 319.47 s > Checking time-core v0.1.8
  884. 319.47 s > Checking itertools v0.14.0
  885. 319.47 s > Checking pin-project-lite v0.2.17
  886. 319.47 s > Checking num_threads v0.1.7
  887. 319.47 s > Checking deranged v0.5.8
  888. 319.47 s > Checking num-conv v0.2.1
  889. 319.47 s > Checking tracing-core v0.1.36
  890. 319.47 s > Checking foldhash v0.2.0
  891. 319.47 s > Checking allocator-api2 v0.2.21
  892. 319.47 s > Checking crossbeam-epoch v0.9.18
  893. 319.47 s > Checking const-random v0.1.18
  894. 319.47 s > Checking unty v0.0.4
  895. 319.47 s > Checking safe_arch v0.7.4
  896. 319.47 s > Checking nu-ansi-term v0.50.3
  897. 319.47 s > Checking winnow v1.0.2
  898. 319.47 s > Checking static_assertions v1.1.0
  899. 319.47 s > Checking aho-corasick v1.1.4
  900. 319.47 s > Checking safe_arch v1.0.0
  901. 319.47 s > Checking hashbrown v0.16.1
  902. 319.47 s > Checking tracing v0.1.44
  903. 319.47 s > Checking crossbeam-deque v0.8.6
  904. 319.47 s > Checking tracing-log v0.2.0
  905. 319.47 s > Checking wide v0.7.33
  906. 319.47 s > Checking rayon-core v1.13.0
  907. 319.47 s > Checking sharded-slab v0.1.7
  908. 319.47 s > Checking thread_local v1.1.9
  909. 319.47 s > Checking toml_writer v1.1.1+spec-1.1.0
  910. 319.47 s > Checking num-traits v0.2.19
  911. 319.47 s > Checking az v1.3.0
  912. 319.47 s > Checking indenter v0.3.4
  913. 319.47 s > Checking rayon v1.12.0
  914. 319.47 s > Checking wide v1.3.0
  915. 319.47 s > Compiling phf_shared v0.11.3
  916. 319.47 s > Checking anyhow v1.0.102
  917. 319.47 s > Checking rawpointer v0.2.1
  918. 319.47 s > Checking utf8parse v0.2.2
  919. 319.47 s > Checking dyn-clone v1.0.20
  920. 319.47 s > Checking alloc-no-stdlib v2.0.4
  921. 319.47 s > Checking anstyle-parse v1.0.0
  922. 319.47 s > Checking matrixmultiply v0.3.10
  923. 319.47 s > Checking colorchoice v1.0.5
  924. 319.47 s > Checking alloc-stdlib v0.2.2
  925. 319.47 s > Checking colored v3.1.1
  926. 319.47 s > Checking anstyle-query v1.1.5
  927. 319.47 s > Checking toml_parser v1.1.2+spec-1.1.0
  928. 319.47 s > Checking anstyle v1.0.14
  929. 319.47 s > Checking is_terminal_polyfill v1.70.2
  930. 319.47 s > Compiling phf_generator v0.11.3
  931. 319.47 s > Checking eyre v0.6.12
  932. 319.47 s > Checking approx v0.5.1
  933. 319.47 s > Checking getrandom v0.3.4
  934. 319.47 s > Checking time v0.3.47
  935. 319.47 s > Checking num-integer v0.1.46
  936. 319.47 s > Checking gmp-mpfr-sys v1.7.1
  937. 319.47 s > Checking anstream v1.0.0
  938. 319.47 s > Checking regex-automata v0.4.14
  939. 319.47 s > Checking unicode-width v0.2.2
  940. 319.47 s > Checking bitflags v1.3.2
  941. 319.47 s > Checking serde v1.0.228
  942. 319.47 s > Checking serde_json v1.0.149
  943. 319.47 s > Compiling pyo3-build-config v0.28.3
  944. 319.47 s > Checking bitflags v2.11.1
  945. 319.47 s > Checking serde_spanned v1.1.1
  946. 319.47 s > Checking toml_datetime v1.1.1+spec-1.1.0
  947. 319.47 s > Compiling phf_codegen v0.11.3
  948. 319.47 s > Checking region v3.0.2
  949. 319.47 s > Checking rand_core v0.9.5
  950. 319.47 s > Checking hugepage-rs v0.1.1
  951. 319.47 s > Checking wasmtime-jit-icache-coherence v34.0.2
  952. 319.47 s > Checking brotli-decompressor v5.0.0
  953. 319.47 s > Checking toml v1.1.2+spec-1.1.0
  954. 319.47 s > Checking spec_math v0.1.6
  955. 319.47 s > Checking inventory v0.3.24
  956. 319.47 s > Checking thiserror v2.0.18
  957. 319.47 s > Compiling getopts v0.2.24
  958. 319.47 s > Checking libloading v0.9.0
  959. 319.47 s > Checking tinyjson v2.5.1
  960. 319.47 s > Checking append-only-vec v0.1.8
  961. 319.47 s > Checking byteorder v1.5.0
  962. 319.47 s > Checking self_cell v1.2.2
  963. 319.47 s > Checking bytes v1.11.1
  964. 319.47 s > Compiling unic-common v0.9.0
  965. 319.47 s > Compiling unic-char-range v0.9.0
  966. 319.47 s > Checking linux-raw-sys v0.12.1
  967. 319.47 s > Checking smallvec v1.15.1
  968. 319.47 s > Checking num-complex v0.4.6
  969. 319.47 s > Checking tracing-serde v0.2.0
  970. 319.47 s > Checking bincode v2.0.1
  971. 319.47 s > Checking smartstring v1.0.1
  972. 319.47 s > Compiling unicode_names2_generator v1.3.0
  973. 319.47 s > Compiling unic-ucd-version v0.9.0
  974. 319.47 s > Compiling unic-char-property v0.9.0
  975. 319.47 s > Checking rustix v1.1.4
  976. 319.47 s > Compiling is-macro v0.3.7
  977. 319.47 s > Compiling rustpython-parser-vendored v0.4.0
  978. 319.47 s > Checking ppv-lite86 v0.2.21
  979. 319.47 s > Checking ahash v0.8.12
  980. 319.47 s > Checking iana-time-zone v0.1.65
  981. 319.47 s > Compiling rustpython-parser v0.4.0
  982. 319.47 s > Checking chrono v0.4.44
  983. 319.47 s > Compiling phf v0.11.3
  984. 319.47 s > Checking simba v0.9.1
  985. 319.47 s > Checking rustc-hash v2.1.2
  986. 319.47 s > Checking ndarray v0.17.2
  987. 319.47 s > Checking brotli v8.0.2
  988. 319.47 s > Compiling unic-emoji-char v0.9.0
  989. 319.47 s > Checking rand_chacha v0.9.0
  990. 319.47 s > Compiling unic-ucd-ident v0.9.0
  991. 319.47 s > Checking rand v0.9.4
  992. 319.47 s > Compiling lalrpop-util v0.20.2
  993. 319.47 s > Compiling rustc-hash v1.1.0
  994. 319.47 s > Checking rug v1.30.0
  995. 319.47 s > Checking unicode-segmentation v1.13.2
  996. 319.47 s > Compiling symbolica v2.2.0 (https://github.com/alphal00p/symbolica?rev=4d0a833eb8e059d1f95bdae5abed2559830b235f#4d0a833e)
  997. 319.47 s > Checking typenum v1.20.0
  998. 319.47 s > Checking getrandom v0.2.17
  999. 319.47 s > Checking scopeguard v1.2.0
  1000. 319.47 s > Checking lock_api v0.4.14
  1001. 319.47 s > Checking parking_lot_core v0.9.12
  1002. 319.47 s > Checking symjit v2.21.0
  1003. 319.47 s > Checking hashbrown v0.17.0
  1004. 319.47 s > Checking unicode-ident v1.0.24
  1005. 319.47 s > Checking parking_lot v0.12.5
  1006. 319.47 s > Checking errno v0.3.14
  1007. 319.47 s > Checking clap_lex v1.1.0
  1008. 319.47 s > Checking strsim v0.11.1
  1009. 319.47 s > Checking unicase v2.9.0
  1010. 319.47 s > Checking terminal_size v0.4.4
  1011. 319.47 s > Checking signal-hook-registry v1.4.8
  1012. 319.47 s > Checking vte v0.14.1
  1013. 319.47 s > Checking same-file v1.0.6
  1014. 319.47 s > Checking clap_builder v4.6.0
  1015. 319.47 s > Checking half v2.7.1
  1016. 319.47 s > Checking signal-hook v0.3.18
  1017. 319.47 s > Checking walkdir v2.5.0
  1018. 319.47 s > Checking mio v1.2.0
  1019. 319.47 s > Checking minimal-lexical v0.2.1
  1020. 319.47 s > Checking ciborium-io v0.2.2
  1021. 319.47 s > Checking generic-array v0.14.7
  1022. 319.47 s > Checking ciborium-ll v0.2.2
  1023. 319.47 s > Checking indexmap v2.14.0
  1024. 319.47 s > Checking derive_more v2.1.1
  1025. 319.47 s > Checking num-bigint v0.4.6
  1026. 319.47 s > Checking nom v7.1.3
  1027. 319.47 s > Checking signal-hook-mio v0.2.5
  1028. 319.47 s > Checking console v0.16.3
  1029. 319.47 s > Checking matchers v0.2.0
  1030. 319.47 s > Checking tracing-subscriber v0.3.23
  1031. 319.47 s > Checking regex v1.12.3
  1032. 319.47 s > Checking crypto-common v0.1.7
  1033. 319.47 s > Checking block-buffer v0.10.4
  1034. 319.47 s > Checking digest v0.10.7
  1035. 319.47 s > Checking bstr v1.12.1
  1036. 319.47 s > Checking cpufeatures v0.2.17
  1037. 319.47 s > Checking winnow v0.7.15
  1038. 319.47 s > Checking linux-raw-sys v0.4.15
  1039. 319.47 s > Compiling unicode_names2 v1.3.0
  1040. 319.47 s > Checking rustix v0.38.44
  1041. 319.47 s > Checking sha2 v0.10.9
  1042. 319.47 s > Checking globset v0.4.18
  1043. 319.47 s > Checking clap v4.6.1
  1044. 319.47 s > Checking ansitok v0.3.0
  1045. 319.47 s > Checking ciborium v0.2.2
  1046. 319.47 s > Checking rand_core v0.6.4
  1047. 319.47 s > Checking getrandom v0.4.2
  1048. 319.47 s > Checking fastrand v2.4.1
  1049. 319.47 s > Checking plotters-backend v0.3.7
  1050. 319.47 s > Checking fnv v1.0.7
  1051. 319.47 s > Checking rust-embed-utils v8.11.0
  1052. 319.47 s > Checking serde_spanned v0.6.9
  1053. 319.47 s > Checking tempfile v3.27.0
  1054. 319.47 s > Checking toml_datetime v0.6.11
  1055. 319.47 s > Checking crossterm v0.28.1
  1056. 319.47 s > Checking itertools v0.10.5
  1057. 319.47 s > Checking tap v1.0.1
  1058. 319.47 s > Checking cast v0.3.0
  1059. 319.47 s > Checking plotters-svg v0.3.7
  1060. 319.47 s > Checking toml_write v0.1.2
  1061. 319.47 s > Checking wyz v0.5.1
  1062. 319.47 s > Checking ansi-str v0.9.0
  1063. 319.47 s > Checking rand_chacha v0.3.1
  1064. 319.47 s > Checking radium v0.7.0
  1065. 319.47 s > Checking typeid v1.0.3
  1066. 319.47 s > Checking plotters v0.3.7
  1067. 319.47 s > Checking similar v2.7.0
  1068. 319.47 s > Checking tinytemplate v1.2.1
  1069. 319.47 s > Checking is-terminal v0.4.17
  1070. 319.47 s > Checking bytecount v0.6.9
  1071. 319.47 s > Checking anes v0.1.6
  1072. 319.47 s > Checking funty v2.0.0
  1073. 319.47 s > Checking oorandom v11.1.5
  1074. 319.47 s > Checking papergrid v0.17.0
  1075. 319.47 s > Checking toml_edit v0.22.27
  1076. 319.47 s > Checking rand v0.8.6
  1077. 319.47 s > Checking ron v0.12.1
  1078. 319.47 s > Checking testing_table v0.3.0
  1079. 319.47 s > Checking env_filter v1.0.1
  1080. 319.47 s > Checking xprec v0.2.2
  1081. 319.47 s > Checking bitvec v1.0.1
  1082. 319.47 s > Checking toml_edit v0.25.11+spec-1.1.0
  1083. 319.47 s > Checking uncased v0.9.10
  1084. 319.47 s > Checking jiff v0.2.24
  1085. 319.47 s > Checking ptr_meta v0.1.4
  1086. 319.47 s > Checking ucd-trie v0.1.7
  1087. 319.47 s > Checking criterion-plot v0.5.0
  1088. 319.47 s > Checking simdutf8 v0.1.5
  1089. 319.47 s > Checking ahash v0.7.8
  1090. 319.47 s > Checking pest v2.8.6
  1091. 319.47 s > Checking approx v0.4.0
  1092. 319.47 s > Checking hashbrown v0.12.3
  1093. 319.47 s > Checking bytecheck v0.6.12
  1094. 319.47 s > Checking criterion v0.5.1
  1095. 319.47 s > Checking seahash v4.1.0
  1096. 319.47 s > Checking cgmath v0.18.0
  1097. 319.47 s > Compiling pyo3-ffi v0.28.3
  1098. 319.47 s > Compiling pyo3-macros-backend v0.28.3
  1099. 319.47 s > Compiling pyo3 v0.28.3
  1100. 319.47 s > Compiling numpy v0.28.0
  1101. 319.47 s > Checking insta v1.47.2
  1102. 319.47 s > Checking tabled v0.20.0
  1103. 319.47 s > Checking rend v0.4.2
  1104. 319.47 s > Checking num-rational v0.4.2
  1105. 319.47 s > Checking num-iter v0.1.45
  1106. 319.47 s > Checking ref-ops v0.2.5
  1107. 319.47 s > Checking toml v0.8.23
  1108. 319.47 s > Checking rand_xoshiro v0.6.0
  1109. 319.47 s > Checking num v0.4.3
  1110. 319.47 s > Checking features v0.10.0
  1111. 319.47 s > Checking gat-lending-iterator v0.1.8
  1112. 319.47 s > Checking constcat v0.5.1
  1113. 319.47 s > Checking colored v2.2.0
  1114. 319.47 s > Checking dot-parser v0.5.1
  1115. 319.47 s > Checking constant_time_eq v0.4.2
  1116. 319.47 s > Checking arrayref v0.3.9
  1117. 319.47 s > Checking cpufeatures v0.3.0
  1118. 319.47 s > Checking base64 v0.22.1
  1119. 319.47 s > Checking blake3 v1.8.5
  1120. 319.47 s > Checking figment v0.10.19
  1121. 319.47 s > Checking siphasher v1.0.2
  1122. 319.47 s > Checking joinery v2.1.0
  1123. 319.47 s > Checking phf_shared v0.13.1
  1124. 319.47 s > Checking titlecase v2.2.1
  1125. 319.47 s > Checking subprocess v0.2.15
  1126. 319.47 s > Checking rust_lisp v0.18.0
  1127. 319.47 s > Compiling vakint v0.1.2 (/build/source/crates/vakint)
  1128. 319.47 s > Compiling rustpython-parser-core v0.4.0
  1129. 319.47 s > Checking version-compare v0.2.1
  1130. 319.47 s > Checking phf v0.13.1
  1131. 319.47 s > Checking xpct v0.5.1
  1132. 319.47 s > Checking ryu v1.0.23
  1133. 319.47 s > Compiling rustpython-ast v0.4.0
  1134. 319.47 s > Checking string-template-plus v0.4.3
  1135. 319.47 s > Checking castaway v0.2.4
  1136. 319.47 s > Checking toml_datetime v0.7.5+spec-1.1.0
  1137. 319.47 s > Checking strum v0.27.2
  1138. 319.47 s > Checking unicode-truncate v2.0.1
  1139. 319.47 s > Checking kasuari v0.4.12
  1140. 319.47 s > Checking lru v0.16.4
  1141. 319.47 s > Checking compact_str v0.9.0
  1142. 319.47 s > Checking vte v0.15.0
  1143. 319.47 s > Checking portable-atomic v1.13.1
  1144. 319.47 s > Checking unit-prefix v0.5.2
  1145. 319.47 s > Checking vt100 v0.16.2
  1146. 319.47 s > Checking toml v0.9.12+spec-1.1.0
  1147. 319.47 s > Checking rand_distr v0.4.3
  1148. 319.47 s > Checking simba v0.6.0
  1149. 319.47 s > Checking line-clipping v0.3.7
  1150. 319.47 s > Checking gimli v0.32.3
  1151. 319.47 s > Checking adler2 v2.0.1
  1152. 319.47 s > Compiling three-dimensional-reps v0.1.0 (/build/source/crates/three-dimensional-reps)
  1153. 319.47 s > Checking thiserror v1.0.69
  1154. 319.47 s > Checking indicatif v0.18.4
  1155. 319.47 s > Checking miniz_oxide v0.8.9
  1156. 319.47 s > Checking derive_builder v0.11.2
  1157. 319.47 s > Checking owo-colors v4.3.0
  1158. 319.47 s > Checking ratatui-core v0.1.0
  1159. 319.47 s > Checking crossterm v0.29.0
  1160. 319.47 s > Checking object v0.37.3
  1161. 319.47 s > Checking tracing-error v0.2.1
  1162. 319.47 s > Checking typed-index-collections v3.5.0
  1163. 319.47 s > Checking serde-big-array v0.5.1
  1164. 319.47 s > Checking env_logger v0.11.10
  1165. 319.47 s > Checking amd v0.2.2
  1166. 319.47 s > Checking itertools v0.11.0
  1167. 319.47 s > Compiling gammaloop-tracing-filter-macros v0.1.0 (/build/source/crates/gammaloop-tracing-filter-macros)
  1168. 319.47 s > Checking rustc-demangle v0.1.27
  1169. 319.47 s > Checking option-ext v0.2.0
  1170. 319.47 s > Checking ref-cast v1.0.25
  1171. 319.47 s > Checking dirs-sys v0.5.0
  1172. 319.47 s > Checking nix v0.31.2
  1173. 319.47 s > Checking integer-sqrt v0.1.5
  1174. 319.47 s > Checking brotli-decompressor v4.0.3
  1175. 319.47 s > Checking crossbeam-channel v0.5.15
  1176. 319.47 s > Checking color-spantrace v0.3.0
  1177. 319.47 s > Checking itertools v0.12.1
  1178. 319.47 s > Checking unsafe-libyaml v0.2.11
  1179. 319.47 s > Checking symlink v0.1.0
  1180. 319.47 s > Checking rkyv v0.7.46
  1181. 319.47 s > Compiling gammalooprs v0.3.4 (/build/source/crates/gammalooprs)
  1182. 319.47 s > Checking ratatui-widgets v0.3.0
  1183. 319.47 s > Checking ratatui-crossterm v0.1.0
  1184. 319.47 s > Checking tracing-appender v0.2.5
  1185. 319.47 s > Checking ctrlc v3.5.2
  1186. 319.47 s > Checking include_dir v0.7.4
  1187. 319.47 s > Checking pathfinding v4.15.0
  1188. 319.47 s > Checking dirs v6.0.0
  1189. 319.47 s > Checking schemars v1.2.1
  1190. 319.47 s > Checking slotmap v1.1.1
  1191. 319.47 s > Checking serde_yaml v0.9.34+deprecated
  1192. 319.47 s > Checking brotli v7.0.0
  1193. 319.47 s > Compiling numerica v2.2.0 (https://github.com/alphal00p/symbolica?rev=4d0a833eb8e059d1f95bdae5abed2559830b235f#4d0a833e)
  1194. 319.47 s > Checking clarabel v0.11.1
  1195. 319.47 s > Checking tracing-indicatif v0.3.14
  1196. 319.47 s > Checking addr2line v0.25.1
  1197. 319.47 s > Checking json5 v0.4.1
  1198. 319.47 s > Checking vectorize v0.2.0
  1199. 319.47 s > Checking ringbuffer v0.16.0
  1200. 319.47 s > Checking base62 v2.2.4
  1201. 319.47 s > Checking rust-embed v8.11.0
  1202. 319.47 s > Checking clap_complete v4.6.3
  1203. 319.47 s > Checking strip-ansi-escapes v0.2.1
  1204. 319.47 s > Checking ratatui-macros v0.7.0
  1205. 319.47 s > Checking fd-lock v4.0.4
  1206. 319.47 s > Compiling gammaloop-api v0.1.0 (/build/source/crates/gammaloop-api)
  1207. 319.47 s > Checking ratatui v0.30.0
  1208. 319.47 s > Checking itertools v0.13.0
  1209. 319.47 s > Checking strum v0.26.3
  1210. 319.47 s > Checking sysinfo v0.33.1
  1211. 319.47 s > Checking shlex v1.3.0
  1212. 319.47 s > Checking slab v0.4.12
  1213. 319.47 s > Checking futures-core v0.3.32
  1214. 319.47 s > Checking futures-task v0.3.32
  1215. 319.47 s > Checking clap_complete_nushell v4.6.0
  1216. 319.47 s > Checking sdd v3.0.10
  1217. 319.47 s > Compiling gammaloop-integration-tests v0.1.0 (/build/source/tests)
  1218. 319.47 s > Compiling test-log-core v0.2.20
  1219. 319.47 s > Checking futures-util v0.3.32
  1220. 319.47 s > Compiling rustc_version v0.4.1
  1221. 319.47 s > Checking which v8.0.2
  1222. 319.47 s > Checking scc v2.4.0
  1223. 319.47 s > Checking bincode v1.3.3
  1224. 319.47 s > Compiling gungraun-runner v0.18.2
  1225. 319.47 s > Checking backtrace v0.3.76
  1226. 319.47 s > Checking nalgebra v0.29.0
  1227. 319.47 s > Checking proc-macro2 v1.0.106
  1228. 319.47 s > Compiling gungraun-macros v0.8.0
  1229. 319.47 s > Checking color-eyre v0.6.5
  1230. 319.47 s > Checking quote v1.0.45
  1231. 319.47 s > Checking reedline v0.42.0
  1232. 319.47 s > Checking maplit v1.0.2
  1233. 319.47 s > Checking base64 v0.21.7
  1234. 319.47 s > Compiling iai-callgrind-runner v0.14.2
  1235. 319.47 s > Checking kurbo v0.13.0
  1236. 319.47 s > Checking ron v0.8.1
  1237. 319.47 s > Checking wait-timeout v0.2.1
  1238. 319.47 s > Compiling iai-callgrind v0.14.2
  1239. 319.47 s > Checking futures-executor v0.3.32
  1240. 319.47 s > Checking quick-error v1.2.3
  1241. 319.47 s > Checking bit-vec v0.8.0
  1242. 319.47 s > Checking serial_test v3.4.0
  1243. 319.47 s > Checking rusty-fork v0.3.1
  1244. 319.47 s > Checking bit-set v0.8.0
  1245. 319.47 s > Checking syn v2.0.117
  1246. 319.47 s > Compiling iai-callgrind-macros v0.5.1
  1247. 319.47 s > Compiling graphica v2.1.0 (https://github.com/alphal00p/symbolica?rev=4d0a833eb8e059d1f95bdae5abed2559830b235f#4d0a833e)
  1248. 319.47 s > Checking rand_xorshift v0.4.0
  1249. 319.47 s > Checking console v0.15.11
  1250. 319.47 s > Checking unarray v0.1.4
  1251. 319.47 s > Compiling test-log-macros v0.2.20
  1252. 319.47 s > Checking pathdiff v0.2.3
  1253. 319.47 s > Checking proptest v1.11.0
  1254. 319.47 s > Checking similar-asserts v1.7.0
  1255. 319.47 s > Checking clinnet v0.1.8 (/build/source/crates/clinnet)
  1256. 319.47 s > Checking kurvst v0.1.0 (/build/source/crates/kurvst)
  1257. 319.47 s > Checking test-log v0.2.20
  1258. 319.47 s > Checking statrs v0.16.1
  1259. 319.47 s > Checking momtrop v0.3.0
  1260. 319.47 s > Checking gungraun v0.18.2
  1261. 319.47 s > Compiling pyo3-macros v0.28.3
  1262. 319.47 s > Compiling pyo3-stub-gen-derive v0.17.2
  1263. 319.47 s > Checking pyo3-stub-gen v0.17.2
  1264. 319.47 s > Checking symbolica-utils v0.1.0 (/build/source/crates/symbolica-utils)
  1265. 319.47 s > Checking spenso-macros v0.3.2 (/build/source/crates/spenso-macros)
  1266. 319.47 s > Compiling gammaloop-workspace-hack v0.1.0 (/build/source/crates/gammaloop-workspace-hack)
  1267. 319.47 s > Checking linnet v0.17.0 (/build/source/crates/linnet)
  1268. 319.47 s > Checking spenso v0.6.0 (/build/source/crates/spenso)
  1269. 319.47 s > Checking linnet-py v0.1.0 (/build/source/crates/linnet-py)
  1270. 319.47 s > Checking linnest v0.1.0 (/build/source/crates/linnest)
  1271. 319.47 s > Checking idenso v0.3.0 (/build/source/crates/idenso)
  1272. 319.47 s > Checking gammaloop-tracing-filter v0.1.0 (/build/source/crates/gammaloop-tracing-filter)
  1273. 319.47 s > Checking spenso-hep-lib v0.1.7 (/build/source/crates/spenso-hep-lib)
  1274. 319.47 s > Checking spynso3 v0.1.2 (/build/source/crates/spynso3)
  1275. 319.47 s > error[E0283]: type annotations needed
  1276. 319.47 s > --> crates/gammalooprs/src/momentum/sample.rs:1165:35
  1277. 319.47 s > |
  1278. 319.47 s > 1165 | requested.into_iter().collect(),
  1279. 319.47 s > | ^^^^^^^ cannot infer type of the type parameter `B` declared on the method `collect`
  1280. 319.47 s > |
  1281. 319.47 s > = note: the type must implement `std::iter::FromIterator<linnet::half_edge::involution::EdgeIndex>`
  1282. 319.47 s > note: required by a bound in `std::iter::Iterator::collect`
  1283. 319.47 s > --> /rustc/2d8144b7880597b6e6d3dfd63a9a9efae3f533d3/library/core/src/iter/traits/iterator.rs:2077:4
  1284. 319.47 s > help: consider specifying the generic argument
  1285. 319.47 s > |
  1286. 319.47 s > 1165 | requested.into_iter().collect::<Vec<_>>(),
  1287. 319.47 s > | ++++++++++
  1288. 319.47 s >
  1289. 319.47 s > error[E0283]: type annotations needed
  1290. 319.47 s > --> crates/gammalooprs/src/momentum/sample.rs:1165:35
  1291. 319.47 s > |
  1292. 319.47 s > 1161 | / assert_eq!(
  1293. 319.47 s > 1162 | | subspace
  1294. 319.47 s > 1163 | | .iter_basis_edges(&all_lmbs)
  1295. 319.47 s > 1164 | | .collect::<std::collections::BTreeSet<_>>(),
  1296. 319.47 s > 1165 | | requested.into_iter().collect(),
  1297. 319.47 s > | | ^^^^^^^ cannot infer type of the type parameter `B` declared on the method `collect`
  1298. 319.47 s > 1166 | | );
  1299. 319.47 s > | |_________- type must be known at this point
  1300. 319.47 s > |
  1301. 319.47 s > = note: multiple `impl`s satisfying `std::collections::BTreeSet<linnet::half_edge::involution::EdgeIndex>: std::cmp::PartialEq<_>` found in the following crates: `alloc`, `rkyv`:
  1302. 319.47 s > - impl<K, AK> std::cmp::PartialEq<rkyv::collections::btree_set::ArchivedBTreeSet<AK>> for std::collections::BTreeSet<K>
  1303. 319.47 s > where AK: std::cmp::PartialEq<K>;
  1304. 319.47 s > - impl<T, A> std::cmp::PartialEq for std::collections::BTreeSet<T, A>
  1305. 319.47 s > where T: std::cmp::PartialEq, A: std::alloc::Allocator, A: std::clone::Clone;
  1306. 319.47 s > help: consider specifying the generic argument
  1307. 319.47 s > |
  1308. 319.47 s > 1165 | requested.into_iter().collect::<Vec<_>>(),
  1309. 319.47 s > | ++++++++++
  1310. 319.47 s >
  1311. 319.47 s > error[E0283]: type annotations needed
  1312. 319.47 s > --> crates/gammalooprs/src/momentum/sample.rs:1182:35
  1313. 319.47 s > |
  1314. 319.47 s > 1178 | / assert_eq!(
  1315. 319.47 s > 1179 | | common_subspace
  1316. 319.47 s > 1180 | | .iter_basis_edges(&all_lmbs)
  1317. 319.47 s > 1181 | | .collect::<std::collections::BTreeSet<_>>(),
  1318. 319.47 s > 1182 | | requested.into_iter().collect(),
  1319. 319.47 s > | | ^^^^^^^ cannot infer type of the type parameter `B` declared on the method `collect`
  1320. 319.47 s > 1183 | | );
  1321. 319.47 s > | |_________- type must be known at this point
  1322. 319.47 s > |
  1323. 319.47 s > = note: multiple `impl`s satisfying `std::collections::BTreeSet<linnet::half_edge::involution::EdgeIndex>: std::cmp::PartialEq<_>` found in the following crates: `alloc`, `rkyv`:
  1324. 319.47 s > - impl<K, AK> std::cmp::PartialEq<rkyv::collections::btree_set::ArchivedBTreeSet<AK>> for std::collections::BTreeSet<K>
  1325. 319.47 s > where AK: std::cmp::PartialEq<K>;
  1326. 319.47 s > - impl<T, A> std::cmp::PartialEq for std::collections::BTreeSet<T, A>
  1327. 319.47 s > where T: std::cmp::PartialEq, A: std::alloc::Allocator, A: std::clone::Clone;
  1328. 319.47 s > help: consider specifying the generic argument
  1329. 319.47 s > |
  1330. 319.47 s > 1182 | requested.into_iter().collect::<Vec<_>>(),
  1331. 319.47 s > | ++++++++++
  1332. 319.47 s >
  1333. 319.47 s > error[E0283]: type annotations needed
  1334. 319.47 s > --> crates/gammalooprs/src/momentum/sample.rs:1203:35
  1335. 319.47 s > |
  1336. 319.47 s > 1199 | / assert_eq!(
  1337. 319.47 s > 1200 | | sparse_common_subspace
  1338. 319.47 s > 1201 | | .iter_basis_edges(&all_lmbs)
  1339. 319.47 s > 1202 | | .collect::<std::collections::BTreeSet<_>>(),
  1340. 319.47 s > 1203 | | requested.into_iter().collect(),
  1341. 319.47 s > | | ^^^^^^^ cannot infer type of the type parameter `B` declared on the method `collect`
  1342. 319.47 s > 1204 | | );
  1343. 319.47 s > | |_________- type must be known at this point
  1344. 319.47 s > |
  1345. 319.47 s > = note: multiple `impl`s satisfying `std::collections::BTreeSet<linnet::half_edge::involution::EdgeIndex>: std::cmp::PartialEq<_>` found in the following crates: `alloc`, `rkyv`:
  1346. 319.47 s > - impl<K, AK> std::cmp::PartialEq<rkyv::collections::btree_set::ArchivedBTreeSet<AK>> for std::collections::BTreeSet<K>
  1347. 319.47 s > where AK: std::cmp::PartialEq<K>;
  1348. 319.47 s > - impl<T, A> std::cmp::PartialEq for std::collections::BTreeSet<T, A>
  1349. 319.47 s > where T: std::cmp::PartialEq, A: std::alloc::Allocator, A: std::clone::Clone;
  1350. 319.47 s > help: consider specifying the generic argument
  1351. 319.47 s > |
  1352. 319.47 s > 1203 | requested.into_iter().collect::<Vec<_>>(),
  1353. 319.47 s > | ++++++++++
  1354. 319.47 s >
  1355. 319.47 s > error[E0283]: type annotations needed
  1356. 319.47 s > --> crates/gammalooprs/src/processes/amplitude.rs:3336:49
  1357. 319.47 s > |
  1358. 319.47 s > 3336 | variant_ids.iter().copied().collect(),
  1359. 319.47 s > | ^^^^^^^ cannot infer type of the type parameter `B` declared on the method `collect`
  1360. 319.47 s > |
  1361. 319.47 s > = note: the type must implement `std::iter::FromIterator<processes::threshold_counterterms::ThresholdCountertermVariantId>`
  1362. 319.47 s > note: required by a bound in `std::iter::Iterator::collect`
  1363. 319.47 s > --> /rustc/2d8144b7880597b6e6d3dfd63a9a9efae3f533d3/library/core/src/iter/traits/iterator.rs:2077:4
  1364. 319.47 s > help: consider specifying the generic argument
  1365. 319.47 s > |
  1366. 319.47 s > 3336 | variant_ids.iter().copied().collect::<Vec<_>>(),
  1367. 319.47 s > | ++++++++++
  1368. 319.47 s >
  1369. 319.47 s > error[E0283]: type annotations needed
  1370. 319.47 s > --> crates/gammalooprs/src/processes/amplitude.rs:3336:49
  1371. 319.47 s > |
  1372. 319.47 s > 3334 | / assert_eq!(
  1373. 319.47 s > 3335 | | referenced_variants,
  1374. 319.47 s > 3336 | | variant_ids.iter().copied().collect(),
  1375. 319.47 s > | | ^^^^^^^ cannot infer type of the type parameter `B` declared on the method `collect`
  1376. 319.47 s > 3337 | | "overlap groups must retain every semantic duplicate independently",
  1377. 319.47 s > 3338 | | );
  1378. 319.47 s > | |_________________- type must be known at this point
  1379. 319.47 s > |
  1380. 319.47 s > = note: multiple `impl`s satisfying `std::collections::BTreeSet<processes::threshold_counterterms::ThresholdCountertermVariantId>: std::cmp::PartialEq<_>` found in the following crates: `alloc`, `rkyv`:
  1381. 319.47 s > - impl<K, AK> std::cmp::PartialEq<rkyv::collections::btree_set::ArchivedBTreeSet<AK>> for std::collections::BTreeSet<K>
  1382. 319.47 s > where AK: std::cmp::PartialEq<K>;
  1383. 319.47 s > - impl<T, A> std::cmp::PartialEq for std::collections::BTreeSet<T, A>
  1384. 319.47 s > where T: std::cmp::PartialEq, A: std::alloc::Allocator, A: std::clone::Clone;
  1385. 319.47 s > help: consider specifying the generic argument
  1386. 319.47 s > |
  1387. 319.47 s > 3336 | variant_ids.iter().copied().collect::<Vec<_>>(),
  1388. 319.47 s > | ++++++++++
  1389. 319.47 s >
  1390. 319.47 s > error[E0283]: type annotations needed
  1391. 319.47 s > --> crates/gammalooprs/src/processes/amplitude.rs:4098:59
  1392. 319.47 s > |
  1393. 319.47 s > 4098 | assert_eq!(orders, [1, 2].into_iter().collect());
  1394. 319.47 s > | ^^^^^^^ cannot infer type of the type parameter `B` declared on the method `collect`
  1395. 319.47 s > |
  1396. 319.47 s > = note: the type must implement `std::iter::FromIterator<i32>`
  1397. 319.47 s > note: required by a bound in `std::iter::Iterator::collect`
  1398. 319.47 s > --> /rustc/2d8144b7880597b6e6d3dfd63a9a9efae3f533d3/library/core/src/iter/traits/iterator.rs:2077:4
  1399. 319.47 s > help: consider specifying the generic argument
  1400. 319.47 s > |
  1401. 319.47 s > 4098 | assert_eq!(orders, [1, 2].into_iter().collect::<Vec<_>>());
  1402. 319.47 s > | ++++++++++
  1403. 319.47 s >
  1404. 319.47 s > error[E0283]: type annotations needed
  1405. 319.47 s > --> crates/gammalooprs/src/processes/amplitude.rs:4098:59
  1406. 319.47 s > |
  1407. 319.47 s > 4098 | assert_eq!(orders, [1, 2].into_iter().collect());
  1408. 319.47 s > | --------------------------------------^^^^^^^---
  1409. 319.47 s > | | |
  1410. 319.47 s > | | cannot infer type of the type parameter `B` declared on the method `collect`
  1411. 319.47 s > | type must be known at this point
  1412. 319.47 s > |
  1413. 319.47 s > = note: multiple `impl`s satisfying `std::collections::BTreeSet<usize>: std::cmp::PartialEq<_>` found in the following crates: `alloc`, `rkyv`:
  1414. 319.47 s > - impl<K, AK> std::cmp::PartialEq<rkyv::collections::btree_set::ArchivedBTreeSet<AK>> for std::collections::BTreeSet<K>
  1415. 319.47 s > where AK: std::cmp::PartialEq<K>;
  1416. 319.47 s > - impl<T, A> std::cmp::PartialEq for std::collections::BTreeSet<T, A>
  1417. 319.47 s > where T: std::cmp::PartialEq, A: std::alloc::Allocator, A: std::clone::Clone;
  1418. 319.47 s > help: consider specifying the generic argument
  1419. 319.47 s > |
  1420. 319.47 s > 4098 | assert_eq!(orders, [1, 2].into_iter().collect::<Vec<_>>());
  1421. 319.47 s > | ++++++++++
  1422. 319.47 s >
  1423. 319.47 s > error[E0283]: type annotations needed
  1424. 319.47 s > --> crates/gammalooprs/src/processes/amplitude.rs:4129:48
  1425. 319.47 s > |
  1426. 319.47 s > 4123 | / assert_eq!(
  1427. 319.47 s > 4124 | | evaluator
  1428. 319.47 s > 4125 | | .evaluator_stacks
  1429. 319.47 s > 4126 | | .keys()
  1430. 319.47 s > ... |
  1431. 319.47 s > 4129 | | [1, 2].into_iter().collect()
  1432. 319.47 s > | | ^^^^^^^ cannot infer type of the type parameter `B` declared on the method `collect`
  1433. 319.47 s > 4130 | | );
  1434. 319.47 s > | |_________________________- type must be known at this point
  1435. 319.47 s > |
  1436. 319.47 s > = note: multiple `impl`s satisfying `std::collections::BTreeSet<usize>: std::cmp::PartialEq<_>` found in the following crates: `alloc`, `rkyv`:
  1437. 319.47 s > - impl<K, AK> std::cmp::PartialEq<rkyv::collections::btree_set::ArchivedBTreeSet<AK>> for std::collections::BTreeSet<K>
  1438. 319.47 s > where AK: std::cmp::PartialEq<K>;
  1439. 319.47 s > - impl<T, A> std::cmp::PartialEq for std::collections::BTreeSet<T, A>
  1440. 319.47 s > where T: std::cmp::PartialEq, A: std::alloc::Allocator, A: std::clone::Clone;
  1441. 319.47 s > help: consider specifying the generic argument
  1442. 319.47 s > |
  1443. 319.47 s > 4129 | [1, 2].into_iter().collect::<Vec<_>>()
  1444. 319.47 s > | ++++++++++
  1445. 319.47 s >
  1446. 319.47 s > error[E0283]: type annotations needed
  1447. 319.47 s > --> crates/gammalooprs/src/processes/amplitude.rs:4160:30
  1448. 319.47 s > |
  1449. 319.47 s > 4148 | / assert_eq!(
  1450. 319.47 s > 4149 | | registry
  1451. 319.47 s > 4150 | | .components
  1452. 319.47 s > 4151 | | .iter()
  1453. 319.47 s > ... |
  1454. 319.47 s > 4160 | | .collect()
  1455. 319.47 s > | | ^^^^^^^ cannot infer type of the type parameter `B` declared on the method `collect`
  1456. 319.47 s > 4161 | | );
  1457. 319.47 s > | |_________________________- type must be known at this point
  1458. 319.47 s > |
  1459. 319.47 s > = note: multiple `impl`s satisfying `std::collections::BTreeSet<processes::threshold_counterterms::ThresholdCountertermComponentKind>: std::cmp::PartialEq<_>` found in the following crates: `alloc`, `rkyv`:
  1460. 319.47 s > - impl<K, AK> std::cmp::PartialEq<rkyv::collections::btree_set::ArchivedBTreeSet<AK>> for std::collections::BTreeSet<K>
  1461. 319.47 s > where AK: std::cmp::PartialEq<K>;
  1462. 319.47 s > - impl<T, A> std::cmp::PartialEq for std::collections::BTreeSet<T, A>
  1463. 319.47 s > where T: std::cmp::PartialEq, A: std::alloc::Allocator, A: std::clone::Clone;
  1464. 319.47 s > help: consider specifying the generic argument
  1465. 319.47 s > |
  1466. 319.47 s > 4160 | .collect::<Vec<_>>()
  1467. 319.47 s > | ++++++++++
  1468. 319.47 s >
  1469. 319.47 s > error[E0283]: type annotations needed
  1470. 319.47 s > --> crates/gammalooprs/src/processes/amplitude.rs:4214:26
  1471. 319.47 s > |
  1472. 319.47 s > 4201 | / assert_eq!(
  1473. 319.47 s > 4202 | | decomposition
  1474. 319.47 s > 4203 | | .components
  1475. 319.47 s > 4204 | | .iter()
  1476. 319.47 s > ... |
  1477. 319.47 s > 4214 | | .collect()
  1478. 319.47 s > | | ^^^^^^^ cannot infer type of the type parameter `B` declared on the method `collect`
  1479. 319.47 s > 4215 | | );
  1480. 319.47 s > | |_____________________- type must be known at this point
  1481. 319.47 s > |
  1482. 319.47 s > = note: multiple `impl`s satisfying `std::collections::BTreeSet<processes::threshold_counterterms::ThresholdCountertermComponentKind>: std::cmp::PartialEq<_>` found in the following crates: `alloc`, `rkyv`:
  1483. 319.47 s > - impl<K, AK> std::cmp::PartialEq<rkyv::collections::btree_set::ArchivedBTreeSet<AK>> for std::collections::BTreeSet<K>
  1484. 319.47 s > where AK: std::cmp::PartialEq<K>;
  1485. 319.47 s > - impl<T, A> std::cmp::PartialEq for std::collections::BTreeSet<T, A>
  1486. 319.47 s > where T: std::cmp::PartialEq, A: std::alloc::Allocator, A: std::clone::Clone;
  1487. 319.47 s > help: consider specifying the generic argument
  1488. 319.47 s > |
  1489. 319.47 s > 4214 | .collect::<Vec<_>>()
  1490. 319.47 s > | ++++++++++
  1491. 319.47 s >
  1492. 319.47 s > error[E0277]: can't compare `std::option::Option<&[linnet::half_edge::involution::EdgeIndex]>` with `std::option::Option<&[linnet::half_edge::involution::EdgeIndex; 1]>`
  1493. 319.47 s > --> crates/gammalooprs/src/processes/cross_section/ir_safe_threshold_fixture_tests.rs:817:25
  1494. 319.47 s > |
  1495. 319.47 s > 816 | .any(|variant| variant.requested_subspace.as_deref()
  1496. 319.47 s > | -------------------------------------
  1497. 319.47 s > 817 | == Some(&[EdgeIndex::from(3)])),
  1498. 319.47 s > | ^^ ---------------------------
  1499. 319.47 s > | |
  1500. 319.47 s > | no implementation for `std::option::Option<&[linnet::half_edge::involution::EdgeIndex]> == std::option::Option<&[linnet::half_edge::involution::EdgeIndex; 1]>`
  1501. 319.47 s > |
  1502. 319.47 s > = help: the trait `std::cmp::PartialEq<std::option::Option<&[linnet::half_edge::involution::EdgeIndex; 1]>>` is not implemented for `std::option::Option<&[linnet::half_edge::involution::EdgeIndex]>`
  1503. 319.47 s > help: the following other types implement trait `std::cmp::PartialEq<Rhs>`
  1504. 319.47 s > --> /rustc/2d8144b7880597b6e6d3dfd63a9a9efae3f533d3/library/core/src/option.rs:2434:0
  1505. 319.47 s > |
  1506. 319.47 s > = note: `std::option::Option<T>` implements `std::cmp::PartialEq`
  1507. 319.47 s > |
  1508. 319.47 s > ::: /nix/store/8zq9ya5slh345hbylmsibxw827bi98w0-vendor-cargo-deps/c19b7c6f923b580ac259164a89f2577984ad5ab09ee9d583b888f934adbbe8d0/rkyv-0.7.46/src/option.rs:210:1
  1509. 319.47 s > |
  1510. 319.47 s > 210 | impl<T: PartialEq<U>, U> PartialEq<ArchivedOption<T>> for Option<U> {
  1511. 319.47 s > | ^^^^^^^^^^^^^^^^^^^^^^^^^^^^^^^^^^^^^^^^^^^^^^^^^^^^^^^^^^^^^^^^^^^ `std::option::Option<U>` implements `std::cmp::PartialEq<rkyv::option::ArchivedOption<T>>`
  1512. 319.47 s > |
  1513. 319.47 s > ::: /nix/store/8zq9ya5slh345hbylmsibxw827bi98w0-vendor-cargo-deps/c19b7c6f923b580ac259164a89f2577984ad5ab09ee9d583b888f934adbbe8d0/rkyv-0.7.46/src/impls/alloc/niche.rs:24:1
  1514. 319.47 s > |
  1515. 319.47 s > 24 | / impl<T, U> PartialEq<ArchivedOptionBox<T>> for Option<Box<U>>
  1516. 319.47 s > 25 | | where
  1517. 319.47 s > 26 | | T: ArchivePointee + PartialEq<U> + ?Sized,
  1518. 319.47 s > 27 | | U: ?Sized,
  1519. 319.47 s > | |______________^ `std::option::Option<std::boxed::Box<U>>` implements `std::cmp::PartialEq<rkyv::niche::option_box::ArchivedOptionBox<T>>`
  1520. 319.47 s >
  1521. 319.47 s > error[E0283]: type annotations needed
  1522. 319.47 s > --> crates/gammalooprs/src/processes/no_directive_equivalence_tests.rs:459:43
  1523. 319.47 s > |
  1524. 319.47 s > 459 | (0..graph.cuts.len()).collect(),
  1525. 319.47 s > | ^^^^^^^ cannot infer type of the type parameter `B` declared on the method `collect`
  1526. 319.47 s > |
  1527. 319.47 s > = note: multiple `impl`s satisfying `_: std::iter::FromIterator<usize>` found in the following crates: `spenso`, `tabled`:
  1528. 319.47 s > - impl std::iter::FromIterator<usize> for spenso::structure::concrete_index::ExpandedIndex;
  1529. 319.47 s > - impl std::iter::FromIterator<usize> for tabled::settings::height::HeightList;
  1530. 319.47 s > - impl std::iter::FromIterator<usize> for tabled::settings::width::WidthList;
  1531. 319.47 s > note: required by a bound in `std::iter::Iterator::collect`
  1532. 319.47 s > --> /rustc/2d8144b7880597b6e6d3dfd63a9a9efae3f533d3/library/core/src/iter/traits/iterator.rs:2077:4
  1533. 319.47 s > help: consider specifying the generic argument
  1534. 319.47 s > |
  1535. 319.47 s > 459 | (0..graph.cuts.len()).collect::<Vec<_>>(),
  1536. 319.47 s > | ++++++++++
  1537. 319.47 s >
  1538. 319.47 s > error[E0283]: type annotations needed
  1539. 319.47 s > --> crates/gammalooprs/src/processes/no_directive_equivalence_tests.rs:459:43
  1540. 319.47 s > |
  1541. 319.47 s > 457 | / assert_eq!(
  1542. 319.47 s > 458 | | grouped_cut_ids,
  1543. 319.47 s > 459 | | (0..graph.cuts.len()).collect(),
  1544. 319.47 s > | | ^^^^^^^ cannot infer type of the type parameter `B` declared on the method `collect`
  1545. 319.47 s > 460 | | "every discovered process-valid cut must remain in the numerical LU evaluation",
  1546. 319.47 s > 461 | | );
  1547. 319.47 s > | |_________________- type must be known at this point
  1548. 319.47 s > |
  1549. 319.47 s > = note: multiple `impl`s satisfying `std::collections::BTreeSet<usize>: std::cmp::PartialEq<_>` found in the following crates: `alloc`, `rkyv`:
  1550. 319.47 s > - impl<K, AK> std::cmp::PartialEq<rkyv::collections::btree_set::ArchivedBTreeSet<AK>> for std::collections::BTreeSet<K>
  1551. 319.47 s > where AK: std::cmp::PartialEq<K>;
  1552. 319.47 s > - impl<T, A> std::cmp::PartialEq for std::collections::BTreeSet<T, A>
  1553. 319.47 s > where T: std::cmp::PartialEq, A: std::alloc::Allocator, A: std::clone::Clone;
  1554. 319.47 s > help: consider specifying the generic argument
  1555. 319.47 s > |
  1556. 319.47 s > 459 | (0..graph.cuts.len()).collect::<Vec<_>>(),
  1557. 319.47 s > | ++++++++++
  1558. 319.47 s >
  1559. 319.47 s > error[E0283]: type annotations needed
  1560. 319.47 s > --> crates/gammalooprs/src/processes/raised_cross_section_tests.rs:150:31
  1561. 319.47 s > |
  1562. 319.47 s > 150 | (0..graph.cuts.len()).collect(),
  1563. 319.47 s > | ^^^^^^^ cannot infer type of the type parameter `B` declared on the method `collect`
  1564. 319.47 s > |
  1565. 319.47 s > = note: multiple `impl`s satisfying `_: std::iter::FromIterator<usize>` found in the following crates: `spenso`, `tabled`:
  1566. 319.47 s > - impl std::iter::FromIterator<usize> for spenso::structure::concrete_index::ExpandedIndex;
  1567. 319.47 s > - impl std::iter::FromIterator<usize> for tabled::settings::height::HeightList;
  1568. 319.47 s > - impl std::iter::FromIterator<usize> for tabled::settings::width::WidthList;
  1569. 319.47 s > note: required by a bound in `std::iter::Iterator::collect`
  1570. 319.47 s > --> /rustc/2d8144b7880597b6e6d3dfd63a9a9efae3f533d3/library/core/src/iter/traits/iterator.rs:2077:4
  1571. 319.47 s > help: consider specifying the generic argument
  1572. 319.47 s > |
  1573. 319.47 s > 150 | (0..graph.cuts.len()).collect::<Vec<_>>(),
  1574. 319.47 s > | ++++++++++
  1575. 319.47 s >
  1576. 319.47 s > error[E0283]: type annotations needed
  1577. 319.47 s > --> crates/gammalooprs/src/processes/raised_cross_section_tests.rs:150:31
  1578. 319.47 s > |
  1579. 319.47 s > 148 | / assert_eq!(
  1580. 319.47 s > 149 | | grouped_cut_ids,
  1581. 319.47 s > 150 | | (0..graph.cuts.len()).collect(),
  1582. 319.47 s > | | ^^^^^^^ cannot infer type of the type parameter `B` declared on the method `collect`
  1583. 319.47 s > 151 | | "every discovered process-valid cut must remain in the numerical LU evaluation",
  1584. 319.47 s > 152 | | );
  1585. 319.47 s > | |_____- type must be known at this point
  1586. 319.47 s > |
  1587. 319.47 s > = note: multiple `impl`s satisfying `std::collections::BTreeSet<usize>: std::cmp::PartialEq<_>` found in the following crates: `alloc`, `rkyv`:
  1588. 319.47 s > - impl<K, AK> std::cmp::PartialEq<rkyv::collections::btree_set::ArchivedBTreeSet<AK>> for std::collections::BTreeSet<K>
  1589. 319.47 s > where AK: std::cmp::PartialEq<K>;
  1590. 319.47 s > - impl<T, A> std::cmp::PartialEq for std::collections::BTreeSet<T, A>
  1591. 319.47 s > where T: std::cmp::PartialEq, A: std::alloc::Allocator, A: std::clone::Clone;
  1592. 319.47 s > help: consider specifying the generic argument
  1593. 319.47 s > |
  1594. 319.47 s > 150 | (0..graph.cuts.len()).collect::<Vec<_>>(),
  1595. 319.47 s > | ++++++++++
  1596. 319.47 s >
  1597. 319.47 s > error: method `lu_prefactor_helper` is never used
  1598. 319.47 s > --> crates/gammalooprs/src/processes/cross_section.rs:1965:8
  1599. 319.47 s > |
  1600. 319.47 s > 1429 | impl CrossSectionGraph {
  1601. 319.47 s > | ---------------------- method in this implementation
  1602. 319.47 s > ...
  1603. 319.47 s > 1965 | fn lu_prefactor_helper(&self) -> Atom {
  1604. 319.47 s > | ^^^^^^^^^^^^^^^^^^^
  1605. 319.47 s > |
  1606. 319.47 s > = note: `-D dead-code` implied by `-D warnings`
  1607. 319.47 s > = help: to override `-D warnings` add `#[expect(dead_code)]` or `#[allow(dead_code)]`
  1608. 319.47 s >
  1609. 319.47 s > error: this `if` statement can be collapsed
  1610. 319.47 s > --> crates/gammalooprs/src/subtraction/amplitude_counterterm.rs:938:17
  1611. 319.47 s > |
  1612. 319.47 s > 938 | / if let Some(group_id) = metadata.group_id {
  1613. 319.47 s > 939 | | if let Some((_, members)) = groups.iter().find(|(id, _)| *id == Some(group_id))
  1614. 319.47 s > 940 | | {
  1615. 319.47 s > 941 | | let first = members[0];
  1616. 319.47 s > ... |
  1617. 319.47 s > 956 | | }
  1618. 319.47 s > | |_________________^
  1619. 319.47 s > |
  1620. 319.47 s > = help: for further information visit https://rust-lang.github.io/rust-clippy/rust-1.97.0/index.html#collapsible_if
  1621. 319.47 s > = note: `-D clippy::collapsible-if` implied by `-D warnings`
  1622. 319.47 s > = help: to override `-D warnings` add `#[allow(clippy::collapsible_if)]`
  1623. 319.47 s > help: collapse nested if block
  1624. 319.47 s > |
  1625. 319.47 s > 938 ~ if let Some(group_id) = metadata.group_id
  1626. 319.47 s > 939 ~ && let Some((_, members)) = groups.iter().find(|(id, _)| *id == Some(group_id))
  1627. 319.47 s > 940 | {
  1628. 319.47 s > ...
  1629. 319.47 s > 954 | ));
  1630. 319.47 s > 955 ~ }
  1631. 319.47 s > |
  1632. 319.47 s >
  1633. 319.47 s > error: this function has too many arguments (13/7)
  1634. 319.47 s > --> crates/gammalooprs/src/subtraction/amplitude_counterterm.rs:994:5
  1635. 319.47 s > |
  1636. 319.47 s > 994 | / fn evaluate_variant_group<T: FloatLike>(
  1637. 319.47 s > 995 | | &mut self,
  1638. 319.47 s > 996 | | momentum_sample: &MomentumSample<T>,
  1639. 319.47 s > 997 | | graph: &Graph,
  1640. 319.47 s > ... |
  1641. 319.47 s > 1007 | | allowed_variant_ids: Option<&[ThresholdCountertermVariantId]>,
  1642. 319.47 s > 1008 | | ) -> Result<AmplitudeCountertermEvaluation<T>> {
  1643. 319.47 s > | |__________________________________________________^
  1644. 319.47 s > |
  1645. 319.47 s > = help: for further information visit https://rust-lang.github.io/rust-clippy/rust-1.97.0/index.html#too_many_arguments
  1646. 319.47 s > = note: `-D clippy::too-many-arguments` implied by `-D warnings`
  1647. 319.47 s > = help: to override `-D warnings` add `#[allow(clippy::too_many_arguments)]`
  1648. 319.47 s >
  1649. 319.47 s > error: this `if` statement can be collapsed
  1650. 319.47 s > --> crates/gammalooprs/src/subtraction/amplitude_counterterm.rs:1359:17
  1651. 319.47 s > |
  1652. 319.47 s > 1359 | / if let Some(group_id) = metadata.group_id {
  1653. 319.47 s > 1360 | | if let Some((_, _, members)) =
  1654. 319.47 s > 1361 | | groups.iter().find(|(id, _, _)| *id == Some(group_id))
  1655. 319.47 s > ... |
  1656. 319.47 s > 1378 | | }
  1657. 319.47 s > | |_________________^
  1658. 319.47 s > |
  1659. 319.47 s > = help: for further information visit https://rust-lang.github.io/rust-clippy/rust-1.97.0/index.html#collapsible_if
  1660. 319.47 s > help: collapse nested if block
  1661. 319.47 s > |
  1662. 319.47 s > 1359 ~ if let Some(group_id) = metadata.group_id
  1663. 319.47 s > 1360 ~ && let Some((_, _, members)) =
  1664. 319.47 s > 1361 | groups.iter().find(|(id, _, _)| *id == Some(group_id))
  1665. 319.47 s > ...
  1666. 319.47 s > 1376 | ));
  1667. 319.47 s > 1377 ~ }
  1668. 319.47 s > |
  1669. 319.47 s >
  1670. 319.47 s > error: this function has too many arguments (8/7)
  1671. 319.47 s > --> crates/gammalooprs/src/subtraction/lu_counterterm.rs:1197:5
  1672. 319.47 s > |
  1673. 319.47 s > 1197 | / pub fn from_atoms(
  1674. 319.47 s > 1198 | | counterterm_data: &LUCounterTermData,
  1675. 319.47 s > 1199 | | max_cut_order: usize,
  1676. 319.47 s > 1200 | | threshold_helpers: LUThresholdHelperEvaluators,
  1677. 319.47 s > ... |
  1678. 319.47 s > 1205 | | production_orientation_ids: &[OrientationID],
  1679. 319.47 s > 1206 | | ) -> (Self, EvaluatorBuildTimings) {
  1680. 319.47 s > | |______________________________________^
  1681. 319.47 s > |
  1682. 319.47 s > = help: for further information visit https://rust-lang.github.io/rust-clippy/rust-1.97.0/index.html#too_many_arguments
  1683. 319.47 s >
  1684. 319.47 s > Some errors have detailed explanations: E0277, E0283.
  1685. 319.47 s > For more information about an error, try `rustc --explain E0277`.
  1686. 319.47 s > error: could not compile `gammalooprs` (lib) due to 5 previous errors
  1687. 319.47 s > warning: build failed, waiting for other jobs to finish...
  1688. 319.47 s > error: could not compile `gammalooprs` (lib test) due to 16 previous errors
  1689. 319.47 s For full logs, run:
  1690. 319.47 s nix log /nix/store/bfvd4racaxf8cd9mpzlpz54h91n6g02c-gammaloop-workspace-clippy-0.1.0.drv
  1691. 319.50 s Build failed.