0.00 s
$ /nix/store/9ypz3flqsrl5xl495mm8h645gadjsxi1-coreutils-9.11/bin/timeout --kill-after=15s 7200s /nix/store/23zk8sgzamrbmj1fday15szf7f2279s8-nix-2.34.7/bin/nix --extra-experimental-features nix-command --extra-experimental-features flakes --log-format internal-json build --no-link --print-out-paths git+https://github.com/alphal00p/gammaloop?ref=ir_safe_threshold_subtraction&rev=6c3b1ff79c34a5e34e424ddd51dd218105b48f53&shallow=1#checks.x86_64-linux.gammaloop-clippy --print-build-logs
4.98 s
5.55 s
Building /nix/store/bfvd4racaxf8cd9mpzlpz54h91n6g02c-gammaloop-workspace-clippy-0.1.0.drv
5.64 s
[gammaloop-workspace-clippy] Phase: unpackPhase
5.65 s
[gammaloop-workspace-clippy] unpacking source archive /nix/store/bcy0vqqk2ibk38nik2bb809ck03m92g2-source
6.29 s
[gammaloop-workspace-clippy] source root is source
6.34 s
[gammaloop-workspace-clippy] Phase: patchPhase
6.35 s
[gammaloop-workspace-clippy] Executing configureCargoCommonVars
6.35 s
[gammaloop-workspace-clippy] decompressing cargo artifacts from /nix/store/wxpx6lf642pgxp2wz1pw1lxksj5p1wb0-gammaloop-workspace-deps-deps-0.1.0/target.tar.zst to target
8.55 s
[gammaloop-workspace-clippy] Phase: updateAutotoolsGnuConfigScriptsPhase
8.60 s
[gammaloop-workspace-clippy] Phase: configurePhase
8.61 s
[gammaloop-workspace-clippy] will append /build/source/.cargo-home/config.toml with contents of /nix/store/8zq9ya5slh345hbylmsibxw827bi98w0-vendor-cargo-deps/config.toml
8.62 s
[gammaloop-workspace-clippy] default configurePhase, nothing to do
8.62 s
[gammaloop-workspace-clippy] Phase: buildPhase
8.67 s
[gammaloop-workspace-clippy] +++ command cargo --version
8.68 s
[gammaloop-workspace-clippy] cargo 1.97.0 (c980f4866 2026-06-30)
8.73 s
[gammaloop-workspace-clippy] +++ command cargo clippy --profile ci-optim --locked --workspace --features gammaloop-tracing-filter/clap,gammaloop-tracing-filter/symbolica,idenso/bincode,idenso/reference-cases,linnet/bincode,linnet/drawing,linnet/rkyv,linnet/serde,linnet/symbolica,spenso-macros/shadowing,spenso/shadowing,symbolica/tracing_max_level_info,three-dimensional-reps/display,three-dimensional-reps/eval,three-dimensional-reps/serde --all-targets --no-deps -- --deny warnings
11.00 s
[gammaloop-workspace-clippy] Checking cfg-if v1.0.4
11.00 s
[gammaloop-workspace-clippy] Checking memchr v2.8.0
11.00 s
[gammaloop-workspace-clippy] Checking once_cell v1.21.4
11.00 s
[gammaloop-workspace-clippy] Checking either v1.15.0
11.01 s
[gammaloop-workspace-clippy] Checking itoa v1.0.18
11.05 s
[gammaloop-workspace-clippy] Checking serde_core v1.0.228
11.05 s
[gammaloop-workspace-clippy] Checking libc v0.2.186
11.05 s
[gammaloop-workspace-clippy] Checking libm v0.2.16
11.07 s
[gammaloop-workspace-clippy] Checking log v0.4.29
11.09 s
[gammaloop-workspace-clippy] Checking zerocopy v0.8.48
11.09 s
[gammaloop-workspace-clippy] Checking regex-syntax v0.8.10
11.10 s
[gammaloop-workspace-clippy] Checking crossbeam-utils v0.8.21
11.14 s
[gammaloop-workspace-clippy] Checking equivalent v1.0.2
11.15 s
[gammaloop-workspace-clippy] Checking zmij v1.0.21
11.15 s
[gammaloop-workspace-clippy] Checking lazy_static v1.5.0
11.15 s
[gammaloop-workspace-clippy] Checking bytemuck v1.25.0
11.15 s
[gammaloop-workspace-clippy] Compiling target-lexicon v0.13.5
11.21 s
[gammaloop-workspace-clippy] Checking arrayvec v0.7.6
11.24 s
[gammaloop-workspace-clippy] Checking powerfmt v0.2.0
11.32 s
[gammaloop-workspace-clippy] Checking time-core v0.1.8
11.38 s
[gammaloop-workspace-clippy] Checking itertools v0.14.0
11.41 s
[gammaloop-workspace-clippy] Checking pin-project-lite v0.2.17
11.42 s
[gammaloop-workspace-clippy] Checking num_threads v0.1.7
11.46 s
[gammaloop-workspace-clippy] Checking deranged v0.5.8
11.53 s
[gammaloop-workspace-clippy] Checking num-conv v0.2.1
11.55 s
[gammaloop-workspace-clippy] Checking tracing-core v0.1.36
11.60 s
[gammaloop-workspace-clippy] Checking foldhash v0.2.0
11.60 s
[gammaloop-workspace-clippy] Checking allocator-api2 v0.2.21
11.77 s
[gammaloop-workspace-clippy] Checking crossbeam-epoch v0.9.18
11.79 s
[gammaloop-workspace-clippy] Checking const-random v0.1.18
11.81 s
[gammaloop-workspace-clippy] Checking unty v0.0.4
11.83 s
[gammaloop-workspace-clippy] Checking safe_arch v0.7.4
11.84 s
[gammaloop-workspace-clippy] Checking nu-ansi-term v0.50.3
11.84 s
[gammaloop-workspace-clippy] Checking winnow v1.0.2
11.87 s
[gammaloop-workspace-clippy] Checking static_assertions v1.1.0
11.89 s
[gammaloop-workspace-clippy] Checking aho-corasick v1.1.4
11.96 s
[gammaloop-workspace-clippy] Checking safe_arch v1.0.0
11.99 s
[gammaloop-workspace-clippy] Checking hashbrown v0.16.1
12.01 s
[gammaloop-workspace-clippy] Checking tracing v0.1.44
12.06 s
[gammaloop-workspace-clippy] Checking crossbeam-deque v0.8.6
12.14 s
[gammaloop-workspace-clippy] Checking tracing-log v0.2.0
12.24 s
[gammaloop-workspace-clippy] Checking wide v0.7.33
12.26 s
[gammaloop-workspace-clippy] Checking rayon-core v1.13.0
12.27 s
[gammaloop-workspace-clippy] Checking sharded-slab v0.1.7
12.33 s
[gammaloop-workspace-clippy] Checking thread_local v1.1.9
12.48 s
[gammaloop-workspace-clippy] Checking toml_writer v1.1.1+spec-1.1.0
12.56 s
[gammaloop-workspace-clippy] Checking num-traits v0.2.19
12.60 s
[gammaloop-workspace-clippy] Checking az v1.3.0
12.70 s
[gammaloop-workspace-clippy] Checking indenter v0.3.4
12.72 s
[gammaloop-workspace-clippy] Checking rayon v1.12.0
12.81 s
[gammaloop-workspace-clippy] Checking wide v1.3.0
12.83 s
[gammaloop-workspace-clippy] Compiling phf_shared v0.11.3
12.90 s
[gammaloop-workspace-clippy] Checking anyhow v1.0.102
12.92 s
[gammaloop-workspace-clippy] Checking rawpointer v0.2.1
12.99 s
[gammaloop-workspace-clippy] Checking utf8parse v0.2.2
13.08 s
[gammaloop-workspace-clippy] Checking dyn-clone v1.0.20
13.11 s
[gammaloop-workspace-clippy] Checking alloc-no-stdlib v2.0.4
13.13 s
[gammaloop-workspace-clippy] Checking anstyle-parse v1.0.0
13.21 s
[gammaloop-workspace-clippy] Checking matrixmultiply v0.3.10
13.27 s
[gammaloop-workspace-clippy] Checking colorchoice v1.0.5
13.28 s
[gammaloop-workspace-clippy] Checking alloc-stdlib v0.2.2
13.35 s
[gammaloop-workspace-clippy] Checking colored v3.1.1
13.36 s
[gammaloop-workspace-clippy] Checking anstyle-query v1.1.5
13.39 s
[gammaloop-workspace-clippy] Checking toml_parser v1.1.2+spec-1.1.0
13.43 s
[gammaloop-workspace-clippy] Checking anstyle v1.0.14
13.44 s
[gammaloop-workspace-clippy] Checking is_terminal_polyfill v1.70.2
13.46 s
[gammaloop-workspace-clippy] Compiling phf_generator v0.11.3
13.54 s
[gammaloop-workspace-clippy] Checking eyre v0.6.12
13.54 s
[gammaloop-workspace-clippy] Checking approx v0.5.1
13.62 s
[gammaloop-workspace-clippy] Checking getrandom v0.3.4
13.69 s
[gammaloop-workspace-clippy] Checking time v0.3.47
13.71 s
[gammaloop-workspace-clippy] Checking num-integer v0.1.46
13.73 s
[gammaloop-workspace-clippy] Checking gmp-mpfr-sys v1.7.1
13.79 s
[gammaloop-workspace-clippy] Checking anstream v1.0.0
13.84 s
[gammaloop-workspace-clippy] Checking regex-automata v0.4.14
13.87 s
[gammaloop-workspace-clippy] Checking unicode-width v0.2.2
13.90 s
[gammaloop-workspace-clippy] Checking bitflags v1.3.2
13.94 s
[gammaloop-workspace-clippy] Checking serde v1.0.228
13.99 s
[gammaloop-workspace-clippy] Checking serde_json v1.0.149
14.07 s
[gammaloop-workspace-clippy] Compiling pyo3-build-config v0.28.3
14.08 s
[gammaloop-workspace-clippy] Checking bitflags v2.11.1
14.11 s
[gammaloop-workspace-clippy] Checking serde_spanned v1.1.1
14.81 s
[gammaloop-workspace-clippy] Checking toml_datetime v1.1.1+spec-1.1.0
15.11 s
[gammaloop-workspace-clippy] Compiling phf_codegen v0.11.3
15.17 s
[gammaloop-workspace-clippy] Checking region v3.0.2
15.19 s
[gammaloop-workspace-clippy] Checking rand_core v0.9.5
15.21 s
[gammaloop-workspace-clippy] Checking hugepage-rs v0.1.1
15.22 s
[gammaloop-workspace-clippy] Checking wasmtime-jit-icache-coherence v34.0.2
15.25 s
[gammaloop-workspace-clippy] Checking brotli-decompressor v5.0.0
15.28 s
[gammaloop-workspace-clippy] Checking toml v1.1.2+spec-1.1.0
15.28 s
[gammaloop-workspace-clippy] Checking spec_math v0.1.6
15.30 s
[gammaloop-workspace-clippy] Checking inventory v0.3.24
15.31 s
[gammaloop-workspace-clippy] Checking thiserror v2.0.18
15.31 s
[gammaloop-workspace-clippy] Compiling getopts v0.2.24
15.33 s
[gammaloop-workspace-clippy] Checking libloading v0.9.0
15.37 s
[gammaloop-workspace-clippy] Checking tinyjson v2.5.1
15.40 s
[gammaloop-workspace-clippy] Checking append-only-vec v0.1.8
15.41 s
[gammaloop-workspace-clippy] Checking byteorder v1.5.0
15.41 s
[gammaloop-workspace-clippy] Checking self_cell v1.2.2
15.43 s
[gammaloop-workspace-clippy] Checking bytes v1.11.1
15.49 s
[gammaloop-workspace-clippy] Compiling unic-common v0.9.0
15.50 s
[gammaloop-workspace-clippy] Compiling unic-char-range v0.9.0
15.50 s
[gammaloop-workspace-clippy] Checking linux-raw-sys v0.12.1
15.59 s
[gammaloop-workspace-clippy] Checking smallvec v1.15.1
15.63 s
[gammaloop-workspace-clippy] Checking num-complex v0.4.6
15.64 s
[gammaloop-workspace-clippy] Checking tracing-serde v0.2.0
15.68 s
[gammaloop-workspace-clippy] Checking bincode v2.0.1
15.68 s
[gammaloop-workspace-clippy] Checking smartstring v1.0.1
15.80 s
[gammaloop-workspace-clippy] Compiling unicode_names2_generator v1.3.0
15.87 s
[gammaloop-workspace-clippy] Compiling unic-ucd-version v0.9.0
15.96 s
[gammaloop-workspace-clippy] Compiling unic-char-property v0.9.0
15.99 s
[gammaloop-workspace-clippy] Checking rustix v1.1.4
15.99 s
[gammaloop-workspace-clippy] Compiling is-macro v0.3.7
16.07 s
[gammaloop-workspace-clippy] Compiling rustpython-parser-vendored v0.4.0
16.12 s
[gammaloop-workspace-clippy] Checking ppv-lite86 v0.2.21
16.15 s
[gammaloop-workspace-clippy] Checking ahash v0.8.12
16.15 s
[gammaloop-workspace-clippy] Checking iana-time-zone v0.1.65
16.23 s
[gammaloop-workspace-clippy] Compiling rustpython-parser v0.4.0
16.38 s
[gammaloop-workspace-clippy] Checking chrono v0.4.44
16.41 s
[gammaloop-workspace-clippy] Compiling phf v0.11.3
16.50 s
[gammaloop-workspace-clippy] Checking simba v0.9.1
16.58 s
[gammaloop-workspace-clippy] Checking rustc-hash v2.1.2
16.78 s
[gammaloop-workspace-clippy] Checking ndarray v0.17.2
16.80 s
[gammaloop-workspace-clippy] Checking brotli v8.0.2
16.90 s
[gammaloop-workspace-clippy] Compiling unic-emoji-char v0.9.0
16.95 s
[gammaloop-workspace-clippy] Checking rand_chacha v0.9.0
17.01 s
[gammaloop-workspace-clippy] Compiling unic-ucd-ident v0.9.0
17.41 s
[gammaloop-workspace-clippy] Checking rand v0.9.4
17.43 s
[gammaloop-workspace-clippy] Compiling lalrpop-util v0.20.2
17.43 s
[gammaloop-workspace-clippy] Compiling rustc-hash v1.1.0
17.56 s
[gammaloop-workspace-clippy] Checking rug v1.30.0
17.62 s
[gammaloop-workspace-clippy] Checking unicode-segmentation v1.13.2
17.95 s
[gammaloop-workspace-clippy] Compiling symbolica v2.2.0 (https://github.com/alphal00p/symbolica?rev=4d0a833eb8e059d1f95bdae5abed2559830b235f#4d0a833e)
18.12 s
[gammaloop-workspace-clippy] Checking typenum v1.20.0
18.24 s
[gammaloop-workspace-clippy] Checking getrandom v0.2.17
18.35 s
[gammaloop-workspace-clippy] Checking scopeguard v1.2.0
18.47 s
[gammaloop-workspace-clippy] Checking lock_api v0.4.14
18.53 s
[gammaloop-workspace-clippy] Checking parking_lot_core v0.9.12
18.63 s
[gammaloop-workspace-clippy] Checking symjit v2.21.0
18.86 s
[gammaloop-workspace-clippy] Checking hashbrown v0.17.0
18.91 s
[gammaloop-workspace-clippy] Checking unicode-ident v1.0.24
18.93 s
[gammaloop-workspace-clippy] Checking parking_lot v0.12.5
18.96 s
[gammaloop-workspace-clippy] Checking errno v0.3.14
19.01 s
[gammaloop-workspace-clippy] Checking clap_lex v1.1.0
19.09 s
[gammaloop-workspace-clippy] Checking strsim v0.11.1
19.15 s
[gammaloop-workspace-clippy] Checking unicase v2.9.0
19.27 s
[gammaloop-workspace-clippy] Checking terminal_size v0.4.4
19.29 s
[gammaloop-workspace-clippy] Checking signal-hook-registry v1.4.8
19.37 s
[gammaloop-workspace-clippy] Checking vte v0.14.1
19.37 s
[gammaloop-workspace-clippy] Checking same-file v1.0.6
19.47 s
[gammaloop-workspace-clippy] Checking clap_builder v4.6.0
19.53 s
[gammaloop-workspace-clippy] Checking half v2.7.1
19.59 s
[gammaloop-workspace-clippy] Checking signal-hook v0.3.18
19.62 s
[gammaloop-workspace-clippy] Checking walkdir v2.5.0
19.82 s
[gammaloop-workspace-clippy] Checking mio v1.2.0
20.03 s
[gammaloop-workspace-clippy] Checking minimal-lexical v0.2.1
20.18 s
[gammaloop-workspace-clippy] Checking ciborium-io v0.2.2
20.27 s
[gammaloop-workspace-clippy] Checking generic-array v0.14.7
20.29 s
[gammaloop-workspace-clippy] Checking ciborium-ll v0.2.2
20.46 s
[gammaloop-workspace-clippy] Checking indexmap v2.14.0
20.51 s
[gammaloop-workspace-clippy] Checking derive_more v2.1.1
20.61 s
[gammaloop-workspace-clippy] Checking num-bigint v0.4.6
20.69 s
[gammaloop-workspace-clippy] Checking nom v7.1.3
20.88 s
[gammaloop-workspace-clippy] Checking signal-hook-mio v0.2.5
20.96 s
[gammaloop-workspace-clippy] Checking console v0.16.3
21.02 s
[gammaloop-workspace-clippy] Checking matchers v0.2.0
21.15 s
[gammaloop-workspace-clippy] Checking tracing-subscriber v0.3.23
21.44 s
[gammaloop-workspace-clippy] Checking regex v1.12.3
21.52 s
[gammaloop-workspace-clippy] Checking crypto-common v0.1.7
21.59 s
[gammaloop-workspace-clippy] Checking block-buffer v0.10.4
21.69 s
[gammaloop-workspace-clippy] Checking digest v0.10.7
21.72 s
[gammaloop-workspace-clippy] Checking bstr v1.12.1
21.79 s
[gammaloop-workspace-clippy] Checking cpufeatures v0.2.17
21.88 s
[gammaloop-workspace-clippy] Checking winnow v0.7.15
21.99 s
[gammaloop-workspace-clippy] Checking linux-raw-sys v0.4.15
22.22 s
[gammaloop-workspace-clippy] Compiling unicode_names2 v1.3.0
22.45 s
[gammaloop-workspace-clippy] Checking rustix v0.38.44
22.55 s
[gammaloop-workspace-clippy] Checking sha2 v0.10.9
22.57 s
[gammaloop-workspace-clippy] Checking globset v0.4.18
22.86 s
[gammaloop-workspace-clippy] Checking clap v4.6.1
22.93 s
[gammaloop-workspace-clippy] Checking ansitok v0.3.0
22.94 s
[gammaloop-workspace-clippy] Checking ciborium v0.2.2
22.96 s
[gammaloop-workspace-clippy] Checking rand_core v0.6.4
23.00 s
[gammaloop-workspace-clippy] Checking getrandom v0.4.2
23.02 s
[gammaloop-workspace-clippy] Checking fastrand v2.4.1
23.16 s
[gammaloop-workspace-clippy] Checking plotters-backend v0.3.7
23.17 s
[gammaloop-workspace-clippy] Checking fnv v1.0.7
23.19 s
[gammaloop-workspace-clippy] Checking rust-embed-utils v8.11.0
23.21 s
[gammaloop-workspace-clippy] Checking serde_spanned v0.6.9
23.24 s
[gammaloop-workspace-clippy] Checking tempfile v3.27.0
23.24 s
[gammaloop-workspace-clippy] Checking toml_datetime v0.6.11
23.25 s
[gammaloop-workspace-clippy] Checking crossterm v0.28.1
23.31 s
[gammaloop-workspace-clippy] Checking itertools v0.10.5
23.35 s
[gammaloop-workspace-clippy] Checking tap v1.0.1
23.38 s
[gammaloop-workspace-clippy] Checking cast v0.3.0
23.40 s
[gammaloop-workspace-clippy] Checking plotters-svg v0.3.7
23.44 s
[gammaloop-workspace-clippy] Checking toml_write v0.1.2
23.45 s
[gammaloop-workspace-clippy] Checking wyz v0.5.1
23.47 s
[gammaloop-workspace-clippy] Checking ansi-str v0.9.0
23.50 s
[gammaloop-workspace-clippy] Checking rand_chacha v0.3.1
23.52 s
[gammaloop-workspace-clippy] Checking radium v0.7.0
23.55 s
[gammaloop-workspace-clippy] Checking typeid v1.0.3
23.57 s
[gammaloop-workspace-clippy] Checking plotters v0.3.7
23.66 s
[gammaloop-workspace-clippy] Checking similar v2.7.0
23.68 s
[gammaloop-workspace-clippy] Checking tinytemplate v1.2.1
23.69 s
[gammaloop-workspace-clippy] Checking is-terminal v0.4.17
23.74 s
[gammaloop-workspace-clippy] Checking bytecount v0.6.9
23.75 s
[gammaloop-workspace-clippy] Checking anes v0.1.6
23.78 s
[gammaloop-workspace-clippy] Checking funty v2.0.0
23.80 s
[gammaloop-workspace-clippy] Checking oorandom v11.1.5
23.85 s
[gammaloop-workspace-clippy] Checking papergrid v0.17.0
23.90 s
[gammaloop-workspace-clippy] Checking toml_edit v0.22.27
23.93 s
[gammaloop-workspace-clippy] Checking rand v0.8.6
23.97 s
[gammaloop-workspace-clippy] Checking ron v0.12.1
24.01 s
[gammaloop-workspace-clippy] Checking testing_table v0.3.0
24.13 s
[gammaloop-workspace-clippy] Checking env_filter v1.0.1
24.15 s
[gammaloop-workspace-clippy] Checking xprec v0.2.2
24.33 s
[gammaloop-workspace-clippy] Checking bitvec v1.0.1
24.38 s
[gammaloop-workspace-clippy] Checking toml_edit v0.25.11+spec-1.1.0
24.42 s
[gammaloop-workspace-clippy] Checking uncased v0.9.10
24.54 s
[gammaloop-workspace-clippy] Checking jiff v0.2.24
24.58 s
[gammaloop-workspace-clippy] Checking ptr_meta v0.1.4
24.60 s
[gammaloop-workspace-clippy] Checking ucd-trie v0.1.7
24.62 s
[gammaloop-workspace-clippy] Checking criterion-plot v0.5.0
24.70 s
[gammaloop-workspace-clippy] Checking simdutf8 v0.1.5
24.73 s
[gammaloop-workspace-clippy] Checking ahash v0.7.8
24.75 s
[gammaloop-workspace-clippy] Checking pest v2.8.6
24.83 s
[gammaloop-workspace-clippy] Checking approx v0.4.0
24.93 s
[gammaloop-workspace-clippy] Checking hashbrown v0.12.3
24.95 s
[gammaloop-workspace-clippy] Checking bytecheck v0.6.12
24.96 s
[gammaloop-workspace-clippy] Checking criterion v0.5.1
24.99 s
[gammaloop-workspace-clippy] Checking seahash v4.1.0
25.12 s
[gammaloop-workspace-clippy] Checking cgmath v0.18.0
25.25 s
[gammaloop-workspace-clippy] Compiling pyo3-ffi v0.28.3
25.35 s
[gammaloop-workspace-clippy] Compiling pyo3-macros-backend v0.28.3
25.42 s
[gammaloop-workspace-clippy] Compiling pyo3 v0.28.3
25.42 s
[gammaloop-workspace-clippy] Compiling numpy v0.28.0
25.51 s
[gammaloop-workspace-clippy] Checking insta v1.47.2
25.57 s
[gammaloop-workspace-clippy] Checking tabled v0.20.0
25.58 s
[gammaloop-workspace-clippy] Checking rend v0.4.2
25.84 s
[gammaloop-workspace-clippy] Checking num-rational v0.4.2
25.85 s
[gammaloop-workspace-clippy] Checking num-iter v0.1.45
26.01 s
[gammaloop-workspace-clippy] Checking ref-ops v0.2.5
26.06 s
[gammaloop-workspace-clippy] Checking toml v0.8.23
26.18 s
[gammaloop-workspace-clippy] Checking rand_xoshiro v0.6.0
26.27 s
[gammaloop-workspace-clippy] Checking num v0.4.3
26.37 s
[gammaloop-workspace-clippy] Checking features v0.10.0
26.48 s
[gammaloop-workspace-clippy] Checking gat-lending-iterator v0.1.8
26.51 s
[gammaloop-workspace-clippy] Checking constcat v0.5.1
26.58 s
[gammaloop-workspace-clippy] Checking colored v2.2.0
26.61 s
[gammaloop-workspace-clippy] Checking dot-parser v0.5.1
26.63 s
[gammaloop-workspace-clippy] Checking constant_time_eq v0.4.2
26.75 s
[gammaloop-workspace-clippy] Checking arrayref v0.3.9
26.83 s
[gammaloop-workspace-clippy] Checking cpufeatures v0.3.0
26.85 s
[gammaloop-workspace-clippy] Checking base64 v0.22.1
26.92 s
[gammaloop-workspace-clippy] Checking blake3 v1.8.5
27.02 s
[gammaloop-workspace-clippy] Checking figment v0.10.19
27.04 s
[gammaloop-workspace-clippy] Checking siphasher v1.0.2
27.06 s
[gammaloop-workspace-clippy] Checking joinery v2.1.0
27.28 s
[gammaloop-workspace-clippy] Checking phf_shared v0.13.1
27.30 s
[gammaloop-workspace-clippy] Checking titlecase v2.2.1
27.32 s
[gammaloop-workspace-clippy] Checking subprocess v0.2.15
27.36 s
[gammaloop-workspace-clippy] Checking rust_lisp v0.18.0
27.51 s
[gammaloop-workspace-clippy] Compiling vakint v0.1.2 (/build/source/crates/vakint)
27.60 s
[gammaloop-workspace-clippy] Compiling rustpython-parser-core v0.4.0
27.70 s
[gammaloop-workspace-clippy] Checking version-compare v0.2.1
27.72 s
[gammaloop-workspace-clippy] Checking phf v0.13.1
27.82 s
[gammaloop-workspace-clippy] Checking xpct v0.5.1
27.86 s
[gammaloop-workspace-clippy] Checking ryu v1.0.23
27.90 s
[gammaloop-workspace-clippy] Compiling rustpython-ast v0.4.0
27.94 s
[gammaloop-workspace-clippy] Checking string-template-plus v0.4.3
27.97 s
[gammaloop-workspace-clippy] Checking castaway v0.2.4
27.99 s
[gammaloop-workspace-clippy] Checking toml_datetime v0.7.5+spec-1.1.0
28.06 s
[gammaloop-workspace-clippy] Checking strum v0.27.2
28.08 s
[gammaloop-workspace-clippy] Checking unicode-truncate v2.0.1
28.10 s
[gammaloop-workspace-clippy] Checking kasuari v0.4.12
28.10 s
[gammaloop-workspace-clippy] Checking lru v0.16.4
28.12 s
[gammaloop-workspace-clippy] Checking compact_str v0.9.0
28.19 s
[gammaloop-workspace-clippy] Checking vte v0.15.0
28.23 s
[gammaloop-workspace-clippy] Checking portable-atomic v1.13.1
28.30 s
[gammaloop-workspace-clippy] Checking unit-prefix v0.5.2
28.37 s
[gammaloop-workspace-clippy] Checking vt100 v0.16.2
28.42 s
[gammaloop-workspace-clippy] Checking toml v0.9.12+spec-1.1.0
28.49 s
[gammaloop-workspace-clippy] Checking rand_distr v0.4.3
28.51 s
[gammaloop-workspace-clippy] Checking simba v0.6.0
28.60 s
[gammaloop-workspace-clippy] Checking line-clipping v0.3.7
28.62 s
[gammaloop-workspace-clippy] Checking gimli v0.32.3
28.74 s
[gammaloop-workspace-clippy] Checking adler2 v2.0.1
28.77 s
[gammaloop-workspace-clippy] Compiling three-dimensional-reps v0.1.0 (/build/source/crates/three-dimensional-reps)
28.79 s
[gammaloop-workspace-clippy] Checking thiserror v1.0.69
28.88 s
[gammaloop-workspace-clippy] Checking indicatif v0.18.4
28.89 s
[gammaloop-workspace-clippy] Checking miniz_oxide v0.8.9
28.91 s
[gammaloop-workspace-clippy] Checking derive_builder v0.11.2
28.92 s
[gammaloop-workspace-clippy] Checking owo-colors v4.3.0
28.98 s
[gammaloop-workspace-clippy] Checking ratatui-core v0.1.0
29.00 s
[gammaloop-workspace-clippy] Checking crossterm v0.29.0
29.15 s
[gammaloop-workspace-clippy] Checking object v0.37.3
29.20 s
[gammaloop-workspace-clippy] Checking tracing-error v0.2.1
29.26 s
[gammaloop-workspace-clippy] Checking typed-index-collections v3.5.0
29.52 s
[gammaloop-workspace-clippy] Checking serde-big-array v0.5.1
29.58 s
[gammaloop-workspace-clippy] Checking env_logger v0.11.10
29.68 s
[gammaloop-workspace-clippy] Checking amd v0.2.2
29.70 s
[gammaloop-workspace-clippy] Checking itertools v0.11.0
29.85 s
[gammaloop-workspace-clippy] Compiling gammaloop-tracing-filter-macros v0.1.0 (/build/source/crates/gammaloop-tracing-filter-macros)
29.89 s
[gammaloop-workspace-clippy] Checking rustc-demangle v0.1.27
30.03 s
[gammaloop-workspace-clippy] Checking option-ext v0.2.0
30.06 s
[gammaloop-workspace-clippy] Checking ref-cast v1.0.25
30.12 s
[gammaloop-workspace-clippy] Checking dirs-sys v0.5.0
30.18 s
[gammaloop-workspace-clippy] Checking nix v0.31.2
30.36 s
[gammaloop-workspace-clippy] Checking integer-sqrt v0.1.5
30.40 s
[gammaloop-workspace-clippy] Checking brotli-decompressor v4.0.3
30.46 s
[gammaloop-workspace-clippy] Checking crossbeam-channel v0.5.15
30.47 s
[gammaloop-workspace-clippy] Checking color-spantrace v0.3.0
30.50 s
[gammaloop-workspace-clippy] Checking itertools v0.12.1
30.52 s
[gammaloop-workspace-clippy] Checking unsafe-libyaml v0.2.11
30.54 s
[gammaloop-workspace-clippy] Checking symlink v0.1.0
30.56 s
[gammaloop-workspace-clippy] Checking rkyv v0.7.46
30.63 s
[gammaloop-workspace-clippy] Compiling gammalooprs v0.3.4 (/build/source/crates/gammalooprs)
31.04 s
[gammaloop-workspace-clippy] Checking ratatui-widgets v0.3.0
31.19 s
[gammaloop-workspace-clippy] Checking ratatui-crossterm v0.1.0
31.24 s
[gammaloop-workspace-clippy] Checking tracing-appender v0.2.5
31.33 s
[gammaloop-workspace-clippy] Checking ctrlc v3.5.2
31.54 s
[gammaloop-workspace-clippy] Checking include_dir v0.7.4
31.55 s
[gammaloop-workspace-clippy] Checking pathfinding v4.15.0
31.57 s
[gammaloop-workspace-clippy] Checking dirs v6.0.0
31.70 s
[gammaloop-workspace-clippy] Checking schemars v1.2.1
31.75 s
[gammaloop-workspace-clippy] Checking slotmap v1.1.1
32.00 s
[gammaloop-workspace-clippy] Checking serde_yaml v0.9.34+deprecated
32.08 s
[gammaloop-workspace-clippy] Checking brotli v7.0.0
32.67 s
[gammaloop-workspace-clippy] Compiling numerica v2.2.0 (https://github.com/alphal00p/symbolica?rev=4d0a833eb8e059d1f95bdae5abed2559830b235f#4d0a833e)
32.85 s
[gammaloop-workspace-clippy] Checking clarabel v0.11.1
32.99 s
[gammaloop-workspace-clippy] Checking tracing-indicatif v0.3.14
33.06 s
[gammaloop-workspace-clippy] Checking addr2line v0.25.1
33.13 s
[gammaloop-workspace-clippy] Checking json5 v0.4.1
33.20 s
[gammaloop-workspace-clippy] Checking vectorize v0.2.0
33.25 s
[gammaloop-workspace-clippy] Checking ringbuffer v0.16.0
33.65 s
[gammaloop-workspace-clippy] Checking base62 v2.2.4
33.71 s
[gammaloop-workspace-clippy] Checking rust-embed v8.11.0
33.72 s
[gammaloop-workspace-clippy] Checking clap_complete v4.6.3
33.81 s
[gammaloop-workspace-clippy] Checking strip-ansi-escapes v0.2.1
33.83 s
[gammaloop-workspace-clippy] Checking ratatui-macros v0.7.0
33.85 s
[gammaloop-workspace-clippy] Checking fd-lock v4.0.4
33.86 s
[gammaloop-workspace-clippy] Compiling gammaloop-api v0.1.0 (/build/source/crates/gammaloop-api)
33.95 s
[gammaloop-workspace-clippy] Checking ratatui v0.30.0
33.97 s
[gammaloop-workspace-clippy] Checking itertools v0.13.0
33.97 s
[gammaloop-workspace-clippy] Checking strum v0.26.3
33.97 s
[gammaloop-workspace-clippy] Checking sysinfo v0.33.1
34.17 s
[gammaloop-workspace-clippy] Checking shlex v1.3.0
34.23 s
[gammaloop-workspace-clippy] Checking slab v0.4.12
34.43 s
[gammaloop-workspace-clippy] Checking futures-core v0.3.32
34.57 s
[gammaloop-workspace-clippy] Checking futures-task v0.3.32
34.58 s
[gammaloop-workspace-clippy] Checking clap_complete_nushell v4.6.0
34.66 s
[gammaloop-workspace-clippy] Checking sdd v3.0.10
34.68 s
[gammaloop-workspace-clippy] Compiling gammaloop-integration-tests v0.1.0 (/build/source/tests)
34.84 s
[gammaloop-workspace-clippy] Compiling test-log-core v0.2.20
34.86 s
[gammaloop-workspace-clippy] Checking futures-util v0.3.32
34.88 s
[gammaloop-workspace-clippy] Compiling rustc_version v0.4.1
34.92 s
[gammaloop-workspace-clippy] Checking which v8.0.2
35.05 s
[gammaloop-workspace-clippy] Checking scc v2.4.0
35.41 s
[gammaloop-workspace-clippy] Checking bincode v1.3.3
35.85 s
[gammaloop-workspace-clippy] Compiling gungraun-runner v0.18.2
36.18 s
[gammaloop-workspace-clippy] Checking backtrace v0.3.76
36.21 s
[gammaloop-workspace-clippy] Checking nalgebra v0.29.0
36.30 s
[gammaloop-workspace-clippy] Checking proc-macro2 v1.0.106
36.60 s
[gammaloop-workspace-clippy] Compiling gungraun-macros v0.8.0
36.76 s
[gammaloop-workspace-clippy] Checking color-eyre v0.6.5
37.13 s
[gammaloop-workspace-clippy] Checking quote v1.0.45
37.16 s
[gammaloop-workspace-clippy] Checking reedline v0.42.0
37.52 s
[gammaloop-workspace-clippy] Checking maplit v1.0.2
37.54 s
[gammaloop-workspace-clippy] Checking base64 v0.21.7
37.60 s
[gammaloop-workspace-clippy] Compiling iai-callgrind-runner v0.14.2
37.63 s
[gammaloop-workspace-clippy] Checking kurbo v0.13.0
38.03 s
[gammaloop-workspace-clippy] Checking ron v0.8.1
38.20 s
[gammaloop-workspace-clippy] Checking wait-timeout v0.2.1
38.44 s
[gammaloop-workspace-clippy] Compiling iai-callgrind v0.14.2
38.46 s
[gammaloop-workspace-clippy] Checking futures-executor v0.3.32
38.54 s
[gammaloop-workspace-clippy] Checking quick-error v1.2.3
38.58 s
[gammaloop-workspace-clippy] Checking bit-vec v0.8.0
38.66 s
[gammaloop-workspace-clippy] Checking serial_test v3.4.0
38.68 s
[gammaloop-workspace-clippy] Checking rusty-fork v0.3.1
39.00 s
[gammaloop-workspace-clippy] Checking bit-set v0.8.0
39.06 s
[gammaloop-workspace-clippy] Checking syn v2.0.117
39.11 s
[gammaloop-workspace-clippy] Compiling iai-callgrind-macros v0.5.1
39.24 s
[gammaloop-workspace-clippy] Compiling graphica v2.1.0 (https://github.com/alphal00p/symbolica?rev=4d0a833eb8e059d1f95bdae5abed2559830b235f#4d0a833e)
39.26 s
[gammaloop-workspace-clippy] Checking rand_xorshift v0.4.0
39.38 s
[gammaloop-workspace-clippy] Checking console v0.15.11
39.43 s
[gammaloop-workspace-clippy] Checking unarray v0.1.4
39.51 s
[gammaloop-workspace-clippy] Compiling test-log-macros v0.2.20
39.54 s
[gammaloop-workspace-clippy] Checking pathdiff v0.2.3
39.62 s
[gammaloop-workspace-clippy] Checking proptest v1.11.0
40.44 s
[gammaloop-workspace-clippy] Checking similar-asserts v1.7.0
40.67 s
[gammaloop-workspace-clippy] Checking clinnet v0.1.8 (/build/source/crates/clinnet)
40.86 s
[gammaloop-workspace-clippy] Checking kurvst v0.1.0 (/build/source/crates/kurvst)
43.56 s
[gammaloop-workspace-clippy] Checking test-log v0.2.20
47.17 s
[gammaloop-workspace-clippy] Checking statrs v0.16.1
48.35 s
[gammaloop-workspace-clippy] Checking momtrop v0.3.0
49.33 s
[gammaloop-workspace-clippy] Checking gungraun v0.18.2
49.91 s
[gammaloop-workspace-clippy] Compiling pyo3-macros v0.28.3
50.20 s
[gammaloop-workspace-clippy] Compiling pyo3-stub-gen-derive v0.17.2
56.31 s
[gammaloop-workspace-clippy] Checking pyo3-stub-gen v0.17.2
65.54 s
[gammaloop-workspace-clippy] Checking symbolica-utils v0.1.0 (/build/source/crates/symbolica-utils)
65.54 s
[gammaloop-workspace-clippy] Checking spenso-macros v0.3.2 (/build/source/crates/spenso-macros)
264.71 s
[gammaloop-workspace-clippy] Compiling gammaloop-workspace-hack v0.1.0 (/build/source/crates/gammaloop-workspace-hack)
265.00 s
[gammaloop-workspace-clippy] Checking linnet v0.17.0 (/build/source/crates/linnet)
270.40 s
[gammaloop-workspace-clippy] Checking spenso v0.6.0 (/build/source/crates/spenso)
271.74 s
[gammaloop-workspace-clippy] Checking linnet-py v0.1.0 (/build/source/crates/linnet-py)
271.74 s
[gammaloop-workspace-clippy] Checking linnest v0.1.0 (/build/source/crates/linnest)
280.62 s
[gammaloop-workspace-clippy] Checking idenso v0.3.0 (/build/source/crates/idenso)
280.62 s
[gammaloop-workspace-clippy] Checking gammaloop-tracing-filter v0.1.0 (/build/source/crates/gammaloop-tracing-filter)
284.19 s
[gammaloop-workspace-clippy] Checking spenso-hep-lib v0.1.7 (/build/source/crates/spenso-hep-lib)
284.46 s
[gammaloop-workspace-clippy] Checking spynso3 v0.1.2 (/build/source/crates/spynso3)
300.77 s
[gammaloop-workspace-clippy] error[E0283] : type annotations needed
300.77 s
[gammaloop-workspace-clippy] --> crates/gammalooprs/src/momentum/sample.rs:1165:35
300.77 s
[gammaloop-workspace-clippy] |
300.77 s
[gammaloop-workspace-clippy] 1165 | requested.into_iter().collect(),
300.77 s
[gammaloop-workspace-clippy] | ^^^^^^^ cannot infer type of the type parameter `B` declared on the method `collect`
300.77 s
[gammaloop-workspace-clippy] |
300.77 s
[gammaloop-workspace-clippy] = note : the type must implement `std::iter::FromIterator<linnet::half_edge::involution::EdgeIndex>`
300.77 s
[gammaloop-workspace-clippy] note : required by a bound in `std::iter::Iterator::collect`
300.77 s
[gammaloop-workspace-clippy] --> /rustc/2d8144b7880597b6e6d3dfd63a9a9efae3f533d3/library/core/src/iter/traits/iterator.rs:2077:4
300.77 s
[gammaloop-workspace-clippy] help : consider specifying the generic argument
300.77 s
[gammaloop-workspace-clippy] |
300.77 s
[gammaloop-workspace-clippy] 1165 | requested.into_iter().collect::<Vec<_>> (),
300.77 s
[gammaloop-workspace-clippy] | ++++++++++
300.77 s
[gammaloop-workspace-clippy]
300.77 s
[gammaloop-workspace-clippy] error[E0283] : type annotations needed
300.77 s
[gammaloop-workspace-clippy] --> crates/gammalooprs/src/momentum/sample.rs:1165:35
300.77 s
[gammaloop-workspace-clippy] |
300.77 s
[gammaloop-workspace-clippy] 1161 | / assert_eq!(
300.77 s
[gammaloop-workspace-clippy] 1162 | | subspace
300.77 s
[gammaloop-workspace-clippy] 1163 | | .iter_basis_edges(&all_lmbs)
300.77 s
[gammaloop-workspace-clippy] 1164 | | .collect::<std::collections::BTreeSet<_>>(),
300.77 s
[gammaloop-workspace-clippy] 1165 | | requested.into_iter().collect(),
300.77 s
[gammaloop-workspace-clippy] | | ^^^^^^^ cannot infer type of the type parameter `B` declared on the method `collect`
300.77 s
[gammaloop-workspace-clippy] 1166 | | );
300.77 s
[gammaloop-workspace-clippy] | |_________- type must be known at this point
300.77 s
[gammaloop-workspace-clippy] |
300.77 s
[gammaloop-workspace-clippy] = note : multiple `impl`s satisfying `std::collections::BTreeSet<linnet::half_edge::involution::EdgeIndex>: std::cmp::PartialEq<_>` found in the following crates: `alloc`, `rkyv`:
300.77 s
[gammaloop-workspace-clippy] - impl<K, AK> std::cmp::PartialEq<rkyv::collections::btree_set::ArchivedBTreeSet<AK>> for std::collections::BTreeSet<K>
300.77 s
[gammaloop-workspace-clippy] where AK: std::cmp::PartialEq<K>;
300.77 s
[gammaloop-workspace-clippy] - impl<T, A> std::cmp::PartialEq for std::collections::BTreeSet<T, A>
300.77 s
[gammaloop-workspace-clippy] where T: std::cmp::PartialEq, A: std::alloc::Allocator, A: std::clone::Clone;
300.77 s
[gammaloop-workspace-clippy] help : consider specifying the generic argument
300.77 s
[gammaloop-workspace-clippy] |
300.77 s
[gammaloop-workspace-clippy] 1165 | requested.into_iter().collect::<Vec<_>> (),
300.77 s
[gammaloop-workspace-clippy] | ++++++++++
300.77 s
[gammaloop-workspace-clippy]
301.44 s
[gammaloop-workspace-clippy] error[E0283] : type annotations needed
301.44 s
[gammaloop-workspace-clippy] --> crates/gammalooprs/src/momentum/sample.rs:1182:35
301.44 s
[gammaloop-workspace-clippy] |
301.44 s
[gammaloop-workspace-clippy] 1178 | / assert_eq!(
301.44 s
[gammaloop-workspace-clippy] 1179 | | common_subspace
301.44 s
[gammaloop-workspace-clippy] 1180 | | .iter_basis_edges(&all_lmbs)
301.44 s
[gammaloop-workspace-clippy] 1181 | | .collect::<std::collections::BTreeSet<_>>(),
301.44 s
[gammaloop-workspace-clippy] 1182 | | requested.into_iter().collect(),
301.44 s
[gammaloop-workspace-clippy] | | ^^^^^^^ cannot infer type of the type parameter `B` declared on the method `collect`
301.44 s
[gammaloop-workspace-clippy] 1183 | | );
301.44 s
[gammaloop-workspace-clippy] | |_________- type must be known at this point
301.44 s
[gammaloop-workspace-clippy] |
301.44 s
[gammaloop-workspace-clippy] = note : multiple `impl`s satisfying `std::collections::BTreeSet<linnet::half_edge::involution::EdgeIndex>: std::cmp::PartialEq<_>` found in the following crates: `alloc`, `rkyv`:
301.44 s
[gammaloop-workspace-clippy] - impl<K, AK> std::cmp::PartialEq<rkyv::collections::btree_set::ArchivedBTreeSet<AK>> for std::collections::BTreeSet<K>
301.44 s
[gammaloop-workspace-clippy] where AK: std::cmp::PartialEq<K>;
301.44 s
[gammaloop-workspace-clippy] - impl<T, A> std::cmp::PartialEq for std::collections::BTreeSet<T, A>
301.44 s
[gammaloop-workspace-clippy] where T: std::cmp::PartialEq, A: std::alloc::Allocator, A: std::clone::Clone;
301.44 s
[gammaloop-workspace-clippy] help : consider specifying the generic argument
301.44 s
[gammaloop-workspace-clippy] |
301.44 s
[gammaloop-workspace-clippy] 1182 | requested.into_iter().collect::<Vec<_>> (),
301.44 s
[gammaloop-workspace-clippy] | ++++++++++
301.44 s
[gammaloop-workspace-clippy]
301.46 s
[gammaloop-workspace-clippy] error[E0283] : type annotations needed
301.46 s
[gammaloop-workspace-clippy] --> crates/gammalooprs/src/momentum/sample.rs:1203:35
301.46 s
[gammaloop-workspace-clippy] |
301.46 s
[gammaloop-workspace-clippy] 1199 | / assert_eq!(
301.46 s
[gammaloop-workspace-clippy] 1200 | | sparse_common_subspace
301.46 s
[gammaloop-workspace-clippy] 1201 | | .iter_basis_edges(&all_lmbs)
301.46 s
[gammaloop-workspace-clippy] 1202 | | .collect::<std::collections::BTreeSet<_>>(),
301.46 s
[gammaloop-workspace-clippy] 1203 | | requested.into_iter().collect(),
301.46 s
[gammaloop-workspace-clippy] | | ^^^^^^^ cannot infer type of the type parameter `B` declared on the method `collect`
301.46 s
[gammaloop-workspace-clippy] 1204 | | );
301.46 s
[gammaloop-workspace-clippy] | |_________- type must be known at this point
301.46 s
[gammaloop-workspace-clippy] |
301.46 s
[gammaloop-workspace-clippy] = note : multiple `impl`s satisfying `std::collections::BTreeSet<linnet::half_edge::involution::EdgeIndex>: std::cmp::PartialEq<_>` found in the following crates: `alloc`, `rkyv`:
301.46 s
[gammaloop-workspace-clippy] - impl<K, AK> std::cmp::PartialEq<rkyv::collections::btree_set::ArchivedBTreeSet<AK>> for std::collections::BTreeSet<K>
301.46 s
[gammaloop-workspace-clippy] where AK: std::cmp::PartialEq<K>;
301.46 s
[gammaloop-workspace-clippy] - impl<T, A> std::cmp::PartialEq for std::collections::BTreeSet<T, A>
301.46 s
[gammaloop-workspace-clippy] where T: std::cmp::PartialEq, A: std::alloc::Allocator, A: std::clone::Clone;
301.47 s
[gammaloop-workspace-clippy] help : consider specifying the generic argument
301.47 s
[gammaloop-workspace-clippy] |
301.47 s
[gammaloop-workspace-clippy] 1203 | requested.into_iter().collect::<Vec<_>> (),
301.47 s
[gammaloop-workspace-clippy] | ++++++++++
301.47 s
[gammaloop-workspace-clippy]
303.21 s
[gammaloop-workspace-clippy] error[E0283] : type annotations needed
303.21 s
[gammaloop-workspace-clippy] --> crates/gammalooprs/src/processes/amplitude.rs:3336:49
303.21 s
[gammaloop-workspace-clippy] |
303.21 s
[gammaloop-workspace-clippy] 3336 | variant_ids.iter().copied().collect(),
303.21 s
[gammaloop-workspace-clippy] | ^^^^^^^ cannot infer type of the type parameter `B` declared on the method `collect`
303.21 s
[gammaloop-workspace-clippy] |
303.21 s
[gammaloop-workspace-clippy] = note : the type must implement `std::iter::FromIterator<processes::threshold_counterterms::ThresholdCountertermVariantId>`
303.21 s
[gammaloop-workspace-clippy] note : required by a bound in `std::iter::Iterator::collect`
303.21 s
[gammaloop-workspace-clippy] --> /rustc/2d8144b7880597b6e6d3dfd63a9a9efae3f533d3/library/core/src/iter/traits/iterator.rs:2077:4
303.21 s
[gammaloop-workspace-clippy] help : consider specifying the generic argument
303.21 s
[gammaloop-workspace-clippy] |
303.21 s
[gammaloop-workspace-clippy] 3336 | variant_ids.iter().copied().collect::<Vec<_>> (),
303.21 s
[gammaloop-workspace-clippy] | ++++++++++
303.21 s
[gammaloop-workspace-clippy]
303.21 s
[gammaloop-workspace-clippy] error[E0283] : type annotations needed
303.21 s
[gammaloop-workspace-clippy] --> crates/gammalooprs/src/processes/amplitude.rs:3336:49
303.21 s
[gammaloop-workspace-clippy] |
303.21 s
[gammaloop-workspace-clippy] 3334 | / assert_eq!(
303.21 s
[gammaloop-workspace-clippy] 3335 | | referenced_variants,
303.21 s
[gammaloop-workspace-clippy] 3336 | | variant_ids.iter().copied().collect(),
303.21 s
[gammaloop-workspace-clippy] | | ^^^^^^^ cannot infer type of the type parameter `B` declared on the method `collect`
303.21 s
[gammaloop-workspace-clippy] 3337 | | "overlap groups must retain every semantic duplicate independently",
303.21 s
[gammaloop-workspace-clippy] 3338 | | );
303.21 s
[gammaloop-workspace-clippy] | |_________________- type must be known at this point
303.21 s
[gammaloop-workspace-clippy] |
303.21 s
[gammaloop-workspace-clippy] = note : multiple `impl`s satisfying `std::collections::BTreeSet<processes::threshold_counterterms::ThresholdCountertermVariantId>: std::cmp::PartialEq<_>` found in the following crates: `alloc`, `rkyv`:
303.21 s
[gammaloop-workspace-clippy] - impl<K, AK> std::cmp::PartialEq<rkyv::collections::btree_set::ArchivedBTreeSet<AK>> for std::collections::BTreeSet<K>
303.21 s
[gammaloop-workspace-clippy] where AK: std::cmp::PartialEq<K>;
303.21 s
[gammaloop-workspace-clippy] - impl<T, A> std::cmp::PartialEq for std::collections::BTreeSet<T, A>
303.21 s
[gammaloop-workspace-clippy] where T: std::cmp::PartialEq, A: std::alloc::Allocator, A: std::clone::Clone;
303.21 s
[gammaloop-workspace-clippy] help : consider specifying the generic argument
303.21 s
[gammaloop-workspace-clippy] |
303.21 s
[gammaloop-workspace-clippy] 3336 | variant_ids.iter().copied().collect::<Vec<_>> (),
303.21 s
[gammaloop-workspace-clippy] | ++++++++++
303.21 s
[gammaloop-workspace-clippy]
303.41 s
[gammaloop-workspace-clippy] error[E0283] : type annotations needed
303.41 s
[gammaloop-workspace-clippy] --> crates/gammalooprs/src/processes/amplitude.rs:4098:59
303.41 s
[gammaloop-workspace-clippy] |
303.41 s
[gammaloop-workspace-clippy] 4098 | assert_eq!(orders, [1, 2].into_iter().collect());
303.41 s
[gammaloop-workspace-clippy] | ^^^^^^^ cannot infer type of the type parameter `B` declared on the method `collect`
303.41 s
[gammaloop-workspace-clippy] |
303.41 s
[gammaloop-workspace-clippy] = note : the type must implement `std::iter::FromIterator<i32>`
303.41 s
[gammaloop-workspace-clippy] note : required by a bound in `std::iter::Iterator::collect`
303.41 s
[gammaloop-workspace-clippy] --> /rustc/2d8144b7880597b6e6d3dfd63a9a9efae3f533d3/library/core/src/iter/traits/iterator.rs:2077:4
303.41 s
[gammaloop-workspace-clippy] help : consider specifying the generic argument
303.41 s
[gammaloop-workspace-clippy] |
303.41 s
[gammaloop-workspace-clippy] 4098 | assert_eq!(orders, [1, 2].into_iter().collect::<Vec<_>> ());
303.41 s
[gammaloop-workspace-clippy] | ++++++++++
303.41 s
[gammaloop-workspace-clippy]
303.41 s
[gammaloop-workspace-clippy] error[E0283] : type annotations needed
303.41 s
[gammaloop-workspace-clippy] --> crates/gammalooprs/src/processes/amplitude.rs:4098:59
303.41 s
[gammaloop-workspace-clippy] |
303.41 s
[gammaloop-workspace-clippy] 4098 | assert_eq!(orders, [1, 2].into_iter().collect());
303.41 s
[gammaloop-workspace-clippy] | -------------------------------------- ^^^^^^^ ---
303.41 s
[gammaloop-workspace-clippy] | | |
303.41 s
[gammaloop-workspace-clippy] | | cannot infer type of the type parameter `B` declared on the method `collect`
303.41 s
[gammaloop-workspace-clippy] | type must be known at this point
303.41 s
[gammaloop-workspace-clippy] |
303.41 s
[gammaloop-workspace-clippy] = note : multiple `impl`s satisfying `std::collections::BTreeSet<usize>: std::cmp::PartialEq<_>` found in the following crates: `alloc`, `rkyv`:
303.41 s
[gammaloop-workspace-clippy] - impl<K, AK> std::cmp::PartialEq<rkyv::collections::btree_set::ArchivedBTreeSet<AK>> for std::collections::BTreeSet<K>
303.41 s
[gammaloop-workspace-clippy] where AK: std::cmp::PartialEq<K>;
303.41 s
[gammaloop-workspace-clippy] - impl<T, A> std::cmp::PartialEq for std::collections::BTreeSet<T, A>
303.42 s
[gammaloop-workspace-clippy] where T: std::cmp::PartialEq, A: std::alloc::Allocator, A: std::clone::Clone;
303.42 s
[gammaloop-workspace-clippy] help : consider specifying the generic argument
303.42 s
[gammaloop-workspace-clippy] |
303.42 s
[gammaloop-workspace-clippy] 4098 | assert_eq!(orders, [1, 2].into_iter().collect::<Vec<_>> ());
303.42 s
[gammaloop-workspace-clippy] | ++++++++++
303.42 s
[gammaloop-workspace-clippy]
303.50 s
[gammaloop-workspace-clippy] error[E0283] : type annotations needed
303.50 s
[gammaloop-workspace-clippy] --> crates/gammalooprs/src/processes/amplitude.rs:4129:48
303.50 s
[gammaloop-workspace-clippy] |
303.50 s
[gammaloop-workspace-clippy] 4123 | / assert_eq!(
303.50 s
[gammaloop-workspace-clippy] 4124 | | evaluator
303.50 s
[gammaloop-workspace-clippy] 4125 | | .evaluator_stacks
303.50 s
[gammaloop-workspace-clippy] 4126 | | .keys()
303.50 s
[gammaloop-workspace-clippy] ... |
303.50 s
[gammaloop-workspace-clippy] 4129 | | [1, 2].into_iter().collect()
303.50 s
[gammaloop-workspace-clippy] | | ^^^^^^^ cannot infer type of the type parameter `B` declared on the method `collect`
303.50 s
[gammaloop-workspace-clippy] 4130 | | );
303.50 s
[gammaloop-workspace-clippy] | |_________________________- type must be known at this point
303.50 s
[gammaloop-workspace-clippy] |
303.50 s
[gammaloop-workspace-clippy] = note : multiple `impl`s satisfying `std::collections::BTreeSet<usize>: std::cmp::PartialEq<_>` found in the following crates: `alloc`, `rkyv`:
303.50 s
[gammaloop-workspace-clippy] - impl<K, AK> std::cmp::PartialEq<rkyv::collections::btree_set::ArchivedBTreeSet<AK>> for std::collections::BTreeSet<K>
303.50 s
[gammaloop-workspace-clippy] where AK: std::cmp::PartialEq<K>;
303.50 s
[gammaloop-workspace-clippy] - impl<T, A> std::cmp::PartialEq for std::collections::BTreeSet<T, A>
303.50 s
[gammaloop-workspace-clippy] where T: std::cmp::PartialEq, A: std::alloc::Allocator, A: std::clone::Clone;
303.50 s
[gammaloop-workspace-clippy] help : consider specifying the generic argument
303.50 s
[gammaloop-workspace-clippy] |
303.50 s
[gammaloop-workspace-clippy] 4129 | [1, 2].into_iter().collect::<Vec<_>> ()
303.50 s
[gammaloop-workspace-clippy] | ++++++++++
303.50 s
[gammaloop-workspace-clippy]
303.53 s
[gammaloop-workspace-clippy] error[E0283] : type annotations needed
303.53 s
[gammaloop-workspace-clippy] --> crates/gammalooprs/src/processes/amplitude.rs:4160:30
303.53 s
[gammaloop-workspace-clippy] |
303.53 s
[gammaloop-workspace-clippy] 4148 | / assert_eq!(
303.53 s
[gammaloop-workspace-clippy] 4149 | | registry
303.53 s
[gammaloop-workspace-clippy] 4150 | | .components
303.53 s
[gammaloop-workspace-clippy] 4151 | | .iter()
303.53 s
[gammaloop-workspace-clippy] ... |
303.53 s
[gammaloop-workspace-clippy] 4160 | | .collect()
303.53 s
[gammaloop-workspace-clippy] | | ^^^^^^^ cannot infer type of the type parameter `B` declared on the method `collect`
303.53 s
[gammaloop-workspace-clippy] 4161 | | );
303.53 s
[gammaloop-workspace-clippy] | |_________________________- type must be known at this point
303.53 s
[gammaloop-workspace-clippy] |
303.53 s
[gammaloop-workspace-clippy] = note : multiple `impl`s satisfying `std::collections::BTreeSet<processes::threshold_counterterms::ThresholdCountertermComponentKind>: std::cmp::PartialEq<_>` found in the following crates: `alloc`, `rkyv`:
303.53 s
[gammaloop-workspace-clippy] - impl<K, AK> std::cmp::PartialEq<rkyv::collections::btree_set::ArchivedBTreeSet<AK>> for std::collections::BTreeSet<K>
303.53 s
[gammaloop-workspace-clippy] where AK: std::cmp::PartialEq<K>;
303.53 s
[gammaloop-workspace-clippy] - impl<T, A> std::cmp::PartialEq for std::collections::BTreeSet<T, A>
303.53 s
[gammaloop-workspace-clippy] where T: std::cmp::PartialEq, A: std::alloc::Allocator, A: std::clone::Clone;
303.53 s
[gammaloop-workspace-clippy] help : consider specifying the generic argument
303.53 s
[gammaloop-workspace-clippy] |
303.53 s
[gammaloop-workspace-clippy] 4160 | .collect::<Vec<_>> ()
303.53 s
[gammaloop-workspace-clippy] | ++++++++++
303.53 s
[gammaloop-workspace-clippy]
303.56 s
[gammaloop-workspace-clippy] error[E0283] : type annotations needed
303.56 s
[gammaloop-workspace-clippy] --> crates/gammalooprs/src/processes/amplitude.rs:4214:26
303.56 s
[gammaloop-workspace-clippy] |
303.56 s
[gammaloop-workspace-clippy] 4201 | / assert_eq!(
303.56 s
[gammaloop-workspace-clippy] 4202 | | decomposition
303.56 s
[gammaloop-workspace-clippy] 4203 | | .components
303.56 s
[gammaloop-workspace-clippy] 4204 | | .iter()
303.56 s
[gammaloop-workspace-clippy] ... |
303.56 s
[gammaloop-workspace-clippy] 4214 | | .collect()
303.56 s
[gammaloop-workspace-clippy] | | ^^^^^^^ cannot infer type of the type parameter `B` declared on the method `collect`
303.56 s
[gammaloop-workspace-clippy] 4215 | | );
303.56 s
[gammaloop-workspace-clippy] | |_____________________- type must be known at this point
303.56 s
[gammaloop-workspace-clippy] |
303.56 s
[gammaloop-workspace-clippy] = note : multiple `impl`s satisfying `std::collections::BTreeSet<processes::threshold_counterterms::ThresholdCountertermComponentKind>: std::cmp::PartialEq<_>` found in the following crates: `alloc`, `rkyv`:
303.56 s
[gammaloop-workspace-clippy] - impl<K, AK> std::cmp::PartialEq<rkyv::collections::btree_set::ArchivedBTreeSet<AK>> for std::collections::BTreeSet<K>
303.56 s
[gammaloop-workspace-clippy] where AK: std::cmp::PartialEq<K>;
303.56 s
[gammaloop-workspace-clippy] - impl<T, A> std::cmp::PartialEq for std::collections::BTreeSet<T, A>
303.56 s
[gammaloop-workspace-clippy] where T: std::cmp::PartialEq, A: std::alloc::Allocator, A: std::clone::Clone;
303.56 s
[gammaloop-workspace-clippy] help : consider specifying the generic argument
303.56 s
[gammaloop-workspace-clippy] |
303.56 s
[gammaloop-workspace-clippy] 4214 | .collect::<Vec<_>> ()
303.56 s
[gammaloop-workspace-clippy] | ++++++++++
303.56 s
[gammaloop-workspace-clippy]
303.69 s
[gammaloop-workspace-clippy] error[E0277] : can't compare `std::option::Option<&[linnet::half_edge::involution::EdgeIndex]>` with `std::option::Option<&[linnet::half_edge::involution::EdgeIndex; 1]>`
303.69 s
[gammaloop-workspace-clippy] --> crates/gammalooprs/src/processes/cross_section/ir_safe_threshold_fixture_tests.rs:817:25
303.69 s
[gammaloop-workspace-clippy] |
303.69 s
[gammaloop-workspace-clippy] 816 | .any(|variant| variant.requested_subspace.as_deref()
303.69 s
[gammaloop-workspace-clippy] | -------------------------------------
303.69 s
[gammaloop-workspace-clippy] 817 | == Some(&[EdgeIndex::from(3)])),
303.69 s
[gammaloop-workspace-clippy] | ^^ ---------------------------
303.69 s
[gammaloop-workspace-clippy] | |
303.69 s
[gammaloop-workspace-clippy] | no implementation for `std::option::Option<&[linnet::half_edge::involution::EdgeIndex]> == std::option::Option<&[linnet::half_edge::involution::EdgeIndex; 1]>`
303.69 s
[gammaloop-workspace-clippy] |
303.70 s
[gammaloop-workspace-clippy] = help : the trait `std::cmp::PartialEq<std::option::Option<&[linnet::half_edge::involution::EdgeIndex; 1]>>` is not implemented for `std::option::Option<&[linnet::half_edge::involution::EdgeIndex]>`
303.70 s
[gammaloop-workspace-clippy] help : the following other types implement trait `std::cmp::PartialEq<Rhs>`
303.70 s
[gammaloop-workspace-clippy] --> /rustc/2d8144b7880597b6e6d3dfd63a9a9efae3f533d3/library/core/src/option.rs:2434:0
303.70 s
[gammaloop-workspace-clippy] |
303.70 s
[gammaloop-workspace-clippy] = note : `std::option::Option<T>` implements `std::cmp::PartialEq`
303.70 s
[gammaloop-workspace-clippy] |
303.70 s
[gammaloop-workspace-clippy] ::: /nix/store/8zq9ya5slh345hbylmsibxw827bi98w0-vendor-cargo-deps/c19b7c6f923b580ac259164a89f2577984ad5ab09ee9d583b888f934adbbe8d0/rkyv-0.7.46/src/option.rs:210:1
303.70 s
[gammaloop-workspace-clippy] |
303.70 s
[gammaloop-workspace-clippy] 210 | impl<T: PartialEq<U>, U> PartialEq<ArchivedOption<T>> for Option<U> {
303.70 s
[gammaloop-workspace-clippy] | ^^^^^^^^^^^^^^^^^^^^^^^^^^^^^^^^^^^^^^^^^^^^^^^^^^^^^^^^^^^^^^^^^^^ `std::option::Option<U>` implements `std::cmp::PartialEq<rkyv::option::ArchivedOption<T>>`
303.70 s
[gammaloop-workspace-clippy] |
303.70 s
[gammaloop-workspace-clippy] ::: /nix/store/8zq9ya5slh345hbylmsibxw827bi98w0-vendor-cargo-deps/c19b7c6f923b580ac259164a89f2577984ad5ab09ee9d583b888f934adbbe8d0/rkyv-0.7.46/src/impls/alloc/niche.rs:24:1
303.70 s
[gammaloop-workspace-clippy] |
303.70 s
[gammaloop-workspace-clippy] 24 | / impl<T, U> PartialEq<ArchivedOptionBox<T>> for Option<Box<U>>
303.70 s
[gammaloop-workspace-clippy] 25 | | where
303.70 s
[gammaloop-workspace-clippy] 26 | | T: ArchivePointee + PartialEq<U> + ?Sized,
303.70 s
[gammaloop-workspace-clippy] 27 | | U: ?Sized,
303.70 s
[gammaloop-workspace-clippy] | |______________^ `std::option::Option<std::boxed::Box<U>>` implements `std::cmp::PartialEq<rkyv::niche::option_box::ArchivedOptionBox<T>>`
303.70 s
[gammaloop-workspace-clippy]
304.30 s
[gammaloop-workspace-clippy] error[E0283] : type annotations needed
304.30 s
[gammaloop-workspace-clippy] --> crates/gammalooprs/src/processes/no_directive_equivalence_tests.rs:459:43
304.30 s
[gammaloop-workspace-clippy] |
304.30 s
[gammaloop-workspace-clippy] 459 | (0..graph.cuts.len()).collect(),
304.30 s
[gammaloop-workspace-clippy] | ^^^^^^^ cannot infer type of the type parameter `B` declared on the method `collect`
304.30 s
[gammaloop-workspace-clippy] |
304.30 s
[gammaloop-workspace-clippy] = note : multiple `impl`s satisfying `_: std::iter::FromIterator<usize>` found in the following crates: `spenso`, `tabled`:
304.30 s
[gammaloop-workspace-clippy] - impl std::iter::FromIterator<usize> for spenso::structure::concrete_index::ExpandedIndex;
304.30 s
[gammaloop-workspace-clippy] - impl std::iter::FromIterator<usize> for tabled::settings::height::HeightList;
304.30 s
[gammaloop-workspace-clippy] - impl std::iter::FromIterator<usize> for tabled::settings::width::WidthList;
304.30 s
[gammaloop-workspace-clippy] note : required by a bound in `std::iter::Iterator::collect`
304.30 s
[gammaloop-workspace-clippy] --> /rustc/2d8144b7880597b6e6d3dfd63a9a9efae3f533d3/library/core/src/iter/traits/iterator.rs:2077:4
304.30 s
[gammaloop-workspace-clippy] help : consider specifying the generic argument
304.30 s
[gammaloop-workspace-clippy] |
304.30 s
[gammaloop-workspace-clippy] 459 | (0..graph.cuts.len()).collect::<Vec<_>> (),
304.30 s
[gammaloop-workspace-clippy] | ++++++++++
304.30 s
[gammaloop-workspace-clippy]
304.30 s
[gammaloop-workspace-clippy] error[E0283] : type annotations needed
304.30 s
[gammaloop-workspace-clippy] --> crates/gammalooprs/src/processes/no_directive_equivalence_tests.rs:459:43
304.30 s
[gammaloop-workspace-clippy] |
304.30 s
[gammaloop-workspace-clippy] 457 | / assert_eq!(
304.30 s
[gammaloop-workspace-clippy] 458 | | grouped_cut_ids,
304.30 s
[gammaloop-workspace-clippy] 459 | | (0..graph.cuts.len()).collect(),
304.30 s
[gammaloop-workspace-clippy] | | ^^^^^^^ cannot infer type of the type parameter `B` declared on the method `collect`
304.30 s
[gammaloop-workspace-clippy] 460 | | "every discovered process-valid cut must remain in the numerical LU evaluation",
304.30 s
[gammaloop-workspace-clippy] 461 | | );
304.30 s
[gammaloop-workspace-clippy] | |_________________- type must be known at this point
304.30 s
[gammaloop-workspace-clippy] |
304.30 s
[gammaloop-workspace-clippy] = note : multiple `impl`s satisfying `std::collections::BTreeSet<usize>: std::cmp::PartialEq<_>` found in the following crates: `alloc`, `rkyv`:
304.30 s
[gammaloop-workspace-clippy] - impl<K, AK> std::cmp::PartialEq<rkyv::collections::btree_set::ArchivedBTreeSet<AK>> for std::collections::BTreeSet<K>
304.30 s
[gammaloop-workspace-clippy] where AK: std::cmp::PartialEq<K>;
304.30 s
[gammaloop-workspace-clippy] - impl<T, A> std::cmp::PartialEq for std::collections::BTreeSet<T, A>
304.30 s
[gammaloop-workspace-clippy] where T: std::cmp::PartialEq, A: std::alloc::Allocator, A: std::clone::Clone;
304.30 s
[gammaloop-workspace-clippy] help : consider specifying the generic argument
304.30 s
[gammaloop-workspace-clippy] |
304.30 s
[gammaloop-workspace-clippy] 459 | (0..graph.cuts.len()).collect::<Vec<_>> (),
304.30 s
[gammaloop-workspace-clippy] | ++++++++++
304.30 s
[gammaloop-workspace-clippy]
304.32 s
[gammaloop-workspace-clippy] error[E0283] : type annotations needed
304.32 s
[gammaloop-workspace-clippy] --> crates/gammalooprs/src/processes/raised_cross_section_tests.rs:150:31
304.32 s
[gammaloop-workspace-clippy] |
304.32 s
[gammaloop-workspace-clippy] 150 | (0..graph.cuts.len()).collect(),
304.32 s
[gammaloop-workspace-clippy] | ^^^^^^^ cannot infer type of the type parameter `B` declared on the method `collect`
304.32 s
[gammaloop-workspace-clippy] |
304.32 s
[gammaloop-workspace-clippy] = note : multiple `impl`s satisfying `_: std::iter::FromIterator<usize>` found in the following crates: `spenso`, `tabled`:
304.32 s
[gammaloop-workspace-clippy] - impl std::iter::FromIterator<usize> for spenso::structure::concrete_index::ExpandedIndex;
304.32 s
[gammaloop-workspace-clippy] - impl std::iter::FromIterator<usize> for tabled::settings::height::HeightList;
304.32 s
[gammaloop-workspace-clippy] - impl std::iter::FromIterator<usize> for tabled::settings::width::WidthList;
304.32 s
[gammaloop-workspace-clippy] note : required by a bound in `std::iter::Iterator::collect`
304.32 s
[gammaloop-workspace-clippy] --> /rustc/2d8144b7880597b6e6d3dfd63a9a9efae3f533d3/library/core/src/iter/traits/iterator.rs:2077:4
304.32 s
[gammaloop-workspace-clippy] help : consider specifying the generic argument
304.32 s
[gammaloop-workspace-clippy] |
304.32 s
[gammaloop-workspace-clippy] 150 | (0..graph.cuts.len()).collect::<Vec<_>> (),
304.32 s
[gammaloop-workspace-clippy] | ++++++++++
304.32 s
[gammaloop-workspace-clippy]
304.32 s
[gammaloop-workspace-clippy] error[E0283] : type annotations needed
304.32 s
[gammaloop-workspace-clippy] --> crates/gammalooprs/src/processes/raised_cross_section_tests.rs:150:31
304.32 s
[gammaloop-workspace-clippy] |
304.32 s
[gammaloop-workspace-clippy] 148 | / assert_eq!(
304.32 s
[gammaloop-workspace-clippy] 149 | | grouped_cut_ids,
304.32 s
[gammaloop-workspace-clippy] 150 | | (0..graph.cuts.len()).collect(),
304.32 s
[gammaloop-workspace-clippy] | | ^^^^^^^ cannot infer type of the type parameter `B` declared on the method `collect`
304.32 s
[gammaloop-workspace-clippy] 151 | | "every discovered process-valid cut must remain in the numerical LU evaluation",
304.32 s
[gammaloop-workspace-clippy] 152 | | );
304.32 s
[gammaloop-workspace-clippy] | |_____- type must be known at this point
304.32 s
[gammaloop-workspace-clippy] |
304.32 s
[gammaloop-workspace-clippy] = note : multiple `impl`s satisfying `std::collections::BTreeSet<usize>: std::cmp::PartialEq<_>` found in the following crates: `alloc`, `rkyv`:
304.32 s
[gammaloop-workspace-clippy] - impl<K, AK> std::cmp::PartialEq<rkyv::collections::btree_set::ArchivedBTreeSet<AK>> for std::collections::BTreeSet<K>
304.32 s
[gammaloop-workspace-clippy] where AK: std::cmp::PartialEq<K>;
304.32 s
[gammaloop-workspace-clippy] - impl<T, A> std::cmp::PartialEq for std::collections::BTreeSet<T, A>
304.32 s
[gammaloop-workspace-clippy] where T: std::cmp::PartialEq, A: std::alloc::Allocator, A: std::clone::Clone;
304.32 s
[gammaloop-workspace-clippy] help : consider specifying the generic argument
304.32 s
[gammaloop-workspace-clippy] |
304.32 s
[gammaloop-workspace-clippy] 150 | (0..graph.cuts.len()).collect::<Vec<_>> (),
304.32 s
[gammaloop-workspace-clippy] | ++++++++++
304.32 s
[gammaloop-workspace-clippy]
310.78 s
[gammaloop-workspace-clippy] error : method `lu_prefactor_helper` is never used
310.78 s
[gammaloop-workspace-clippy] --> crates/gammalooprs/src/processes/cross_section.rs:1965:8
310.78 s
[gammaloop-workspace-clippy] |
310.78 s
[gammaloop-workspace-clippy] 1429 | impl CrossSectionGraph {
310.78 s
[gammaloop-workspace-clippy] | ---------------------- method in this implementation
310.78 s
[gammaloop-workspace-clippy] ...
310.78 s
[gammaloop-workspace-clippy] 1965 | fn lu_prefactor_helper(&self) -> Atom {
310.78 s
[gammaloop-workspace-clippy] | ^^^^^^^^^^^^^^^^^^^
310.78 s
[gammaloop-workspace-clippy] |
310.78 s
[gammaloop-workspace-clippy] = note : `-D dead-code` implied by `-D warnings`
310.78 s
[gammaloop-workspace-clippy] = help : to override `-D warnings` add `#[expect(dead_code)]` or `#[allow(dead_code)]`
310.78 s
[gammaloop-workspace-clippy]
316.50 s
[gammaloop-workspace-clippy] error : this `if` statement can be collapsed
316.50 s
[gammaloop-workspace-clippy] --> crates/gammalooprs/src/subtraction/amplitude_counterterm.rs:938:17
316.50 s
[gammaloop-workspace-clippy] |
316.50 s
[gammaloop-workspace-clippy] 938 | / if let Some(group_id) = metadata.group_id {
316.50 s
[gammaloop-workspace-clippy] 939 | | if let Some((_, members)) = groups.iter().find(|(id, _)| *id == Some(group_id))
316.50 s
[gammaloop-workspace-clippy] 940 | | {
316.50 s
[gammaloop-workspace-clippy] 941 | | let first = members[0];
316.50 s
[gammaloop-workspace-clippy] ... |
316.50 s
[gammaloop-workspace-clippy] 956 | | }
316.50 s
[gammaloop-workspace-clippy] | |_________________^
316.50 s
[gammaloop-workspace-clippy] |
316.50 s
[gammaloop-workspace-clippy] = help : for further information visit https://rust-lang.github.io/rust-clippy/rust-1.97.0/index.html#collapsible_if
316.50 s
[gammaloop-workspace-clippy] = note : `-D clippy::collapsible-if` implied by `-D warnings`
316.50 s
[gammaloop-workspace-clippy] = help : to override `-D warnings` add `#[allow(clippy::collapsible_if)]`
316.50 s
[gammaloop-workspace-clippy] help : collapse nested if block
316.50 s
[gammaloop-workspace-clippy] |
316.50 s
[gammaloop-workspace-clippy] 938 ~ if let Some(group_id) = metadata.group_id
316.50 s
[gammaloop-workspace-clippy] 939 ~ && let Some((_, members)) = groups.iter().find(|(id, _)| *id == Some(group_id))
316.50 s
[gammaloop-workspace-clippy] 940 | {
316.50 s
[gammaloop-workspace-clippy] ...
316.50 s
[gammaloop-workspace-clippy] 954 | ));
316.50 s
[gammaloop-workspace-clippy] 955 ~ }
316.50 s
[gammaloop-workspace-clippy] |
316.50 s
[gammaloop-workspace-clippy]
316.50 s
[gammaloop-workspace-clippy] error : this function has too many arguments (13/7)
316.50 s
[gammaloop-workspace-clippy] --> crates/gammalooprs/src/subtraction/amplitude_counterterm.rs:994:5
316.50 s
[gammaloop-workspace-clippy] |
316.50 s
[gammaloop-workspace-clippy] 994 | / fn evaluate_variant_group<T: FloatLike>(
316.50 s
[gammaloop-workspace-clippy] 995 | | &mut self,
316.50 s
[gammaloop-workspace-clippy] 996 | | momentum_sample: &MomentumSample<T>,
316.50 s
[gammaloop-workspace-clippy] 997 | | graph: &Graph,
316.50 s
[gammaloop-workspace-clippy] ... |
316.50 s
[gammaloop-workspace-clippy] 1007 | | allowed_variant_ids: Option<&[ThresholdCountertermVariantId]>,
316.50 s
[gammaloop-workspace-clippy] 1008 | | ) -> Result<AmplitudeCountertermEvaluation<T>> {
316.50 s
[gammaloop-workspace-clippy] | |__________________________________________________^
316.50 s
[gammaloop-workspace-clippy] |
316.50 s
[gammaloop-workspace-clippy] = help : for further information visit https://rust-lang.github.io/rust-clippy/rust-1.97.0/index.html#too_many_arguments
316.50 s
[gammaloop-workspace-clippy] = note : `-D clippy::too-many-arguments` implied by `-D warnings`
316.50 s
[gammaloop-workspace-clippy] = help : to override `-D warnings` add `#[allow(clippy::too_many_arguments)]`
316.50 s
[gammaloop-workspace-clippy]
316.51 s
[gammaloop-workspace-clippy] error : this `if` statement can be collapsed
316.51 s
[gammaloop-workspace-clippy] --> crates/gammalooprs/src/subtraction/amplitude_counterterm.rs:1359:17
316.51 s
[gammaloop-workspace-clippy] |
316.51 s
[gammaloop-workspace-clippy] 1359 | / if let Some(group_id) = metadata.group_id {
316.51 s
[gammaloop-workspace-clippy] 1360 | | if let Some((_, _, members)) =
316.51 s
[gammaloop-workspace-clippy] 1361 | | groups.iter().find(|(id, _, _)| *id == Some(group_id))
316.51 s
[gammaloop-workspace-clippy] ... |
316.51 s
[gammaloop-workspace-clippy] 1378 | | }
316.51 s
[gammaloop-workspace-clippy] | |_________________^
316.51 s
[gammaloop-workspace-clippy] |
316.51 s
[gammaloop-workspace-clippy] = help : for further information visit https://rust-lang.github.io/rust-clippy/rust-1.97.0/index.html#collapsible_if
316.51 s
[gammaloop-workspace-clippy] help : collapse nested if block
316.51 s
[gammaloop-workspace-clippy] |
316.51 s
[gammaloop-workspace-clippy] 1359 ~ if let Some(group_id) = metadata.group_id
316.51 s
[gammaloop-workspace-clippy] 1360 ~ && let Some((_, _, members)) =
316.51 s
[gammaloop-workspace-clippy] 1361 | groups.iter().find(|(id, _, _)| *id == Some(group_id))
316.51 s
[gammaloop-workspace-clippy] ...
316.51 s
[gammaloop-workspace-clippy] 1376 | ));
316.51 s
[gammaloop-workspace-clippy] 1377 ~ }
316.51 s
[gammaloop-workspace-clippy] |
316.51 s
[gammaloop-workspace-clippy]
316.63 s
[gammaloop-workspace-clippy] error : this function has too many arguments (8/7)
316.63 s
[gammaloop-workspace-clippy] --> crates/gammalooprs/src/subtraction/lu_counterterm.rs:1197:5
316.63 s
[gammaloop-workspace-clippy] |
316.63 s
[gammaloop-workspace-clippy] 1197 | / pub fn from_atoms(
316.63 s
[gammaloop-workspace-clippy] 1198 | | counterterm_data: &LUCounterTermData,
316.63 s
[gammaloop-workspace-clippy] 1199 | | max_cut_order: usize,
316.63 s
[gammaloop-workspace-clippy] 1200 | | threshold_helpers: LUThresholdHelperEvaluators,
316.63 s
[gammaloop-workspace-clippy] ... |
316.63 s
[gammaloop-workspace-clippy] 1205 | | production_orientation_ids: &[OrientationID],
316.63 s
[gammaloop-workspace-clippy] 1206 | | ) -> (Self, EvaluatorBuildTimings) {
316.63 s
[gammaloop-workspace-clippy] | |______________________________________^
316.63 s
[gammaloop-workspace-clippy] |
316.63 s
[gammaloop-workspace-clippy] = help : for further information visit https://rust-lang.github.io/rust-clippy/rust-1.97.0/index.html#too_many_arguments
316.63 s
[gammaloop-workspace-clippy]
318.75 s
[gammaloop-workspace-clippy] Some errors have detailed explanations: E0277, E0283.
318.75 s
[gammaloop-workspace-clippy] For more information about an error, try `rustc --explain E0277`.
318.77 s
[gammaloop-workspace-clippy] error : could not compile `gammalooprs` (lib) due to 5 previous errors
318.77 s
[gammaloop-workspace-clippy] warning : build failed, waiting for other jobs to finish...
318.87 s
[gammaloop-workspace-clippy] error : could not compile `gammalooprs` (lib test) due to 16 previous errors
319.46 s
Progress: 0 of 1 built (1 failed)
319.46 s
Failed to build gammaloop-workspace-clippy after 5m13s
319.47 s
Cannot build ' /nix/store/bfvd4racaxf8cd9mpzlpz54h91n6g02c-gammaloop-workspace-clippy-0.1.0.drv '.
319.47 s
Reason: builder failed with exit code 101 .
319.47 s
Output paths:
319.47 s
/nix/store/q9icfkcxyilyy0y4bfigad3kv8g0svbq-gammaloop-workspace-clippy-0.1.0
319.47 s
Last 839 log lines:
319.47 s
> Running phase: unpackPhase
319.47 s
> unpacking source archive /nix/store/bcy0vqqk2ibk38nik2bb809ck03m92g2-source
319.47 s
> source root is source
319.47 s
> Running phase: patchPhase
319.47 s
> Executing configureCargoCommonVars
319.47 s
> decompressing cargo artifacts from /nix/store/wxpx6lf642pgxp2wz1pw1lxksj5p1wb0-gammaloop-workspace-deps-deps-0.1.0/target.tar.zst to target
319.47 s
> Running phase: updateAutotoolsGnuConfigScriptsPhase
319.47 s
> Running phase: configurePhase
319.47 s
> will append /build/source/.cargo-home/config.toml with contents of /nix/store/8zq9ya5slh345hbylmsibxw827bi98w0-vendor-cargo-deps/config.toml
319.47 s
> default configurePhase, nothing to do
319.47 s
> Running phase: buildPhase
319.47 s
> +++ command cargo --version
319.47 s
> cargo 1.97.0 (c980f4866 2026-06-30)
319.47 s
> +++ command cargo clippy --profile ci-optim --locked --workspace --features gammaloop-tracing-filter/clap,gammaloop-tracing-filter/symbolica,idenso/bincode,idenso/reference-cases,linnet/bincode,linnet/drawing,linnet/rkyv,linnet/serde,linnet/symbolica,spenso-macros/shadowing,spenso/shadowing,symbolica/tracing_max_level_info,three-dimensional-reps/display,three-dimensional-reps/eval,three-dimensional-reps/serde --all-targets --no-deps -- --deny warnings
319.47 s
> Checking cfg-if v1.0.4
319.47 s
> Checking memchr v2.8.0
319.47 s
> Checking once_cell v1.21.4
319.47 s
> Checking either v1.15.0
319.47 s
> Checking itoa v1.0.18
319.47 s
> Checking serde_core v1.0.228
319.47 s
> Checking libc v0.2.186
319.47 s
> Checking libm v0.2.16
319.47 s
> Checking log v0.4.29
319.47 s
> Checking zerocopy v0.8.48
319.47 s
> Checking regex-syntax v0.8.10
319.47 s
> Checking crossbeam-utils v0.8.21
319.47 s
> Checking equivalent v1.0.2
319.47 s
> Checking zmij v1.0.21
319.47 s
> Checking lazy_static v1.5.0
319.47 s
> Checking bytemuck v1.25.0
319.47 s
> Compiling target-lexicon v0.13.5
319.47 s
> Checking arrayvec v0.7.6
319.47 s
> Checking powerfmt v0.2.0
319.47 s
> Checking time-core v0.1.8
319.47 s
> Checking itertools v0.14.0
319.47 s
> Checking pin-project-lite v0.2.17
319.47 s
> Checking num_threads v0.1.7
319.47 s
> Checking deranged v0.5.8
319.47 s
> Checking num-conv v0.2.1
319.47 s
> Checking tracing-core v0.1.36
319.47 s
> Checking foldhash v0.2.0
319.47 s
> Checking allocator-api2 v0.2.21
319.47 s
> Checking crossbeam-epoch v0.9.18
319.47 s
> Checking const-random v0.1.18
319.47 s
> Checking unty v0.0.4
319.47 s
> Checking safe_arch v0.7.4
319.47 s
> Checking nu-ansi-term v0.50.3
319.47 s
> Checking winnow v1.0.2
319.47 s
> Checking static_assertions v1.1.0
319.47 s
> Checking aho-corasick v1.1.4
319.47 s
> Checking safe_arch v1.0.0
319.47 s
> Checking hashbrown v0.16.1
319.47 s
> Checking tracing v0.1.44
319.47 s
> Checking crossbeam-deque v0.8.6
319.47 s
> Checking tracing-log v0.2.0
319.47 s
> Checking wide v0.7.33
319.47 s
> Checking rayon-core v1.13.0
319.47 s
> Checking sharded-slab v0.1.7
319.47 s
> Checking thread_local v1.1.9
319.47 s
> Checking toml_writer v1.1.1+spec-1.1.0
319.47 s
> Checking num-traits v0.2.19
319.47 s
> Checking az v1.3.0
319.47 s
> Checking indenter v0.3.4
319.47 s
> Checking rayon v1.12.0
319.47 s
> Checking wide v1.3.0
319.47 s
> Compiling phf_shared v0.11.3
319.47 s
> Checking anyhow v1.0.102
319.47 s
> Checking rawpointer v0.2.1
319.47 s
> Checking utf8parse v0.2.2
319.47 s
> Checking dyn-clone v1.0.20
319.47 s
> Checking alloc-no-stdlib v2.0.4
319.47 s
> Checking anstyle-parse v1.0.0
319.47 s
> Checking matrixmultiply v0.3.10
319.47 s
> Checking colorchoice v1.0.5
319.47 s
> Checking alloc-stdlib v0.2.2
319.47 s
> Checking colored v3.1.1
319.47 s
> Checking anstyle-query v1.1.5
319.47 s
> Checking toml_parser v1.1.2+spec-1.1.0
319.47 s
> Checking anstyle v1.0.14
319.47 s
> Checking is_terminal_polyfill v1.70.2
319.47 s
> Compiling phf_generator v0.11.3
319.47 s
> Checking eyre v0.6.12
319.47 s
> Checking approx v0.5.1
319.47 s
> Checking getrandom v0.3.4
319.47 s
> Checking time v0.3.47
319.47 s
> Checking num-integer v0.1.46
319.47 s
> Checking gmp-mpfr-sys v1.7.1
319.47 s
> Checking anstream v1.0.0
319.47 s
> Checking regex-automata v0.4.14
319.47 s
> Checking unicode-width v0.2.2
319.47 s
> Checking bitflags v1.3.2
319.47 s
> Checking serde v1.0.228
319.47 s
> Checking serde_json v1.0.149
319.47 s
> Compiling pyo3-build-config v0.28.3
319.47 s
> Checking bitflags v2.11.1
319.47 s
> Checking serde_spanned v1.1.1
319.47 s
> Checking toml_datetime v1.1.1+spec-1.1.0
319.47 s
> Compiling phf_codegen v0.11.3
319.47 s
> Checking region v3.0.2
319.47 s
> Checking rand_core v0.9.5
319.47 s
> Checking hugepage-rs v0.1.1
319.47 s
> Checking wasmtime-jit-icache-coherence v34.0.2
319.47 s
> Checking brotli-decompressor v5.0.0
319.47 s
> Checking toml v1.1.2+spec-1.1.0
319.47 s
> Checking spec_math v0.1.6
319.47 s
> Checking inventory v0.3.24
319.47 s
> Checking thiserror v2.0.18
319.47 s
> Compiling getopts v0.2.24
319.47 s
> Checking libloading v0.9.0
319.47 s
> Checking tinyjson v2.5.1
319.47 s
> Checking append-only-vec v0.1.8
319.47 s
> Checking byteorder v1.5.0
319.47 s
> Checking self_cell v1.2.2
319.47 s
> Checking bytes v1.11.1
319.47 s
> Compiling unic-common v0.9.0
319.47 s
> Compiling unic-char-range v0.9.0
319.47 s
> Checking linux-raw-sys v0.12.1
319.47 s
> Checking smallvec v1.15.1
319.47 s
> Checking num-complex v0.4.6
319.47 s
> Checking tracing-serde v0.2.0
319.47 s
> Checking bincode v2.0.1
319.47 s
> Checking smartstring v1.0.1
319.47 s
> Compiling unicode_names2_generator v1.3.0
319.47 s
> Compiling unic-ucd-version v0.9.0
319.47 s
> Compiling unic-char-property v0.9.0
319.47 s
> Checking rustix v1.1.4
319.47 s
> Compiling is-macro v0.3.7
319.47 s
> Compiling rustpython-parser-vendored v0.4.0
319.47 s
> Checking ppv-lite86 v0.2.21
319.47 s
> Checking ahash v0.8.12
319.47 s
> Checking iana-time-zone v0.1.65
319.47 s
> Compiling rustpython-parser v0.4.0
319.47 s
> Checking chrono v0.4.44
319.47 s
> Compiling phf v0.11.3
319.47 s
> Checking simba v0.9.1
319.47 s
> Checking rustc-hash v2.1.2
319.47 s
> Checking ndarray v0.17.2
319.47 s
> Checking brotli v8.0.2
319.47 s
> Compiling unic-emoji-char v0.9.0
319.47 s
> Checking rand_chacha v0.9.0
319.47 s
> Compiling unic-ucd-ident v0.9.0
319.47 s
> Checking rand v0.9.4
319.47 s
> Compiling lalrpop-util v0.20.2
319.47 s
> Compiling rustc-hash v1.1.0
319.47 s
> Checking rug v1.30.0
319.47 s
> Checking unicode-segmentation v1.13.2
319.47 s
> Compiling symbolica v2.2.0 (https://github.com/alphal00p/symbolica?rev=4d0a833eb8e059d1f95bdae5abed2559830b235f#4d0a833e)
319.47 s
> Checking typenum v1.20.0
319.47 s
> Checking getrandom v0.2.17
319.47 s
> Checking scopeguard v1.2.0
319.47 s
> Checking lock_api v0.4.14
319.47 s
> Checking parking_lot_core v0.9.12
319.47 s
> Checking symjit v2.21.0
319.47 s
> Checking hashbrown v0.17.0
319.47 s
> Checking unicode-ident v1.0.24
319.47 s
> Checking parking_lot v0.12.5
319.47 s
> Checking errno v0.3.14
319.47 s
> Checking clap_lex v1.1.0
319.47 s
> Checking strsim v0.11.1
319.47 s
> Checking unicase v2.9.0
319.47 s
> Checking terminal_size v0.4.4
319.47 s
> Checking signal-hook-registry v1.4.8
319.47 s
> Checking vte v0.14.1
319.47 s
> Checking same-file v1.0.6
319.47 s
> Checking clap_builder v4.6.0
319.47 s
> Checking half v2.7.1
319.47 s
> Checking signal-hook v0.3.18
319.47 s
> Checking walkdir v2.5.0
319.47 s
> Checking mio v1.2.0
319.47 s
> Checking minimal-lexical v0.2.1
319.47 s
> Checking ciborium-io v0.2.2
319.47 s
> Checking generic-array v0.14.7
319.47 s
> Checking ciborium-ll v0.2.2
319.47 s
> Checking indexmap v2.14.0
319.47 s
> Checking derive_more v2.1.1
319.47 s
> Checking num-bigint v0.4.6
319.47 s
> Checking nom v7.1.3
319.47 s
> Checking signal-hook-mio v0.2.5
319.47 s
> Checking console v0.16.3
319.47 s
> Checking matchers v0.2.0
319.47 s
> Checking tracing-subscriber v0.3.23
319.47 s
> Checking regex v1.12.3
319.47 s
> Checking crypto-common v0.1.7
319.47 s
> Checking block-buffer v0.10.4
319.47 s
> Checking digest v0.10.7
319.47 s
> Checking bstr v1.12.1
319.47 s
> Checking cpufeatures v0.2.17
319.47 s
> Checking winnow v0.7.15
319.47 s
> Checking linux-raw-sys v0.4.15
319.47 s
> Compiling unicode_names2 v1.3.0
319.47 s
> Checking rustix v0.38.44
319.47 s
> Checking sha2 v0.10.9
319.47 s
> Checking globset v0.4.18
319.47 s
> Checking clap v4.6.1
319.47 s
> Checking ansitok v0.3.0
319.47 s
> Checking ciborium v0.2.2
319.47 s
> Checking rand_core v0.6.4
319.47 s
> Checking getrandom v0.4.2
319.47 s
> Checking fastrand v2.4.1
319.47 s
> Checking plotters-backend v0.3.7
319.47 s
> Checking fnv v1.0.7
319.47 s
> Checking rust-embed-utils v8.11.0
319.47 s
> Checking serde_spanned v0.6.9
319.47 s
> Checking tempfile v3.27.0
319.47 s
> Checking toml_datetime v0.6.11
319.47 s
> Checking crossterm v0.28.1
319.47 s
> Checking itertools v0.10.5
319.47 s
> Checking tap v1.0.1
319.47 s
> Checking cast v0.3.0
319.47 s
> Checking plotters-svg v0.3.7
319.47 s
> Checking toml_write v0.1.2
319.47 s
> Checking wyz v0.5.1
319.47 s
> Checking ansi-str v0.9.0
319.47 s
> Checking rand_chacha v0.3.1
319.47 s
> Checking radium v0.7.0
319.47 s
> Checking typeid v1.0.3
319.47 s
> Checking plotters v0.3.7
319.47 s
> Checking similar v2.7.0
319.47 s
> Checking tinytemplate v1.2.1
319.47 s
> Checking is-terminal v0.4.17
319.47 s
> Checking bytecount v0.6.9
319.47 s
> Checking anes v0.1.6
319.47 s
> Checking funty v2.0.0
319.47 s
> Checking oorandom v11.1.5
319.47 s
> Checking papergrid v0.17.0
319.47 s
> Checking toml_edit v0.22.27
319.47 s
> Checking rand v0.8.6
319.47 s
> Checking ron v0.12.1
319.47 s
> Checking testing_table v0.3.0
319.47 s
> Checking env_filter v1.0.1
319.47 s
> Checking xprec v0.2.2
319.47 s
> Checking bitvec v1.0.1
319.47 s
> Checking toml_edit v0.25.11+spec-1.1.0
319.47 s
> Checking uncased v0.9.10
319.47 s
> Checking jiff v0.2.24
319.47 s
> Checking ptr_meta v0.1.4
319.47 s
> Checking ucd-trie v0.1.7
319.47 s
> Checking criterion-plot v0.5.0
319.47 s
> Checking simdutf8 v0.1.5
319.47 s
> Checking ahash v0.7.8
319.47 s
> Checking pest v2.8.6
319.47 s
> Checking approx v0.4.0
319.47 s
> Checking hashbrown v0.12.3
319.47 s
> Checking bytecheck v0.6.12
319.47 s
> Checking criterion v0.5.1
319.47 s
> Checking seahash v4.1.0
319.47 s
> Checking cgmath v0.18.0
319.47 s
> Compiling pyo3-ffi v0.28.3
319.47 s
> Compiling pyo3-macros-backend v0.28.3
319.47 s
> Compiling pyo3 v0.28.3
319.47 s
> Compiling numpy v0.28.0
319.47 s
> Checking insta v1.47.2
319.47 s
> Checking tabled v0.20.0
319.47 s
> Checking rend v0.4.2
319.47 s
> Checking num-rational v0.4.2
319.47 s
> Checking num-iter v0.1.45
319.47 s
> Checking ref-ops v0.2.5
319.47 s
> Checking toml v0.8.23
319.47 s
> Checking rand_xoshiro v0.6.0
319.47 s
> Checking num v0.4.3
319.47 s
> Checking features v0.10.0
319.47 s
> Checking gat-lending-iterator v0.1.8
319.47 s
> Checking constcat v0.5.1
319.47 s
> Checking colored v2.2.0
319.47 s
> Checking dot-parser v0.5.1
319.47 s
> Checking constant_time_eq v0.4.2
319.47 s
> Checking arrayref v0.3.9
319.47 s
> Checking cpufeatures v0.3.0
319.47 s
> Checking base64 v0.22.1
319.47 s
> Checking blake3 v1.8.5
319.47 s
> Checking figment v0.10.19
319.47 s
> Checking siphasher v1.0.2
319.47 s
> Checking joinery v2.1.0
319.47 s
> Checking phf_shared v0.13.1
319.47 s
> Checking titlecase v2.2.1
319.47 s
> Checking subprocess v0.2.15
319.47 s
> Checking rust_lisp v0.18.0
319.47 s
> Compiling vakint v0.1.2 (/build/source/crates/vakint)
319.47 s
> Compiling rustpython-parser-core v0.4.0
319.47 s
> Checking version-compare v0.2.1
319.47 s
> Checking phf v0.13.1
319.47 s
> Checking xpct v0.5.1
319.47 s
> Checking ryu v1.0.23
319.47 s
> Compiling rustpython-ast v0.4.0
319.47 s
> Checking string-template-plus v0.4.3
319.47 s
> Checking castaway v0.2.4
319.47 s
> Checking toml_datetime v0.7.5+spec-1.1.0
319.47 s
> Checking strum v0.27.2
319.47 s
> Checking unicode-truncate v2.0.1
319.47 s
> Checking kasuari v0.4.12
319.47 s
> Checking lru v0.16.4
319.47 s
> Checking compact_str v0.9.0
319.47 s
> Checking vte v0.15.0
319.47 s
> Checking portable-atomic v1.13.1
319.47 s
> Checking unit-prefix v0.5.2
319.47 s
> Checking vt100 v0.16.2
319.47 s
> Checking toml v0.9.12+spec-1.1.0
319.47 s
> Checking rand_distr v0.4.3
319.47 s
> Checking simba v0.6.0
319.47 s
> Checking line-clipping v0.3.7
319.47 s
> Checking gimli v0.32.3
319.47 s
> Checking adler2 v2.0.1
319.47 s
> Compiling three-dimensional-reps v0.1.0 (/build/source/crates/three-dimensional-reps)
319.47 s
> Checking thiserror v1.0.69
319.47 s
> Checking indicatif v0.18.4
319.47 s
> Checking miniz_oxide v0.8.9
319.47 s
> Checking derive_builder v0.11.2
319.47 s
> Checking owo-colors v4.3.0
319.47 s
> Checking ratatui-core v0.1.0
319.47 s
> Checking crossterm v0.29.0
319.47 s
> Checking object v0.37.3
319.47 s
> Checking tracing-error v0.2.1
319.47 s
> Checking typed-index-collections v3.5.0
319.47 s
> Checking serde-big-array v0.5.1
319.47 s
> Checking env_logger v0.11.10
319.47 s
> Checking amd v0.2.2
319.47 s
> Checking itertools v0.11.0
319.47 s
> Compiling gammaloop-tracing-filter-macros v0.1.0 (/build/source/crates/gammaloop-tracing-filter-macros)
319.47 s
> Checking rustc-demangle v0.1.27
319.47 s
> Checking option-ext v0.2.0
319.47 s
> Checking ref-cast v1.0.25
319.47 s
> Checking dirs-sys v0.5.0
319.47 s
> Checking nix v0.31.2
319.47 s
> Checking integer-sqrt v0.1.5
319.47 s
> Checking brotli-decompressor v4.0.3
319.47 s
> Checking crossbeam-channel v0.5.15
319.47 s
> Checking color-spantrace v0.3.0
319.47 s
> Checking itertools v0.12.1
319.47 s
> Checking unsafe-libyaml v0.2.11
319.47 s
> Checking symlink v0.1.0
319.47 s
> Checking rkyv v0.7.46
319.47 s
> Compiling gammalooprs v0.3.4 (/build/source/crates/gammalooprs)
319.47 s
> Checking ratatui-widgets v0.3.0
319.47 s
> Checking ratatui-crossterm v0.1.0
319.47 s
> Checking tracing-appender v0.2.5
319.47 s
> Checking ctrlc v3.5.2
319.47 s
> Checking include_dir v0.7.4
319.47 s
> Checking pathfinding v4.15.0
319.47 s
> Checking dirs v6.0.0
319.47 s
> Checking schemars v1.2.1
319.47 s
> Checking slotmap v1.1.1
319.47 s
> Checking serde_yaml v0.9.34+deprecated
319.47 s
> Checking brotli v7.0.0
319.47 s
> Compiling numerica v2.2.0 (https://github.com/alphal00p/symbolica?rev=4d0a833eb8e059d1f95bdae5abed2559830b235f#4d0a833e)
319.47 s
> Checking clarabel v0.11.1
319.47 s
> Checking tracing-indicatif v0.3.14
319.47 s
> Checking addr2line v0.25.1
319.47 s
> Checking json5 v0.4.1
319.47 s
> Checking vectorize v0.2.0
319.47 s
> Checking ringbuffer v0.16.0
319.47 s
> Checking base62 v2.2.4
319.47 s
> Checking rust-embed v8.11.0
319.47 s
> Checking clap_complete v4.6.3
319.47 s
> Checking strip-ansi-escapes v0.2.1
319.47 s
> Checking ratatui-macros v0.7.0
319.47 s
> Checking fd-lock v4.0.4
319.47 s
> Compiling gammaloop-api v0.1.0 (/build/source/crates/gammaloop-api)
319.47 s
> Checking ratatui v0.30.0
319.47 s
> Checking itertools v0.13.0
319.47 s
> Checking strum v0.26.3
319.47 s
> Checking sysinfo v0.33.1
319.47 s
> Checking shlex v1.3.0
319.47 s
> Checking slab v0.4.12
319.47 s
> Checking futures-core v0.3.32
319.47 s
> Checking futures-task v0.3.32
319.47 s
> Checking clap_complete_nushell v4.6.0
319.47 s
> Checking sdd v3.0.10
319.47 s
> Compiling gammaloop-integration-tests v0.1.0 (/build/source/tests)
319.47 s
> Compiling test-log-core v0.2.20
319.47 s
> Checking futures-util v0.3.32
319.47 s
> Compiling rustc_version v0.4.1
319.47 s
> Checking which v8.0.2
319.47 s
> Checking scc v2.4.0
319.47 s
> Checking bincode v1.3.3
319.47 s
> Compiling gungraun-runner v0.18.2
319.47 s
> Checking backtrace v0.3.76
319.47 s
> Checking nalgebra v0.29.0
319.47 s
> Checking proc-macro2 v1.0.106
319.47 s
> Compiling gungraun-macros v0.8.0
319.47 s
> Checking color-eyre v0.6.5
319.47 s
> Checking quote v1.0.45
319.47 s
> Checking reedline v0.42.0
319.47 s
> Checking maplit v1.0.2
319.47 s
> Checking base64 v0.21.7
319.47 s
> Compiling iai-callgrind-runner v0.14.2
319.47 s
> Checking kurbo v0.13.0
319.47 s
> Checking ron v0.8.1
319.47 s
> Checking wait-timeout v0.2.1
319.47 s
> Compiling iai-callgrind v0.14.2
319.47 s
> Checking futures-executor v0.3.32
319.47 s
> Checking quick-error v1.2.3
319.47 s
> Checking bit-vec v0.8.0
319.47 s
> Checking serial_test v3.4.0
319.47 s
> Checking rusty-fork v0.3.1
319.47 s
> Checking bit-set v0.8.0
319.47 s
> Checking syn v2.0.117
319.47 s
> Compiling iai-callgrind-macros v0.5.1
319.47 s
> Compiling graphica v2.1.0 (https://github.com/alphal00p/symbolica?rev=4d0a833eb8e059d1f95bdae5abed2559830b235f#4d0a833e)
319.47 s
> Checking rand_xorshift v0.4.0
319.47 s
> Checking console v0.15.11
319.47 s
> Checking unarray v0.1.4
319.47 s
> Compiling test-log-macros v0.2.20
319.47 s
> Checking pathdiff v0.2.3
319.47 s
> Checking proptest v1.11.0
319.47 s
> Checking similar-asserts v1.7.0
319.47 s
> Checking clinnet v0.1.8 (/build/source/crates/clinnet)
319.47 s
> Checking kurvst v0.1.0 (/build/source/crates/kurvst)
319.47 s
> Checking test-log v0.2.20
319.47 s
> Checking statrs v0.16.1
319.47 s
> Checking momtrop v0.3.0
319.47 s
> Checking gungraun v0.18.2
319.47 s
> Compiling pyo3-macros v0.28.3
319.47 s
> Compiling pyo3-stub-gen-derive v0.17.2
319.47 s
> Checking pyo3-stub-gen v0.17.2
319.47 s
> Checking symbolica-utils v0.1.0 (/build/source/crates/symbolica-utils)
319.47 s
> Checking spenso-macros v0.3.2 (/build/source/crates/spenso-macros)
319.47 s
> Compiling gammaloop-workspace-hack v0.1.0 (/build/source/crates/gammaloop-workspace-hack)
319.47 s
> Checking linnet v0.17.0 (/build/source/crates/linnet)
319.47 s
> Checking spenso v0.6.0 (/build/source/crates/spenso)
319.47 s
> Checking linnet-py v0.1.0 (/build/source/crates/linnet-py)
319.47 s
> Checking linnest v0.1.0 (/build/source/crates/linnest)
319.47 s
> Checking idenso v0.3.0 (/build/source/crates/idenso)
319.47 s
> Checking gammaloop-tracing-filter v0.1.0 (/build/source/crates/gammaloop-tracing-filter)
319.47 s
> Checking spenso-hep-lib v0.1.7 (/build/source/crates/spenso-hep-lib)
319.47 s
> Checking spynso3 v0.1.2 (/build/source/crates/spynso3)
319.47 s
> error[E0283] : type annotations needed
319.47 s
> --> crates/gammalooprs/src/momentum/sample.rs:1165:35
319.47 s
> |
319.47 s
> 1165 | requested.into_iter().collect(),
319.47 s
> | ^^^^^^^ cannot infer type of the type parameter `B` declared on the method `collect`
319.47 s
> |
319.47 s
> = note : the type must implement `std::iter::FromIterator<linnet::half_edge::involution::EdgeIndex>`
319.47 s
> note : required by a bound in `std::iter::Iterator::collect`
319.47 s
> --> /rustc/2d8144b7880597b6e6d3dfd63a9a9efae3f533d3/library/core/src/iter/traits/iterator.rs:2077:4
319.47 s
> help : consider specifying the generic argument
319.47 s
> |
319.47 s
> 1165 | requested.into_iter().collect::<Vec<_>> (),
319.47 s
> | ++++++++++
319.47 s
>
319.47 s
> error[E0283] : type annotations needed
319.47 s
> --> crates/gammalooprs/src/momentum/sample.rs:1165:35
319.47 s
> |
319.47 s
> 1161 | / assert_eq!(
319.47 s
> 1162 | | subspace
319.47 s
> 1163 | | .iter_basis_edges(&all_lmbs)
319.47 s
> 1164 | | .collect::<std::collections::BTreeSet<_>>(),
319.47 s
> 1165 | | requested.into_iter().collect(),
319.47 s
> | | ^^^^^^^ cannot infer type of the type parameter `B` declared on the method `collect`
319.47 s
> 1166 | | );
319.47 s
> | |_________- type must be known at this point
319.47 s
> |
319.47 s
> = note : multiple `impl`s satisfying `std::collections::BTreeSet<linnet::half_edge::involution::EdgeIndex>: std::cmp::PartialEq<_>` found in the following crates: `alloc`, `rkyv`:
319.47 s
> - impl<K, AK> std::cmp::PartialEq<rkyv::collections::btree_set::ArchivedBTreeSet<AK>> for std::collections::BTreeSet<K>
319.47 s
> where AK: std::cmp::PartialEq<K>;
319.47 s
> - impl<T, A> std::cmp::PartialEq for std::collections::BTreeSet<T, A>
319.47 s
> where T: std::cmp::PartialEq, A: std::alloc::Allocator, A: std::clone::Clone;
319.47 s
> help : consider specifying the generic argument
319.47 s
> |
319.47 s
> 1165 | requested.into_iter().collect::<Vec<_>> (),
319.47 s
> | ++++++++++
319.47 s
>
319.47 s
> error[E0283] : type annotations needed
319.47 s
> --> crates/gammalooprs/src/momentum/sample.rs:1182:35
319.47 s
> |
319.47 s
> 1178 | / assert_eq!(
319.47 s
> 1179 | | common_subspace
319.47 s
> 1180 | | .iter_basis_edges(&all_lmbs)
319.47 s
> 1181 | | .collect::<std::collections::BTreeSet<_>>(),
319.47 s
> 1182 | | requested.into_iter().collect(),
319.47 s
> | | ^^^^^^^ cannot infer type of the type parameter `B` declared on the method `collect`
319.47 s
> 1183 | | );
319.47 s
> | |_________- type must be known at this point
319.47 s
> |
319.47 s
> = note : multiple `impl`s satisfying `std::collections::BTreeSet<linnet::half_edge::involution::EdgeIndex>: std::cmp::PartialEq<_>` found in the following crates: `alloc`, `rkyv`:
319.47 s
> - impl<K, AK> std::cmp::PartialEq<rkyv::collections::btree_set::ArchivedBTreeSet<AK>> for std::collections::BTreeSet<K>
319.47 s
> where AK: std::cmp::PartialEq<K>;
319.47 s
> - impl<T, A> std::cmp::PartialEq for std::collections::BTreeSet<T, A>
319.47 s
> where T: std::cmp::PartialEq, A: std::alloc::Allocator, A: std::clone::Clone;
319.47 s
> help : consider specifying the generic argument
319.47 s
> |
319.47 s
> 1182 | requested.into_iter().collect::<Vec<_>> (),
319.47 s
> | ++++++++++
319.47 s
>
319.47 s
> error[E0283] : type annotations needed
319.47 s
> --> crates/gammalooprs/src/momentum/sample.rs:1203:35
319.47 s
> |
319.47 s
> 1199 | / assert_eq!(
319.47 s
> 1200 | | sparse_common_subspace
319.47 s
> 1201 | | .iter_basis_edges(&all_lmbs)
319.47 s
> 1202 | | .collect::<std::collections::BTreeSet<_>>(),
319.47 s
> 1203 | | requested.into_iter().collect(),
319.47 s
> | | ^^^^^^^ cannot infer type of the type parameter `B` declared on the method `collect`
319.47 s
> 1204 | | );
319.47 s
> | |_________- type must be known at this point
319.47 s
> |
319.47 s
> = note : multiple `impl`s satisfying `std::collections::BTreeSet<linnet::half_edge::involution::EdgeIndex>: std::cmp::PartialEq<_>` found in the following crates: `alloc`, `rkyv`:
319.47 s
> - impl<K, AK> std::cmp::PartialEq<rkyv::collections::btree_set::ArchivedBTreeSet<AK>> for std::collections::BTreeSet<K>
319.47 s
> where AK: std::cmp::PartialEq<K>;
319.47 s
> - impl<T, A> std::cmp::PartialEq for std::collections::BTreeSet<T, A>
319.47 s
> where T: std::cmp::PartialEq, A: std::alloc::Allocator, A: std::clone::Clone;
319.47 s
> help : consider specifying the generic argument
319.47 s
> |
319.47 s
> 1203 | requested.into_iter().collect::<Vec<_>> (),
319.47 s
> | ++++++++++
319.47 s
>
319.47 s
> error[E0283] : type annotations needed
319.47 s
> --> crates/gammalooprs/src/processes/amplitude.rs:3336:49
319.47 s
> |
319.47 s
> 3336 | variant_ids.iter().copied().collect(),
319.47 s
> | ^^^^^^^ cannot infer type of the type parameter `B` declared on the method `collect`
319.47 s
> |
319.47 s
> = note : the type must implement `std::iter::FromIterator<processes::threshold_counterterms::ThresholdCountertermVariantId>`
319.47 s
> note : required by a bound in `std::iter::Iterator::collect`
319.47 s
> --> /rustc/2d8144b7880597b6e6d3dfd63a9a9efae3f533d3/library/core/src/iter/traits/iterator.rs:2077:4
319.47 s
> help : consider specifying the generic argument
319.47 s
> |
319.47 s
> 3336 | variant_ids.iter().copied().collect::<Vec<_>> (),
319.47 s
> | ++++++++++
319.47 s
>
319.47 s
> error[E0283] : type annotations needed
319.47 s
> --> crates/gammalooprs/src/processes/amplitude.rs:3336:49
319.47 s
> |
319.47 s
> 3334 | / assert_eq!(
319.47 s
> 3335 | | referenced_variants,
319.47 s
> 3336 | | variant_ids.iter().copied().collect(),
319.47 s
> | | ^^^^^^^ cannot infer type of the type parameter `B` declared on the method `collect`
319.47 s
> 3337 | | "overlap groups must retain every semantic duplicate independently",
319.47 s
> 3338 | | );
319.47 s
> | |_________________- type must be known at this point
319.47 s
> |
319.47 s
> = note : multiple `impl`s satisfying `std::collections::BTreeSet<processes::threshold_counterterms::ThresholdCountertermVariantId>: std::cmp::PartialEq<_>` found in the following crates: `alloc`, `rkyv`:
319.47 s
> - impl<K, AK> std::cmp::PartialEq<rkyv::collections::btree_set::ArchivedBTreeSet<AK>> for std::collections::BTreeSet<K>
319.47 s
> where AK: std::cmp::PartialEq<K>;
319.47 s
> - impl<T, A> std::cmp::PartialEq for std::collections::BTreeSet<T, A>
319.47 s
> where T: std::cmp::PartialEq, A: std::alloc::Allocator, A: std::clone::Clone;
319.47 s
> help : consider specifying the generic argument
319.47 s
> |
319.47 s
> 3336 | variant_ids.iter().copied().collect::<Vec<_>> (),
319.47 s
> | ++++++++++
319.47 s
>
319.47 s
> error[E0283] : type annotations needed
319.47 s
> --> crates/gammalooprs/src/processes/amplitude.rs:4098:59
319.47 s
> |
319.47 s
> 4098 | assert_eq!(orders, [1, 2].into_iter().collect());
319.47 s
> | ^^^^^^^ cannot infer type of the type parameter `B` declared on the method `collect`
319.47 s
> |
319.47 s
> = note : the type must implement `std::iter::FromIterator<i32>`
319.47 s
> note : required by a bound in `std::iter::Iterator::collect`
319.47 s
> --> /rustc/2d8144b7880597b6e6d3dfd63a9a9efae3f533d3/library/core/src/iter/traits/iterator.rs:2077:4
319.47 s
> help : consider specifying the generic argument
319.47 s
> |
319.47 s
> 4098 | assert_eq!(orders, [1, 2].into_iter().collect::<Vec<_>> ());
319.47 s
> | ++++++++++
319.47 s
>
319.47 s
> error[E0283] : type annotations needed
319.47 s
> --> crates/gammalooprs/src/processes/amplitude.rs:4098:59
319.47 s
> |
319.47 s
> 4098 | assert_eq!(orders, [1, 2].into_iter().collect());
319.47 s
> | -------------------------------------- ^^^^^^^ ---
319.47 s
> | | |
319.47 s
> | | cannot infer type of the type parameter `B` declared on the method `collect`
319.47 s
> | type must be known at this point
319.47 s
> |
319.47 s
> = note : multiple `impl`s satisfying `std::collections::BTreeSet<usize>: std::cmp::PartialEq<_>` found in the following crates: `alloc`, `rkyv`:
319.47 s
> - impl<K, AK> std::cmp::PartialEq<rkyv::collections::btree_set::ArchivedBTreeSet<AK>> for std::collections::BTreeSet<K>
319.47 s
> where AK: std::cmp::PartialEq<K>;
319.47 s
> - impl<T, A> std::cmp::PartialEq for std::collections::BTreeSet<T, A>
319.47 s
> where T: std::cmp::PartialEq, A: std::alloc::Allocator, A: std::clone::Clone;
319.47 s
> help : consider specifying the generic argument
319.47 s
> |
319.47 s
> 4098 | assert_eq!(orders, [1, 2].into_iter().collect::<Vec<_>> ());
319.47 s
> | ++++++++++
319.47 s
>
319.47 s
> error[E0283] : type annotations needed
319.47 s
> --> crates/gammalooprs/src/processes/amplitude.rs:4129:48
319.47 s
> |
319.47 s
> 4123 | / assert_eq!(
319.47 s
> 4124 | | evaluator
319.47 s
> 4125 | | .evaluator_stacks
319.47 s
> 4126 | | .keys()
319.47 s
> ... |
319.47 s
> 4129 | | [1, 2].into_iter().collect()
319.47 s
> | | ^^^^^^^ cannot infer type of the type parameter `B` declared on the method `collect`
319.47 s
> 4130 | | );
319.47 s
> | |_________________________- type must be known at this point
319.47 s
> |
319.47 s
> = note : multiple `impl`s satisfying `std::collections::BTreeSet<usize>: std::cmp::PartialEq<_>` found in the following crates: `alloc`, `rkyv`:
319.47 s
> - impl<K, AK> std::cmp::PartialEq<rkyv::collections::btree_set::ArchivedBTreeSet<AK>> for std::collections::BTreeSet<K>
319.47 s
> where AK: std::cmp::PartialEq<K>;
319.47 s
> - impl<T, A> std::cmp::PartialEq for std::collections::BTreeSet<T, A>
319.47 s
> where T: std::cmp::PartialEq, A: std::alloc::Allocator, A: std::clone::Clone;
319.47 s
> help : consider specifying the generic argument
319.47 s
> |
319.47 s
> 4129 | [1, 2].into_iter().collect::<Vec<_>> ()
319.47 s
> | ++++++++++
319.47 s
>
319.47 s
> error[E0283] : type annotations needed
319.47 s
> --> crates/gammalooprs/src/processes/amplitude.rs:4160:30
319.47 s
> |
319.47 s
> 4148 | / assert_eq!(
319.47 s
> 4149 | | registry
319.47 s
> 4150 | | .components
319.47 s
> 4151 | | .iter()
319.47 s
> ... |
319.47 s
> 4160 | | .collect()
319.47 s
> | | ^^^^^^^ cannot infer type of the type parameter `B` declared on the method `collect`
319.47 s
> 4161 | | );
319.47 s
> | |_________________________- type must be known at this point
319.47 s
> |
319.47 s
> = note : multiple `impl`s satisfying `std::collections::BTreeSet<processes::threshold_counterterms::ThresholdCountertermComponentKind>: std::cmp::PartialEq<_>` found in the following crates: `alloc`, `rkyv`:
319.47 s
> - impl<K, AK> std::cmp::PartialEq<rkyv::collections::btree_set::ArchivedBTreeSet<AK>> for std::collections::BTreeSet<K>
319.47 s
> where AK: std::cmp::PartialEq<K>;
319.47 s
> - impl<T, A> std::cmp::PartialEq for std::collections::BTreeSet<T, A>
319.47 s
> where T: std::cmp::PartialEq, A: std::alloc::Allocator, A: std::clone::Clone;
319.47 s
> help : consider specifying the generic argument
319.47 s
> |
319.47 s
> 4160 | .collect::<Vec<_>> ()
319.47 s
> | ++++++++++
319.47 s
>
319.47 s
> error[E0283] : type annotations needed
319.47 s
> --> crates/gammalooprs/src/processes/amplitude.rs:4214:26
319.47 s
> |
319.47 s
> 4201 | / assert_eq!(
319.47 s
> 4202 | | decomposition
319.47 s
> 4203 | | .components
319.47 s
> 4204 | | .iter()
319.47 s
> ... |
319.47 s
> 4214 | | .collect()
319.47 s
> | | ^^^^^^^ cannot infer type of the type parameter `B` declared on the method `collect`
319.47 s
> 4215 | | );
319.47 s
> | |_____________________- type must be known at this point
319.47 s
> |
319.47 s
> = note : multiple `impl`s satisfying `std::collections::BTreeSet<processes::threshold_counterterms::ThresholdCountertermComponentKind>: std::cmp::PartialEq<_>` found in the following crates: `alloc`, `rkyv`:
319.47 s
> - impl<K, AK> std::cmp::PartialEq<rkyv::collections::btree_set::ArchivedBTreeSet<AK>> for std::collections::BTreeSet<K>
319.47 s
> where AK: std::cmp::PartialEq<K>;
319.47 s
> - impl<T, A> std::cmp::PartialEq for std::collections::BTreeSet<T, A>
319.47 s
> where T: std::cmp::PartialEq, A: std::alloc::Allocator, A: std::clone::Clone;
319.47 s
> help : consider specifying the generic argument
319.47 s
> |
319.47 s
> 4214 | .collect::<Vec<_>> ()
319.47 s
> | ++++++++++
319.47 s
>
319.47 s
> error[E0277] : can't compare `std::option::Option<&[linnet::half_edge::involution::EdgeIndex]>` with `std::option::Option<&[linnet::half_edge::involution::EdgeIndex; 1]>`
319.47 s
> --> crates/gammalooprs/src/processes/cross_section/ir_safe_threshold_fixture_tests.rs:817:25
319.47 s
> |
319.47 s
> 816 | .any(|variant| variant.requested_subspace.as_deref()
319.47 s
> | -------------------------------------
319.47 s
> 817 | == Some(&[EdgeIndex::from(3)])),
319.47 s
> | ^^ ---------------------------
319.47 s
> | |
319.47 s
> | no implementation for `std::option::Option<&[linnet::half_edge::involution::EdgeIndex]> == std::option::Option<&[linnet::half_edge::involution::EdgeIndex; 1]>`
319.47 s
> |
319.47 s
> = help : the trait `std::cmp::PartialEq<std::option::Option<&[linnet::half_edge::involution::EdgeIndex; 1]>>` is not implemented for `std::option::Option<&[linnet::half_edge::involution::EdgeIndex]>`
319.47 s
> help : the following other types implement trait `std::cmp::PartialEq<Rhs>`
319.47 s
> --> /rustc/2d8144b7880597b6e6d3dfd63a9a9efae3f533d3/library/core/src/option.rs:2434:0
319.47 s
> |
319.47 s
> = note : `std::option::Option<T>` implements `std::cmp::PartialEq`
319.47 s
> |
319.47 s
> ::: /nix/store/8zq9ya5slh345hbylmsibxw827bi98w0-vendor-cargo-deps/c19b7c6f923b580ac259164a89f2577984ad5ab09ee9d583b888f934adbbe8d0/rkyv-0.7.46/src/option.rs:210:1
319.47 s
> |
319.47 s
> 210 | impl<T: PartialEq<U>, U> PartialEq<ArchivedOption<T>> for Option<U> {
319.47 s
> | ^^^^^^^^^^^^^^^^^^^^^^^^^^^^^^^^^^^^^^^^^^^^^^^^^^^^^^^^^^^^^^^^^^^ `std::option::Option<U>` implements `std::cmp::PartialEq<rkyv::option::ArchivedOption<T>>`
319.47 s
> |
319.47 s
> ::: /nix/store/8zq9ya5slh345hbylmsibxw827bi98w0-vendor-cargo-deps/c19b7c6f923b580ac259164a89f2577984ad5ab09ee9d583b888f934adbbe8d0/rkyv-0.7.46/src/impls/alloc/niche.rs:24:1
319.47 s
> |
319.47 s
> 24 | / impl<T, U> PartialEq<ArchivedOptionBox<T>> for Option<Box<U>>
319.47 s
> 25 | | where
319.47 s
> 26 | | T: ArchivePointee + PartialEq<U> + ?Sized,
319.47 s
> 27 | | U: ?Sized,
319.47 s
> | |______________^ `std::option::Option<std::boxed::Box<U>>` implements `std::cmp::PartialEq<rkyv::niche::option_box::ArchivedOptionBox<T>>`
319.47 s
>
319.47 s
> error[E0283] : type annotations needed
319.47 s
> --> crates/gammalooprs/src/processes/no_directive_equivalence_tests.rs:459:43
319.47 s
> |
319.47 s
> 459 | (0..graph.cuts.len()).collect(),
319.47 s
> | ^^^^^^^ cannot infer type of the type parameter `B` declared on the method `collect`
319.47 s
> |
319.47 s
> = note : multiple `impl`s satisfying `_: std::iter::FromIterator<usize>` found in the following crates: `spenso`, `tabled`:
319.47 s
> - impl std::iter::FromIterator<usize> for spenso::structure::concrete_index::ExpandedIndex;
319.47 s
> - impl std::iter::FromIterator<usize> for tabled::settings::height::HeightList;
319.47 s
> - impl std::iter::FromIterator<usize> for tabled::settings::width::WidthList;
319.47 s
> note : required by a bound in `std::iter::Iterator::collect`
319.47 s
> --> /rustc/2d8144b7880597b6e6d3dfd63a9a9efae3f533d3/library/core/src/iter/traits/iterator.rs:2077:4
319.47 s
> help : consider specifying the generic argument
319.47 s
> |
319.47 s
> 459 | (0..graph.cuts.len()).collect::<Vec<_>> (),
319.47 s
> | ++++++++++
319.47 s
>
319.47 s
> error[E0283] : type annotations needed
319.47 s
> --> crates/gammalooprs/src/processes/no_directive_equivalence_tests.rs:459:43
319.47 s
> |
319.47 s
> 457 | / assert_eq!(
319.47 s
> 458 | | grouped_cut_ids,
319.47 s
> 459 | | (0..graph.cuts.len()).collect(),
319.47 s
> | | ^^^^^^^ cannot infer type of the type parameter `B` declared on the method `collect`
319.47 s
> 460 | | "every discovered process-valid cut must remain in the numerical LU evaluation",
319.47 s
> 461 | | );
319.47 s
> | |_________________- type must be known at this point
319.47 s
> |
319.47 s
> = note : multiple `impl`s satisfying `std::collections::BTreeSet<usize>: std::cmp::PartialEq<_>` found in the following crates: `alloc`, `rkyv`:
319.47 s
> - impl<K, AK> std::cmp::PartialEq<rkyv::collections::btree_set::ArchivedBTreeSet<AK>> for std::collections::BTreeSet<K>
319.47 s
> where AK: std::cmp::PartialEq<K>;
319.47 s
> - impl<T, A> std::cmp::PartialEq for std::collections::BTreeSet<T, A>
319.47 s
> where T: std::cmp::PartialEq, A: std::alloc::Allocator, A: std::clone::Clone;
319.47 s
> help : consider specifying the generic argument
319.47 s
> |
319.47 s
> 459 | (0..graph.cuts.len()).collect::<Vec<_>> (),
319.47 s
> | ++++++++++
319.47 s
>
319.47 s
> error[E0283] : type annotations needed
319.47 s
> --> crates/gammalooprs/src/processes/raised_cross_section_tests.rs:150:31
319.47 s
> |
319.47 s
> 150 | (0..graph.cuts.len()).collect(),
319.47 s
> | ^^^^^^^ cannot infer type of the type parameter `B` declared on the method `collect`
319.47 s
> |
319.47 s
> = note : multiple `impl`s satisfying `_: std::iter::FromIterator<usize>` found in the following crates: `spenso`, `tabled`:
319.47 s
> - impl std::iter::FromIterator<usize> for spenso::structure::concrete_index::ExpandedIndex;
319.47 s
> - impl std::iter::FromIterator<usize> for tabled::settings::height::HeightList;
319.47 s
> - impl std::iter::FromIterator<usize> for tabled::settings::width::WidthList;
319.47 s
> note : required by a bound in `std::iter::Iterator::collect`
319.47 s
> --> /rustc/2d8144b7880597b6e6d3dfd63a9a9efae3f533d3/library/core/src/iter/traits/iterator.rs:2077:4
319.47 s
> help : consider specifying the generic argument
319.47 s
> |
319.47 s
> 150 | (0..graph.cuts.len()).collect::<Vec<_>> (),
319.47 s
> | ++++++++++
319.47 s
>
319.47 s
> error[E0283] : type annotations needed
319.47 s
> --> crates/gammalooprs/src/processes/raised_cross_section_tests.rs:150:31
319.47 s
> |
319.47 s
> 148 | / assert_eq!(
319.47 s
> 149 | | grouped_cut_ids,
319.47 s
> 150 | | (0..graph.cuts.len()).collect(),
319.47 s
> | | ^^^^^^^ cannot infer type of the type parameter `B` declared on the method `collect`
319.47 s
> 151 | | "every discovered process-valid cut must remain in the numerical LU evaluation",
319.47 s
> 152 | | );
319.47 s
> | |_____- type must be known at this point
319.47 s
> |
319.47 s
> = note : multiple `impl`s satisfying `std::collections::BTreeSet<usize>: std::cmp::PartialEq<_>` found in the following crates: `alloc`, `rkyv`:
319.47 s
> - impl<K, AK> std::cmp::PartialEq<rkyv::collections::btree_set::ArchivedBTreeSet<AK>> for std::collections::BTreeSet<K>
319.47 s
> where AK: std::cmp::PartialEq<K>;
319.47 s
> - impl<T, A> std::cmp::PartialEq for std::collections::BTreeSet<T, A>
319.47 s
> where T: std::cmp::PartialEq, A: std::alloc::Allocator, A: std::clone::Clone;
319.47 s
> help : consider specifying the generic argument
319.47 s
> |
319.47 s
> 150 | (0..graph.cuts.len()).collect::<Vec<_>> (),
319.47 s
> | ++++++++++
319.47 s
>
319.47 s
> error : method `lu_prefactor_helper` is never used
319.47 s
> --> crates/gammalooprs/src/processes/cross_section.rs:1965:8
319.47 s
> |
319.47 s
> 1429 | impl CrossSectionGraph {
319.47 s
> | ---------------------- method in this implementation
319.47 s
> ...
319.47 s
> 1965 | fn lu_prefactor_helper(&self) -> Atom {
319.47 s
> | ^^^^^^^^^^^^^^^^^^^
319.47 s
> |
319.47 s
> = note : `-D dead-code` implied by `-D warnings`
319.47 s
> = help : to override `-D warnings` add `#[expect(dead_code)]` or `#[allow(dead_code)]`
319.47 s
>
319.47 s
> error : this `if` statement can be collapsed
319.47 s
> --> crates/gammalooprs/src/subtraction/amplitude_counterterm.rs:938:17
319.47 s
> |
319.47 s
> 938 | / if let Some(group_id) = metadata.group_id {
319.47 s
> 939 | | if let Some((_, members)) = groups.iter().find(|(id, _)| *id == Some(group_id))
319.47 s
> 940 | | {
319.47 s
> 941 | | let first = members[0];
319.47 s
> ... |
319.47 s
> 956 | | }
319.47 s
> | |_________________^
319.47 s
> |
319.47 s
> = help : for further information visit https://rust-lang.github.io/rust-clippy/rust-1.97.0/index.html#collapsible_if
319.47 s
> = note : `-D clippy::collapsible-if` implied by `-D warnings`
319.47 s
> = help : to override `-D warnings` add `#[allow(clippy::collapsible_if)]`
319.47 s
> help : collapse nested if block
319.47 s
> |
319.47 s
> 938 ~ if let Some(group_id) = metadata.group_id
319.47 s
> 939 ~ && let Some((_, members)) = groups.iter().find(|(id, _)| *id == Some(group_id))
319.47 s
> 940 | {
319.47 s
> ...
319.47 s
> 954 | ));
319.47 s
> 955 ~ }
319.47 s
> |
319.47 s
>
319.47 s
> error : this function has too many arguments (13/7)
319.47 s
> --> crates/gammalooprs/src/subtraction/amplitude_counterterm.rs:994:5
319.47 s
> |
319.47 s
> 994 | / fn evaluate_variant_group<T: FloatLike>(
319.47 s
> 995 | | &mut self,
319.47 s
> 996 | | momentum_sample: &MomentumSample<T>,
319.47 s
> 997 | | graph: &Graph,
319.47 s
> ... |
319.47 s
> 1007 | | allowed_variant_ids: Option<&[ThresholdCountertermVariantId]>,
319.47 s
> 1008 | | ) -> Result<AmplitudeCountertermEvaluation<T>> {
319.47 s
> | |__________________________________________________^
319.47 s
> |
319.47 s
> = help : for further information visit https://rust-lang.github.io/rust-clippy/rust-1.97.0/index.html#too_many_arguments
319.47 s
> = note : `-D clippy::too-many-arguments` implied by `-D warnings`
319.47 s
> = help : to override `-D warnings` add `#[allow(clippy::too_many_arguments)]`
319.47 s
>
319.47 s
> error : this `if` statement can be collapsed
319.47 s
> --> crates/gammalooprs/src/subtraction/amplitude_counterterm.rs:1359:17
319.47 s
> |
319.47 s
> 1359 | / if let Some(group_id) = metadata.group_id {
319.47 s
> 1360 | | if let Some((_, _, members)) =
319.47 s
> 1361 | | groups.iter().find(|(id, _, _)| *id == Some(group_id))
319.47 s
> ... |
319.47 s
> 1378 | | }
319.47 s
> | |_________________^
319.47 s
> |
319.47 s
> = help : for further information visit https://rust-lang.github.io/rust-clippy/rust-1.97.0/index.html#collapsible_if
319.47 s
> help : collapse nested if block
319.47 s
> |
319.47 s
> 1359 ~ if let Some(group_id) = metadata.group_id
319.47 s
> 1360 ~ && let Some((_, _, members)) =
319.47 s
> 1361 | groups.iter().find(|(id, _, _)| *id == Some(group_id))
319.47 s
> ...
319.47 s
> 1376 | ));
319.47 s
> 1377 ~ }
319.47 s
> |
319.47 s
>
319.47 s
> error : this function has too many arguments (8/7)
319.47 s
> --> crates/gammalooprs/src/subtraction/lu_counterterm.rs:1197:5
319.47 s
> |
319.47 s
> 1197 | / pub fn from_atoms(
319.47 s
> 1198 | | counterterm_data: &LUCounterTermData,
319.47 s
> 1199 | | max_cut_order: usize,
319.47 s
> 1200 | | threshold_helpers: LUThresholdHelperEvaluators,
319.47 s
> ... |
319.47 s
> 1205 | | production_orientation_ids: &[OrientationID],
319.47 s
> 1206 | | ) -> (Self, EvaluatorBuildTimings) {
319.47 s
> | |______________________________________^
319.47 s
> |
319.47 s
> = help : for further information visit https://rust-lang.github.io/rust-clippy/rust-1.97.0/index.html#too_many_arguments
319.47 s
>
319.47 s
> Some errors have detailed explanations: E0277, E0283.
319.47 s
> For more information about an error, try `rustc --explain E0277`.
319.47 s
> error : could not compile `gammalooprs` (lib) due to 5 previous errors
319.47 s
> warning : build failed, waiting for other jobs to finish...
319.47 s
> error : could not compile `gammalooprs` (lib test) due to 16 previous errors
319.47 s
For full logs, run:
319.47 s
nix log /nix/store/bfvd4racaxf8cd9mpzlpz54h91n6g02c-gammaloop-workspace-clippy-0.1.0.drv
319.50 s
Build failed.