1. 0.00 s $ /nix/store/9ypz3flqsrl5xl495mm8h645gadjsxi1-coreutils-9.11/bin/timeout --kill-after=15s 7200s /nix/store/23zk8sgzamrbmj1fday15szf7f2279s8-nix-2.34.7/bin/nix --extra-experimental-features nix-command --extra-experimental-features flakes --log-format internal-json build --no-link --print-out-paths git+https://github.com/alphal00p/gammaloop?ref=ir_safe_threshold_subtraction&rev=6c3b1ff79c34a5e34e424ddd51dd218105b48f53&shallow=1#checks.x86_64-linux.gammaloop-check --print-build-logs
  2. 0.12 s
  3. 0.40 s Building /nix/store/bcqc79if6hchn98779cm1bksy0kvkzh2-gammaloop-workspace-check-0.1.0.drv
  4. 0.47 s [gammaloop-workspace-check] Phase: unpackPhase
  5. 0.47 s [gammaloop-workspace-check] unpacking source archive /nix/store/bcy0vqqk2ibk38nik2bb809ck03m92g2-source
  6. 0.63 s [gammaloop-workspace-check] source root is source
  7. 0.66 s [gammaloop-workspace-check] Phase: patchPhase
  8. 0.66 s [gammaloop-workspace-check] Executing configureCargoCommonVars
  9. 0.67 s [gammaloop-workspace-check] decompressing cargo artifacts from /nix/store/wxpx6lf642pgxp2wz1pw1lxksj5p1wb0-gammaloop-workspace-deps-deps-0.1.0/target.tar.zst to target
  10. 1.99 s [gammaloop-workspace-check] Phase: updateAutotoolsGnuConfigScriptsPhase
  11. 2.03 s [gammaloop-workspace-check] Phase: configurePhase
  12. 2.03 s [gammaloop-workspace-check] will append /build/source/.cargo-home/config.toml with contents of /nix/store/8zq9ya5slh345hbylmsibxw827bi98w0-vendor-cargo-deps/config.toml
  13. 2.03 s [gammaloop-workspace-check] default configurePhase, nothing to do
  14. 2.04 s [gammaloop-workspace-check] Phase: buildPhase
  15. 2.04 s [gammaloop-workspace-check] +++ command cargo --version
  16. 2.04 s [gammaloop-workspace-check] cargo 1.97.0 (c980f4866 2026-06-30)
  17. 2.07 s [gammaloop-workspace-check] +++ command cargo check --profile ci-optim --locked --workspace --features gammaloop-tracing-filter/clap,gammaloop-tracing-filter/symbolica,idenso/bincode,idenso/reference-cases,linnet/bincode,linnet/drawing,linnet/rkyv,linnet/serde,linnet/symbolica,spenso-macros/shadowing,spenso/shadowing,symbolica/tracing_max_level_info,three-dimensional-reps/display,three-dimensional-reps/eval,three-dimensional-reps/serde --all-targets
  18. 2.57 s [gammaloop-workspace-check] Checking cfg-if v1.0.4
  19. 2.57 s [gammaloop-workspace-check] Checking memchr v2.8.0
  20. 2.57 s [gammaloop-workspace-check] Checking once_cell v1.21.4
  21. 2.58 s [gammaloop-workspace-check] Checking either v1.15.0
  22. 2.58 s [gammaloop-workspace-check] Checking serde_core v1.0.228
  23. 2.58 s [gammaloop-workspace-check] Checking libc v0.2.186
  24. 2.58 s [gammaloop-workspace-check] Checking libm v0.2.16
  25. 2.60 s [gammaloop-workspace-check] Checking itoa v1.0.18
  26. 2.60 s [gammaloop-workspace-check] Checking log v0.4.29
  27. 2.60 s [gammaloop-workspace-check] Checking regex-syntax v0.8.10
  28. 2.61 s [gammaloop-workspace-check] Checking zerocopy v0.8.48
  29. 2.61 s [gammaloop-workspace-check] Checking crossbeam-utils v0.8.21
  30. 2.62 s [gammaloop-workspace-check] Checking equivalent v1.0.2
  31. 2.63 s [gammaloop-workspace-check] Checking zmij v1.0.21
  32. 2.63 s [gammaloop-workspace-check] Checking lazy_static v1.5.0
  33. 2.63 s [gammaloop-workspace-check] Checking bytemuck v1.25.0
  34. 2.63 s [gammaloop-workspace-check] Compiling target-lexicon v0.13.5
  35. 2.66 s [gammaloop-workspace-check] Checking arrayvec v0.7.6
  36. 2.68 s [gammaloop-workspace-check] Checking powerfmt v0.2.0
  37. 2.70 s [gammaloop-workspace-check] Checking num_threads v0.1.7
  38. 2.71 s [gammaloop-workspace-check] Checking num-conv v0.2.1
  39. 2.71 s [gammaloop-workspace-check] Checking time-core v0.1.8
  40. 2.73 s [gammaloop-workspace-check] Checking itertools v0.14.0
  41. 2.74 s [gammaloop-workspace-check] Checking safe_arch v0.7.4
  42. 2.76 s [gammaloop-workspace-check] Checking pin-project-lite v0.2.17
  43. 2.79 s [gammaloop-workspace-check] Checking tracing-core v0.1.36
  44. 2.80 s [gammaloop-workspace-check] Checking deranged v0.5.8
  45. 2.80 s [gammaloop-workspace-check] Checking foldhash v0.2.0
  46. 2.81 s [gammaloop-workspace-check] Checking allocator-api2 v0.2.21
  47. 2.90 s [gammaloop-workspace-check] Checking const-random v0.1.18
  48. 2.91 s [gammaloop-workspace-check] Checking nu-ansi-term v0.50.3
  49. 2.93 s [gammaloop-workspace-check] Checking winnow v1.0.2
  50. 2.95 s [gammaloop-workspace-check] Checking unty v0.0.4
  51. 2.99 s [gammaloop-workspace-check] Checking aho-corasick v1.1.4
  52. 2.99 s [gammaloop-workspace-check] Checking static_assertions v1.1.0
  53. 3.04 s [gammaloop-workspace-check] Checking safe_arch v1.0.0
  54. 3.09 s [gammaloop-workspace-check] Checking hashbrown v0.16.1
  55. 3.12 s [gammaloop-workspace-check] Checking sharded-slab v0.1.7
  56. 3.17 s [gammaloop-workspace-check] Checking wide v0.7.33
  57. 3.19 s [gammaloop-workspace-check] Checking crossbeam-epoch v0.9.18
  58. 3.28 s [gammaloop-workspace-check] Checking tracing-log v0.2.0
  59. 3.39 s [gammaloop-workspace-check] Checking tracing v0.1.44
  60. 3.41 s [gammaloop-workspace-check] Checking crossbeam-deque v0.8.6
  61. 3.44 s [gammaloop-workspace-check] Checking thread_local v1.1.9
  62. 3.49 s [gammaloop-workspace-check] Checking toml_writer v1.1.1+spec-1.1.0
  63. 3.53 s [gammaloop-workspace-check] Checking az v1.3.0
  64. 3.54 s [gammaloop-workspace-check] Checking indenter v0.3.4
  65. 3.57 s [gammaloop-workspace-check] Checking rayon-core v1.13.0
  66. 3.58 s [gammaloop-workspace-check] Checking num-traits v0.2.19
  67. 3.62 s [gammaloop-workspace-check] Checking wide v1.3.0
  68. 3.64 s [gammaloop-workspace-check] Compiling phf_shared v0.11.3
  69. 3.71 s [gammaloop-workspace-check] Checking anyhow v1.0.102
  70. 3.76 s [gammaloop-workspace-check] Checking getrandom v0.3.4
  71. 3.77 s [gammaloop-workspace-check] Checking time v0.3.47
  72. 3.81 s [gammaloop-workspace-check] Checking toml_parser v1.1.2+spec-1.1.0
  73. 3.89 s [gammaloop-workspace-check] Checking gmp-mpfr-sys v1.7.1
  74. 3.94 s [gammaloop-workspace-check] Checking utf8parse v0.2.2
  75. 3.96 s [gammaloop-workspace-check] Checking rand_core v0.9.5
  76. 3.97 s [gammaloop-workspace-check] Checking alloc-no-stdlib v2.0.4
  77. 4.00 s [gammaloop-workspace-check] Checking rayon v1.12.0
  78. 4.01 s [gammaloop-workspace-check] Checking dyn-clone v1.0.20
  79. 4.03 s [gammaloop-workspace-check] Checking rawpointer v0.2.1
  80. 4.06 s [gammaloop-workspace-check] Checking matrixmultiply v0.3.10
  81. 4.09 s [gammaloop-workspace-check] Checking alloc-stdlib v0.2.2
  82. 4.12 s [gammaloop-workspace-check] Checking anstyle-parse v1.0.0
  83. 4.13 s [gammaloop-workspace-check] Checking colorchoice v1.0.5
  84. 4.15 s [gammaloop-workspace-check] Checking is_terminal_polyfill v1.70.2
  85. 4.15 s [gammaloop-workspace-check] Checking approx v0.5.1
  86. 4.18 s [gammaloop-workspace-check] Checking num-integer v0.1.46
  87. 4.19 s [gammaloop-workspace-check] Checking anstyle v1.0.14
  88. 4.21 s [gammaloop-workspace-check] Checking anstyle-query v1.1.5
  89. 4.22 s [gammaloop-workspace-check] Checking colored v3.1.1
  90. 4.25 s [gammaloop-workspace-check] Compiling phf_generator v0.11.3
  91. 4.26 s [gammaloop-workspace-check] Checking eyre v0.6.12
  92. 4.27 s [gammaloop-workspace-check] Checking unicode-width v0.2.2
  93. 4.28 s [gammaloop-workspace-check] Checking regex-automata v0.4.14
  94. 4.28 s [gammaloop-workspace-check] Checking bitflags v1.3.2
  95. 4.30 s [gammaloop-workspace-check] Checking brotli-decompressor v5.0.0
  96. 4.32 s [gammaloop-workspace-check] Checking region v3.0.2
  97. 4.33 s [gammaloop-workspace-check] Checking serde v1.0.228
  98. 4.35 s [gammaloop-workspace-check] Checking serde_json v1.0.149
  99. 4.39 s [gammaloop-workspace-check] Checking bitflags v2.11.1
  100. 4.40 s [gammaloop-workspace-check] Checking serde_spanned v1.1.1
  101. 4.40 s [gammaloop-workspace-check] Checking toml_datetime v1.1.1+spec-1.1.0
  102. 4.48 s [gammaloop-workspace-check] Checking anstream v1.0.0
  103. 4.52 s [gammaloop-workspace-check] Compiling phf_codegen v0.11.3
  104. 4.53 s [gammaloop-workspace-check] Compiling pyo3-build-config v0.28.3
  105. 4.54 s [gammaloop-workspace-check] Checking wasmtime-jit-icache-coherence v34.0.2
  106. 4.55 s [gammaloop-workspace-check] Checking hugepage-rs v0.1.1
  107. 4.56 s [gammaloop-workspace-check] Checking inventory v0.3.24
  108. 4.60 s [gammaloop-workspace-check] Checking spec_math v0.1.6
  109. 4.62 s [gammaloop-workspace-check] Checking thiserror v2.0.18
  110. 4.63 s [gammaloop-workspace-check] Compiling getopts v0.2.24
  111. 4.63 s [gammaloop-workspace-check] Checking libloading v0.9.0
  112. 4.65 s [gammaloop-workspace-check] Checking self_cell v1.2.2
  113. 4.66 s [gammaloop-workspace-check] Checking toml v1.1.2+spec-1.1.0
  114. 4.70 s [gammaloop-workspace-check] Checking tinyjson v2.5.1
  115. 4.71 s [gammaloop-workspace-check] Checking bytes v1.11.1
  116. 4.73 s [gammaloop-workspace-check] Checking byteorder v1.5.0
  117. 4.76 s [gammaloop-workspace-check] Checking append-only-vec v0.1.8
  118. 4.85 s [gammaloop-workspace-check] Checking smallvec v1.15.1
  119. 4.86 s [gammaloop-workspace-check] Checking num-complex v0.4.6
  120. 4.87 s [gammaloop-workspace-check] Checking tracing-serde v0.2.0
  121. 4.91 s [gammaloop-workspace-check] Checking bincode v2.0.1
  122. 4.97 s [gammaloop-workspace-check] Checking smartstring v1.0.1
  123. 5.00 s [gammaloop-workspace-check] Compiling unicode_names2_generator v1.3.0
  124. 5.01 s [gammaloop-workspace-check] Checking linux-raw-sys v0.12.1
  125. 5.03 s [gammaloop-workspace-check] Checking brotli v8.0.2
  126. 5.07 s [gammaloop-workspace-check] Compiling unic-common v0.9.0
  127. 5.14 s [gammaloop-workspace-check] Compiling unic-char-range v0.9.0
  128. 5.16 s [gammaloop-workspace-check] Checking simba v0.9.1
  129. 5.18 s [gammaloop-workspace-check] Compiling unic-ucd-version v0.9.0
  130. 5.19 s [gammaloop-workspace-check] Compiling is-macro v0.3.7
  131. 5.22 s [gammaloop-workspace-check] Compiling unic-char-property v0.9.0
  132. 5.24 s [gammaloop-workspace-check] Compiling rustpython-parser-vendored v0.4.0
  133. 5.29 s [gammaloop-workspace-check] Checking iana-time-zone v0.1.65
  134. 5.29 s [gammaloop-workspace-check] Compiling rustpython-parser v0.4.0
  135. 5.30 s [gammaloop-workspace-check] Checking rustix v1.1.4
  136. 5.40 s [gammaloop-workspace-check] Checking chrono v0.4.44
  137. 5.48 s [gammaloop-workspace-check] Compiling phf v0.11.3
  138. 5.50 s [gammaloop-workspace-check] Checking rustc-hash v2.1.2
  139. 5.55 s [gammaloop-workspace-check] Compiling unic-emoji-char v0.9.0
  140. 5.58 s [gammaloop-workspace-check] Compiling unic-ucd-ident v0.9.0
  141. 5.59 s [gammaloop-workspace-check] Checking ndarray v0.17.2
  142. 5.62 s [gammaloop-workspace-check] Compiling lalrpop-util v0.20.2
  143. 5.65 s [gammaloop-workspace-check] Compiling rustc-hash v1.1.0
  144. 5.74 s [gammaloop-workspace-check] Checking rug v1.30.0
  145. 5.75 s [gammaloop-workspace-check] Compiling symbolica v2.2.0 (https://github.com/alphal00p/symbolica?rev=4d0a833eb8e059d1f95bdae5abed2559830b235f#4d0a833e)
  146. 5.77 s [gammaloop-workspace-check] Checking unicode-segmentation v1.13.2
  147. 5.87 s [gammaloop-workspace-check] Checking typenum v1.20.0
  148. 5.88 s [gammaloop-workspace-check] Checking getrandom v0.2.17
  149. 5.98 s [gammaloop-workspace-check] Checking scopeguard v1.2.0
  150. 6.02 s [gammaloop-workspace-check] Checking lock_api v0.4.14
  151. 6.16 s [gammaloop-workspace-check] Checking ppv-lite86 v0.2.21
  152. 6.17 s [gammaloop-workspace-check] Checking ahash v0.8.12
  153. 6.21 s [gammaloop-workspace-check] Checking parking_lot_core v0.9.12
  154. 6.31 s [gammaloop-workspace-check] Checking hashbrown v0.17.0
  155. 6.33 s [gammaloop-workspace-check] Checking unicode-ident v1.0.24
  156. 6.39 s [gammaloop-workspace-check] Checking parking_lot v0.12.5
  157. 6.41 s [gammaloop-workspace-check] Checking errno v0.3.14
  158. 6.43 s [gammaloop-workspace-check] Checking clap_lex v1.1.0
  159. 6.49 s [gammaloop-workspace-check] Checking rand_chacha v0.9.0
  160. 6.53 s [gammaloop-workspace-check] Checking unicase v2.9.0
  161. 6.54 s [gammaloop-workspace-check] Checking generic-array v0.14.7
  162. 6.55 s [gammaloop-workspace-check] Checking matchers v0.2.0
  163. 6.56 s [gammaloop-workspace-check] Checking regex v1.12.3
  164. 6.58 s [gammaloop-workspace-check] Checking strsim v0.11.1
  165. 6.62 s [gammaloop-workspace-check] Checking tracing-subscriber v0.3.23
  166. 6.65 s [gammaloop-workspace-check] Checking signal-hook-registry v1.4.8
  167. 6.73 s [gammaloop-workspace-check] Checking rand v0.9.4
  168. 6.78 s [gammaloop-workspace-check] Checking vte v0.14.1
  169. 6.79 s [gammaloop-workspace-check] Checking indexmap v2.14.0
  170. 6.82 s [gammaloop-workspace-check] Checking terminal_size v0.4.4
  171. 6.85 s [gammaloop-workspace-check] Checking same-file v1.0.6
  172. 6.90 s [gammaloop-workspace-check] Checking signal-hook v0.3.18
  173. 6.91 s [gammaloop-workspace-check] Checking half v2.7.1
  174. 6.93 s [gammaloop-workspace-check] Checking clap_builder v4.6.0
  175. 6.96 s [gammaloop-workspace-check] Checking walkdir v2.5.0
  176. 7.00 s [gammaloop-workspace-check] Checking block-buffer v0.10.4
  177. 7.04 s [gammaloop-workspace-check] Checking crypto-common v0.1.7
  178. 7.11 s [gammaloop-workspace-check] Checking mio v1.2.0
  179. 7.13 s [gammaloop-workspace-check] Checking ciborium-io v0.2.2
  180. 7.19 s [gammaloop-workspace-check] Checking minimal-lexical v0.2.1
  181. 7.33 s [gammaloop-workspace-check] Checking ciborium-ll v0.2.2
  182. 7.34 s [gammaloop-workspace-check] Checking digest v0.10.7
  183. 7.39 s [gammaloop-workspace-check] Checking symjit v2.21.0
  184. 7.45 s [gammaloop-workspace-check] Checking derive_more v2.1.1
  185. 7.50 s [gammaloop-workspace-check] Checking nom v7.1.3
  186. 7.52 s [gammaloop-workspace-check] Checking num-bigint v0.4.6
  187. 7.55 s [gammaloop-workspace-check] Checking signal-hook-mio v0.2.5
  188. 7.56 s [gammaloop-workspace-check] Checking console v0.16.3
  189. 7.65 s [gammaloop-workspace-check] Checking bstr v1.12.1
  190. 7.69 s [gammaloop-workspace-check] Checking linux-raw-sys v0.4.15
  191. 7.70 s [gammaloop-workspace-check] Checking cpufeatures v0.2.17
  192. 7.76 s [gammaloop-workspace-check] Checking winnow v0.7.15
  193. 8.08 s [gammaloop-workspace-check] Checking sha2 v0.10.9
  194. 8.19 s [gammaloop-workspace-check] Checking globset v0.4.18
  195. 8.21 s [gammaloop-workspace-check] Checking ciborium v0.2.2
  196. 8.36 s [gammaloop-workspace-check] Checking rustix v0.38.44
  197. 8.73 s [gammaloop-workspace-check] Checking getrandom v0.4.2
  198. 8.74 s [gammaloop-workspace-check] Checking rand_core v0.6.4
  199. 8.81 s [gammaloop-workspace-check] Checking clap v4.6.1
  200. 8.85 s [gammaloop-workspace-check] Checking plotters-backend v0.3.7
  201. 8.95 s [gammaloop-workspace-check] Checking fastrand v2.4.1
  202. 8.96 s [gammaloop-workspace-check] Checking fnv v1.0.7
  203. 9.02 s [gammaloop-workspace-check] Checking plotters-svg v0.3.7
  204. 9.06 s [gammaloop-workspace-check] Checking rust-embed-utils v8.11.0
  205. 9.14 s [gammaloop-workspace-check] Compiling unicode_names2 v1.3.0
  206. 9.16 s [gammaloop-workspace-check] Checking serde_spanned v0.6.9
  207. 9.17 s [gammaloop-workspace-check] Checking tempfile v3.27.0
  208. 9.20 s [gammaloop-workspace-check] Checking toml_datetime v0.6.11
  209. 9.23 s [gammaloop-workspace-check] Checking itertools v0.10.5
  210. 9.23 s [gammaloop-workspace-check] Checking cast v0.3.0
  211. 9.27 s [gammaloop-workspace-check] Checking toml_write v0.1.2
  212. 9.34 s [gammaloop-workspace-check] Checking tap v1.0.1
  213. 9.43 s [gammaloop-workspace-check] Checking plotters v0.3.7
  214. 9.45 s [gammaloop-workspace-check] Checking crossterm v0.28.1
  215. 9.46 s [gammaloop-workspace-check] Checking rand_chacha v0.3.1
  216. 9.48 s [gammaloop-workspace-check] Checking wyz v0.5.1
  217. 9.58 s [gammaloop-workspace-check] Checking radium v0.7.0
  218. 9.59 s [gammaloop-workspace-check] Checking typeid v1.0.3
  219. 9.65 s [gammaloop-workspace-check] Checking similar v2.7.0
  220. 9.77 s [gammaloop-workspace-check] Checking tinytemplate v1.2.1
  221. 9.79 s [gammaloop-workspace-check] Checking is-terminal v0.4.17
  222. 9.87 s [gammaloop-workspace-check] Checking funty v2.0.0
  223. 9.87 s [gammaloop-workspace-check] Checking anes v0.1.6
  224. 10.08 s [gammaloop-workspace-check] Checking bytecount v0.6.9
  225. 10.12 s [gammaloop-workspace-check] Checking oorandom v11.1.5
  226. 10.13 s [gammaloop-workspace-check] Checking rand v0.8.6
  227. 10.16 s [gammaloop-workspace-check] Checking ron v0.12.1
  228. 10.19 s [gammaloop-workspace-check] Checking toml_edit v0.25.11+spec-1.1.0
  229. 10.35 s [gammaloop-workspace-check] Checking bitvec v1.0.1
  230. 10.50 s [gammaloop-workspace-check] Checking criterion-plot v0.5.0
  231. 10.75 s [gammaloop-workspace-check] Checking ansitok v0.3.0
  232. 10.83 s [gammaloop-workspace-check] Checking xprec v0.2.2
  233. 11.02 s [gammaloop-workspace-check] Checking toml_edit v0.22.27
  234. 11.06 s [gammaloop-workspace-check] Checking uncased v0.9.10
  235. 11.10 s [gammaloop-workspace-check] Checking env_filter v1.0.1
  236. 11.14 s [gammaloop-workspace-check] Checking criterion v0.5.1
  237. 11.19 s [gammaloop-workspace-check] Checking jiff v0.2.24
  238. 11.19 s [gammaloop-workspace-check] Checking ptr_meta v0.1.4
  239. 11.23 s [gammaloop-workspace-check] Checking simdutf8 v0.1.5
  240. 11.37 s [gammaloop-workspace-check] Checking ucd-trie v0.1.7
  241. 11.37 s [gammaloop-workspace-check] Checking bytecheck v0.6.12
  242. 11.37 s [gammaloop-workspace-check] Checking ahash v0.7.8
  243. 11.37 s [gammaloop-workspace-check] Checking insta v1.47.2
  244. 11.40 s [gammaloop-workspace-check] Checking approx v0.4.0
  245. 11.43 s [gammaloop-workspace-check] Checking seahash v4.1.0
  246. 11.48 s [gammaloop-workspace-check] Checking ansi-str v0.9.0
  247. 11.56 s [gammaloop-workspace-check] Checking testing_table v0.3.0
  248. 11.59 s [gammaloop-workspace-check] Checking pest v2.8.6
  249. 11.63 s [gammaloop-workspace-check] Checking cgmath v0.18.0
  250. 11.65 s [gammaloop-workspace-check] Checking num-rational v0.4.2
  251. 11.82 s [gammaloop-workspace-check] Checking hashbrown v0.12.3
  252. 11.91 s [gammaloop-workspace-check] Checking rend v0.4.2
  253. 12.19 s [gammaloop-workspace-check] Checking num-iter v0.1.45
  254. 12.20 s [gammaloop-workspace-check] Checking papergrid v0.17.0
  255. 12.29 s [gammaloop-workspace-check] Checking ref-ops v0.2.5
  256. 12.42 s [gammaloop-workspace-check] Checking num v0.4.3
  257. 12.46 s [gammaloop-workspace-check] Checking rand_xoshiro v0.6.0
  258. 12.51 s [gammaloop-workspace-check] Checking features v0.10.0
  259. 12.51 s [gammaloop-workspace-check] Checking constcat v0.5.1
  260. 12.53 s [gammaloop-workspace-check] Checking gat-lending-iterator v0.1.8
  261. 12.59 s [gammaloop-workspace-check] Checking colored v2.2.0
  262. 12.60 s [gammaloop-workspace-check] Checking constant_time_eq v0.4.2
  263. 12.68 s [gammaloop-workspace-check] Checking arrayref v0.3.9
  264. 12.79 s [gammaloop-workspace-check] Checking cpufeatures v0.3.0
  265. 12.81 s [gammaloop-workspace-check] Checking base64 v0.22.1
  266. 12.86 s [gammaloop-workspace-check] Checking blake3 v1.8.5
  267. 12.91 s [gammaloop-workspace-check] Checking joinery v2.1.0
  268. 13.02 s [gammaloop-workspace-check] Checking siphasher v1.0.2
  269. 13.06 s [gammaloop-workspace-check] Checking titlecase v2.2.1
  270. 13.18 s [gammaloop-workspace-check] Checking phf_shared v0.13.1
  271. 13.21 s [gammaloop-workspace-check] Checking subprocess v0.2.15
  272. 13.25 s [gammaloop-workspace-check] Checking rust_lisp v0.18.0
  273. 13.28 s [gammaloop-workspace-check] Compiling vakint v0.1.2 (/build/source/crates/vakint)
  274. 13.32 s [gammaloop-workspace-check] Checking version-compare v0.2.1
  275. 13.35 s [gammaloop-workspace-check] Checking toml v0.8.23
  276. 13.40 s [gammaloop-workspace-check] Checking phf v0.13.1
  277. 13.46 s [gammaloop-workspace-check] Checking xpct v0.5.1
  278. 13.48 s [gammaloop-workspace-check] Checking dot-parser v0.5.1
  279. 13.50 s [gammaloop-workspace-check] Compiling pyo3-macros-backend v0.28.3
  280. 13.52 s [gammaloop-workspace-check] Compiling pyo3-ffi v0.28.3
  281. 13.54 s [gammaloop-workspace-check] Compiling pyo3 v0.28.3
  282. 13.57 s [gammaloop-workspace-check] Compiling numpy v0.28.0
  283. 13.59 s [gammaloop-workspace-check] Checking tabled v0.20.0
  284. 13.64 s [gammaloop-workspace-check] Checking string-template-plus v0.4.3
  285. 13.86 s [gammaloop-workspace-check] Checking ryu v1.0.23
  286. 13.90 s [gammaloop-workspace-check] Checking figment v0.10.19
  287. 13.94 s [gammaloop-workspace-check] Checking castaway v0.2.4
  288. 13.96 s [gammaloop-workspace-check] Checking toml_datetime v0.7.5+spec-1.1.0
  289. 14.00 s [gammaloop-workspace-check] Checking strum v0.27.2
  290. 14.02 s [gammaloop-workspace-check] Checking compact_str v0.9.0
  291. 14.06 s [gammaloop-workspace-check] Checking unicode-truncate v2.0.1
  292. 14.08 s [gammaloop-workspace-check] Checking kasuari v0.4.12
  293. 14.10 s [gammaloop-workspace-check] Checking lru v0.16.4
  294. 14.12 s [gammaloop-workspace-check] Checking vte v0.15.0
  295. 14.13 s [gammaloop-workspace-check] Checking toml v0.9.12+spec-1.1.0
  296. 14.18 s [gammaloop-workspace-check] Checking portable-atomic v1.13.1
  297. 14.25 s [gammaloop-workspace-check] Checking vt100 v0.16.2
  298. 14.27 s [gammaloop-workspace-check] Checking unit-prefix v0.5.2
  299. 14.27 s [gammaloop-workspace-check] Checking rand_distr v0.4.3
  300. 14.29 s [gammaloop-workspace-check] Checking simba v0.6.0
  301. 14.35 s [gammaloop-workspace-check] Checking line-clipping v0.3.7
  302. 14.37 s [gammaloop-workspace-check] Compiling three-dimensional-reps v0.1.0 (/build/source/crates/three-dimensional-reps)
  303. 14.40 s [gammaloop-workspace-check] Checking ratatui-core v0.1.0
  304. 14.45 s [gammaloop-workspace-check] Checking gimli v0.32.3
  305. 14.47 s [gammaloop-workspace-check] Checking adler2 v2.0.1
  306. 14.52 s [gammaloop-workspace-check] Checking thiserror v1.0.69
  307. 14.54 s [gammaloop-workspace-check] Checking miniz_oxide v0.8.9
  308. 14.58 s [gammaloop-workspace-check] Checking derive_builder v0.11.2
  309. 14.59 s [gammaloop-workspace-check] Checking crossterm v0.29.0
  310. 14.60 s [gammaloop-workspace-check] Checking indicatif v0.18.4
  311. 14.64 s [gammaloop-workspace-check] Checking object v0.37.3
  312. 14.72 s [gammaloop-workspace-check] Checking owo-colors v4.3.0
  313. 14.75 s [gammaloop-workspace-check] Checking tracing-error v0.2.1
  314. 14.77 s [gammaloop-workspace-check] Checking env_logger v0.11.10
  315. 14.79 s [gammaloop-workspace-check] Checking typed-index-collections v3.5.0
  316. 14.83 s [gammaloop-workspace-check] Checking rkyv v0.7.46
  317. 14.94 s [gammaloop-workspace-check] Checking serde-big-array v0.5.1
  318. 14.97 s [gammaloop-workspace-check] Checking amd v0.2.2
  319. 15.04 s [gammaloop-workspace-check] Checking itertools v0.11.0
  320. 15.11 s [gammaloop-workspace-check] Compiling gammaloop-tracing-filter-macros v0.1.0 (/build/source/crates/gammaloop-tracing-filter-macros)
  321. 15.14 s [gammaloop-workspace-check] Checking rustc-demangle v0.1.27
  322. 15.24 s [gammaloop-workspace-check] Checking option-ext v0.2.0
  323. 15.27 s [gammaloop-workspace-check] Checking ratatui-widgets v0.3.0
  324. 15.31 s [gammaloop-workspace-check] Checking dirs-sys v0.5.0
  325. 15.42 s [gammaloop-workspace-check] Checking ref-cast v1.0.25
  326. 15.48 s [gammaloop-workspace-check] Checking nix v0.31.2
  327. 15.57 s [gammaloop-workspace-check] Checking integer-sqrt v0.1.5
  328. 15.62 s [gammaloop-workspace-check] Checking brotli-decompressor v4.0.3
  329. 15.64 s [gammaloop-workspace-check] Checking crossbeam-channel v0.5.15
  330. 15.86 s [gammaloop-workspace-check] Checking itertools v0.12.1
  331. 16.19 s [gammaloop-workspace-check] Checking color-spantrace v0.3.0
  332. 16.21 s [gammaloop-workspace-check] Checking symlink v0.1.0
  333. 16.21 s [gammaloop-workspace-check] Checking ratatui-crossterm v0.1.0
  334. 16.29 s [gammaloop-workspace-check] Compiling gammalooprs v0.3.4 (/build/source/crates/gammalooprs)
  335. 16.30 s [gammaloop-workspace-check] Checking unsafe-libyaml v0.2.11
  336. 16.31 s [gammaloop-workspace-check] Checking tracing-appender v0.2.5
  337. 16.43 s [gammaloop-workspace-check] Compiling rustpython-parser-core v0.4.0
  338. 16.47 s [gammaloop-workspace-check] Checking include_dir v0.7.4
  339. 16.49 s [gammaloop-workspace-check] Checking ctrlc v3.5.2
  340. 16.54 s [gammaloop-workspace-check] Checking tracing-indicatif v0.3.14
  341. 16.57 s [gammaloop-workspace-check] Checking pathfinding v4.15.0
  342. 16.59 s [gammaloop-workspace-check] Compiling rustpython-ast v0.4.0
  343. 16.64 s [gammaloop-workspace-check] Checking schemars v1.2.1
  344. 16.71 s [gammaloop-workspace-check] Checking slotmap v1.1.1
  345. 16.79 s [gammaloop-workspace-check] Checking dirs v6.0.0
  346. 16.88 s [gammaloop-workspace-check] Checking json5 v0.4.1
  347. 17.00 s [gammaloop-workspace-check] Checking ratatui-macros v0.7.0
  348. 17.06 s [gammaloop-workspace-check] Checking ratatui v0.30.0
  349. 17.13 s [gammaloop-workspace-check] Checking brotli v7.0.0
  350. 17.19 s [gammaloop-workspace-check] Checking vectorize v0.2.0
  351. 17.19 s [gammaloop-workspace-check] Checking base62 v2.2.4
  352. 17.23 s [gammaloop-workspace-check] Checking ringbuffer v0.16.0
  353. 17.34 s [gammaloop-workspace-check] Checking clarabel v0.11.1
  354. 17.35 s [gammaloop-workspace-check] Checking rust-embed v8.11.0
  355. 17.36 s [gammaloop-workspace-check] Checking clap_complete v4.6.3
  356. 17.41 s [gammaloop-workspace-check] Checking strip-ansi-escapes v0.2.1
  357. 17.43 s [gammaloop-workspace-check] Checking fd-lock v4.0.4
  358. 17.49 s [gammaloop-workspace-check] Compiling gammaloop-api v0.1.0 (/build/source/crates/gammaloop-api)
  359. 17.54 s [gammaloop-workspace-check] Checking itertools v0.13.0
  360. 17.57 s [gammaloop-workspace-check] Checking serde_yaml v0.9.34+deprecated
  361. 17.62 s [gammaloop-workspace-check] Checking strum v0.26.3
  362. 17.79 s [gammaloop-workspace-check] Checking sysinfo v0.33.1
  363. 17.94 s [gammaloop-workspace-check] Checking shlex v1.3.0
  364. 18.05 s [gammaloop-workspace-check] Checking clap_complete_nushell v4.6.0
  365. 18.12 s [gammaloop-workspace-check] Checking slab v0.4.12
  366. 18.23 s [gammaloop-workspace-check] Checking futures-task v0.3.32
  367. 18.25 s [gammaloop-workspace-check] Checking futures-core v0.3.32
  368. 18.33 s [gammaloop-workspace-check] Checking sdd v3.0.10
  369. 18.35 s [gammaloop-workspace-check] Compiling gammaloop-integration-tests v0.1.0 (/build/source/tests)
  370. 18.39 s [gammaloop-workspace-check] Compiling test-log-core v0.2.20
  371. 18.47 s [gammaloop-workspace-check] Checking futures-util v0.3.32
  372. 18.86 s [gammaloop-workspace-check] Checking scc v2.4.0
  373. 18.91 s [gammaloop-workspace-check] Compiling rustc_version v0.4.1
  374. 18.93 s [gammaloop-workspace-check] Checking which v8.0.2
  375. 19.18 s [gammaloop-workspace-check] Checking bincode v1.3.3
  376. 19.26 s [gammaloop-workspace-check] Checking reedline v0.42.0
  377. 19.27 s [gammaloop-workspace-check] Checking addr2line v0.25.1
  378. 19.69 s [gammaloop-workspace-check] Compiling numerica v2.2.0 (https://github.com/alphal00p/symbolica?rev=4d0a833eb8e059d1f95bdae5abed2559830b235f#4d0a833e)
  379. 19.89 s [gammaloop-workspace-check] Checking backtrace v0.3.76
  380. 19.91 s [gammaloop-workspace-check] Compiling gungraun-runner v0.18.2
  381. 20.19 s [gammaloop-workspace-check] Compiling gungraun-macros v0.8.0
  382. 20.41 s [gammaloop-workspace-check] Checking nalgebra v0.29.0
  383. 21.22 s [gammaloop-workspace-check] Checking color-eyre v0.6.5
  384. 21.40 s [gammaloop-workspace-check] Checking proc-macro2 v1.0.106
  385. 21.73 s [gammaloop-workspace-check] Checking quote v1.0.45
  386. 21.81 s [gammaloop-workspace-check] Checking base64 v0.21.7
  387. 21.86 s [gammaloop-workspace-check] Checking maplit v1.0.2
  388. 21.92 s [gammaloop-workspace-check] Compiling iai-callgrind-runner v0.14.2
  389. 21.93 s [gammaloop-workspace-check] Checking kurbo v0.13.0
  390. 22.01 s [gammaloop-workspace-check] Checking wait-timeout v0.2.1
  391. 22.11 s [gammaloop-workspace-check] Compiling iai-callgrind v0.14.2
  392. 22.16 s [gammaloop-workspace-check] Checking bit-vec v0.8.0
  393. 22.20 s [gammaloop-workspace-check] Checking quick-error v1.2.3
  394. 22.29 s [gammaloop-workspace-check] Checking ron v0.8.1
  395. 22.29 s [gammaloop-workspace-check] Checking rusty-fork v0.3.1
  396. 22.46 s [gammaloop-workspace-check] Checking syn v2.0.117
  397. 22.46 s [gammaloop-workspace-check] Compiling iai-callgrind-macros v0.5.1
  398. 22.53 s [gammaloop-workspace-check] Checking bit-set v0.8.0
  399. 22.73 s [gammaloop-workspace-check] Compiling test-log-macros v0.2.20
  400. 22.86 s [gammaloop-workspace-check] Checking futures-executor v0.3.32
  401. 22.96 s [gammaloop-workspace-check] Checking rand_xorshift v0.4.0
  402. 23.04 s [gammaloop-workspace-check] Checking serial_test v3.4.0
  403. 23.11 s [gammaloop-workspace-check] Checking console v0.15.11
  404. 23.15 s [gammaloop-workspace-check] Checking pathdiff v0.2.3
  405. 23.20 s [gammaloop-workspace-check] Checking unarray v0.1.4
  406. 23.29 s [gammaloop-workspace-check] Checking proptest v1.11.0
  407. 23.67 s [gammaloop-workspace-check] Checking similar-asserts v1.7.0
  408. 23.85 s [gammaloop-workspace-check] Checking clinnet v0.1.8 (/build/source/crates/clinnet)
  409. 24.36 s [gammaloop-workspace-check] Checking kurvst v0.1.0 (/build/source/crates/kurvst)
  410. 26.42 s [gammaloop-workspace-check] Compiling graphica v2.1.0 (https://github.com/alphal00p/symbolica?rev=4d0a833eb8e059d1f95bdae5abed2559830b235f#4d0a833e)
  411. 26.66 s [gammaloop-workspace-check] Checking test-log v0.2.20
  412. 31.88 s [gammaloop-workspace-check] Checking statrs v0.16.1
  413. 32.83 s [gammaloop-workspace-check] Checking gungraun v0.18.2
  414. 33.33 s [gammaloop-workspace-check] Checking momtrop v0.3.0
  415. 36.62 s [gammaloop-workspace-check] Compiling pyo3-macros v0.28.3
  416. 38.74 s [gammaloop-workspace-check] Compiling pyo3-stub-gen-derive v0.17.2
  417. 45.51 s [gammaloop-workspace-check] Checking pyo3-stub-gen v0.17.2
  418. 54.88 s [gammaloop-workspace-check] Checking symbolica-utils v0.1.0 (/build/source/crates/symbolica-utils)
  419. 54.88 s [gammaloop-workspace-check] Checking spenso-macros v0.3.2 (/build/source/crates/spenso-macros)
  420. 241.07 s [gammaloop-workspace-check] Compiling gammaloop-workspace-hack v0.1.0 (/build/source/crates/gammaloop-workspace-hack)
  421. 241.40 s [gammaloop-workspace-check] Checking linnet v0.17.0 (/build/source/crates/linnet)
  422. 244.85 s [gammaloop-workspace-check] Checking spenso v0.6.0 (/build/source/crates/spenso)
  423. 244.92 s [gammaloop-workspace-check] Checking linnet-py v0.1.0 (/build/source/crates/linnet-py)
  424. 244.92 s [gammaloop-workspace-check] Checking linnest v0.1.0 (/build/source/crates/linnest)
  425. 252.73 s [gammaloop-workspace-check] Checking idenso v0.3.0 (/build/source/crates/idenso)
  426. 252.73 s [gammaloop-workspace-check] Checking gammaloop-tracing-filter v0.1.0 (/build/source/crates/gammaloop-tracing-filter)
  427. 254.79 s [gammaloop-workspace-check] Checking spenso-hep-lib v0.1.7 (/build/source/crates/spenso-hep-lib)
  428. 255.02 s [gammaloop-workspace-check] Checking spynso3 v0.1.2 (/build/source/crates/spynso3)
  429. 267.93 s [gammaloop-workspace-check] error[E0283]: type annotations needed
  430. 267.93 s [gammaloop-workspace-check] --> crates/gammalooprs/src/momentum/sample.rs:1165:35
  431. 267.93 s [gammaloop-workspace-check] |
  432. 267.93 s [gammaloop-workspace-check] 1165 | requested.into_iter().collect(),
  433. 267.93 s [gammaloop-workspace-check] | ^^^^^^^ cannot infer type of the type parameter `B` declared on the method `collect`
  434. 267.93 s [gammaloop-workspace-check] |
  435. 267.93 s [gammaloop-workspace-check] = note: the type must implement `FromIterator<linnet::half_edge::involution::EdgeIndex>`
  436. 267.93 s [gammaloop-workspace-check] note: required by a bound in `std::iter::Iterator::collect`
  437. 267.93 s [gammaloop-workspace-check] --> /rustc/2d8144b7880597b6e6d3dfd63a9a9efae3f533d3/library/core/src/iter/traits/iterator.rs:2077:4
  438. 267.93 s [gammaloop-workspace-check] help: consider specifying the generic argument
  439. 267.93 s [gammaloop-workspace-check] |
  440. 267.93 s [gammaloop-workspace-check] 1165 | requested.into_iter().collect::<Vec<_>>(),
  441. 267.93 s [gammaloop-workspace-check] | ++++++++++
  442. 267.93 s [gammaloop-workspace-check]
  443. 267.94 s [gammaloop-workspace-check] error[E0283]: type annotations needed
  444. 267.94 s [gammaloop-workspace-check] --> crates/gammalooprs/src/momentum/sample.rs:1165:35
  445. 267.94 s [gammaloop-workspace-check] |
  446. 267.94 s [gammaloop-workspace-check] 1161 | / assert_eq!(
  447. 267.94 s [gammaloop-workspace-check] 1162 | | subspace
  448. 267.94 s [gammaloop-workspace-check] 1163 | | .iter_basis_edges(&all_lmbs)
  449. 267.94 s [gammaloop-workspace-check] 1164 | | .collect::<std::collections::BTreeSet<_>>(),
  450. 267.94 s [gammaloop-workspace-check] 1165 | | requested.into_iter().collect(),
  451. 267.94 s [gammaloop-workspace-check] | | ^^^^^^^ cannot infer type of the type parameter `B` declared on the method `collect`
  452. 267.94 s [gammaloop-workspace-check] 1166 | | );
  453. 267.94 s [gammaloop-workspace-check] | |_________- type must be known at this point
  454. 267.94 s [gammaloop-workspace-check] |
  455. 267.94 s [gammaloop-workspace-check] = note: multiple `impl`s satisfying `std::collections::BTreeSet<linnet::half_edge::involution::EdgeIndex>: PartialEq<_>` found in the following crates: `alloc`, `rkyv`:
  456. 267.94 s [gammaloop-workspace-check] - impl<K, AK> PartialEq<rkyv::collections::btree_set::ArchivedBTreeSet<AK>> for std::collections::BTreeSet<K>
  457. 267.94 s [gammaloop-workspace-check] where AK: PartialEq<K>;
  458. 267.94 s [gammaloop-workspace-check] - impl<T, A> PartialEq for std::collections::BTreeSet<T, A>
  459. 267.94 s [gammaloop-workspace-check] where T: PartialEq, A: Allocator, A: Clone;
  460. 267.94 s [gammaloop-workspace-check] help: consider specifying the generic argument
  461. 267.94 s [gammaloop-workspace-check] |
  462. 267.94 s [gammaloop-workspace-check] 1165 | requested.into_iter().collect::<Vec<_>>(),
  463. 267.94 s [gammaloop-workspace-check] | ++++++++++
  464. 267.94 s [gammaloop-workspace-check]
  465. 268.67 s [gammaloop-workspace-check] error[E0283]: type annotations needed
  466. 268.67 s [gammaloop-workspace-check] --> crates/gammalooprs/src/momentum/sample.rs:1182:35
  467. 268.67 s [gammaloop-workspace-check] |
  468. 268.67 s [gammaloop-workspace-check] 1178 | / assert_eq!(
  469. 268.67 s [gammaloop-workspace-check] 1179 | | common_subspace
  470. 268.67 s [gammaloop-workspace-check] 1180 | | .iter_basis_edges(&all_lmbs)
  471. 268.67 s [gammaloop-workspace-check] 1181 | | .collect::<std::collections::BTreeSet<_>>(),
  472. 268.67 s [gammaloop-workspace-check] 1182 | | requested.into_iter().collect(),
  473. 268.67 s [gammaloop-workspace-check] | | ^^^^^^^ cannot infer type of the type parameter `B` declared on the method `collect`
  474. 268.67 s [gammaloop-workspace-check] 1183 | | );
  475. 268.67 s [gammaloop-workspace-check] | |_________- type must be known at this point
  476. 268.67 s [gammaloop-workspace-check] |
  477. 268.67 s [gammaloop-workspace-check] = note: multiple `impl`s satisfying `std::collections::BTreeSet<linnet::half_edge::involution::EdgeIndex>: PartialEq<_>` found in the following crates: `alloc`, `rkyv`:
  478. 268.67 s [gammaloop-workspace-check] - impl<K, AK> PartialEq<rkyv::collections::btree_set::ArchivedBTreeSet<AK>> for std::collections::BTreeSet<K>
  479. 268.67 s [gammaloop-workspace-check] where AK: PartialEq<K>;
  480. 268.67 s [gammaloop-workspace-check] - impl<T, A> PartialEq for std::collections::BTreeSet<T, A>
  481. 268.67 s [gammaloop-workspace-check] where T: PartialEq, A: Allocator, A: Clone;
  482. 268.67 s [gammaloop-workspace-check] help: consider specifying the generic argument
  483. 268.67 s [gammaloop-workspace-check] |
  484. 268.67 s [gammaloop-workspace-check] 1182 | requested.into_iter().collect::<Vec<_>>(),
  485. 268.67 s [gammaloop-workspace-check] | ++++++++++
  486. 268.67 s [gammaloop-workspace-check]
  487. 268.69 s [gammaloop-workspace-check] error[E0283]: type annotations needed
  488. 268.69 s [gammaloop-workspace-check] --> crates/gammalooprs/src/momentum/sample.rs:1203:35
  489. 268.69 s [gammaloop-workspace-check] |
  490. 268.69 s [gammaloop-workspace-check] 1199 | / assert_eq!(
  491. 268.69 s [gammaloop-workspace-check] 1200 | | sparse_common_subspace
  492. 268.69 s [gammaloop-workspace-check] 1201 | | .iter_basis_edges(&all_lmbs)
  493. 268.69 s [gammaloop-workspace-check] 1202 | | .collect::<std::collections::BTreeSet<_>>(),
  494. 268.69 s [gammaloop-workspace-check] 1203 | | requested.into_iter().collect(),
  495. 268.69 s [gammaloop-workspace-check] | | ^^^^^^^ cannot infer type of the type parameter `B` declared on the method `collect`
  496. 268.69 s [gammaloop-workspace-check] 1204 | | );
  497. 268.69 s [gammaloop-workspace-check] | |_________- type must be known at this point
  498. 268.69 s [gammaloop-workspace-check] |
  499. 268.69 s [gammaloop-workspace-check] = note: multiple `impl`s satisfying `std::collections::BTreeSet<linnet::half_edge::involution::EdgeIndex>: PartialEq<_>` found in the following crates: `alloc`, `rkyv`:
  500. 268.69 s [gammaloop-workspace-check] - impl<K, AK> PartialEq<rkyv::collections::btree_set::ArchivedBTreeSet<AK>> for std::collections::BTreeSet<K>
  501. 268.69 s [gammaloop-workspace-check] where AK: PartialEq<K>;
  502. 268.69 s [gammaloop-workspace-check] - impl<T, A> PartialEq for std::collections::BTreeSet<T, A>
  503. 268.69 s [gammaloop-workspace-check] where T: PartialEq, A: Allocator, A: Clone;
  504. 268.69 s [gammaloop-workspace-check] help: consider specifying the generic argument
  505. 268.69 s [gammaloop-workspace-check] |
  506. 268.69 s [gammaloop-workspace-check] 1203 | requested.into_iter().collect::<Vec<_>>(),
  507. 268.69 s [gammaloop-workspace-check] | ++++++++++
  508. 268.69 s [gammaloop-workspace-check]
  509. 270.41 s [gammaloop-workspace-check] error[E0283]: type annotations needed
  510. 270.41 s [gammaloop-workspace-check] --> crates/gammalooprs/src/processes/amplitude.rs:3336:49
  511. 270.41 s [gammaloop-workspace-check] |
  512. 270.41 s [gammaloop-workspace-check] 3336 | variant_ids.iter().copied().collect(),
  513. 270.41 s [gammaloop-workspace-check] | ^^^^^^^ cannot infer type of the type parameter `B` declared on the method `collect`
  514. 270.41 s [gammaloop-workspace-check] |
  515. 270.41 s [gammaloop-workspace-check] = note: the type must implement `FromIterator<processes::threshold_counterterms::ThresholdCountertermVariantId>`
  516. 270.41 s [gammaloop-workspace-check] note: required by a bound in `std::iter::Iterator::collect`
  517. 270.41 s [gammaloop-workspace-check] --> /rustc/2d8144b7880597b6e6d3dfd63a9a9efae3f533d3/library/core/src/iter/traits/iterator.rs:2077:4
  518. 270.41 s [gammaloop-workspace-check] help: consider specifying the generic argument
  519. 270.41 s [gammaloop-workspace-check] |
  520. 270.41 s [gammaloop-workspace-check] 3336 | variant_ids.iter().copied().collect::<Vec<_>>(),
  521. 270.41 s [gammaloop-workspace-check] | ++++++++++
  522. 270.41 s [gammaloop-workspace-check]
  523. 270.42 s [gammaloop-workspace-check] error[E0283]: type annotations needed
  524. 270.42 s [gammaloop-workspace-check] --> crates/gammalooprs/src/processes/amplitude.rs:3336:49
  525. 270.42 s [gammaloop-workspace-check] |
  526. 270.42 s [gammaloop-workspace-check] 3334 | / assert_eq!(
  527. 270.42 s [gammaloop-workspace-check] 3335 | | referenced_variants,
  528. 270.42 s [gammaloop-workspace-check] 3336 | | variant_ids.iter().copied().collect(),
  529. 270.42 s [gammaloop-workspace-check] | | ^^^^^^^ cannot infer type of the type parameter `B` declared on the method `collect`
  530. 270.42 s [gammaloop-workspace-check] 3337 | | "overlap groups must retain every semantic duplicate independently",
  531. 270.42 s [gammaloop-workspace-check] 3338 | | );
  532. 270.42 s [gammaloop-workspace-check] | |_________________- type must be known at this point
  533. 270.42 s [gammaloop-workspace-check] |
  534. 270.42 s [gammaloop-workspace-check] = note: multiple `impl`s satisfying `std::collections::BTreeSet<processes::threshold_counterterms::ThresholdCountertermVariantId>: PartialEq<_>` found in the following crates: `alloc`, `rkyv`:
  535. 270.42 s [gammaloop-workspace-check] - impl<K, AK> PartialEq<rkyv::collections::btree_set::ArchivedBTreeSet<AK>> for std::collections::BTreeSet<K>
  536. 270.42 s [gammaloop-workspace-check] where AK: PartialEq<K>;
  537. 270.42 s [gammaloop-workspace-check] - impl<T, A> PartialEq for std::collections::BTreeSet<T, A>
  538. 270.42 s [gammaloop-workspace-check] where T: PartialEq, A: Allocator, A: Clone;
  539. 270.42 s [gammaloop-workspace-check] help: consider specifying the generic argument
  540. 270.42 s [gammaloop-workspace-check] |
  541. 270.42 s [gammaloop-workspace-check] 3336 | variant_ids.iter().copied().collect::<Vec<_>>(),
  542. 270.42 s [gammaloop-workspace-check] | ++++++++++
  543. 270.42 s [gammaloop-workspace-check]
  544. 270.62 s [gammaloop-workspace-check] error[E0283]: type annotations needed
  545. 270.62 s [gammaloop-workspace-check] --> crates/gammalooprs/src/processes/amplitude.rs:4098:59
  546. 270.62 s [gammaloop-workspace-check] |
  547. 270.62 s [gammaloop-workspace-check] 4098 | assert_eq!(orders, [1, 2].into_iter().collect());
  548. 270.62 s [gammaloop-workspace-check] | ^^^^^^^ cannot infer type of the type parameter `B` declared on the method `collect`
  549. 270.62 s [gammaloop-workspace-check] |
  550. 270.62 s [gammaloop-workspace-check] = note: the type must implement `FromIterator<i32>`
  551. 270.62 s [gammaloop-workspace-check] note: required by a bound in `std::iter::Iterator::collect`
  552. 270.62 s [gammaloop-workspace-check] --> /rustc/2d8144b7880597b6e6d3dfd63a9a9efae3f533d3/library/core/src/iter/traits/iterator.rs:2077:4
  553. 270.62 s [gammaloop-workspace-check] help: consider specifying the generic argument
  554. 270.62 s [gammaloop-workspace-check] |
  555. 270.62 s [gammaloop-workspace-check] 4098 | assert_eq!(orders, [1, 2].into_iter().collect::<Vec<_>>());
  556. 270.62 s [gammaloop-workspace-check] | ++++++++++
  557. 270.62 s [gammaloop-workspace-check]
  558. 270.63 s [gammaloop-workspace-check] error[E0283]: type annotations needed
  559. 270.63 s [gammaloop-workspace-check] --> crates/gammalooprs/src/processes/amplitude.rs:4098:59
  560. 270.63 s [gammaloop-workspace-check] |
  561. 270.63 s [gammaloop-workspace-check] 4098 | assert_eq!(orders, [1, 2].into_iter().collect());
  562. 270.63 s [gammaloop-workspace-check] | --------------------------------------^^^^^^^---
  563. 270.63 s [gammaloop-workspace-check] | | |
  564. 270.63 s [gammaloop-workspace-check] | | cannot infer type of the type parameter `B` declared on the method `collect`
  565. 270.63 s [gammaloop-workspace-check] | type must be known at this point
  566. 270.63 s [gammaloop-workspace-check] |
  567. 270.63 s [gammaloop-workspace-check] = note: multiple `impl`s satisfying `std::collections::BTreeSet<usize>: PartialEq<_>` found in the following crates: `alloc`, `rkyv`:
  568. 270.63 s [gammaloop-workspace-check] - impl<K, AK> PartialEq<rkyv::collections::btree_set::ArchivedBTreeSet<AK>> for std::collections::BTreeSet<K>
  569. 270.63 s [gammaloop-workspace-check] where AK: PartialEq<K>;
  570. 270.63 s [gammaloop-workspace-check] - impl<T, A> PartialEq for std::collections::BTreeSet<T, A>
  571. 270.63 s [gammaloop-workspace-check] where T: PartialEq, A: Allocator, A: Clone;
  572. 270.63 s [gammaloop-workspace-check] help: consider specifying the generic argument
  573. 270.63 s [gammaloop-workspace-check] |
  574. 270.63 s [gammaloop-workspace-check] 4098 | assert_eq!(orders, [1, 2].into_iter().collect::<Vec<_>>());
  575. 270.63 s [gammaloop-workspace-check] | ++++++++++
  576. 270.63 s [gammaloop-workspace-check]
  577. 270.65 s [gammaloop-workspace-check] error[E0283]: type annotations needed
  578. 270.65 s [gammaloop-workspace-check] --> crates/gammalooprs/src/processes/amplitude.rs:4129:48
  579. 270.65 s [gammaloop-workspace-check] |
  580. 270.65 s [gammaloop-workspace-check] 4123 | / assert_eq!(
  581. 270.65 s [gammaloop-workspace-check] 4124 | | evaluator
  582. 270.65 s [gammaloop-workspace-check] 4125 | | .evaluator_stacks
  583. 270.65 s [gammaloop-workspace-check] 4126 | | .keys()
  584. 270.65 s [gammaloop-workspace-check] ... |
  585. 270.65 s [gammaloop-workspace-check] 4129 | | [1, 2].into_iter().collect()
  586. 270.65 s [gammaloop-workspace-check] | | ^^^^^^^ cannot infer type of the type parameter `B` declared on the method `collect`
  587. 270.65 s [gammaloop-workspace-check] 4130 | | );
  588. 270.65 s [gammaloop-workspace-check] | |_________________________- type must be known at this point
  589. 270.65 s [gammaloop-workspace-check] |
  590. 270.65 s [gammaloop-workspace-check] = note: multiple `impl`s satisfying `std::collections::BTreeSet<usize>: PartialEq<_>` found in the following crates: `alloc`, `rkyv`:
  591. 270.65 s [gammaloop-workspace-check] - impl<K, AK> PartialEq<rkyv::collections::btree_set::ArchivedBTreeSet<AK>> for std::collections::BTreeSet<K>
  592. 270.65 s [gammaloop-workspace-check] where AK: PartialEq<K>;
  593. 270.65 s [gammaloop-workspace-check] - impl<T, A> PartialEq for std::collections::BTreeSet<T, A>
  594. 270.65 s [gammaloop-workspace-check] where T: PartialEq, A: Allocator, A: Clone;
  595. 270.65 s [gammaloop-workspace-check] help: consider specifying the generic argument
  596. 270.65 s [gammaloop-workspace-check] |
  597. 270.65 s [gammaloop-workspace-check] 4129 | [1, 2].into_iter().collect::<Vec<_>>()
  598. 270.65 s [gammaloop-workspace-check] | ++++++++++
  599. 270.65 s [gammaloop-workspace-check]
  600. 270.74 s [gammaloop-workspace-check] error[E0283]: type annotations needed
  601. 270.74 s [gammaloop-workspace-check] --> crates/gammalooprs/src/processes/amplitude.rs:4160:30
  602. 270.74 s [gammaloop-workspace-check] |
  603. 270.74 s [gammaloop-workspace-check] 4148 | / assert_eq!(
  604. 270.74 s [gammaloop-workspace-check] 4149 | | registry
  605. 270.74 s [gammaloop-workspace-check] 4150 | | .components
  606. 270.74 s [gammaloop-workspace-check] 4151 | | .iter()
  607. 270.74 s [gammaloop-workspace-check] ... |
  608. 270.74 s [gammaloop-workspace-check] 4160 | | .collect()
  609. 270.74 s [gammaloop-workspace-check] | | ^^^^^^^ cannot infer type of the type parameter `B` declared on the method `collect`
  610. 270.74 s [gammaloop-workspace-check] 4161 | | );
  611. 270.74 s [gammaloop-workspace-check] | |_________________________- type must be known at this point
  612. 270.74 s [gammaloop-workspace-check] |
  613. 270.74 s [gammaloop-workspace-check] = note: multiple `impl`s satisfying `std::collections::BTreeSet<processes::threshold_counterterms::ThresholdCountertermComponentKind>: PartialEq<_>` found in the following crates: `alloc`, `rkyv`:
  614. 270.74 s [gammaloop-workspace-check] - impl<K, AK> PartialEq<rkyv::collections::btree_set::ArchivedBTreeSet<AK>> for std::collections::BTreeSet<K>
  615. 270.74 s [gammaloop-workspace-check] where AK: PartialEq<K>;
  616. 270.74 s [gammaloop-workspace-check] - impl<T, A> PartialEq for std::collections::BTreeSet<T, A>
  617. 270.74 s [gammaloop-workspace-check] where T: PartialEq, A: Allocator, A: Clone;
  618. 270.74 s [gammaloop-workspace-check] help: consider specifying the generic argument
  619. 270.74 s [gammaloop-workspace-check] |
  620. 270.74 s [gammaloop-workspace-check] 4160 | .collect::<Vec<_>>()
  621. 270.74 s [gammaloop-workspace-check] | ++++++++++
  622. 270.74 s [gammaloop-workspace-check]
  623. 270.76 s [gammaloop-workspace-check] error[E0283]: type annotations needed
  624. 270.76 s [gammaloop-workspace-check] --> crates/gammalooprs/src/processes/amplitude.rs:4214:26
  625. 270.76 s [gammaloop-workspace-check] |
  626. 270.76 s [gammaloop-workspace-check] 4201 | / assert_eq!(
  627. 270.76 s [gammaloop-workspace-check] 4202 | | decomposition
  628. 270.76 s [gammaloop-workspace-check] 4203 | | .components
  629. 270.76 s [gammaloop-workspace-check] 4204 | | .iter()
  630. 270.76 s [gammaloop-workspace-check] ... |
  631. 270.76 s [gammaloop-workspace-check] 4214 | | .collect()
  632. 270.76 s [gammaloop-workspace-check] | | ^^^^^^^ cannot infer type of the type parameter `B` declared on the method `collect`
  633. 270.76 s [gammaloop-workspace-check] 4215 | | );
  634. 270.76 s [gammaloop-workspace-check] | |_____________________- type must be known at this point
  635. 270.76 s [gammaloop-workspace-check] |
  636. 270.76 s [gammaloop-workspace-check] = note: multiple `impl`s satisfying `std::collections::BTreeSet<processes::threshold_counterterms::ThresholdCountertermComponentKind>: PartialEq<_>` found in the following crates: `alloc`, `rkyv`:
  637. 270.76 s [gammaloop-workspace-check] - impl<K, AK> PartialEq<rkyv::collections::btree_set::ArchivedBTreeSet<AK>> for std::collections::BTreeSet<K>
  638. 270.76 s [gammaloop-workspace-check] where AK: PartialEq<K>;
  639. 270.76 s [gammaloop-workspace-check] - impl<T, A> PartialEq for std::collections::BTreeSet<T, A>
  640. 270.76 s [gammaloop-workspace-check] where T: PartialEq, A: Allocator, A: Clone;
  641. 270.76 s [gammaloop-workspace-check] help: consider specifying the generic argument
  642. 270.76 s [gammaloop-workspace-check] |
  643. 270.76 s [gammaloop-workspace-check] 4214 | .collect::<Vec<_>>()
  644. 270.76 s [gammaloop-workspace-check] | ++++++++++
  645. 270.76 s [gammaloop-workspace-check]
  646. 270.88 s [gammaloop-workspace-check] error[E0277]: can't compare `std::option::Option<&[linnet::half_edge::involution::EdgeIndex]>` with `std::option::Option<&[linnet::half_edge::involution::EdgeIndex; 1]>`
  647. 270.88 s [gammaloop-workspace-check] --> crates/gammalooprs/src/processes/cross_section/ir_safe_threshold_fixture_tests.rs:817:25
  648. 270.88 s [gammaloop-workspace-check] |
  649. 270.88 s [gammaloop-workspace-check] 816 | .any(|variant| variant.requested_subspace.as_deref()
  650. 270.88 s [gammaloop-workspace-check] | -------------------------------------
  651. 270.88 s [gammaloop-workspace-check] 817 | == Some(&[EdgeIndex::from(3)])),
  652. 270.88 s [gammaloop-workspace-check] | ^^ ---------------------------
  653. 270.88 s [gammaloop-workspace-check] | |
  654. 270.88 s [gammaloop-workspace-check] | no implementation for `std::option::Option<&[linnet::half_edge::involution::EdgeIndex]> == std::option::Option<&[linnet::half_edge::involution::EdgeIndex; 1]>`
  655. 270.88 s [gammaloop-workspace-check] |
  656. 270.88 s [gammaloop-workspace-check] = help: the trait `PartialEq<std::option::Option<&[linnet::half_edge::involution::EdgeIndex; 1]>>` is not implemented for `std::option::Option<&[linnet::half_edge::involution::EdgeIndex]>`
  657. 270.88 s [gammaloop-workspace-check] help: the following other types implement trait `PartialEq<Rhs>`
  658. 270.88 s [gammaloop-workspace-check] --> /nix/store/8zq9ya5slh345hbylmsibxw827bi98w0-vendor-cargo-deps/c19b7c6f923b580ac259164a89f2577984ad5ab09ee9d583b888f934adbbe8d0/rkyv-0.7.46/src/impls/alloc/niche.rs:24:1
  659. 270.88 s [gammaloop-workspace-check] |
  660. 270.88 s [gammaloop-workspace-check] 24 | / impl<T, U> PartialEq<ArchivedOptionBox<T>> for Option<Box<U>>
  661. 270.88 s [gammaloop-workspace-check] 25 | | where
  662. 270.88 s [gammaloop-workspace-check] 26 | | T: ArchivePointee + PartialEq<U> + ?Sized,
  663. 270.88 s [gammaloop-workspace-check] 27 | | U: ?Sized,
  664. 270.88 s [gammaloop-workspace-check] | |______________^ `std::option::Option<Box<U>>` implements `PartialEq<rkyv::niche::option_box::ArchivedOptionBox<T>>`
  665. 270.88 s [gammaloop-workspace-check] --> /rustc/2d8144b7880597b6e6d3dfd63a9a9efae3f533d3/library/core/src/option.rs:2434:0
  666. 270.88 s [gammaloop-workspace-check] |
  667. 270.88 s [gammaloop-workspace-check] = note: `std::option::Option<T>` implements `PartialEq`
  668. 270.88 s [gammaloop-workspace-check] |
  669. 270.88 s [gammaloop-workspace-check] ::: /nix/store/8zq9ya5slh345hbylmsibxw827bi98w0-vendor-cargo-deps/c19b7c6f923b580ac259164a89f2577984ad5ab09ee9d583b888f934adbbe8d0/rkyv-0.7.46/src/option.rs:210:1
  670. 270.88 s [gammaloop-workspace-check] |
  671. 270.88 s [gammaloop-workspace-check] 210 | impl<T: PartialEq<U>, U> PartialEq<ArchivedOption<T>> for Option<U> {
  672. 270.88 s [gammaloop-workspace-check] | ^^^^^^^^^^^^^^^^^^^^^^^^^^^^^^^^^^^^^^^^^^^^^^^^^^^^^^^^^^^^^^^^^^^ `std::option::Option<U>` implements `PartialEq<rkyv::option::ArchivedOption<T>>`
  673. 270.88 s [gammaloop-workspace-check]
  674. 271.45 s [gammaloop-workspace-check] error[E0283]: type annotations needed
  675. 271.45 s [gammaloop-workspace-check] --> crates/gammalooprs/src/processes/no_directive_equivalence_tests.rs:459:43
  676. 271.45 s [gammaloop-workspace-check] |
  677. 271.45 s [gammaloop-workspace-check] 459 | (0..graph.cuts.len()).collect(),
  678. 271.45 s [gammaloop-workspace-check] | ^^^^^^^ cannot infer type of the type parameter `B` declared on the method `collect`
  679. 271.45 s [gammaloop-workspace-check] |
  680. 271.45 s [gammaloop-workspace-check] = note: multiple `impl`s satisfying `_: FromIterator<usize>` found in the following crates: `spenso`, `tabled`:
  681. 271.45 s [gammaloop-workspace-check] - impl FromIterator<usize> for ExpandedIndex;
  682. 271.45 s [gammaloop-workspace-check] - impl FromIterator<usize> for HeightList;
  683. 271.45 s [gammaloop-workspace-check] - impl FromIterator<usize> for WidthList;
  684. 271.45 s [gammaloop-workspace-check] note: required by a bound in `std::iter::Iterator::collect`
  685. 271.45 s [gammaloop-workspace-check] --> /rustc/2d8144b7880597b6e6d3dfd63a9a9efae3f533d3/library/core/src/iter/traits/iterator.rs:2077:4
  686. 271.45 s [gammaloop-workspace-check] help: consider specifying the generic argument
  687. 271.45 s [gammaloop-workspace-check] |
  688. 271.45 s [gammaloop-workspace-check] 459 | (0..graph.cuts.len()).collect::<Vec<_>>(),
  689. 271.45 s [gammaloop-workspace-check] | ++++++++++
  690. 271.45 s [gammaloop-workspace-check]
  691. 271.46 s [gammaloop-workspace-check] error[E0283]: type annotations needed
  692. 271.46 s [gammaloop-workspace-check] --> crates/gammalooprs/src/processes/no_directive_equivalence_tests.rs:459:43
  693. 271.46 s [gammaloop-workspace-check] |
  694. 271.46 s [gammaloop-workspace-check] 457 | / assert_eq!(
  695. 271.46 s [gammaloop-workspace-check] 458 | | grouped_cut_ids,
  696. 271.46 s [gammaloop-workspace-check] 459 | | (0..graph.cuts.len()).collect(),
  697. 271.46 s [gammaloop-workspace-check] | | ^^^^^^^ cannot infer type of the type parameter `B` declared on the method `collect`
  698. 271.46 s [gammaloop-workspace-check] 460 | | "every discovered process-valid cut must remain in the numerical LU evaluation",
  699. 271.46 s [gammaloop-workspace-check] 461 | | );
  700. 271.46 s [gammaloop-workspace-check] | |_________________- type must be known at this point
  701. 271.46 s [gammaloop-workspace-check] |
  702. 271.46 s [gammaloop-workspace-check] = note: multiple `impl`s satisfying `std::collections::BTreeSet<usize>: PartialEq<_>` found in the following crates: `alloc`, `rkyv`:
  703. 271.46 s [gammaloop-workspace-check] - impl<K, AK> PartialEq<rkyv::collections::btree_set::ArchivedBTreeSet<AK>> for std::collections::BTreeSet<K>
  704. 271.46 s [gammaloop-workspace-check] where AK: PartialEq<K>;
  705. 271.46 s [gammaloop-workspace-check] - impl<T, A> PartialEq for std::collections::BTreeSet<T, A>
  706. 271.46 s [gammaloop-workspace-check] where T: PartialEq, A: Allocator, A: Clone;
  707. 271.46 s [gammaloop-workspace-check] help: consider specifying the generic argument
  708. 271.46 s [gammaloop-workspace-check] |
  709. 271.46 s [gammaloop-workspace-check] 459 | (0..graph.cuts.len()).collect::<Vec<_>>(),
  710. 271.46 s [gammaloop-workspace-check] | ++++++++++
  711. 271.46 s [gammaloop-workspace-check]
  712. 271.48 s [gammaloop-workspace-check] error[E0283]: type annotations needed
  713. 271.48 s [gammaloop-workspace-check] --> crates/gammalooprs/src/processes/raised_cross_section_tests.rs:150:31
  714. 271.48 s [gammaloop-workspace-check] |
  715. 271.48 s [gammaloop-workspace-check] 150 | (0..graph.cuts.len()).collect(),
  716. 271.48 s [gammaloop-workspace-check] | ^^^^^^^ cannot infer type of the type parameter `B` declared on the method `collect`
  717. 271.48 s [gammaloop-workspace-check] |
  718. 271.48 s [gammaloop-workspace-check] = note: multiple `impl`s satisfying `_: FromIterator<usize>` found in the following crates: `spenso`, `tabled`:
  719. 271.48 s [gammaloop-workspace-check] - impl FromIterator<usize> for ExpandedIndex;
  720. 271.48 s [gammaloop-workspace-check] - impl FromIterator<usize> for HeightList;
  721. 271.48 s [gammaloop-workspace-check] - impl FromIterator<usize> for WidthList;
  722. 271.48 s [gammaloop-workspace-check] note: required by a bound in `std::iter::Iterator::collect`
  723. 271.48 s [gammaloop-workspace-check] --> /rustc/2d8144b7880597b6e6d3dfd63a9a9efae3f533d3/library/core/src/iter/traits/iterator.rs:2077:4
  724. 271.48 s [gammaloop-workspace-check] help: consider specifying the generic argument
  725. 271.48 s [gammaloop-workspace-check] |
  726. 271.48 s [gammaloop-workspace-check] 150 | (0..graph.cuts.len()).collect::<Vec<_>>(),
  727. 271.48 s [gammaloop-workspace-check] | ++++++++++
  728. 271.48 s [gammaloop-workspace-check]
  729. 271.48 s [gammaloop-workspace-check] error[E0283]: type annotations needed
  730. 271.48 s [gammaloop-workspace-check] --> crates/gammalooprs/src/processes/raised_cross_section_tests.rs:150:31
  731. 271.48 s [gammaloop-workspace-check] |
  732. 271.48 s [gammaloop-workspace-check] 148 | / assert_eq!(
  733. 271.48 s [gammaloop-workspace-check] 149 | | grouped_cut_ids,
  734. 271.48 s [gammaloop-workspace-check] 150 | | (0..graph.cuts.len()).collect(),
  735. 271.48 s [gammaloop-workspace-check] | | ^^^^^^^ cannot infer type of the type parameter `B` declared on the method `collect`
  736. 271.48 s [gammaloop-workspace-check] 151 | | "every discovered process-valid cut must remain in the numerical LU evaluation",
  737. 271.48 s [gammaloop-workspace-check] 152 | | );
  738. 271.48 s [gammaloop-workspace-check] | |_____- type must be known at this point
  739. 271.48 s [gammaloop-workspace-check] |
  740. 271.48 s [gammaloop-workspace-check] = note: multiple `impl`s satisfying `std::collections::BTreeSet<usize>: PartialEq<_>` found in the following crates: `alloc`, `rkyv`:
  741. 271.48 s [gammaloop-workspace-check] - impl<K, AK> PartialEq<rkyv::collections::btree_set::ArchivedBTreeSet<AK>> for std::collections::BTreeSet<K>
  742. 271.48 s [gammaloop-workspace-check] where AK: PartialEq<K>;
  743. 271.48 s [gammaloop-workspace-check] - impl<T, A> PartialEq for std::collections::BTreeSet<T, A>
  744. 271.48 s [gammaloop-workspace-check] where T: PartialEq, A: Allocator, A: Clone;
  745. 271.48 s [gammaloop-workspace-check] help: consider specifying the generic argument
  746. 271.48 s [gammaloop-workspace-check] |
  747. 271.48 s [gammaloop-workspace-check] 150 | (0..graph.cuts.len()).collect::<Vec<_>>(),
  748. 271.48 s [gammaloop-workspace-check] | ++++++++++
  749. 271.48 s [gammaloop-workspace-check]
  750. 279.04 s [gammaloop-workspace-check] warning: method `lu_prefactor_helper` is never used
  751. 279.04 s [gammaloop-workspace-check] --> crates/gammalooprs/src/processes/cross_section.rs:1965:8
  752. 279.04 s [gammaloop-workspace-check] |
  753. 279.04 s [gammaloop-workspace-check] 1429 | impl CrossSectionGraph {
  754. 279.04 s [gammaloop-workspace-check] | ---------------------- method in this implementation
  755. 279.04 s [gammaloop-workspace-check] ...
  756. 279.04 s [gammaloop-workspace-check] 1965 | fn lu_prefactor_helper(&self) -> Atom {
  757. 279.04 s [gammaloop-workspace-check] | ^^^^^^^^^^^^^^^^^^^
  758. 279.04 s [gammaloop-workspace-check] |
  759. 279.04 s [gammaloop-workspace-check] = note: `#[warn(dead_code)]` (part of `#[warn(unused)]`) on by default
  760. 279.04 s [gammaloop-workspace-check]
  761. 282.47 s [gammaloop-workspace-check] warning: `gammalooprs` (lib) generated 1 warning
  762. 286.99 s [gammaloop-workspace-check] Some errors have detailed explanations: E0277, E0283.
  763. 286.99 s [gammaloop-workspace-check] For more information about an error, try `rustc --explain E0277`.
  764. 287.13 s [gammaloop-workspace-check] error: could not compile `gammalooprs` (lib test) due to 16 previous errors
  765. 287.13 s [gammaloop-workspace-check] warning: build failed, waiting for other jobs to finish...
  766. 292.37 s Progress: 0 of 1 built (1 failed)
  767. 292.37 s Failed to build gammaloop-workspace-check after 4m51s
  768. 292.44 s Cannot build '/nix/store/bcqc79if6hchn98779cm1bksy0kvkzh2-gammaloop-workspace-check-0.1.0.drv'.
  769. 292.44 s Reason: builder failed with exit code 101.
  770. 292.44 s Output paths:
  771. 292.44 s /nix/store/5icl4qp5m7zfzfy0j18qvwvxghnximcs-gammaloop-workspace-check-0.1.0
  772. 292.44 s Last 762 log lines:
  773. 292.44 s > Running phase: unpackPhase
  774. 292.44 s > unpacking source archive /nix/store/bcy0vqqk2ibk38nik2bb809ck03m92g2-source
  775. 292.44 s > source root is source
  776. 292.44 s > Running phase: patchPhase
  777. 292.44 s > Executing configureCargoCommonVars
  778. 292.44 s > decompressing cargo artifacts from /nix/store/wxpx6lf642pgxp2wz1pw1lxksj5p1wb0-gammaloop-workspace-deps-deps-0.1.0/target.tar.zst to target
  779. 292.44 s > Running phase: updateAutotoolsGnuConfigScriptsPhase
  780. 292.44 s > Running phase: configurePhase
  781. 292.44 s > will append /build/source/.cargo-home/config.toml with contents of /nix/store/8zq9ya5slh345hbylmsibxw827bi98w0-vendor-cargo-deps/config.toml
  782. 292.44 s > default configurePhase, nothing to do
  783. 292.44 s > Running phase: buildPhase
  784. 292.44 s > +++ command cargo --version
  785. 292.44 s > cargo 1.97.0 (c980f4866 2026-06-30)
  786. 292.44 s > +++ command cargo check --profile ci-optim --locked --workspace --features gammaloop-tracing-filter/clap,gammaloop-tracing-filter/symbolica,idenso/bincode,idenso/reference-cases,linnet/bincode,linnet/drawing,linnet/rkyv,linnet/serde,linnet/symbolica,spenso-macros/shadowing,spenso/shadowing,symbolica/tracing_max_level_info,three-dimensional-reps/display,three-dimensional-reps/eval,three-dimensional-reps/serde --all-targets
  787. 292.44 s > Checking cfg-if v1.0.4
  788. 292.44 s > Checking memchr v2.8.0
  789. 292.44 s > Checking once_cell v1.21.4
  790. 292.44 s > Checking either v1.15.0
  791. 292.44 s > Checking serde_core v1.0.228
  792. 292.44 s > Checking libc v0.2.186
  793. 292.44 s > Checking libm v0.2.16
  794. 292.44 s > Checking itoa v1.0.18
  795. 292.44 s > Checking log v0.4.29
  796. 292.44 s > Checking regex-syntax v0.8.10
  797. 292.44 s > Checking zerocopy v0.8.48
  798. 292.44 s > Checking crossbeam-utils v0.8.21
  799. 292.44 s > Checking equivalent v1.0.2
  800. 292.44 s > Checking zmij v1.0.21
  801. 292.44 s > Checking lazy_static v1.5.0
  802. 292.44 s > Checking bytemuck v1.25.0
  803. 292.44 s > Compiling target-lexicon v0.13.5
  804. 292.44 s > Checking arrayvec v0.7.6
  805. 292.44 s > Checking powerfmt v0.2.0
  806. 292.44 s > Checking num_threads v0.1.7
  807. 292.44 s > Checking num-conv v0.2.1
  808. 292.44 s > Checking time-core v0.1.8
  809. 292.44 s > Checking itertools v0.14.0
  810. 292.44 s > Checking safe_arch v0.7.4
  811. 292.44 s > Checking pin-project-lite v0.2.17
  812. 292.44 s > Checking tracing-core v0.1.36
  813. 292.44 s > Checking deranged v0.5.8
  814. 292.44 s > Checking foldhash v0.2.0
  815. 292.44 s > Checking allocator-api2 v0.2.21
  816. 292.44 s > Checking const-random v0.1.18
  817. 292.44 s > Checking nu-ansi-term v0.50.3
  818. 292.44 s > Checking winnow v1.0.2
  819. 292.44 s > Checking unty v0.0.4
  820. 292.44 s > Checking aho-corasick v1.1.4
  821. 292.44 s > Checking static_assertions v1.1.0
  822. 292.44 s > Checking safe_arch v1.0.0
  823. 292.44 s > Checking hashbrown v0.16.1
  824. 292.44 s > Checking sharded-slab v0.1.7
  825. 292.44 s > Checking wide v0.7.33
  826. 292.44 s > Checking crossbeam-epoch v0.9.18
  827. 292.44 s > Checking tracing-log v0.2.0
  828. 292.44 s > Checking tracing v0.1.44
  829. 292.44 s > Checking crossbeam-deque v0.8.6
  830. 292.44 s > Checking thread_local v1.1.9
  831. 292.44 s > Checking toml_writer v1.1.1+spec-1.1.0
  832. 292.44 s > Checking az v1.3.0
  833. 292.44 s > Checking indenter v0.3.4
  834. 292.44 s > Checking rayon-core v1.13.0
  835. 292.44 s > Checking num-traits v0.2.19
  836. 292.44 s > Checking wide v1.3.0
  837. 292.44 s > Compiling phf_shared v0.11.3
  838. 292.44 s > Checking anyhow v1.0.102
  839. 292.44 s > Checking getrandom v0.3.4
  840. 292.44 s > Checking time v0.3.47
  841. 292.44 s > Checking toml_parser v1.1.2+spec-1.1.0
  842. 292.44 s > Checking gmp-mpfr-sys v1.7.1
  843. 292.44 s > Checking utf8parse v0.2.2
  844. 292.44 s > Checking rand_core v0.9.5
  845. 292.44 s > Checking alloc-no-stdlib v2.0.4
  846. 292.44 s > Checking rayon v1.12.0
  847. 292.44 s > Checking dyn-clone v1.0.20
  848. 292.44 s > Checking rawpointer v0.2.1
  849. 292.44 s > Checking matrixmultiply v0.3.10
  850. 292.44 s > Checking alloc-stdlib v0.2.2
  851. 292.44 s > Checking anstyle-parse v1.0.0
  852. 292.44 s > Checking colorchoice v1.0.5
  853. 292.44 s > Checking is_terminal_polyfill v1.70.2
  854. 292.44 s > Checking approx v0.5.1
  855. 292.44 s > Checking num-integer v0.1.46
  856. 292.44 s > Checking anstyle v1.0.14
  857. 292.44 s > Checking anstyle-query v1.1.5
  858. 292.44 s > Checking colored v3.1.1
  859. 292.44 s > Compiling phf_generator v0.11.3
  860. 292.44 s > Checking eyre v0.6.12
  861. 292.44 s > Checking unicode-width v0.2.2
  862. 292.44 s > Checking regex-automata v0.4.14
  863. 292.44 s > Checking bitflags v1.3.2
  864. 292.44 s > Checking brotli-decompressor v5.0.0
  865. 292.44 s > Checking region v3.0.2
  866. 292.44 s > Checking serde v1.0.228
  867. 292.44 s > Checking serde_json v1.0.149
  868. 292.44 s > Checking bitflags v2.11.1
  869. 292.44 s > Checking serde_spanned v1.1.1
  870. 292.44 s > Checking toml_datetime v1.1.1+spec-1.1.0
  871. 292.44 s > Checking anstream v1.0.0
  872. 292.44 s > Compiling phf_codegen v0.11.3
  873. 292.44 s > Compiling pyo3-build-config v0.28.3
  874. 292.44 s > Checking wasmtime-jit-icache-coherence v34.0.2
  875. 292.44 s > Checking hugepage-rs v0.1.1
  876. 292.44 s > Checking inventory v0.3.24
  877. 292.44 s > Checking spec_math v0.1.6
  878. 292.44 s > Checking thiserror v2.0.18
  879. 292.44 s > Compiling getopts v0.2.24
  880. 292.44 s > Checking libloading v0.9.0
  881. 292.44 s > Checking self_cell v1.2.2
  882. 292.44 s > Checking toml v1.1.2+spec-1.1.0
  883. 292.44 s > Checking tinyjson v2.5.1
  884. 292.44 s > Checking bytes v1.11.1
  885. 292.44 s > Checking byteorder v1.5.0
  886. 292.44 s > Checking append-only-vec v0.1.8
  887. 292.44 s > Checking smallvec v1.15.1
  888. 292.44 s > Checking num-complex v0.4.6
  889. 292.44 s > Checking tracing-serde v0.2.0
  890. 292.44 s > Checking bincode v2.0.1
  891. 292.44 s > Checking smartstring v1.0.1
  892. 292.44 s > Compiling unicode_names2_generator v1.3.0
  893. 292.44 s > Checking linux-raw-sys v0.12.1
  894. 292.44 s > Checking brotli v8.0.2
  895. 292.44 s > Compiling unic-common v0.9.0
  896. 292.44 s > Compiling unic-char-range v0.9.0
  897. 292.44 s > Checking simba v0.9.1
  898. 292.44 s > Compiling unic-ucd-version v0.9.0
  899. 292.44 s > Compiling is-macro v0.3.7
  900. 292.44 s > Compiling unic-char-property v0.9.0
  901. 292.44 s > Compiling rustpython-parser-vendored v0.4.0
  902. 292.44 s > Checking iana-time-zone v0.1.65
  903. 292.44 s > Compiling rustpython-parser v0.4.0
  904. 292.44 s > Checking rustix v1.1.4
  905. 292.44 s > Checking chrono v0.4.44
  906. 292.44 s > Compiling phf v0.11.3
  907. 292.44 s > Checking rustc-hash v2.1.2
  908. 292.44 s > Compiling unic-emoji-char v0.9.0
  909. 292.44 s > Compiling unic-ucd-ident v0.9.0
  910. 292.44 s > Checking ndarray v0.17.2
  911. 292.44 s > Compiling lalrpop-util v0.20.2
  912. 292.44 s > Compiling rustc-hash v1.1.0
  913. 292.44 s > Checking rug v1.30.0
  914. 292.44 s > Compiling symbolica v2.2.0 (https://github.com/alphal00p/symbolica?rev=4d0a833eb8e059d1f95bdae5abed2559830b235f#4d0a833e)
  915. 292.44 s > Checking unicode-segmentation v1.13.2
  916. 292.44 s > Checking typenum v1.20.0
  917. 292.44 s > Checking getrandom v0.2.17
  918. 292.44 s > Checking scopeguard v1.2.0
  919. 292.44 s > Checking lock_api v0.4.14
  920. 292.44 s > Checking ppv-lite86 v0.2.21
  921. 292.44 s > Checking ahash v0.8.12
  922. 292.44 s > Checking parking_lot_core v0.9.12
  923. 292.44 s > Checking hashbrown v0.17.0
  924. 292.44 s > Checking unicode-ident v1.0.24
  925. 292.44 s > Checking parking_lot v0.12.5
  926. 292.44 s > Checking errno v0.3.14
  927. 292.44 s > Checking clap_lex v1.1.0
  928. 292.44 s > Checking rand_chacha v0.9.0
  929. 292.44 s > Checking unicase v2.9.0
  930. 292.44 s > Checking generic-array v0.14.7
  931. 292.44 s > Checking matchers v0.2.0
  932. 292.44 s > Checking regex v1.12.3
  933. 292.44 s > Checking strsim v0.11.1
  934. 292.44 s > Checking tracing-subscriber v0.3.23
  935. 292.44 s > Checking signal-hook-registry v1.4.8
  936. 292.44 s > Checking rand v0.9.4
  937. 292.44 s > Checking vte v0.14.1
  938. 292.44 s > Checking indexmap v2.14.0
  939. 292.44 s > Checking terminal_size v0.4.4
  940. 292.44 s > Checking same-file v1.0.6
  941. 292.44 s > Checking signal-hook v0.3.18
  942. 292.44 s > Checking half v2.7.1
  943. 292.44 s > Checking clap_builder v4.6.0
  944. 292.44 s > Checking walkdir v2.5.0
  945. 292.44 s > Checking block-buffer v0.10.4
  946. 292.44 s > Checking crypto-common v0.1.7
  947. 292.44 s > Checking mio v1.2.0
  948. 292.44 s > Checking ciborium-io v0.2.2
  949. 292.44 s > Checking minimal-lexical v0.2.1
  950. 292.44 s > Checking ciborium-ll v0.2.2
  951. 292.44 s > Checking digest v0.10.7
  952. 292.44 s > Checking symjit v2.21.0
  953. 292.44 s > Checking derive_more v2.1.1
  954. 292.44 s > Checking nom v7.1.3
  955. 292.44 s > Checking num-bigint v0.4.6
  956. 292.44 s > Checking signal-hook-mio v0.2.5
  957. 292.44 s > Checking console v0.16.3
  958. 292.44 s > Checking bstr v1.12.1
  959. 292.44 s > Checking linux-raw-sys v0.4.15
  960. 292.44 s > Checking cpufeatures v0.2.17
  961. 292.44 s > Checking winnow v0.7.15
  962. 292.44 s > Checking sha2 v0.10.9
  963. 292.44 s > Checking globset v0.4.18
  964. 292.44 s > Checking ciborium v0.2.2
  965. 292.44 s > Checking rustix v0.38.44
  966. 292.44 s > Checking getrandom v0.4.2
  967. 292.44 s > Checking rand_core v0.6.4
  968. 292.44 s > Checking clap v4.6.1
  969. 292.44 s > Checking plotters-backend v0.3.7
  970. 292.44 s > Checking fastrand v2.4.1
  971. 292.44 s > Checking fnv v1.0.7
  972. 292.44 s > Checking plotters-svg v0.3.7
  973. 292.44 s > Checking rust-embed-utils v8.11.0
  974. 292.44 s > Compiling unicode_names2 v1.3.0
  975. 292.44 s > Checking serde_spanned v0.6.9
  976. 292.44 s > Checking tempfile v3.27.0
  977. 292.44 s > Checking toml_datetime v0.6.11
  978. 292.44 s > Checking itertools v0.10.5
  979. 292.44 s > Checking cast v0.3.0
  980. 292.44 s > Checking toml_write v0.1.2
  981. 292.44 s > Checking tap v1.0.1
  982. 292.44 s > Checking plotters v0.3.7
  983. 292.44 s > Checking crossterm v0.28.1
  984. 292.44 s > Checking rand_chacha v0.3.1
  985. 292.44 s > Checking wyz v0.5.1
  986. 292.44 s > Checking radium v0.7.0
  987. 292.44 s > Checking typeid v1.0.3
  988. 292.44 s > Checking similar v2.7.0
  989. 292.44 s > Checking tinytemplate v1.2.1
  990. 292.44 s > Checking is-terminal v0.4.17
  991. 292.44 s > Checking funty v2.0.0
  992. 292.44 s > Checking anes v0.1.6
  993. 292.44 s > Checking bytecount v0.6.9
  994. 292.44 s > Checking oorandom v11.1.5
  995. 292.44 s > Checking rand v0.8.6
  996. 292.44 s > Checking ron v0.12.1
  997. 292.44 s > Checking toml_edit v0.25.11+spec-1.1.0
  998. 292.44 s > Checking bitvec v1.0.1
  999. 292.44 s > Checking criterion-plot v0.5.0
  1000. 292.44 s > Checking ansitok v0.3.0
  1001. 292.44 s > Checking xprec v0.2.2
  1002. 292.44 s > Checking toml_edit v0.22.27
  1003. 292.44 s > Checking uncased v0.9.10
  1004. 292.44 s > Checking env_filter v1.0.1
  1005. 292.44 s > Checking criterion v0.5.1
  1006. 292.44 s > Checking jiff v0.2.24
  1007. 292.44 s > Checking ptr_meta v0.1.4
  1008. 292.44 s > Checking simdutf8 v0.1.5
  1009. 292.44 s > Checking ucd-trie v0.1.7
  1010. 292.44 s > Checking bytecheck v0.6.12
  1011. 292.44 s > Checking ahash v0.7.8
  1012. 292.44 s > Checking insta v1.47.2
  1013. 292.44 s > Checking approx v0.4.0
  1014. 292.44 s > Checking seahash v4.1.0
  1015. 292.44 s > Checking ansi-str v0.9.0
  1016. 292.44 s > Checking testing_table v0.3.0
  1017. 292.44 s > Checking pest v2.8.6
  1018. 292.44 s > Checking cgmath v0.18.0
  1019. 292.44 s > Checking num-rational v0.4.2
  1020. 292.44 s > Checking hashbrown v0.12.3
  1021. 292.44 s > Checking rend v0.4.2
  1022. 292.44 s > Checking num-iter v0.1.45
  1023. 292.44 s > Checking papergrid v0.17.0
  1024. 292.44 s > Checking ref-ops v0.2.5
  1025. 292.44 s > Checking num v0.4.3
  1026. 292.44 s > Checking rand_xoshiro v0.6.0
  1027. 292.44 s > Checking features v0.10.0
  1028. 292.44 s > Checking constcat v0.5.1
  1029. 292.44 s > Checking gat-lending-iterator v0.1.8
  1030. 292.44 s > Checking colored v2.2.0
  1031. 292.44 s > Checking constant_time_eq v0.4.2
  1032. 292.44 s > Checking arrayref v0.3.9
  1033. 292.44 s > Checking cpufeatures v0.3.0
  1034. 292.44 s > Checking base64 v0.22.1
  1035. 292.44 s > Checking blake3 v1.8.5
  1036. 292.44 s > Checking joinery v2.1.0
  1037. 292.44 s > Checking siphasher v1.0.2
  1038. 292.44 s > Checking titlecase v2.2.1
  1039. 292.44 s > Checking phf_shared v0.13.1
  1040. 292.44 s > Checking subprocess v0.2.15
  1041. 292.44 s > Checking rust_lisp v0.18.0
  1042. 292.44 s > Compiling vakint v0.1.2 (/build/source/crates/vakint)
  1043. 292.44 s > Checking version-compare v0.2.1
  1044. 292.44 s > Checking toml v0.8.23
  1045. 292.44 s > Checking phf v0.13.1
  1046. 292.44 s > Checking xpct v0.5.1
  1047. 292.44 s > Checking dot-parser v0.5.1
  1048. 292.44 s > Compiling pyo3-macros-backend v0.28.3
  1049. 292.44 s > Compiling pyo3-ffi v0.28.3
  1050. 292.44 s > Compiling pyo3 v0.28.3
  1051. 292.44 s > Compiling numpy v0.28.0
  1052. 292.44 s > Checking tabled v0.20.0
  1053. 292.44 s > Checking string-template-plus v0.4.3
  1054. 292.44 s > Checking ryu v1.0.23
  1055. 292.44 s > Checking figment v0.10.19
  1056. 292.44 s > Checking castaway v0.2.4
  1057. 292.44 s > Checking toml_datetime v0.7.5+spec-1.1.0
  1058. 292.44 s > Checking strum v0.27.2
  1059. 292.44 s > Checking compact_str v0.9.0
  1060. 292.44 s > Checking unicode-truncate v2.0.1
  1061. 292.44 s > Checking kasuari v0.4.12
  1062. 292.44 s > Checking lru v0.16.4
  1063. 292.44 s > Checking vte v0.15.0
  1064. 292.44 s > Checking toml v0.9.12+spec-1.1.0
  1065. 292.44 s > Checking portable-atomic v1.13.1
  1066. 292.44 s > Checking vt100 v0.16.2
  1067. 292.44 s > Checking unit-prefix v0.5.2
  1068. 292.44 s > Checking rand_distr v0.4.3
  1069. 292.44 s > Checking simba v0.6.0
  1070. 292.44 s > Checking line-clipping v0.3.7
  1071. 292.44 s > Compiling three-dimensional-reps v0.1.0 (/build/source/crates/three-dimensional-reps)
  1072. 292.44 s > Checking ratatui-core v0.1.0
  1073. 292.44 s > Checking gimli v0.32.3
  1074. 292.44 s > Checking adler2 v2.0.1
  1075. 292.44 s > Checking thiserror v1.0.69
  1076. 292.44 s > Checking miniz_oxide v0.8.9
  1077. 292.44 s > Checking derive_builder v0.11.2
  1078. 292.44 s > Checking crossterm v0.29.0
  1079. 292.44 s > Checking indicatif v0.18.4
  1080. 292.44 s > Checking object v0.37.3
  1081. 292.44 s > Checking owo-colors v4.3.0
  1082. 292.44 s > Checking tracing-error v0.2.1
  1083. 292.44 s > Checking env_logger v0.11.10
  1084. 292.44 s > Checking typed-index-collections v3.5.0
  1085. 292.44 s > Checking rkyv v0.7.46
  1086. 292.44 s > Checking serde-big-array v0.5.1
  1087. 292.44 s > Checking amd v0.2.2
  1088. 292.44 s > Checking itertools v0.11.0
  1089. 292.44 s > Compiling gammaloop-tracing-filter-macros v0.1.0 (/build/source/crates/gammaloop-tracing-filter-macros)
  1090. 292.44 s > Checking rustc-demangle v0.1.27
  1091. 292.44 s > Checking option-ext v0.2.0
  1092. 292.44 s > Checking ratatui-widgets v0.3.0
  1093. 292.44 s > Checking dirs-sys v0.5.0
  1094. 292.44 s > Checking ref-cast v1.0.25
  1095. 292.44 s > Checking nix v0.31.2
  1096. 292.44 s > Checking integer-sqrt v0.1.5
  1097. 292.44 s > Checking brotli-decompressor v4.0.3
  1098. 292.44 s > Checking crossbeam-channel v0.5.15
  1099. 292.44 s > Checking itertools v0.12.1
  1100. 292.44 s > Checking color-spantrace v0.3.0
  1101. 292.44 s > Checking symlink v0.1.0
  1102. 292.44 s > Checking ratatui-crossterm v0.1.0
  1103. 292.44 s > Compiling gammalooprs v0.3.4 (/build/source/crates/gammalooprs)
  1104. 292.44 s > Checking unsafe-libyaml v0.2.11
  1105. 292.44 s > Checking tracing-appender v0.2.5
  1106. 292.44 s > Compiling rustpython-parser-core v0.4.0
  1107. 292.44 s > Checking include_dir v0.7.4
  1108. 292.44 s > Checking ctrlc v3.5.2
  1109. 292.44 s > Checking tracing-indicatif v0.3.14
  1110. 292.44 s > Checking pathfinding v4.15.0
  1111. 292.44 s > Compiling rustpython-ast v0.4.0
  1112. 292.44 s > Checking schemars v1.2.1
  1113. 292.44 s > Checking slotmap v1.1.1
  1114. 292.44 s > Checking dirs v6.0.0
  1115. 292.44 s > Checking json5 v0.4.1
  1116. 292.44 s > Checking ratatui-macros v0.7.0
  1117. 292.44 s > Checking ratatui v0.30.0
  1118. 292.44 s > Checking brotli v7.0.0
  1119. 292.44 s > Checking vectorize v0.2.0
  1120. 292.44 s > Checking base62 v2.2.4
  1121. 292.44 s > Checking ringbuffer v0.16.0
  1122. 292.44 s > Checking clarabel v0.11.1
  1123. 292.44 s > Checking rust-embed v8.11.0
  1124. 292.44 s > Checking clap_complete v4.6.3
  1125. 292.44 s > Checking strip-ansi-escapes v0.2.1
  1126. 292.44 s > Checking fd-lock v4.0.4
  1127. 292.44 s > Compiling gammaloop-api v0.1.0 (/build/source/crates/gammaloop-api)
  1128. 292.44 s > Checking itertools v0.13.0
  1129. 292.44 s > Checking serde_yaml v0.9.34+deprecated
  1130. 292.44 s > Checking strum v0.26.3
  1131. 292.44 s > Checking sysinfo v0.33.1
  1132. 292.44 s > Checking shlex v1.3.0
  1133. 292.44 s > Checking clap_complete_nushell v4.6.0
  1134. 292.44 s > Checking slab v0.4.12
  1135. 292.44 s > Checking futures-task v0.3.32
  1136. 292.44 s > Checking futures-core v0.3.32
  1137. 292.44 s > Checking sdd v3.0.10
  1138. 292.44 s > Compiling gammaloop-integration-tests v0.1.0 (/build/source/tests)
  1139. 292.44 s > Compiling test-log-core v0.2.20
  1140. 292.44 s > Checking futures-util v0.3.32
  1141. 292.44 s > Checking scc v2.4.0
  1142. 292.44 s > Compiling rustc_version v0.4.1
  1143. 292.44 s > Checking which v8.0.2
  1144. 292.44 s > Checking bincode v1.3.3
  1145. 292.44 s > Checking reedline v0.42.0
  1146. 292.44 s > Checking addr2line v0.25.1
  1147. 292.44 s > Compiling numerica v2.2.0 (https://github.com/alphal00p/symbolica?rev=4d0a833eb8e059d1f95bdae5abed2559830b235f#4d0a833e)
  1148. 292.44 s > Checking backtrace v0.3.76
  1149. 292.44 s > Compiling gungraun-runner v0.18.2
  1150. 292.44 s > Compiling gungraun-macros v0.8.0
  1151. 292.44 s > Checking nalgebra v0.29.0
  1152. 292.44 s > Checking color-eyre v0.6.5
  1153. 292.44 s > Checking proc-macro2 v1.0.106
  1154. 292.44 s > Checking quote v1.0.45
  1155. 292.44 s > Checking base64 v0.21.7
  1156. 292.44 s > Checking maplit v1.0.2
  1157. 292.44 s > Compiling iai-callgrind-runner v0.14.2
  1158. 292.44 s > Checking kurbo v0.13.0
  1159. 292.44 s > Checking wait-timeout v0.2.1
  1160. 292.44 s > Compiling iai-callgrind v0.14.2
  1161. 292.44 s > Checking bit-vec v0.8.0
  1162. 292.44 s > Checking quick-error v1.2.3
  1163. 292.44 s > Checking ron v0.8.1
  1164. 292.44 s > Checking rusty-fork v0.3.1
  1165. 292.44 s > Checking syn v2.0.117
  1166. 292.44 s > Compiling iai-callgrind-macros v0.5.1
  1167. 292.44 s > Checking bit-set v0.8.0
  1168. 292.44 s > Compiling test-log-macros v0.2.20
  1169. 292.44 s > Checking futures-executor v0.3.32
  1170. 292.44 s > Checking rand_xorshift v0.4.0
  1171. 292.44 s > Checking serial_test v3.4.0
  1172. 292.44 s > Checking console v0.15.11
  1173. 292.44 s > Checking pathdiff v0.2.3
  1174. 292.44 s > Checking unarray v0.1.4
  1175. 292.44 s > Checking proptest v1.11.0
  1176. 292.44 s > Checking similar-asserts v1.7.0
  1177. 292.44 s > Checking clinnet v0.1.8 (/build/source/crates/clinnet)
  1178. 292.44 s > Checking kurvst v0.1.0 (/build/source/crates/kurvst)
  1179. 292.44 s > Compiling graphica v2.1.0 (https://github.com/alphal00p/symbolica?rev=4d0a833eb8e059d1f95bdae5abed2559830b235f#4d0a833e)
  1180. 292.44 s > Checking test-log v0.2.20
  1181. 292.44 s > Checking statrs v0.16.1
  1182. 292.44 s > Checking gungraun v0.18.2
  1183. 292.44 s > Checking momtrop v0.3.0
  1184. 292.44 s > Compiling pyo3-macros v0.28.3
  1185. 292.44 s > Compiling pyo3-stub-gen-derive v0.17.2
  1186. 292.44 s > Checking pyo3-stub-gen v0.17.2
  1187. 292.44 s > Checking symbolica-utils v0.1.0 (/build/source/crates/symbolica-utils)
  1188. 292.44 s > Checking spenso-macros v0.3.2 (/build/source/crates/spenso-macros)
  1189. 292.44 s > Compiling gammaloop-workspace-hack v0.1.0 (/build/source/crates/gammaloop-workspace-hack)
  1190. 292.44 s > Checking linnet v0.17.0 (/build/source/crates/linnet)
  1191. 292.44 s > Checking spenso v0.6.0 (/build/source/crates/spenso)
  1192. 292.44 s > Checking linnet-py v0.1.0 (/build/source/crates/linnet-py)
  1193. 292.44 s > Checking linnest v0.1.0 (/build/source/crates/linnest)
  1194. 292.44 s > Checking idenso v0.3.0 (/build/source/crates/idenso)
  1195. 292.44 s > Checking gammaloop-tracing-filter v0.1.0 (/build/source/crates/gammaloop-tracing-filter)
  1196. 292.44 s > Checking spenso-hep-lib v0.1.7 (/build/source/crates/spenso-hep-lib)
  1197. 292.44 s > Checking spynso3 v0.1.2 (/build/source/crates/spynso3)
  1198. 292.44 s > error[E0283]: type annotations needed
  1199. 292.44 s > --> crates/gammalooprs/src/momentum/sample.rs:1165:35
  1200. 292.44 s > |
  1201. 292.44 s > 1165 | requested.into_iter().collect(),
  1202. 292.44 s > | ^^^^^^^ cannot infer type of the type parameter `B` declared on the method `collect`
  1203. 292.44 s > |
  1204. 292.44 s > = note: the type must implement `FromIterator<linnet::half_edge::involution::EdgeIndex>`
  1205. 292.44 s > note: required by a bound in `std::iter::Iterator::collect`
  1206. 292.44 s > --> /rustc/2d8144b7880597b6e6d3dfd63a9a9efae3f533d3/library/core/src/iter/traits/iterator.rs:2077:4
  1207. 292.44 s > help: consider specifying the generic argument
  1208. 292.44 s > |
  1209. 292.44 s > 1165 | requested.into_iter().collect::<Vec<_>>(),
  1210. 292.44 s > | ++++++++++
  1211. 292.44 s >
  1212. 292.44 s > error[E0283]: type annotations needed
  1213. 292.44 s > --> crates/gammalooprs/src/momentum/sample.rs:1165:35
  1214. 292.44 s > |
  1215. 292.44 s > 1161 | / assert_eq!(
  1216. 292.44 s > 1162 | | subspace
  1217. 292.44 s > 1163 | | .iter_basis_edges(&all_lmbs)
  1218. 292.44 s > 1164 | | .collect::<std::collections::BTreeSet<_>>(),
  1219. 292.44 s > 1165 | | requested.into_iter().collect(),
  1220. 292.44 s > | | ^^^^^^^ cannot infer type of the type parameter `B` declared on the method `collect`
  1221. 292.44 s > 1166 | | );
  1222. 292.44 s > | |_________- type must be known at this point
  1223. 292.44 s > |
  1224. 292.44 s > = note: multiple `impl`s satisfying `std::collections::BTreeSet<linnet::half_edge::involution::EdgeIndex>: PartialEq<_>` found in the following crates: `alloc`, `rkyv`:
  1225. 292.44 s > - impl<K, AK> PartialEq<rkyv::collections::btree_set::ArchivedBTreeSet<AK>> for std::collections::BTreeSet<K>
  1226. 292.44 s > where AK: PartialEq<K>;
  1227. 292.44 s > - impl<T, A> PartialEq for std::collections::BTreeSet<T, A>
  1228. 292.44 s > where T: PartialEq, A: Allocator, A: Clone;
  1229. 292.44 s > help: consider specifying the generic argument
  1230. 292.44 s > |
  1231. 292.44 s > 1165 | requested.into_iter().collect::<Vec<_>>(),
  1232. 292.44 s > | ++++++++++
  1233. 292.44 s >
  1234. 292.44 s > error[E0283]: type annotations needed
  1235. 292.44 s > --> crates/gammalooprs/src/momentum/sample.rs:1182:35
  1236. 292.44 s > |
  1237. 292.44 s > 1178 | / assert_eq!(
  1238. 292.44 s > 1179 | | common_subspace
  1239. 292.44 s > 1180 | | .iter_basis_edges(&all_lmbs)
  1240. 292.44 s > 1181 | | .collect::<std::collections::BTreeSet<_>>(),
  1241. 292.44 s > 1182 | | requested.into_iter().collect(),
  1242. 292.44 s > | | ^^^^^^^ cannot infer type of the type parameter `B` declared on the method `collect`
  1243. 292.44 s > 1183 | | );
  1244. 292.44 s > | |_________- type must be known at this point
  1245. 292.44 s > |
  1246. 292.44 s > = note: multiple `impl`s satisfying `std::collections::BTreeSet<linnet::half_edge::involution::EdgeIndex>: PartialEq<_>` found in the following crates: `alloc`, `rkyv`:
  1247. 292.44 s > - impl<K, AK> PartialEq<rkyv::collections::btree_set::ArchivedBTreeSet<AK>> for std::collections::BTreeSet<K>
  1248. 292.44 s > where AK: PartialEq<K>;
  1249. 292.44 s > - impl<T, A> PartialEq for std::collections::BTreeSet<T, A>
  1250. 292.44 s > where T: PartialEq, A: Allocator, A: Clone;
  1251. 292.44 s > help: consider specifying the generic argument
  1252. 292.44 s > |
  1253. 292.44 s > 1182 | requested.into_iter().collect::<Vec<_>>(),
  1254. 292.44 s > | ++++++++++
  1255. 292.44 s >
  1256. 292.44 s > error[E0283]: type annotations needed
  1257. 292.44 s > --> crates/gammalooprs/src/momentum/sample.rs:1203:35
  1258. 292.44 s > |
  1259. 292.44 s > 1199 | / assert_eq!(
  1260. 292.44 s > 1200 | | sparse_common_subspace
  1261. 292.44 s > 1201 | | .iter_basis_edges(&all_lmbs)
  1262. 292.44 s > 1202 | | .collect::<std::collections::BTreeSet<_>>(),
  1263. 292.44 s > 1203 | | requested.into_iter().collect(),
  1264. 292.44 s > | | ^^^^^^^ cannot infer type of the type parameter `B` declared on the method `collect`
  1265. 292.44 s > 1204 | | );
  1266. 292.44 s > | |_________- type must be known at this point
  1267. 292.44 s > |
  1268. 292.44 s > = note: multiple `impl`s satisfying `std::collections::BTreeSet<linnet::half_edge::involution::EdgeIndex>: PartialEq<_>` found in the following crates: `alloc`, `rkyv`:
  1269. 292.44 s > - impl<K, AK> PartialEq<rkyv::collections::btree_set::ArchivedBTreeSet<AK>> for std::collections::BTreeSet<K>
  1270. 292.44 s > where AK: PartialEq<K>;
  1271. 292.44 s > - impl<T, A> PartialEq for std::collections::BTreeSet<T, A>
  1272. 292.44 s > where T: PartialEq, A: Allocator, A: Clone;
  1273. 292.44 s > help: consider specifying the generic argument
  1274. 292.44 s > |
  1275. 292.44 s > 1203 | requested.into_iter().collect::<Vec<_>>(),
  1276. 292.44 s > | ++++++++++
  1277. 292.44 s >
  1278. 292.44 s > error[E0283]: type annotations needed
  1279. 292.44 s > --> crates/gammalooprs/src/processes/amplitude.rs:3336:49
  1280. 292.44 s > |
  1281. 292.44 s > 3336 | variant_ids.iter().copied().collect(),
  1282. 292.44 s > | ^^^^^^^ cannot infer type of the type parameter `B` declared on the method `collect`
  1283. 292.44 s > |
  1284. 292.44 s > = note: the type must implement `FromIterator<processes::threshold_counterterms::ThresholdCountertermVariantId>`
  1285. 292.44 s > note: required by a bound in `std::iter::Iterator::collect`
  1286. 292.44 s > --> /rustc/2d8144b7880597b6e6d3dfd63a9a9efae3f533d3/library/core/src/iter/traits/iterator.rs:2077:4
  1287. 292.44 s > help: consider specifying the generic argument
  1288. 292.44 s > |
  1289. 292.44 s > 3336 | variant_ids.iter().copied().collect::<Vec<_>>(),
  1290. 292.44 s > | ++++++++++
  1291. 292.44 s >
  1292. 292.44 s > error[E0283]: type annotations needed
  1293. 292.44 s > --> crates/gammalooprs/src/processes/amplitude.rs:3336:49
  1294. 292.44 s > |
  1295. 292.44 s > 3334 | / assert_eq!(
  1296. 292.44 s > 3335 | | referenced_variants,
  1297. 292.44 s > 3336 | | variant_ids.iter().copied().collect(),
  1298. 292.44 s > | | ^^^^^^^ cannot infer type of the type parameter `B` declared on the method `collect`
  1299. 292.44 s > 3337 | | "overlap groups must retain every semantic duplicate independently",
  1300. 292.44 s > 3338 | | );
  1301. 292.44 s > | |_________________- type must be known at this point
  1302. 292.44 s > |
  1303. 292.44 s > = note: multiple `impl`s satisfying `std::collections::BTreeSet<processes::threshold_counterterms::ThresholdCountertermVariantId>: PartialEq<_>` found in the following crates: `alloc`, `rkyv`:
  1304. 292.44 s > - impl<K, AK> PartialEq<rkyv::collections::btree_set::ArchivedBTreeSet<AK>> for std::collections::BTreeSet<K>
  1305. 292.44 s > where AK: PartialEq<K>;
  1306. 292.44 s > - impl<T, A> PartialEq for std::collections::BTreeSet<T, A>
  1307. 292.44 s > where T: PartialEq, A: Allocator, A: Clone;
  1308. 292.44 s > help: consider specifying the generic argument
  1309. 292.44 s > |
  1310. 292.44 s > 3336 | variant_ids.iter().copied().collect::<Vec<_>>(),
  1311. 292.44 s > | ++++++++++
  1312. 292.44 s >
  1313. 292.44 s > error[E0283]: type annotations needed
  1314. 292.44 s > --> crates/gammalooprs/src/processes/amplitude.rs:4098:59
  1315. 292.44 s > |
  1316. 292.44 s > 4098 | assert_eq!(orders, [1, 2].into_iter().collect());
  1317. 292.44 s > | ^^^^^^^ cannot infer type of the type parameter `B` declared on the method `collect`
  1318. 292.44 s > |
  1319. 292.44 s > = note: the type must implement `FromIterator<i32>`
  1320. 292.44 s > note: required by a bound in `std::iter::Iterator::collect`
  1321. 292.44 s > --> /rustc/2d8144b7880597b6e6d3dfd63a9a9efae3f533d3/library/core/src/iter/traits/iterator.rs:2077:4
  1322. 292.44 s > help: consider specifying the generic argument
  1323. 292.44 s > |
  1324. 292.44 s > 4098 | assert_eq!(orders, [1, 2].into_iter().collect::<Vec<_>>());
  1325. 292.44 s > | ++++++++++
  1326. 292.44 s >
  1327. 292.44 s > error[E0283]: type annotations needed
  1328. 292.44 s > --> crates/gammalooprs/src/processes/amplitude.rs:4098:59
  1329. 292.44 s > |
  1330. 292.44 s > 4098 | assert_eq!(orders, [1, 2].into_iter().collect());
  1331. 292.44 s > | --------------------------------------^^^^^^^---
  1332. 292.44 s > | | |
  1333. 292.44 s > | | cannot infer type of the type parameter `B` declared on the method `collect`
  1334. 292.44 s > | type must be known at this point
  1335. 292.44 s > |
  1336. 292.44 s > = note: multiple `impl`s satisfying `std::collections::BTreeSet<usize>: PartialEq<_>` found in the following crates: `alloc`, `rkyv`:
  1337. 292.44 s > - impl<K, AK> PartialEq<rkyv::collections::btree_set::ArchivedBTreeSet<AK>> for std::collections::BTreeSet<K>
  1338. 292.44 s > where AK: PartialEq<K>;
  1339. 292.44 s > - impl<T, A> PartialEq for std::collections::BTreeSet<T, A>
  1340. 292.44 s > where T: PartialEq, A: Allocator, A: Clone;
  1341. 292.44 s > help: consider specifying the generic argument
  1342. 292.44 s > |
  1343. 292.44 s > 4098 | assert_eq!(orders, [1, 2].into_iter().collect::<Vec<_>>());
  1344. 292.44 s > | ++++++++++
  1345. 292.44 s >
  1346. 292.44 s > error[E0283]: type annotations needed
  1347. 292.44 s > --> crates/gammalooprs/src/processes/amplitude.rs:4129:48
  1348. 292.44 s > |
  1349. 292.44 s > 4123 | / assert_eq!(
  1350. 292.44 s > 4124 | | evaluator
  1351. 292.44 s > 4125 | | .evaluator_stacks
  1352. 292.44 s > 4126 | | .keys()
  1353. 292.44 s > ... |
  1354. 292.44 s > 4129 | | [1, 2].into_iter().collect()
  1355. 292.44 s > | | ^^^^^^^ cannot infer type of the type parameter `B` declared on the method `collect`
  1356. 292.44 s > 4130 | | );
  1357. 292.44 s > | |_________________________- type must be known at this point
  1358. 292.44 s > |
  1359. 292.44 s > = note: multiple `impl`s satisfying `std::collections::BTreeSet<usize>: PartialEq<_>` found in the following crates: `alloc`, `rkyv`:
  1360. 292.44 s > - impl<K, AK> PartialEq<rkyv::collections::btree_set::ArchivedBTreeSet<AK>> for std::collections::BTreeSet<K>
  1361. 292.44 s > where AK: PartialEq<K>;
  1362. 292.44 s > - impl<T, A> PartialEq for std::collections::BTreeSet<T, A>
  1363. 292.44 s > where T: PartialEq, A: Allocator, A: Clone;
  1364. 292.44 s > help: consider specifying the generic argument
  1365. 292.44 s > |
  1366. 292.44 s > 4129 | [1, 2].into_iter().collect::<Vec<_>>()
  1367. 292.44 s > | ++++++++++
  1368. 292.44 s >
  1369. 292.44 s > error[E0283]: type annotations needed
  1370. 292.44 s > --> crates/gammalooprs/src/processes/amplitude.rs:4160:30
  1371. 292.44 s > |
  1372. 292.44 s > 4148 | / assert_eq!(
  1373. 292.44 s > 4149 | | registry
  1374. 292.44 s > 4150 | | .components
  1375. 292.44 s > 4151 | | .iter()
  1376. 292.44 s > ... |
  1377. 292.44 s > 4160 | | .collect()
  1378. 292.44 s > | | ^^^^^^^ cannot infer type of the type parameter `B` declared on the method `collect`
  1379. 292.44 s > 4161 | | );
  1380. 292.44 s > | |_________________________- type must be known at this point
  1381. 292.44 s > |
  1382. 292.44 s > = note: multiple `impl`s satisfying `std::collections::BTreeSet<processes::threshold_counterterms::ThresholdCountertermComponentKind>: PartialEq<_>` found in the following crates: `alloc`, `rkyv`:
  1383. 292.44 s > - impl<K, AK> PartialEq<rkyv::collections::btree_set::ArchivedBTreeSet<AK>> for std::collections::BTreeSet<K>
  1384. 292.44 s > where AK: PartialEq<K>;
  1385. 292.44 s > - impl<T, A> PartialEq for std::collections::BTreeSet<T, A>
  1386. 292.44 s > where T: PartialEq, A: Allocator, A: Clone;
  1387. 292.44 s > help: consider specifying the generic argument
  1388. 292.44 s > |
  1389. 292.44 s > 4160 | .collect::<Vec<_>>()
  1390. 292.44 s > | ++++++++++
  1391. 292.44 s >
  1392. 292.44 s > error[E0283]: type annotations needed
  1393. 292.44 s > --> crates/gammalooprs/src/processes/amplitude.rs:4214:26
  1394. 292.44 s > |
  1395. 292.44 s > 4201 | / assert_eq!(
  1396. 292.44 s > 4202 | | decomposition
  1397. 292.44 s > 4203 | | .components
  1398. 292.44 s > 4204 | | .iter()
  1399. 292.44 s > ... |
  1400. 292.44 s > 4214 | | .collect()
  1401. 292.44 s > | | ^^^^^^^ cannot infer type of the type parameter `B` declared on the method `collect`
  1402. 292.44 s > 4215 | | );
  1403. 292.44 s > | |_____________________- type must be known at this point
  1404. 292.44 s > |
  1405. 292.44 s > = note: multiple `impl`s satisfying `std::collections::BTreeSet<processes::threshold_counterterms::ThresholdCountertermComponentKind>: PartialEq<_>` found in the following crates: `alloc`, `rkyv`:
  1406. 292.44 s > - impl<K, AK> PartialEq<rkyv::collections::btree_set::ArchivedBTreeSet<AK>> for std::collections::BTreeSet<K>
  1407. 292.44 s > where AK: PartialEq<K>;
  1408. 292.44 s > - impl<T, A> PartialEq for std::collections::BTreeSet<T, A>
  1409. 292.44 s > where T: PartialEq, A: Allocator, A: Clone;
  1410. 292.44 s > help: consider specifying the generic argument
  1411. 292.44 s > |
  1412. 292.44 s > 4214 | .collect::<Vec<_>>()
  1413. 292.44 s > | ++++++++++
  1414. 292.44 s >
  1415. 292.44 s > error[E0277]: can't compare `std::option::Option<&[linnet::half_edge::involution::EdgeIndex]>` with `std::option::Option<&[linnet::half_edge::involution::EdgeIndex; 1]>`
  1416. 292.44 s > --> crates/gammalooprs/src/processes/cross_section/ir_safe_threshold_fixture_tests.rs:817:25
  1417. 292.44 s > |
  1418. 292.44 s > 816 | .any(|variant| variant.requested_subspace.as_deref()
  1419. 292.44 s > | -------------------------------------
  1420. 292.44 s > 817 | == Some(&[EdgeIndex::from(3)])),
  1421. 292.44 s > | ^^ ---------------------------
  1422. 292.44 s > | |
  1423. 292.44 s > | no implementation for `std::option::Option<&[linnet::half_edge::involution::EdgeIndex]> == std::option::Option<&[linnet::half_edge::involution::EdgeIndex; 1]>`
  1424. 292.44 s > |
  1425. 292.44 s > = help: the trait `PartialEq<std::option::Option<&[linnet::half_edge::involution::EdgeIndex; 1]>>` is not implemented for `std::option::Option<&[linnet::half_edge::involution::EdgeIndex]>`
  1426. 292.44 s > help: the following other types implement trait `PartialEq<Rhs>`
  1427. 292.44 s > --> /nix/store/8zq9ya5slh345hbylmsibxw827bi98w0-vendor-cargo-deps/c19b7c6f923b580ac259164a89f2577984ad5ab09ee9d583b888f934adbbe8d0/rkyv-0.7.46/src/impls/alloc/niche.rs:24:1
  1428. 292.44 s > |
  1429. 292.44 s > 24 | / impl<T, U> PartialEq<ArchivedOptionBox<T>> for Option<Box<U>>
  1430. 292.44 s > 25 | | where
  1431. 292.44 s > 26 | | T: ArchivePointee + PartialEq<U> + ?Sized,
  1432. 292.44 s > 27 | | U: ?Sized,
  1433. 292.44 s > | |______________^ `std::option::Option<Box<U>>` implements `PartialEq<rkyv::niche::option_box::ArchivedOptionBox<T>>`
  1434. 292.44 s > --> /rustc/2d8144b7880597b6e6d3dfd63a9a9efae3f533d3/library/core/src/option.rs:2434:0
  1435. 292.44 s > |
  1436. 292.44 s > = note: `std::option::Option<T>` implements `PartialEq`
  1437. 292.44 s > |
  1438. 292.44 s > ::: /nix/store/8zq9ya5slh345hbylmsibxw827bi98w0-vendor-cargo-deps/c19b7c6f923b580ac259164a89f2577984ad5ab09ee9d583b888f934adbbe8d0/rkyv-0.7.46/src/option.rs:210:1
  1439. 292.44 s > |
  1440. 292.44 s > 210 | impl<T: PartialEq<U>, U> PartialEq<ArchivedOption<T>> for Option<U> {
  1441. 292.44 s > | ^^^^^^^^^^^^^^^^^^^^^^^^^^^^^^^^^^^^^^^^^^^^^^^^^^^^^^^^^^^^^^^^^^^ `std::option::Option<U>` implements `PartialEq<rkyv::option::ArchivedOption<T>>`
  1442. 292.44 s >
  1443. 292.44 s > error[E0283]: type annotations needed
  1444. 292.44 s > --> crates/gammalooprs/src/processes/no_directive_equivalence_tests.rs:459:43
  1445. 292.44 s > |
  1446. 292.44 s > 459 | (0..graph.cuts.len()).collect(),
  1447. 292.44 s > | ^^^^^^^ cannot infer type of the type parameter `B` declared on the method `collect`
  1448. 292.44 s > |
  1449. 292.44 s > = note: multiple `impl`s satisfying `_: FromIterator<usize>` found in the following crates: `spenso`, `tabled`:
  1450. 292.44 s > - impl FromIterator<usize> for ExpandedIndex;
  1451. 292.44 s > - impl FromIterator<usize> for HeightList;
  1452. 292.44 s > - impl FromIterator<usize> for WidthList;
  1453. 292.44 s > note: required by a bound in `std::iter::Iterator::collect`
  1454. 292.44 s > --> /rustc/2d8144b7880597b6e6d3dfd63a9a9efae3f533d3/library/core/src/iter/traits/iterator.rs:2077:4
  1455. 292.44 s > help: consider specifying the generic argument
  1456. 292.44 s > |
  1457. 292.44 s > 459 | (0..graph.cuts.len()).collect::<Vec<_>>(),
  1458. 292.44 s > | ++++++++++
  1459. 292.44 s >
  1460. 292.44 s > error[E0283]: type annotations needed
  1461. 292.44 s > --> crates/gammalooprs/src/processes/no_directive_equivalence_tests.rs:459:43
  1462. 292.44 s > |
  1463. 292.44 s > 457 | / assert_eq!(
  1464. 292.44 s > 458 | | grouped_cut_ids,
  1465. 292.44 s > 459 | | (0..graph.cuts.len()).collect(),
  1466. 292.44 s > | | ^^^^^^^ cannot infer type of the type parameter `B` declared on the method `collect`
  1467. 292.44 s > 460 | | "every discovered process-valid cut must remain in the numerical LU evaluation",
  1468. 292.44 s > 461 | | );
  1469. 292.44 s > | |_________________- type must be known at this point
  1470. 292.44 s > |
  1471. 292.44 s > = note: multiple `impl`s satisfying `std::collections::BTreeSet<usize>: PartialEq<_>` found in the following crates: `alloc`, `rkyv`:
  1472. 292.44 s > - impl<K, AK> PartialEq<rkyv::collections::btree_set::ArchivedBTreeSet<AK>> for std::collections::BTreeSet<K>
  1473. 292.44 s > where AK: PartialEq<K>;
  1474. 292.44 s > - impl<T, A> PartialEq for std::collections::BTreeSet<T, A>
  1475. 292.44 s > where T: PartialEq, A: Allocator, A: Clone;
  1476. 292.44 s > help: consider specifying the generic argument
  1477. 292.44 s > |
  1478. 292.44 s > 459 | (0..graph.cuts.len()).collect::<Vec<_>>(),
  1479. 292.44 s > | ++++++++++
  1480. 292.44 s >
  1481. 292.44 s > error[E0283]: type annotations needed
  1482. 292.44 s > --> crates/gammalooprs/src/processes/raised_cross_section_tests.rs:150:31
  1483. 292.44 s > |
  1484. 292.44 s > 150 | (0..graph.cuts.len()).collect(),
  1485. 292.44 s > | ^^^^^^^ cannot infer type of the type parameter `B` declared on the method `collect`
  1486. 292.44 s > |
  1487. 292.44 s > = note: multiple `impl`s satisfying `_: FromIterator<usize>` found in the following crates: `spenso`, `tabled`:
  1488. 292.44 s > - impl FromIterator<usize> for ExpandedIndex;
  1489. 292.44 s > - impl FromIterator<usize> for HeightList;
  1490. 292.44 s > - impl FromIterator<usize> for WidthList;
  1491. 292.44 s > note: required by a bound in `std::iter::Iterator::collect`
  1492. 292.44 s > --> /rustc/2d8144b7880597b6e6d3dfd63a9a9efae3f533d3/library/core/src/iter/traits/iterator.rs:2077:4
  1493. 292.44 s > help: consider specifying the generic argument
  1494. 292.44 s > |
  1495. 292.44 s > 150 | (0..graph.cuts.len()).collect::<Vec<_>>(),
  1496. 292.44 s > | ++++++++++
  1497. 292.44 s >
  1498. 292.44 s > error[E0283]: type annotations needed
  1499. 292.44 s > --> crates/gammalooprs/src/processes/raised_cross_section_tests.rs:150:31
  1500. 292.44 s > |
  1501. 292.44 s > 148 | / assert_eq!(
  1502. 292.44 s > 149 | | grouped_cut_ids,
  1503. 292.44 s > 150 | | (0..graph.cuts.len()).collect(),
  1504. 292.44 s > | | ^^^^^^^ cannot infer type of the type parameter `B` declared on the method `collect`
  1505. 292.44 s > 151 | | "every discovered process-valid cut must remain in the numerical LU evaluation",
  1506. 292.44 s > 152 | | );
  1507. 292.44 s > | |_____- type must be known at this point
  1508. 292.44 s > |
  1509. 292.44 s > = note: multiple `impl`s satisfying `std::collections::BTreeSet<usize>: PartialEq<_>` found in the following crates: `alloc`, `rkyv`:
  1510. 292.44 s > - impl<K, AK> PartialEq<rkyv::collections::btree_set::ArchivedBTreeSet<AK>> for std::collections::BTreeSet<K>
  1511. 292.44 s > where AK: PartialEq<K>;
  1512. 292.44 s > - impl<T, A> PartialEq for std::collections::BTreeSet<T, A>
  1513. 292.44 s > where T: PartialEq, A: Allocator, A: Clone;
  1514. 292.44 s > help: consider specifying the generic argument
  1515. 292.44 s > |
  1516. 292.44 s > 150 | (0..graph.cuts.len()).collect::<Vec<_>>(),
  1517. 292.44 s > | ++++++++++
  1518. 292.44 s >
  1519. 292.44 s > warning: method `lu_prefactor_helper` is never used
  1520. 292.44 s > --> crates/gammalooprs/src/processes/cross_section.rs:1965:8
  1521. 292.44 s > |
  1522. 292.44 s > 1429 | impl CrossSectionGraph {
  1523. 292.44 s > | ---------------------- method in this implementation
  1524. 292.44 s > ...
  1525. 292.44 s > 1965 | fn lu_prefactor_helper(&self) -> Atom {
  1526. 292.44 s > | ^^^^^^^^^^^^^^^^^^^
  1527. 292.44 s > |
  1528. 292.44 s > = note: `#[warn(dead_code)]` (part of `#[warn(unused)]`) on by default
  1529. 292.44 s >
  1530. 292.44 s > warning: `gammalooprs` (lib) generated 1 warning
  1531. 292.44 s > Some errors have detailed explanations: E0277, E0283.
  1532. 292.44 s > For more information about an error, try `rustc --explain E0277`.
  1533. 292.44 s > error: could not compile `gammalooprs` (lib test) due to 16 previous errors
  1534. 292.44 s > warning: build failed, waiting for other jobs to finish...
  1535. 292.44 s For full logs, run:
  1536. 292.44 s nix log /nix/store/bcqc79if6hchn98779cm1bksy0kvkzh2-gammaloop-workspace-check-0.1.0.drv
  1537. 292.51 s Build failed.