test packages.x86_64-linux.nix-ci-check-gammaloop-nextest-docs

Reproduce this run
Retry Run
  1. 0.00 s $ /nix/store/61685rbaxmpigwi3z23i33sv3jyfl70q-coreutils-9.11/bin/timeout --kill-after=15s 7200s /nix/store/wknkybkzrc16r11vk5vrykh4wmw7a353-nix-2.34.8/bin/nix --extra-experimental-features nix-command --extra-experimental-features flakes flake clone git+https://github.com/alphal00p/gammaloop --dest /tmp/nix-ci-worker/stable-pwd/repo/
  2. 0.13 s Cloning into '/tmp/nix-ci-worker/stable-pwd/repo'...
  3. 0.85 s remote: Enumerating objects: 110731, done.
  4. 0.98 s remote: Counting objects: 0% (1/14562) remote: Counting objects: 1% (146/14562) remote: Counting objects: 2% (292/14562) remote: Counting objects: 3% (437/14562) remote: Counting objects: 4% (583/14562) remote: Counting objects: 5% (729/14562) remote: Counting objects: 6% (874/14562) remote: Counting objects: 7% (1020/14562) remote: Counting objects: 8% (1165/14562) remote: Counting objects: 9% (1311/14562) remote: Counting objects: 10% (1457/14562) remote: Counting objects: 11% (1602/14562) remote: Counting objects: 12% (1748/14562) remote: Counting objects: 13% (1894/14562) remote: Counting objects: 14% (2039/14562) remote: Counting objects: 15% (2185/14562) remote: Counting objects: 16% (2330/14562) remote: Counting objects: 17% (2476/14562) remote: Counting objects: 18% (2622/14562) remote: Counting objects: 19% (2767/14562) remote: Counting objects: 20% (2913/14562) remote: Counting objects: 21% (3059/14562) remote: Counting objects: 22% (3204/14562) remote: Counting objects: 23% (3350/14562) remote: Counting objects: 24% (3495/14562) remote: Counting objects: 25% (3641/14562) remote: Counting objects: 26% (3787/14562) remote: Counting objects: 27% (3932/14562) remote: Counting objects: 28% (4078/14562) remote: Counting objects: 29% (4223/14562) remote: Counting objects: 30% (4369/14562) remote: Counting objects: 31% (4515/14562) remote: Counting objects: 32% (4660/14562) remote: Counting objects: 33% (4806/14562) remote: Counting objects: 34% (4952/14562) remote: Counting objects: 35% (5097/14562) remote: Counting objects: 36% (5243/14562) remote: Counting objects: 37% (5388/14562) remote: Counting objects: 38% (5534/14562) remote: Counting objects: 39% (5680/14562) remote: Counting objects: 40% (5825/14562) remote: Counting objects: 41% (5971/14562) remote: Counting objects: 42% (6117/14562) remote: Counting objects: 43% (6262/14562) remote: Counting objects: 44% (6408/14562) remote: Counting objects: 45% (6553/14562) remote: Counting objects: 46% (6699/14562) remote: Counting objects: 47% (6845/14562) remote: Counting objects: 48% (6990/14562) remote: Counting objects: 49% (7136/14562) remote: Counting objects: 50% (7281/14562) remote: Counting objects: 51% (7427/14562) remote: Counting objects: 52% (7573/14562) remote: Counting objects: 53% (7718/14562) remote: Counting objects: 54% (7864/14562) remote: Counting objects: 55% (8010/14562) remote: Counting objects: 56% (8155/14562) remote: Counting objects: 57% (8301/14562) remote: Counting objects: 58% (8446/14562) remote: Counting objects: 59% (8592/14562) remote: Counting objects: 60% (8738/14562) remote: Counting objects: 61% (8883/14562) remote: Counting objects: 62% (9029/14562) remote: Counting objects: 63% (9175/14562) remote: Counting objects: 64% (9320/14562) remote: Counting objects: 65% (9466/14562) remote: Counting objects: 66% (9611/14562) remote: Counting objects: 67% (9757/14562) remote: Counting objects: 68% (9903/14562) remote: Counting objects: 69% (10048/14562) remote: Counting objects: 70% (10194/14562) remote: Counting objects: 71% (10340/14562) remote: Counting objects: 72% (10485/14562) remote: Counting objects: 73% (10631/14562) remote: Counting objects: 74% (10776/14562) remote: Counting objects: 75% (10922/14562) remote: Counting objects: 76% (11068/14562) remote: Counting objects: 77% (11213/14562) remote: Counting objects: 78% (11359/14562) remote: Counting objects: 79% (11504/14562) remote: Counting objects: 80% (11650/14562) remote: Counting objects: 81% (11796/14562) remote: Counting objects: 82% (11941/14562) remote: Counting objects: 83% (12087/14562) remote: Counting objects: 84% (12233/14562) remote: Counting objects: 85% (12378/14562) remote: Counting objects: 86% (12524/14562) remote: Counting objects: 87% (12669/14562) remote: Counting objects: 88% (12815/14562) remote: Counting objects: 89% (12961/14562) remote: Counting objects: 90% (13106/14562) remote: Counting objects: 91% (13252/14562) remote: Counting objects: 92% (13398/14562) remote: Counting objects: 93% (13543/14562) remote: Counting objects: 94% (13689/14562) remote: Counting objects: 95% (13834/14562) remote: Counting objects: 96% (13980/14562) remote: Counting objects: 97% (14126/14562) remote: Counting objects: 98% (14271/14562) remote: Counting objects: 99% (14417/14562) remote: Counting objects: 100% (14562/14562) remote: Counting objects: 100% (14562/14562), done.
  5. 5.40 s remote: Compressing objects: 0% (1/2921) remote: Compressing objects: 1% (30/2921) remote: Compressing objects: 2% (59/2921) remote: Compressing objects: 3% (88/2921) remote: Compressing objects: 4% (117/2921) remote: Compressing objects: 5% (147/2921) remote: Compressing objects: 6% (176/2921) remote: Compressing objects: 7% (205/2921) remote: Compressing objects: 8% (234/2921) remote: Compressing objects: 9% (263/2921) remote: Compressing objects: 10% (293/2921) remote: Compressing objects: 11% (322/2921) remote: Compressing objects: 11% (342/2921) remote: Compressing objects: 12% (351/2921) remote: Compressing objects: 13% (380/2921) remote: Compressing objects: 13% (387/2921) remote: Compressing objects: 14% (409/2921) remote: Compressing objects: 15% (439/2921) remote: Compressing objects: 16% (468/2921) remote: Compressing objects: 17% (497/2921) remote: Compressing objects: 17% (519/2921) remote: Compressing objects: 18% (526/2921) remote: Compressing objects: 19% (555/2921) remote: Compressing objects: 20% (585/2921) remote: Compressing objects: 21% (614/2921) remote: Compressing objects: 22% (643/2921) remote: Compressing objects: 23% (672/2921) remote: Compressing objects: 24% (702/2921) remote: Compressing objects: 25% (731/2921) remote: Compressing objects: 26% (760/2921) remote: Compressing objects: 26% (776/2921) remote: Compressing objects: 27% (789/2921) remote: Compressing objects: 28% (818/2921) remote: Compressing objects: 29% (848/2921) remote: Compressing objects: 30% (877/2921) remote: Compressing objects: 31% (906/2921) remote: Compressing objects: 32% (935/2921) remote: Compressing objects: 33% (964/2921) remote: Compressing objects: 34% (994/2921) remote: Compressing objects: 35% (1023/2921) remote: Compressing objects: 36% (1052/2921) remote: Compressing objects: 37% (1081/2921) remote: Compressing objects: 38% (1110/2921) remote: Compressing objects: 39% (1140/2921) remote: Compressing objects: 40% (1169/2921) remote: Compressing objects: 41% (1198/2921) remote: Compressing objects: 42% (1227/2921) remote: Compressing objects: 43% (1257/2921) remote: Compressing objects: 44% (1286/2921) remote: Compressing objects: 45% (1315/2921) remote: Compressing objects: 46% (1344/2921) remote: Compressing objects: 47% (1373/2921) remote: Compressing objects: 48% (1403/2921) remote: Compressing objects: 49% (1432/2921) remote: Compressing objects: 50% (1461/2921) remote: Compressing objects: 51% (1490/2921) remote: Compressing objects: 52% (1519/2921) remote: Compressing objects: 53% (1549/2921) remote: Compressing objects: 54% (1578/2921) remote: Compressing objects: 55% (1607/2921) remote: Compressing objects: 56% (1636/2921) remote: Compressing objects: 57% (1665/2921) remote: Compressing objects: 58% (1695/2921) remote: Compressing objects: 59% (1724/2921) remote: Compressing objects: 60% (1753/2921) remote: Compressing objects: 61% (1782/2921) remote: Compressing objects: 62% (1812/2921) remote: Compressing objects: 63% (1841/2921) remote: Compressing objects: 64% (1870/2921) remote: Compressing objects: 65% (1899/2921) remote: Compressing objects: 66% (1928/2921) remote: Compressing objects: 67% (1958/2921) remote: Compressing objects: 68% (1987/2921) remote: Compressing objects: 69% (2016/2921) remote: Compressing objects: 70% (2045/2921) remote: Compressing objects: 71% (2074/2921) remote: Compressing objects: 72% (2104/2921) remote: Compressing objects: 73% (2133/2921) remote: Compressing objects: 74% (2162/2921) remote: Compressing objects: 75% (2191/2921) remote: Compressing objects: 76% (2220/2921) remote: Compressing objects: 77% (2250/2921) remote: Compressing objects: 78% (2279/2921) remote: Compressing objects: 79% (2308/2921) remote: Compressing objects: 80% (2337/2921) remote: Compressing objects: 81% (2367/2921) remote: Compressing objects: 82% (2396/2921) remote: Compressing objects: 83% (2425/2921) remote: Compressing objects: 84% (2454/2921) remote: Compressing objects: 85% (2483/2921) remote: Compressing objects: 86% (2513/2921) remote: Compressing objects: 87% (2542/2921) remote: Compressing objects: 88% (2571/2921) remote: Compressing objects: 89% (2600/2921) remote: Compressing objects: 90% (2629/2921) remote: Compressing objects: 91% (2659/2921) remote: Compressing objects: 92% (2688/2921) remote: Compressing objects: 93% (2717/2921) remote: Compressing objects: 94% (2746/2921) remote: Compressing objects: 95% (2775/2921) remote: Compressing objects: 96% (2805/2921) remote: Compressing objects: 97% (2834/2921) remote: Compressing objects: 98% (2863/2921) remote: Compressing objects: 99% (2892/2921) remote: Compressing objects: 100% (2921/2921) remote: Compressing objects: 100% (2921/2921), done.
  6. 15.99 s Receiving objects: 0% (1/110731) Receiving objects: 1% (1108/110731) Receiving objects: 2% (2215/110731) Receiving objects: 3% (3322/110731), 15.94 MiB | 31.86 MiB/s Receiving objects: 4% (4430/110731), 15.94 MiB | 31.86 MiB/s Receiving objects: 5% (5537/110731), 15.94 MiB | 31.86 MiB/s Receiving objects: 6% (6644/110731), 15.94 MiB | 31.86 MiB/s Receiving objects: 6% (7490/110731), 31.53 MiB | 31.33 MiB/s Receiving objects: 7% (7752/110731), 31.53 MiB | 31.33 MiB/s Receiving objects: 8% (8859/110731), 31.53 MiB | 31.33 MiB/s Receiving objects: 9% (9966/110731), 31.53 MiB | 31.33 MiB/s Receiving objects: 10% (11074/110731), 31.53 MiB | 31.33 MiB/s Receiving objects: 10% (11662/110731), 47.28 MiB | 31.39 MiB/s Receiving objects: 11% (12181/110731), 62.96 MiB | 31.37 MiB/s Receiving objects: 12% (13288/110731), 62.96 MiB | 31.37 MiB/s Receiving objects: 13% (14396/110731), 62.96 MiB | 31.37 MiB/s Receiving objects: 14% (15503/110731), 62.96 MiB | 31.37 MiB/s Receiving objects: 15% (16610/110731), 62.96 MiB | 31.37 MiB/s Receiving objects: 16% (17717/110731), 74.83 MiB | 29.85 MiB/s Receiving objects: 17% (18825/110731), 74.83 MiB | 29.85 MiB/s Receiving objects: 18% (19932/110731), 74.83 MiB | 29.85 MiB/s Receiving objects: 19% (21039/110731), 74.83 MiB | 29.85 MiB/s Receiving objects: 20% (22147/110731), 74.83 MiB | 29.85 MiB/s Receiving objects: 21% (23254/110731), 74.83 MiB | 29.85 MiB/s Receiving objects: 22% (24361/110731), 74.83 MiB | 29.85 MiB/s Receiving objects: 23% (25469/110731), 74.83 MiB | 29.85 MiB/s Receiving objects: 24% (26576/110731), 74.83 MiB | 29.85 MiB/s Receiving objects: 25% (27683/110731), 74.83 MiB | 29.85 MiB/s Receiving objects: 26% (28791/110731), 74.83 MiB | 29.85 MiB/s Receiving objects: 27% (29898/110731), 74.83 MiB | 29.85 MiB/s Receiving objects: 28% (31005/110731), 74.83 MiB | 29.85 MiB/s Receiving objects: 29% (32112/110731), 74.83 MiB | 29.85 MiB/s Receiving objects: 30% (33220/110731), 74.83 MiB | 29.85 MiB/s Receiving objects: 31% (34327/110731), 74.83 MiB | 29.85 MiB/s Receiving objects: 32% (35434/110731), 74.83 MiB | 29.85 MiB/s Receiving objects: 33% (36542/110731), 74.83 MiB | 29.85 MiB/s Receiving objects: 34% (37649/110731), 74.83 MiB | 29.85 MiB/s Receiving objects: 35% (38756/110731), 74.83 MiB | 29.85 MiB/s Receiving objects: 36% (39864/110731), 74.83 MiB | 29.85 MiB/s Receiving objects: 37% (40971/110731), 74.83 MiB | 29.85 MiB/s Receiving objects: 38% (42078/110731), 74.83 MiB | 29.85 MiB/s Receiving objects: 38% (42867/110731), 93.50 MiB | 31.10 MiB/s Receiving objects: 39% (43186/110731), 93.50 MiB | 31.10 MiB/s Receiving objects: 40% (44293/110731), 93.50 MiB | 31.10 MiB/s Receiving objects: 41% (45400/110731), 93.50 MiB | 31.10 MiB/s Receiving objects: 42% (46508/110731), 93.50 MiB | 31.10 MiB/s Receiving objects: 43% (47615/110731), 93.50 MiB | 31.10 MiB/s Receiving objects: 44% (48722/110731), 93.50 MiB | 31.10 MiB/s Receiving objects: 45% (49829/110731), 93.50 MiB | 31.10 MiB/s Receiving objects: 46% (50937/110731), 109.56 MiB | 31.25 MiB/s Receiving objects: 47% (52044/110731), 109.56 MiB | 31.25 MiB/s Receiving objects: 48% (53151/110731), 109.56 MiB | 31.25 MiB/s Receiving objects: 49% (54259/110731), 109.56 MiB | 31.25 MiB/s Receiving objects: 50% (55366/110731), 109.56 MiB | 31.25 MiB/s Receiving objects: 51% (56473/110731), 109.56 MiB | 31.25 MiB/s Receiving objects: 52% (57581/110731), 109.56 MiB | 31.25 MiB/s Receiving objects: 53% (58688/110731), 109.56 MiB | 31.25 MiB/s Receiving objects: 53% (59020/110731), 109.56 MiB | 31.25 MiB/s Receiving objects: 54% (59795/110731), 124.82 MiB | 31.16 MiB/s Receiving objects: 55% (60903/110731), 124.82 MiB | 31.16 MiB/s Receiving objects: 56% (62010/110731), 124.82 MiB | 31.16 MiB/s Receiving objects: 57% (63117/110731), 124.82 MiB | 31.16 MiB/s Receiving objects: 58% (64224/110731), 124.82 MiB | 31.16 MiB/s Receiving objects: 59% (65332/110731), 140.64 MiB | 31.21 MiB/s Receiving objects: 60% (66439/110731), 140.64 MiB | 31.21 MiB/s Receiving objects: 61% (67546/110731), 140.64 MiB | 31.21 MiB/s Receiving objects: 61% (68174/110731), 156.29 MiB | 31.15 MiB/s Receiving objects: 62% (68654/110731), 156.29 MiB | 31.15 MiB/s Receiving objects: 63% (69761/110731), 156.29 MiB | 31.15 MiB/s Receiving objects: 64% (70868/110731), 156.29 MiB | 31.15 MiB/s Receiving objects: 65% (71976/110731), 156.29 MiB | 31.15 MiB/s Receiving objects: 66% (73083/110731), 172.26 MiB | 31.27 MiB/s Receiving objects: 67% (74190/110731), 172.26 MiB | 31.27 MiB/s Receiving objects: 68% (75298/110731), 172.26 MiB | 31.27 MiB/s Receiving objects: 69% (76405/110731), 172.26 MiB | 31.27 MiB/s Receiving objects: 70% (77512/110731), 172.26 MiB | 31.27 MiB/s Receiving objects: 71% (78620/110731), 172.26 MiB | 31.27 MiB/s Receiving objects: 72% (79727/110731), 172.26 MiB | 31.27 MiB/s Receiving objects: 72% (80699/110731), 172.26 MiB | 31.27 MiB/s Receiving objects: 73% (80834/110731), 172.26 MiB | 31.27 MiB/s Receiving objects: 74% (81941/110731), 187.53 MiB | 31.17 MiB/s Receiving objects: 75% (83049/110731), 187.53 MiB | 31.17 MiB/s Receiving objects: 76% (84156/110731), 187.53 MiB | 31.17 MiB/s Receiving objects: 77% (85263/110731), 187.53 MiB | 31.17 MiB/s Receiving objects: 78% (86371/110731), 187.53 MiB | 31.17 MiB/s Receiving objects: 79% (87478/110731), 187.53 MiB | 31.17 MiB/s Receiving objects: 80% (88585/110731), 203.11 MiB | 31.15 MiB/s Receiving objects: 81% (89693/110731), 203.11 MiB | 31.15 MiB/s Receiving objects: 81% (89701/110731), 219.22 MiB | 32.09 MiB/s Receiving objects: 81% (89737/110731), 250.40 MiB | 31.30 MiB/s Receiving objects: 82% (90800/110731), 250.40 MiB | 31.30 MiB/s Receiving objects: 83% (91907/110731), 250.40 MiB | 31.30 MiB/s Receiving objects: 84% (93015/110731), 265.84 MiB | 31.34 MiB/s Receiving objects: 85% (94122/110731), 265.84 MiB | 31.34 MiB/s Receiving objects: 85% (94731/110731), 265.84 MiB | 31.34 MiB/s Receiving objects: 86% (95229/110731), 292.09 MiB | 30.03 MiB/s Receiving objects: 87% (96336/110731), 292.09 MiB | 30.03 MiB/s Receiving objects: 88% (97444/110731), 292.09 MiB | 30.03 MiB/s Receiving objects: 89% (98551/110731), 292.09 MiB | 30.03 MiB/s Receiving objects: 90% (99658/110731), 292.09 MiB | 30.03 MiB/s Receiving objects: 91% (100766/110731), 292.09 MiB | 30.03 MiB/s Receiving objects: 92% (101873/110731), 292.09 MiB | 30.03 MiB/s Receiving objects: 93% (102980/110731), 292.09 MiB | 30.03 MiB/s Receiving objects: 94% (104088/110731), 292.09 MiB | 30.03 MiB/s Receiving objects: 95% (105195/110731), 292.09 MiB | 30.03 MiB/s Receiving objects: 96% (106302/110731), 292.09 MiB | 30.03 MiB/s Receiving objects: 97% (107410/110731), 292.09 MiB | 30.03 MiB/s Receiving objects: 97% (108458/110731), 292.09 MiB | 30.03 MiB/s Receiving objects: 98% (108517/110731), 292.09 MiB | 30.03 MiB/s Receiving objects: 99% (109624/110731), 307.79 MiB | 29.96 MiB/s remote: Total 110731 (delta 12254), reused 11928 (delta 11241), pack-reused 96169 (from 2)
  7. 16.00 s Receiving objects: 100% (110731/110731), 323.53 MiB | 30.05 MiB/s Receiving objects: 100% (110731/110731), 324.99 MiB | 30.68 MiB/s, done.
  8. 17.86 s Resolving deltas: 0% (0/72611) Resolving deltas: 1% (727/72611) Resolving deltas: 2% (1453/72611) Resolving deltas: 3% (2179/72611) Resolving deltas: 4% (2905/72611) Resolving deltas: 5% (3631/72611) Resolving deltas: 6% (4357/72611) Resolving deltas: 7% (5083/72611) Resolving deltas: 8% (5809/72611) Resolving deltas: 9% (6535/72611) Resolving deltas: 10% (7262/72611) Resolving deltas: 11% (7988/72611) Resolving deltas: 12% (8715/72611) Resolving deltas: 13% (9440/72611) Resolving deltas: 14% (10166/72611) Resolving deltas: 15% (10892/72611) Resolving deltas: 16% (11618/72611) Resolving deltas: 17% (12344/72611) Resolving deltas: 18% (13070/72611) Resolving deltas: 19% (13797/72611) Resolving deltas: 20% (14525/72611) Resolving deltas: 21% (15249/72611) Resolving deltas: 22% (15975/72611) Resolving deltas: 23% (16701/72611) Resolving deltas: 24% (17427/72611) Resolving deltas: 25% (18155/72611) Resolving deltas: 26% (18879/72611) Resolving deltas: 27% (19605/72611) Resolving deltas: 28% (20332/72611) Resolving deltas: 29% (21058/72611) Resolving deltas: 30% (21784/72611) Resolving deltas: 31% (22512/72611) Resolving deltas: 32% (23236/72611) Resolving deltas: 33% (23964/72611) Resolving deltas: 34% (24688/72611) Resolving deltas: 35% (25414/72611) Resolving deltas: 36% (26140/72611) Resolving deltas: 37% (26867/72611) Resolving deltas: 38% (27593/72611) Resolving deltas: 38% (28131/72611) Resolving deltas: 39% (28319/72611) Resolving deltas: 40% (29045/72611) Resolving deltas: 41% (29771/72611) Resolving deltas: 42% (30497/72611) Resolving deltas: 43% (31223/72611) Resolving deltas: 44% (31949/72611) Resolving deltas: 45% (32675/72611) Resolving deltas: 46% (33403/72611) Resolving deltas: 47% (34128/72611) Resolving deltas: 48% (34854/72611) Resolving deltas: 49% (35582/72611) Resolving deltas: 50% (36306/72611) Resolving deltas: 51% (37032/72611) Resolving deltas: 52% (37758/72611) Resolving deltas: 53% (38484/72611) Resolving deltas: 54% (39210/72611) Resolving deltas: 55% (39937/72611) Resolving deltas: 56% (40663/72611) Resolving deltas: 57% (41390/72611) Resolving deltas: 58% (42115/72611) Resolving deltas: 59% (42842/72611) Resolving deltas: 60% (43567/72611) Resolving deltas: 61% (44293/72611) Resolving deltas: 62% (45019/72611) Resolving deltas: 63% (45745/72611) Resolving deltas: 64% (46472/72611) Resolving deltas: 65% (47198/72611) Resolving deltas: 66% (47924/72611) Resolving deltas: 67% (48650/72611) Resolving deltas: 68% (49378/72611) Resolving deltas: 69% (50102/72611) Resolving deltas: 70% (50828/72611) Resolving deltas: 71% (51555/72611) Resolving deltas: 72% (52280/72611) Resolving deltas: 73% (53007/72611) Resolving deltas: 74% (53734/72611) Resolving deltas: 75% (54459/72611) Resolving deltas: 76% (55185/72611) Resolving deltas: 77% (55911/72611) Resolving deltas: 78% (56637/72611) Resolving deltas: 79% (57364/72611) Resolving deltas: 80% (58089/72611) Resolving deltas: 81% (58815/72611) Resolving deltas: 82% (59542/72611) Resolving deltas: 83% (60268/72611) Resolving deltas: 84% (60994/72611) Resolving deltas: 85% (61720/72611) Resolving deltas: 86% (62446/72611) Resolving deltas: 87% (63172/72611) Resolving deltas: 88% (63898/72611) Resolving deltas: 89% (64624/72611) Resolving deltas: 90% (65350/72611) Resolving deltas: 91% (66077/72611) Resolving deltas: 92% (66803/72611) Resolving deltas: 93% (67529/72611) Resolving deltas: 94% (68255/72611) Resolving deltas: 95% (68981/72611) Resolving deltas: 96% (69707/72611) Resolving deltas: 97% (70437/72611) Resolving deltas: 98% (71160/72611) Resolving deltas: 99% (71885/72611) Resolving deltas: 100% (72611/72611) Resolving deltas: 100% (72611/72611), done.
  9. 18.42 s Fetching commit 07b1d150507fa30cd2cd44f18a21e3387ba5063b for linnest-endpoints-momentum-layouts ...
  10. 18.42 s $ /nix/store/5vpcfsdx1lcnlb2y4k7xyc74shp5qwbh-git-2.54.0/bin/git fetch origin 07b1d150507fa30cd2cd44f18a21e3387ba5063b
  11. 18.85 s From https://github.com/alphal00p/gammaloop
  12. 18.85 s * branch 07b1d150507fa30cd2cd44f18a21e3387ba5063b -> FETCH_HEAD
  13. 18.87 s $ /nix/store/61685rbaxmpigwi3z23i33sv3jyfl70q-coreutils-9.11/bin/timeout --kill-after=15s 7200s /nix/store/5vpcfsdx1lcnlb2y4k7xyc74shp5qwbh-git-2.54.0/bin/git -c advice.detachedHead=false checkout 07b1d150507fa30cd2cd44f18a21e3387ba5063b
  14. 19.18 s HEAD is now at 07b1d1505 extend linnest edge endpoints, momentum display, and partial layouts
  15. 19.18 s $ /nix/store/61685rbaxmpigwi3z23i33sv3jyfl70q-coreutils-9.11/bin/timeout --kill-after=15s 7200s /nix/store/wknkybkzrc16r11vk5vrykh4wmw7a353-nix-2.34.8/bin/nix --extra-experimental-features nix-command --extra-experimental-features flakes --log-format internal-json run .#packages.x86_64-linux.nix-ci-check-gammaloop-nextest-docs --print-build-logs
  16. 19.29 s warning: ignoring untrusted flake configuration setting 'extra-substituters'.
  17. 19.29 s Pass '--accept-flake-config' to trust it
  18. 19.29 s warning: ignoring untrusted flake configuration setting 'extra-trusted-public-keys'.
  19. 19.29 s Pass '--accept-flake-config' to trust it
  20. 23.80 s
  21. 24.03 s do you want to allow configuration setting 'extra-substituters' to be set to 'https://cache.nix-ci.com' (y/N)? do you want to permanently mark this value as untrusted (y/N)? warning: ignoring untrusted flake configuration setting 'extra-substituters'.
  22. 24.03 s Pass '--accept-flake-config' to trust it
  23. 24.03 s evaluating derivation 'gdo you want to allow configuration setting 'extra-trusted-public-keys' to be set to 'nix-ci:g3xV5BDTLtIBZr/A00IU1x0EtKKlb7YLgBN2SgYgM6A=' (y/N)? do you want to permanently mark this value as untrusted (y/N)? warning: ignoring untrusted flake configuration setting 'extra-trusted-public-keys'.
  24. 24.03 s Pass '--accept-flake-config' to trust it
  25. 28.47 s copying '/nix/store/gisz evaluating derivation 'g copying '/nix/store/gisz evaluating derivation 'g copying '/nix/store/gisz evaluating derivation 'g copying '/nix/store/gisz evaluating derivation 'g copying '/nix/store/gisz evaluating derivation 'g copying '/nix/store/gisz evaluating derivation 'g copying '/nix/store/gisz evaluating derivation 'g copying '/nix/store/gisz evaluating derivation 'g copying '/nix/store/gisz evaluating derivation 'g [1/0/1 copied (0.0 KiB/2
  26. 37.66 s [1/0/1 copied (6.1/201.4 [1/0/1 copied (25.2/201. [1/0/1 copied (42.2/201. [1/0/1 copied (53.5/201. [1/0/1 copied (58.2/201. [1/0/1 copied (74.2/201. [1/0/1 copied (79.8/201. [1/0/1 copied (93.6/201. [1/0/1 copied (113.1/201 [1/0/1 copied (135.0/201 [1/0/1 copied (162.6/201 [1/0/1 copied (183.9/201 [1/0/1 copied (196.4/201 [1 copied (201.4 MiB), 4
  27. 51.76 s [0/9 built, 1/80 copied [0/10 built, 16/1/72 cop [0/10 built, 9/10/72 cop [0/10 built, 12/13/72 co [0/10 built, 7/21/72 cop [0/10 built, 5/24/72 cop [0/10 built, 4/25/72 cop [0/10 built, 3/26/72 cop [0/10 built, 12/43/72 co [0/9 built, 12/44/72 cop [0/9 built, 11/45/72 cop [0/8 built, 7/50/72 copi [0/8 built, 4/54/72 copi [0/8 built, 3/55/72 copi [0/8 built, 2/56/72 copi [0/8 built, 5/59/72 copi [0/8 built, 7/60/72 copi [0/8 built, 6/61/72 copi [0/7 built, 5/63/72 copi [0/7 built, 4/65/72 copi [0/6 built, 3/66/72 copi [0/5 built, 2/67/72 copi [0/4 built, 1/69/72 copi [0/3 built, 72 copied (9 [0/2 built, 72 copied (9 [1/0/1 built, 72 copied gammaloop-nextest-docs> Extracting 2 binaries to /build/source
  28. 51.81 s gammaloop-nextest-docs> Extracted 5 files to /build/source in 0.05s
  29. 51.82 s gammaloop-nextest-docs> ------------
  30. 51.82 s gammaloop-nextest-docs> Nextest run ID f6f9c216-f175-4d58-b410-38a939b7edc4 with nextest profile: ci_gammaloop
  31. 51.82 s gammaloop-nextest-docs> Starting 129 tests across 2 binaries
  32. 52.07 s gammaloop-nextest-docs> FAIL [ 0.214s] ( 62/129) alphal00p-docs-builder tests::developer_scope_ranges_ignore_unrelated_edits_and_warn_only_while_watching
  33. 52.07 s gammaloop-nextest-docs> stdout ---
  34. 52.07 s gammaloop-nextest-docs>
  35. 52.07 s gammaloop-nextest-docs> running 1 test
  36. 52.07 s gammaloop-nextest-docs> test tests::developer_scope_ranges_ignore_unrelated_edits_and_warn_only_while_watching ... FAILED
  37. 52.07 s gammaloop-nextest-docs>
  38. 52.07 s gammaloop-nextest-docs> failures:
  39. 52.07 s gammaloop-nextest-docs>
  40. 52.07 s gammaloop-nextest-docs> failures:
  41. 52.07 s gammaloop-nextest-docs> tests::developer_scope_ranges_ignore_unrelated_edits_and_warn_only_while_watching
  42. 52.07 s gammaloop-nextest-docs>
  43. 52.07 s gammaloop-nextest-docs> test result: FAILED. 0 passed; 1 failed; 0 ignored; 0 measured; 128 filtered out; finished in 0.21s
  44. 52.07 s gammaloop-nextest-docs>
  45. 52.07 s gammaloop-nextest-docs> stderr ---
  46. 52.07 s gammaloop-nextest-docs>
  47. 52.07 s gammaloop-nextest-docs> thread 'tests::developer_scope_ranges_ignore_unrelated_edits_and_warn_only_while_watching' (286) panicked at crates/alphal00p-docs-builder/src/lib.rs:12263:29:
  48. 52.07 s gammaloop-nextest-docs> called `Result::unwrap()` on an `Err` value: developer note nix-crane-cache-reuse verified scope nix/rust-workspace.nix changed (expected 66f700580ce13b9eaee90fe0111639e46968c531, found 0a568cb5712045aee37d96bfb2f91d3d32b7e9b9); owner review or an explicit no-impact attestation is required
  49. 52.07 s gammaloop-nextest-docs>
  50. 52.07 s gammaloop-nextest-docs> Location:
  51. 52.07 s gammaloop-nextest-docs> crates/alphal00p-docs-builder/src/lib.rs:992:29
  52. 52.07 s gammaloop-nextest-docs> stack backtrace:
  53. 52.07 s gammaloop-nextest-docs> 0: __rustc::rust_begin_unwind
  54. 52.07 s gammaloop-nextest-docs> 1: core::panicking::panic_fmt
  55. 52.07 s gammaloop-nextest-docs> 2: core::result::unwrap_failed
  56. 52.07 s gammaloop-nextest-docs> 3: alphal00p_docs_builder::tests::developer_scope_ranges_ignore_unrelated_edits_and_warn_only_while_watching
  57. 52.07 s gammaloop-nextest-docs> 4: <alphal00p_docs_builder::tests::developer_scope_ranges_ignore_unrelated_edits_and_warn_only_while_watching::{closure#0} as core::ops::function::FnOnce<()>>::call_once
  58. 52.07 s gammaloop-nextest-docs> note: Some details are omitted, run with `RUST_BACKTRACE=full` for a verbose backtrace.
  59. 52.07 s gammaloop-nextest-docs>
  60. 52.10 s gammaloop-nextest-docs> FAIL [ 0.274s] ( 66/129) alphal00p-docs-builder provenance_tests::each_build_captures_one_revision_before_rendering
  61. 52.10 s gammaloop-nextest-docs> stdout ---
  62. 52.10 s gammaloop-nextest-docs>
  63. 52.10 s gammaloop-nextest-docs> running 1 test
  64. 52.10 s gammaloop-nextest-docs>
  65. 52.10 s gammaloop-nextest-docs> running 1 test
  66. 52.10 s gammaloop-nextest-docs> test provenance_tests::each_build_captures_one_revision_before_rendering ... FAILED
  67. 52.10 s gammaloop-nextest-docs>
  68. 52.10 s gammaloop-nextest-docs> failures:
  69. 52.10 s gammaloop-nextest-docs>
  70. 52.10 s gammaloop-nextest-docs> failures:
  71. 52.10 s gammaloop-nextest-docs> provenance_tests::each_build_captures_one_revision_before_rendering
  72. 52.10 s gammaloop-nextest-docs>
  73. 52.10 s gammaloop-nextest-docs> test result: FAILED. 0 passed; 1 failed; 0 ignored; 0 measured; 128 filtered out; finished in 0.25s
  74. 52.10 s gammaloop-nextest-docs>
  75. 52.10 s gammaloop-nextest-docs> test provenance_tests::each_build_captures_one_revision_before_rendering ... FAILED
  76. 52.10 s gammaloop-nextest-docs>
  77. 52.10 s gammaloop-nextest-docs> failures:
  78. 52.10 s gammaloop-nextest-docs>
  79. 52.10 s gammaloop-nextest-docs> failures:
  80. 52.10 s gammaloop-nextest-docs> provenance_tests::each_build_captures_one_revision_before_rendering
  81. 52.10 s gammaloop-nextest-docs>
  82. 52.10 s gammaloop-nextest-docs> test result: FAILED. 0 passed; 1 failed; 0 ignored; 0 measured; 128 filtered out; finished in 0.27s
  83. 52.10 s gammaloop-nextest-docs>
  84. 52.10 s gammaloop-nextest-docs> stderr ---
  85. 52.10 s gammaloop-nextest-docs>
  86. 52.10 s gammaloop-nextest-docs> thread 'provenance_tests::each_build_captures_one_revision_before_rendering' (224) panicked at crates/alphal00p-docs-builder/src/provenance_tests.rs:297:14:
  87. 52.10 s gammaloop-nextest-docs> called `Result::unwrap()` on an `Err` value: developer note nix-crane-cache-reuse verified scope nix/rust-workspace.nix changed (expected 66f700580ce13b9eaee90fe0111639e46968c531, found 0a568cb5712045aee37d96bfb2f91d3d32b7e9b9); owner review or an explicit no-impact attestation is required
  88. 52.10 s gammaloop-nextest-docs>
  89. 52.10 s gammaloop-nextest-docs> Location:
  90. 52.10 s gammaloop-nextest-docs> crates/alphal00p-docs-builder/src/lib.rs:992:29
  91. 52.10 s gammaloop-nextest-docs> stack backtrace:
  92. 52.10 s gammaloop-nextest-docs> 0: __rustc::rust_begin_unwind
  93. 52.10 s gammaloop-nextest-docs> 1: core::panicking::panic_fmt
  94. 52.10 s gammaloop-nextest-docs> 2: core::result::unwrap_failed
  95. 52.10 s gammaloop-nextest-docs> 3: alphal00p_docs_builder::provenance_tests::each_build_captures_one_revision_before_rendering
  96. 52.10 s gammaloop-nextest-docs> 4: <alphal00p_docs_builder::provenance_tests::each_build_captures_one_revision_before_rendering::{closure#0} as core::ops::function::FnOnce<()>>::call_once
  97. 52.10 s gammaloop-nextest-docs> note: Some details are omitted, run with `RUST_BACKTRACE=full` for a verbose backtrace.
  98. 52.10 s gammaloop-nextest-docs>
  99. 52.10 s gammaloop-nextest-docs> thread 'provenance_tests::each_build_captures_one_revision_before_rendering' (163) panicked at crates/alphal00p-docs-builder/src/provenance_tests.rs:274:9:
  100. 52.10 s gammaloop-nextest-docs> assertion failed: command.status().unwrap().success()
  101. 52.10 s gammaloop-nextest-docs> stack backtrace:
  102. 52.10 s gammaloop-nextest-docs> 0: __rustc::rust_begin_unwind
  103. 52.10 s gammaloop-nextest-docs> 1: core::panicking::panic_fmt
  104. 52.10 s gammaloop-nextest-docs> 2: core::panicking::panic
  105. 52.10 s gammaloop-nextest-docs> 3: alphal00p_docs_builder::provenance_tests::each_build_captures_one_revision_before_rendering
  106. 52.10 s gammaloop-nextest-docs> 4: <alphal00p_docs_builder::provenance_tests::each_build_captures_one_revision_before_rendering::{closure#0} as core::ops::function::FnOnce<()>>::call_once
  107. 52.10 s gammaloop-nextest-docs> note: Some details are omitted, run with `RUST_BACKTRACE=full` for a verbose backtrace.
  108. 52.10 s gammaloop-nextest-docs>
  109. 52.10 s gammaloop-nextest-docs> FAIL [ 0.274s] ( 67/129) alphal00p-docs-builder tests::checked_in_registry_is_valid
  110. 52.10 s gammaloop-nextest-docs> stdout ---
  111. 52.10 s gammaloop-nextest-docs>
  112. 52.10 s gammaloop-nextest-docs> running 1 test
  113. 52.10 s gammaloop-nextest-docs> test tests::checked_in_registry_is_valid ... FAILED
  114. 52.10 s gammaloop-nextest-docs>
  115. 52.10 s gammaloop-nextest-docs> failures:
  116. 52.10 s gammaloop-nextest-docs>
  117. 52.10 s gammaloop-nextest-docs> failures:
  118. 52.10 s gammaloop-nextest-docs> tests::checked_in_registry_is_valid
  119. 52.10 s gammaloop-nextest-docs>
  120. 52.10 s gammaloop-nextest-docs> test result: FAILED. 0 passed; 1 failed; 0 ignored; 0 measured; 128 filtered out; finished in 0.26s
  121. 52.10 s gammaloop-nextest-docs>
  122. 52.10 s gammaloop-nextest-docs> stderr ---
  123. 52.10 s gammaloop-nextest-docs>
  124. 52.10 s gammaloop-nextest-docs> thread 'tests::checked_in_registry_is_valid' (213) panicked at crates/alphal00p-docs-builder/src/lib.rs:12178:50:
  125. 52.10 s gammaloop-nextest-docs> called `Result::unwrap()` on an `Err` value: developer note nix-crane-cache-reuse verified scope nix/rust-workspace.nix changed (expected 66f700580ce13b9eaee90fe0111639e46968c531, found 0a568cb5712045aee37d96bfb2f91d3d32b7e9b9); owner review or an explicit no-impact attestation is required
  126. 52.10 s gammaloop-nextest-docs>
  127. 52.10 s gammaloop-nextest-docs> Location:
  128. 52.10 s gammaloop-nextest-docs> crates/alphal00p-docs-builder/src/lib.rs:992:29
  129. 52.10 s gammaloop-nextest-docs> stack backtrace:
  130. 52.10 s gammaloop-nextest-docs> 0: __rustc::rust_begin_unwind
  131. 52.10 s gammaloop-nextest-docs> 1: core::panicking::panic_fmt
  132. 52.10 s gammaloop-nextest-docs> 2: core::result::unwrap_failed
  133. 52.10 s gammaloop-nextest-docs> 3: alphal00p_docs_builder::tests::checked_in_registry_is_valid
  134. 52.10 s gammaloop-nextest-docs> 4: <alphal00p_docs_builder::tests::checked_in_registry_is_valid::{closure#0} as core::ops::function::FnOnce<()>>::call_once
  135. 52.10 s gammaloop-nextest-docs> note: Some details are omitted, run with `RUST_BACKTRACE=full` for a verbose backtrace.
  136. 52.10 s gammaloop-nextest-docs>
  137. 52.13 s gammaloop-nextest-docs> FAIL [ 0.267s] ( 77/129) alphal00p-docs-builder tests::every_product_requires_a_task_chooser_and_each_supported_interface
  138. 52.13 s gammaloop-nextest-docs> stdout ---
  139. 52.13 s gammaloop-nextest-docs>
  140. 52.13 s gammaloop-nextest-docs> running 1 test
  141. 52.13 s gammaloop-nextest-docs> test tests::every_product_requires_a_task_chooser_and_each_supported_interface ... FAILED
  142. 52.13 s gammaloop-nextest-docs>
  143. 52.13 s gammaloop-nextest-docs> failures:
  144. 52.13 s gammaloop-nextest-docs>
  145. 52.13 s gammaloop-nextest-docs> failures:
  146. 52.13 s gammaloop-nextest-docs> tests::every_product_requires_a_task_chooser_and_each_supported_interface
  147. 52.13 s gammaloop-nextest-docs>
  148. 52.13 s gammaloop-nextest-docs> test result: FAILED. 0 passed; 1 failed; 0 ignored; 0 measured; 128 filtered out; finished in 0.26s
  149. 52.13 s gammaloop-nextest-docs>
  150. 52.13 s gammaloop-nextest-docs> stderr ---
  151. 52.13 s gammaloop-nextest-docs>
  152. 52.13 s gammaloop-nextest-docs> thread 'tests::every_product_requires_a_task_chooser_and_each_supported_interface' (308) panicked at crates/alphal00p-docs-builder/src/lib.rs:12192:9:
  153. 52.13 s gammaloop-nextest-docs> assertion failed: format!("{error:#}").contains("has no quickstart page")
  154. 52.13 s gammaloop-nextest-docs> stack backtrace:
  155. 52.13 s gammaloop-nextest-docs> 0: __rustc::rust_begin_unwind
  156. 52.13 s gammaloop-nextest-docs> 1: core::panicking::panic_fmt
  157. 52.13 s gammaloop-nextest-docs> 2: core::panicking::panic
  158. 52.13 s gammaloop-nextest-docs> 3: alphal00p_docs_builder::tests::every_product_requires_a_task_chooser_and_each_supported_interface
  159. 52.13 s gammaloop-nextest-docs> 4: <alphal00p_docs_builder::tests::every_product_requires_a_task_chooser_and_each_supported_interface::{closure#0} as core::ops::function::FnOnce<()>>::call_once
  160. 52.13 s gammaloop-nextest-docs> note: Some details are omitted, run with `RUST_BACKTRACE=full` for a verbose backtrace.
  161. 52.13 s gammaloop-nextest-docs>
  162. 52.24 s gammaloop-nextest-docs> FAIL [ 0.294s] (121/129) alphal00p-docs-builder tests::pdf_manual_chapter_order_must_match_the_page_registry
  163. 52.24 s gammaloop-nextest-docs> stdout ---
  164. 52.24 s gammaloop-nextest-docs>
  165. 52.24 s gammaloop-nextest-docs> running 1 test
  166. 52.24 s gammaloop-nextest-docs> test tests::pdf_manual_chapter_order_must_match_the_page_registry ... FAILED
  167. 52.24 s gammaloop-nextest-docs>
  168. 52.24 s gammaloop-nextest-docs> failures:
  169. 52.24 s gammaloop-nextest-docs>
  170. 52.24 s gammaloop-nextest-docs> failures:
  171. 52.24 s gammaloop-nextest-docs> tests::pdf_manual_chapter_order_must_match_the_page_registry
  172. 52.24 s gammaloop-nextest-docs>
  173. 52.24 s gammaloop-nextest-docs> test result: FAILED. 0 passed; 1 failed; 0 ignored; 0 measured; 128 filtered out; finished in 0.27s
  174. 52.24 s gammaloop-nextest-docs>
  175. 52.24 s gammaloop-nextest-docs> stderr ---
  176. 52.24 s gammaloop-nextest-docs>
  177. 52.24 s gammaloop-nextest-docs> thread 'tests::pdf_manual_chapter_order_must_match_the_page_registry' (440) panicked at crates/alphal00p-docs-builder/src/lib.rs:12243:9:
  178. 52.24 s gammaloop-nextest-docs> assertion failed: format!("{error:#}").contains("PDF manual chapter order differs")
  179. 52.24 s gammaloop-nextest-docs> stack backtrace:
  180. 52.24 s gammaloop-nextest-docs> 0: __rustc::rust_begin_unwind
  181. 52.24 s gammaloop-nextest-docs> 1: core::panicking::panic_fmt
  182. 52.24 s gammaloop-nextest-docs> 2: core::panicking::panic
  183. 52.24 s gammaloop-nextest-docs> 3: alphal00p_docs_builder::tests::pdf_manual_chapter_order_must_match_the_page_registry
  184. 52.24 s gammaloop-nextest-docs> 4: <alphal00p_docs_builder::tests::pdf_manual_chapter_order_must_match_the_page_registry::{closure#0} as core::ops::function::FnOnce<()>>::call_once
  185. 52.24 s gammaloop-nextest-docs> note: Some details are omitted, run with `RUST_BACKTRACE=full` for a verbose backtrace.
  186. 52.24 s gammaloop-nextest-docs>
  187. 69.06 s gammaloop-nextest-docs> ------------
  188. 69.06 s gammaloop-nextest-docs> Summary [ 17.240s] 129 tests run: 124 passed, 5 failed, 0 skipped
  189. 69.06 s gammaloop-nextest-docs> FAIL [ 0.214s] ( 62/129) alphal00p-docs-builder tests::developer_scope_ranges_ignore_unrelated_edits_and_warn_only_while_watching
  190. 69.06 s gammaloop-nextest-docs> stdout ---
  191. 69.06 s gammaloop-nextest-docs>
  192. 69.06 s gammaloop-nextest-docs> running 1 test
  193. 69.06 s gammaloop-nextest-docs> test tests::developer_scope_ranges_ignore_unrelated_edits_and_warn_only_while_watching ... FAILED
  194. 69.06 s gammaloop-nextest-docs>
  195. 69.06 s gammaloop-nextest-docs> failures:
  196. 69.06 s gammaloop-nextest-docs>
  197. 69.06 s gammaloop-nextest-docs> failures:
  198. 69.06 s gammaloop-nextest-docs> tests::developer_scope_ranges_ignore_unrelated_edits_and_warn_only_while_watching
  199. 69.06 s gammaloop-nextest-docs>
  200. 69.06 s gammaloop-nextest-docs> test result: FAILED. 0 passed; 1 failed; 0 ignored; 0 measured; 128 filtered out; finished in 0.21s
  201. 69.06 s gammaloop-nextest-docs>
  202. 69.06 s gammaloop-nextest-docs> stderr ---
  203. 69.06 s gammaloop-nextest-docs>
  204. 69.06 s gammaloop-nextest-docs> thread 'tests::developer_scope_ranges_ignore_unrelated_edits_and_warn_only_while_watching' (286) panicked at crates/alphal00p-docs-builder/src/lib.rs:12263:29:
  205. 69.06 s gammaloop-nextest-docs> called `Result::unwrap()` on an `Err` value: developer note nix-crane-cache-reuse verified scope nix/rust-workspace.nix changed (expected 66f700580ce13b9eaee90fe0111639e46968c531, found 0a568cb5712045aee37d96bfb2f91d3d32b7e9b9); owner review or an explicit no-impact attestation is required
  206. 69.06 s gammaloop-nextest-docs>
  207. 69.06 s gammaloop-nextest-docs> Location:
  208. 69.06 s gammaloop-nextest-docs> crates/alphal00p-docs-builder/src/lib.rs:992:29
  209. 69.06 s gammaloop-nextest-docs> stack backtrace:
  210. 69.06 s gammaloop-nextest-docs> 0: __rustc::rust_begin_unwind
  211. 69.06 s gammaloop-nextest-docs> 1: core::panicking::panic_fmt
  212. 69.06 s gammaloop-nextest-docs> 2: core::result::unwrap_failed
  213. 69.06 s gammaloop-nextest-docs> 3: alphal00p_docs_builder::tests::developer_scope_ranges_ignore_unrelated_edits_and_warn_only_while_watching
  214. 69.06 s gammaloop-nextest-docs> 4: <alphal00p_docs_builder::tests::developer_scope_ranges_ignore_unrelated_edits_and_warn_only_while_watching::{closure#0} as core::ops::function::FnOnce<()>>::call_once
  215. 69.06 s gammaloop-nextest-docs> note: Some details are omitted, run with `RUST_BACKTRACE=full` for a verbose backtrace.
  216. 69.06 s gammaloop-nextest-docs>
  217. 69.06 s gammaloop-nextest-docs> FAIL [ 0.274s] ( 66/129) alphal00p-docs-builder provenance_tests::each_build_captures_one_revision_before_rendering
  218. 69.06 s gammaloop-nextest-docs> stdout ---
  219. 69.06 s gammaloop-nextest-docs>
  220. 69.06 s gammaloop-nextest-docs> running 1 test
  221. 69.06 s gammaloop-nextest-docs>
  222. 69.06 s gammaloop-nextest-docs> running 1 test
  223. 69.06 s gammaloop-nextest-docs> test provenance_tests::each_build_captures_one_revision_before_rendering ... FAILED
  224. 69.06 s gammaloop-nextest-docs>
  225. 69.06 s gammaloop-nextest-docs> failures:
  226. 69.06 s gammaloop-nextest-docs>
  227. 69.06 s gammaloop-nextest-docs> failures:
  228. 69.06 s gammaloop-nextest-docs> provenance_tests::each_build_captures_one_revision_before_rendering
  229. 69.06 s gammaloop-nextest-docs>
  230. 69.06 s gammaloop-nextest-docs> test result: FAILED. 0 passed; 1 failed; 0 ignored; 0 measured; 128 filtered out; finished in 0.25s
  231. 69.06 s gammaloop-nextest-docs>
  232. 69.06 s gammaloop-nextest-docs> test provenance_tests::each_build_captures_one_revision_before_rendering ... FAILED
  233. 69.06 s gammaloop-nextest-docs>
  234. 69.06 s gammaloop-nextest-docs> failures:
  235. 69.06 s gammaloop-nextest-docs>
  236. 69.06 s gammaloop-nextest-docs> failures:
  237. 69.06 s gammaloop-nextest-docs> provenance_tests::each_build_captures_one_revision_before_rendering
  238. 69.06 s gammaloop-nextest-docs>
  239. 69.06 s gammaloop-nextest-docs> test result: FAILED. 0 passed; 1 failed; 0 ignored; 0 measured; 128 filtered out; finished in 0.27s
  240. 69.06 s gammaloop-nextest-docs>
  241. 69.06 s gammaloop-nextest-docs> stderr ---
  242. 69.06 s gammaloop-nextest-docs>
  243. 69.06 s gammaloop-nextest-docs> thread 'provenance_tests::each_build_captures_one_revision_before_rendering' (224) panicked at crates/alphal00p-docs-builder/src/provenance_tests.rs:297:14:
  244. 69.06 s gammaloop-nextest-docs> called `Result::unwrap()` on an `Err` value: developer note nix-crane-cache-reuse verified scope nix/rust-workspace.nix changed (expected 66f700580ce13b9eaee90fe0111639e46968c531, found 0a568cb5712045aee37d96bfb2f91d3d32b7e9b9); owner review or an explicit no-impact attestation is required
  245. 69.06 s gammaloop-nextest-docs>
  246. 69.06 s gammaloop-nextest-docs> Location:
  247. 69.06 s gammaloop-nextest-docs> crates/alphal00p-docs-builder/src/lib.rs:992:29
  248. 69.06 s gammaloop-nextest-docs> stack backtrace:
  249. 69.06 s gammaloop-nextest-docs> 0: __rustc::rust_begin_unwind
  250. 69.06 s gammaloop-nextest-docs> 1: core::panicking::panic_fmt
  251. 69.06 s gammaloop-nextest-docs> 2: core::result::unwrap_failed
  252. 69.06 s gammaloop-nextest-docs> 3: alphal00p_docs_builder::provenance_tests::each_build_captures_one_revision_before_rendering
  253. 69.06 s gammaloop-nextest-docs> 4: <alphal00p_docs_builder::provenance_tests::each_build_captures_one_revision_before_rendering::{closure#0} as core::ops::function::FnOnce<()>>::call_once
  254. 69.06 s gammaloop-nextest-docs> note: Some details are omitted, run with `RUST_BACKTRACE=full` for a verbose backtrace.
  255. 69.06 s gammaloop-nextest-docs>
  256. 69.06 s gammaloop-nextest-docs> thread 'provenance_tests::each_build_captures_one_revision_before_rendering' (163) panicked at crates/alphal00p-docs-builder/src/provenance_tests.rs:274:9:
  257. 69.06 s gammaloop-nextest-docs> assertion failed: command.status().unwrap().success()
  258. 69.06 s gammaloop-nextest-docs> stack backtrace:
  259. 69.06 s gammaloop-nextest-docs> 0: __rustc::rust_begin_unwind
  260. 69.06 s gammaloop-nextest-docs> 1: core::panicking::panic_fmt
  261. 69.06 s gammaloop-nextest-docs> 2: core::panicking::panic
  262. 69.06 s gammaloop-nextest-docs> 3: alphal00p_docs_builder::provenance_tests::each_build_captures_one_revision_before_rendering
  263. 69.06 s gammaloop-nextest-docs> 4: <alphal00p_docs_builder::provenance_tests::each_build_captures_one_revision_before_rendering::{closure#0} as core::ops::function::FnOnce<()>>::call_once
  264. 69.06 s gammaloop-nextest-docs> note: Some details are omitted, run with `RUST_BACKTRACE=full` for a verbose backtrace.
  265. 69.06 s gammaloop-nextest-docs>
  266. 69.06 s gammaloop-nextest-docs> FAIL [ 0.274s] ( 67/129) alphal00p-docs-builder tests::checked_in_registry_is_valid
  267. 69.06 s gammaloop-nextest-docs> stdout ---
  268. 69.06 s gammaloop-nextest-docs>
  269. 69.06 s gammaloop-nextest-docs> running 1 test
  270. 69.06 s gammaloop-nextest-docs> test tests::checked_in_registry_is_valid ... FAILED
  271. 69.06 s gammaloop-nextest-docs>
  272. 69.06 s gammaloop-nextest-docs> failures:
  273. 69.06 s gammaloop-nextest-docs>
  274. 69.06 s gammaloop-nextest-docs> failures:
  275. 69.06 s gammaloop-nextest-docs> tests::checked_in_registry_is_valid
  276. 69.06 s gammaloop-nextest-docs>
  277. 69.06 s gammaloop-nextest-docs> test result: FAILED. 0 passed; 1 failed; 0 ignored; 0 measured; 128 filtered out; finished in 0.26s
  278. 69.06 s gammaloop-nextest-docs>
  279. 69.06 s gammaloop-nextest-docs> stderr ---
  280. 69.06 s gammaloop-nextest-docs>
  281. 69.06 s gammaloop-nextest-docs> thread 'tests::checked_in_registry_is_valid' (213) panicked at crates/alphal00p-docs-builder/src/lib.rs:12178:50:
  282. 69.06 s gammaloop-nextest-docs> called `Result::unwrap()` on an `Err` value: developer note nix-crane-cache-reuse verified scope nix/rust-workspace.nix changed (expected 66f700580ce13b9eaee90fe0111639e46968c531, found 0a568cb5712045aee37d96bfb2f91d3d32b7e9b9); owner review or an explicit no-impact attestation is required
  283. 69.06 s gammaloop-nextest-docs>
  284. 69.06 s gammaloop-nextest-docs> Location:
  285. 69.06 s gammaloop-nextest-docs> crates/alphal00p-docs-builder/src/lib.rs:992:29
  286. 69.06 s gammaloop-nextest-docs> stack backtrace:
  287. 69.06 s gammaloop-nextest-docs> 0: __rustc::rust_begin_unwind
  288. 69.06 s gammaloop-nextest-docs> 1: core::panicking::panic_fmt
  289. 69.06 s gammaloop-nextest-docs> 2: core::result::unwrap_failed
  290. 69.06 s gammaloop-nextest-docs> 3: alphal00p_docs_builder::tests::checked_in_registry_is_valid
  291. 69.06 s gammaloop-nextest-docs> 4: <alphal00p_docs_builder::tests::checked_in_registry_is_valid::{closure#0} as core::ops::function::FnOnce<()>>::call_once
  292. 69.06 s gammaloop-nextest-docs> note: Some details are omitted, run with `RUST_BACKTRACE=full` for a verbose backtrace.
  293. 69.06 s gammaloop-nextest-docs>
  294. 69.06 s gammaloop-nextest-docs> FAIL [ 0.267s] ( 77/129) alphal00p-docs-builder tests::every_product_requires_a_task_chooser_and_each_supported_interface
  295. 69.06 s gammaloop-nextest-docs> stdout ---
  296. 69.06 s gammaloop-nextest-docs>
  297. 69.06 s gammaloop-nextest-docs> running 1 test
  298. 69.06 s gammaloop-nextest-docs> test tests::every_product_requires_a_task_chooser_and_each_supported_interface ... FAILED
  299. 69.06 s gammaloop-nextest-docs>
  300. 69.06 s gammaloop-nextest-docs> failures:
  301. 69.06 s gammaloop-nextest-docs>
  302. 69.06 s gammaloop-nextest-docs> failures:
  303. 69.06 s gammaloop-nextest-docs> tests::every_product_requires_a_task_chooser_and_each_supported_interface
  304. 69.06 s gammaloop-nextest-docs>
  305. 69.06 s gammaloop-nextest-docs> test result: FAILED. 0 passed; 1 failed; 0 ignored; 0 measured; 128 filtered out; finished in 0.26s
  306. 69.06 s gammaloop-nextest-docs>
  307. 69.06 s gammaloop-nextest-docs> stderr ---
  308. 69.06 s gammaloop-nextest-docs>
  309. 69.06 s gammaloop-nextest-docs> thread 'tests::every_product_requires_a_task_chooser_and_each_supported_interface' (308) panicked at crates/alphal00p-docs-builder/src/lib.rs:12192:9:
  310. 69.06 s gammaloop-nextest-docs> assertion failed: format!("{error:#}").contains("has no quickstart page")
  311. 69.06 s gammaloop-nextest-docs> stack backtrace:
  312. 69.06 s gammaloop-nextest-docs> 0: __rustc::rust_begin_unwind
  313. 69.06 s gammaloop-nextest-docs> 1: core::panicking::panic_fmt
  314. 69.06 s gammaloop-nextest-docs> 2: core::panicking::panic
  315. 69.06 s gammaloop-nextest-docs> 3: alphal00p_docs_builder::tests::every_product_requires_a_task_chooser_and_each_supported_interface
  316. 69.06 s gammaloop-nextest-docs> 4: <alphal00p_docs_builder::tests::every_product_requires_a_task_chooser_and_each_supported_interface::{closure#0} as core::ops::function::FnOnce<()>>::call_once
  317. 69.06 s gammaloop-nextest-docs> note: Some details are omitted, run with `RUST_BACKTRACE=full` for a verbose backtrace.
  318. 69.06 s gammaloop-nextest-docs>
  319. 69.06 s gammaloop-nextest-docs> FAIL [ 0.294s] (121/129) alphal00p-docs-builder tests::pdf_manual_chapter_order_must_match_the_page_registry
  320. 69.06 s gammaloop-nextest-docs> stdout ---
  321. 69.06 s gammaloop-nextest-docs>
  322. 69.06 s gammaloop-nextest-docs> running 1 test
  323. 69.06 s gammaloop-nextest-docs> test tests::pdf_manual_chapter_order_must_match_the_page_registry ... FAILED
  324. 69.06 s gammaloop-nextest-docs>
  325. 69.06 s gammaloop-nextest-docs> failures:
  326. 69.06 s gammaloop-nextest-docs>
  327. 69.06 s gammaloop-nextest-docs> failures:
  328. 69.06 s gammaloop-nextest-docs> tests::pdf_manual_chapter_order_must_match_the_page_registry
  329. 69.06 s gammaloop-nextest-docs>
  330. 69.06 s gammaloop-nextest-docs> test result: FAILED. 0 passed; 1 failed; 0 ignored; 0 measured; 128 filtered out; finished in 0.27s
  331. 69.06 s gammaloop-nextest-docs>
  332. 69.06 s gammaloop-nextest-docs> stderr ---
  333. 69.06 s gammaloop-nextest-docs>
  334. 69.06 s gammaloop-nextest-docs> thread 'tests::pdf_manual_chapter_order_must_match_the_page_registry' (440) panicked at crates/alphal00p-docs-builder/src/lib.rs:12243:9:
  335. 69.06 s gammaloop-nextest-docs> assertion failed: format!("{error:#}").contains("PDF manual chapter order differs")
  336. 69.06 s gammaloop-nextest-docs> stack backtrace:
  337. 69.06 s gammaloop-nextest-docs> 0: __rustc::rust_begin_unwind
  338. 69.06 s gammaloop-nextest-docs> 1: core::panicking::panic_fmt
  339. 69.06 s gammaloop-nextest-docs> 2: core::panicking::panic
  340. 69.06 s gammaloop-nextest-docs> 3: alphal00p_docs_builder::tests::pdf_manual_chapter_order_must_match_the_page_registry
  341. 69.06 s gammaloop-nextest-docs> 4: <alphal00p_docs_builder::tests::pdf_manual_chapter_order_must_match_the_page_registry::{closure#0} as core::ops::function::FnOnce<()>>::call_once
  342. 69.06 s gammaloop-nextest-docs> note: Some details are omitted, run with `RUST_BACKTRACE=full` for a verbose backtrace.
  343. 69.06 s gammaloop-nextest-docs>
  344. 69.07 s gammaloop-nextest-docs> error: test run failed
  345. 69.10 s gammaloop-nextest-docs>
  346. 69.10 s gammaloop-nextest-docs> ========== nextest test summary ==========
  347. 69.10 s gammaloop-nextest-docs> report: target/nextest/ci_gammaloop/junit.xml
  348. 69.10 s gammaloop-nextest-docs> tests: 129, failures: 5, errors: 0
  349. 69.10 s gammaloop-nextest-docs>
  350. 69.10 s gammaloop-nextest-docs> 1. alphal00p-docs-builder::tests::developer_scope_ranges_ignore_unrelated_edits_and_warn_only_while_watching
  351. 69.10 s gammaloop-nextest-docs> failure: test failure with exit code 101
  352. 69.10 s gammaloop-nextest-docs> thread 'tests::developer_scope_ranges_ignore_unrelated_edits_and_warn_only_while_watching' (286) panicked at crates/alphal00p-docs-builder/src/lib.rs:12263:29:
  353. 69.10 s gammaloop-nextest-docs> called `Result::unwrap()` on an `Err` value: developer note nix-crane-cache-reuse verified scope nix/rust-workspace.nix changed (expected 66f700580ce13b9eaee90fe0111639e46968c531, found 0a568cb5712045aee37d96bfb2f91d3d32b7e9b9); owner review or an explicit no-impact attestation is required
  354. 69.10 s gammaloop-nextest-docs>
  355. 69.10 s gammaloop-nextest-docs> Location:
  356. 69.10 s gammaloop-nextest-docs> crates/alphal00p-docs-builder/src/lib.rs:992:29
  357. 69.10 s gammaloop-nextest-docs> stack backtrace:
  358. 69.10 s gammaloop-nextest-docs> 0: __rustc::rust_begin_unwind
  359. 69.10 s gammaloop-nextest-docs> 1: core::panicking::panic_fmt
  360. 69.10 s gammaloop-nextest-docs> 2: core::result::unwrap_failed
  361. 69.10 s gammaloop-nextest-docs> 3: alphal00p_docs_builder::tests::developer_scope_ranges_ignore_unrelated_edits_and_warn_only_while_watching
  362. 69.10 s gammaloop-nextest-docs> 4: <alphal00p_docs_builder::tests::developer_scope_ranges_ignore_unrelated_edits_and_warn_only_while_watching::{closure#0} as core::ops::function::FnOnce<()>>::call_once
  363. 69.10 s gammaloop-nextest-docs> note: Some details are omitted, run with `RUST_BACKTRACE=full` for a verbose backtrace.
  364. 69.10 s gammaloop-nextest-docs> system-out
  365. 69.10 s gammaloop-nextest-docs> running 1 test
  366. 69.10 s gammaloop-nextest-docs> test tests::developer_scope_ranges_ignore_unrelated_edits_and_warn_only_while_watching ... FAILED
  367. 69.10 s gammaloop-nextest-docs>
  368. 69.10 s gammaloop-nextest-docs> failures:
  369. 69.10 s gammaloop-nextest-docs>
  370. 69.10 s gammaloop-nextest-docs> failures:
  371. 69.10 s gammaloop-nextest-docs> tests::developer_scope_ranges_ignore_unrelated_edits_and_warn_only_while_watching
  372. 69.10 s gammaloop-nextest-docs>
  373. 69.10 s gammaloop-nextest-docs> test result: FAILED. 0 passed; 1 failed; 0 ignored; 0 measured; 128 filtered out; finished in 0.21s
  374. 69.10 s gammaloop-nextest-docs> system-err
  375. 69.10 s gammaloop-nextest-docs> thread 'tests::developer_scope_ranges_ignore_unrelated_edits_and_warn_only_while_watching' (286) panicked at crates/alphal00p-docs-builder/src/lib.rs:12263:29:
  376. 69.10 s gammaloop-nextest-docs> called `Result::unwrap()` on an `Err` value: developer note nix-crane-cache-reuse verified scope nix/rust-workspace.nix changed (expected 66f700580ce13b9eaee90fe0111639e46968c531, found 0a568cb5712045aee37d96bfb2f91d3d32b7e9b9); owner review or an explicit no-impact attestation is required
  377. 69.10 s gammaloop-nextest-docs>
  378. 69.10 s gammaloop-nextest-docs> Location:
  379. 69.10 s gammaloop-nextest-docs> crates/alphal00p-docs-builder/src/lib.rs:992:29
  380. 69.10 s gammaloop-nextest-docs> stack backtrace:
  381. 69.10 s gammaloop-nextest-docs> 0: __rustc::rust_begin_unwind
  382. 69.10 s gammaloop-nextest-docs> 1: core::panicking::panic_fmt
  383. 69.10 s gammaloop-nextest-docs> 2: core::result::unwrap_failed
  384. 69.10 s gammaloop-nextest-docs> 3: alphal00p_docs_builder::tests::developer_scope_ranges_ignore_unrelated_edits_and_warn_only_while_watching
  385. 69.10 s gammaloop-nextest-docs> 4: <alphal00p_docs_builder::tests::developer_scope_ranges_ignore_unrelated_edits_and_warn_only_while_watching::{closure#0} as core::ops::function::FnOnce<()>>::call_once
  386. 69.10 s gammaloop-nextest-docs> note: Some details are omitted, run with `RUST_BACKTRACE=full` for a verbose backtrace.
  387. 69.10 s gammaloop-nextest-docs>
  388. 69.10 s gammaloop-nextest-docs> 2. alphal00p-docs-builder::provenance_tests::each_build_captures_one_revision_before_rendering
  389. 69.10 s gammaloop-nextest-docs> failure: test failure with exit code 101
  390. 69.10 s gammaloop-nextest-docs> thread 'provenance_tests::each_build_captures_one_revision_before_rendering' (163) panicked at crates/alphal00p-docs-builder/src/provenance_tests.rs:274:9:
  391. 69.10 s gammaloop-nextest-docs> assertion failed: command.status().unwrap().success()
  392. 69.10 s gammaloop-nextest-docs> stack backtrace:
  393. 69.10 s gammaloop-nextest-docs> 0: __rustc::rust_begin_unwind
  394. 69.10 s gammaloop-nextest-docs> 1: core::panicking::panic_fmt
  395. 69.10 s gammaloop-nextest-docs> 2: core::panicking::panic
  396. 69.10 s gammaloop-nextest-docs> 3: alphal00p_docs_builder::provenance_tests::each_build_captures_one_revision_before_rendering
  397. 69.10 s gammaloop-nextest-docs> 4: <alphal00p_docs_builder::provenance_tests::each_build_captures_one_revision_before_rendering::{closure#0} as core::ops::function::FnOnce<()>>::call_once
  398. 69.10 s gammaloop-nextest-docs> note: Some details are omitted, run with `RUST_BACKTRACE=full` for a verbose backtrace.
  399. 69.10 s gammaloop-nextest-docs> system-out
  400. 69.10 s gammaloop-nextest-docs> running 1 test
  401. 69.10 s gammaloop-nextest-docs>
  402. 69.10 s gammaloop-nextest-docs> running 1 test
  403. 69.10 s gammaloop-nextest-docs> test provenance_tests::each_build_captures_one_revision_before_rendering ... FAILED
  404. 69.10 s gammaloop-nextest-docs>
  405. 69.10 s gammaloop-nextest-docs> failures:
  406. 69.10 s gammaloop-nextest-docs>
  407. 69.10 s gammaloop-nextest-docs> failures:
  408. 69.10 s gammaloop-nextest-docs> provenance_tests::each_build_captures_one_revision_before_rendering
  409. 69.10 s gammaloop-nextest-docs>
  410. 69.10 s gammaloop-nextest-docs> test result: FAILED. 0 passed; 1 failed; 0 ignored; 0 measured; 128 filtered out; finished in 0.25s
  411. 69.10 s gammaloop-nextest-docs>
  412. 69.10 s gammaloop-nextest-docs> test provenance_tests::each_build_captures_one_revision_before_rendering ... FAILED
  413. 69.10 s gammaloop-nextest-docs>
  414. 69.10 s gammaloop-nextest-docs> failures:
  415. 69.10 s gammaloop-nextest-docs>
  416. 69.10 s gammaloop-nextest-docs> failures:
  417. 69.10 s gammaloop-nextest-docs> provenance_tests::each_build_captures_one_revision_before_rendering
  418. 69.10 s gammaloop-nextest-docs>
  419. 69.10 s gammaloop-nextest-docs> test result: FAILED. 0 passed; 1 failed; 0 ignored; 0 measured; 128 filtered out; finished in 0.27s
  420. 69.10 s gammaloop-nextest-docs> system-err
  421. 69.10 s gammaloop-nextest-docs> thread 'provenance_tests::each_build_captures_one_revision_before_rendering' (224) panicked at crates/alphal00p-docs-builder/src/provenance_tests.rs:297:14:
  422. 69.10 s gammaloop-nextest-docs> called `Result::unwrap()` on an `Err` value: developer note nix-crane-cache-reuse verified scope nix/rust-workspace.nix changed (expected 66f700580ce13b9eaee90fe0111639e46968c531, found 0a568cb5712045aee37d96bfb2f91d3d32b7e9b9); owner review or an explicit no-impact attestation is required
  423. 69.10 s gammaloop-nextest-docs>
  424. 69.10 s gammaloop-nextest-docs> Location:
  425. 69.10 s gammaloop-nextest-docs> crates/alphal00p-docs-builder/src/lib.rs:992:29
  426. 69.10 s gammaloop-nextest-docs> stack backtrace:
  427. 69.10 s gammaloop-nextest-docs> 0: __rustc::rust_begin_unwind
  428. 69.10 s gammaloop-nextest-docs> 1: core::panicking::panic_fmt
  429. 69.10 s gammaloop-nextest-docs> 2: core::result::unwrap_failed
  430. 69.10 s gammaloop-nextest-docs> 3: alphal00p_docs_builder::provenance_tests::each_build_captures_one_revision_before_rendering
  431. 69.10 s gammaloop-nextest-docs> 4: <alphal00p_docs_builder::provenance_tests::each_build_captures_one_revision_before_rendering::{closure#0} as core::ops::function::FnOnce<()>>::call_once
  432. 69.10 s gammaloop-nextest-docs> note: Some details are omitted, run with `RUST_BACKTRACE=full` for a verbose backtrace.
  433. 69.10 s gammaloop-nextest-docs>
  434. 69.10 s gammaloop-nextest-docs> thread 'provenance_tests::each_build_captures_one_revision_before_rendering' (163) panicked at crates/alphal00p-docs-builder/src/provenance_tests.rs:274:9:
  435. 69.10 s gammaloop-nextest-docs> assertion failed: command.status().unwrap().success()
  436. 69.10 s gammaloop-nextest-docs> stack backtrace:
  437. 69.10 s gammaloop-nextest-docs> 0: __rustc::rust_begin_unwind
  438. 69.10 s gammaloop-nextest-docs> 1: core::panicking::panic_fmt
  439. 69.10 s gammaloop-nextest-docs> 2: core::panicking::panic
  440. 69.10 s gammaloop-nextest-docs> 3: alphal00p_docs_builder::provenance_tests::each_build_captures_one_revision_before_rendering
  441. 69.10 s gammaloop-nextest-docs> 4: <alphal00p_docs_builder::provenance_tests::each_build_captures_one_revision_before_rendering::{closure#0} as core::ops::function::FnOnce<()>>::call_once
  442. 69.10 s gammaloop-nextest-docs> note: Some details are omitted, run with `RUST_BACKTRACE=full` for a verbose backtrace.
  443. 69.10 s gammaloop-nextest-docs>
  444. 69.10 s gammaloop-nextest-docs> 3. alphal00p-docs-builder::tests::checked_in_registry_is_valid
  445. 69.10 s gammaloop-nextest-docs> failure: test failure with exit code 101
  446. 69.10 s gammaloop-nextest-docs> thread 'tests::checked_in_registry_is_valid' (213) panicked at crates/alphal00p-docs-builder/src/lib.rs:12178:50:
  447. 69.10 s gammaloop-nextest-docs> called `Result::unwrap()` on an `Err` value: developer note nix-crane-cache-reuse verified scope nix/rust-workspace.nix changed (expected 66f700580ce13b9eaee90fe0111639e46968c531, found 0a568cb5712045aee37d96bfb2f91d3d32b7e9b9); owner review or an explicit no-impact attestation is required
  448. 69.10 s gammaloop-nextest-docs>
  449. 69.10 s gammaloop-nextest-docs> Location:
  450. 69.10 s gammaloop-nextest-docs> crates/alphal00p-docs-builder/src/lib.rs:992:29
  451. 69.10 s gammaloop-nextest-docs> stack backtrace:
  452. 69.10 s gammaloop-nextest-docs> 0: __rustc::rust_begin_unwind
  453. 69.10 s gammaloop-nextest-docs> 1: core::panicking::panic_fmt
  454. 69.10 s gammaloop-nextest-docs> 2: core::result::unwrap_failed
  455. 69.10 s gammaloop-nextest-docs> 3: alphal00p_docs_builder::tests::checked_in_registry_is_valid
  456. 69.10 s gammaloop-nextest-docs> 4: <alphal00p_docs_builder::tests::checked_in_registry_is_valid::{closure#0} as core::ops::function::FnOnce<()>>::call_once
  457. 69.10 s gammaloop-nextest-docs> note: Some details are omitted, run with `RUST_BACKTRACE=full` for a verbose backtrace.
  458. 69.10 s gammaloop-nextest-docs> system-out
  459. 69.10 s gammaloop-nextest-docs> running 1 test
  460. 69.10 s gammaloop-nextest-docs> test tests::checked_in_registry_is_valid ... FAILED
  461. 69.10 s gammaloop-nextest-docs>
  462. 69.10 s gammaloop-nextest-docs> failures:
  463. 69.10 s gammaloop-nextest-docs>
  464. 69.10 s gammaloop-nextest-docs> failures:
  465. 69.10 s gammaloop-nextest-docs> tests::checked_in_registry_is_valid
  466. 69.10 s gammaloop-nextest-docs>
  467. 69.10 s gammaloop-nextest-docs> test result: FAILED. 0 passed; 1 failed; 0 ignored; 0 measured; 128 filtered out; finished in 0.26s
  468. 69.10 s gammaloop-nextest-docs> system-err
  469. 69.10 s gammaloop-nextest-docs> thread 'tests::checked_in_registry_is_valid' (213) panicked at crates/alphal00p-docs-builder/src/lib.rs:12178:50:
  470. 69.10 s gammaloop-nextest-docs> called `Result::unwrap()` on an `Err` value: developer note nix-crane-cache-reuse verified scope nix/rust-workspace.nix changed (expected 66f700580ce13b9eaee90fe0111639e46968c531, found 0a568cb5712045aee37d96bfb2f91d3d32b7e9b9); owner review or an explicit no-impact attestation is required
  471. 69.10 s gammaloop-nextest-docs>
  472. 69.10 s gammaloop-nextest-docs> Location:
  473. 69.10 s gammaloop-nextest-docs> crates/alphal00p-docs-builder/src/lib.rs:992:29
  474. 69.10 s gammaloop-nextest-docs> stack backtrace:
  475. 69.10 s gammaloop-nextest-docs> 0: __rustc::rust_begin_unwind
  476. 69.10 s gammaloop-nextest-docs> 1: core::panicking::panic_fmt
  477. 69.10 s gammaloop-nextest-docs> 2: core::result::unwrap_failed
  478. 69.10 s gammaloop-nextest-docs> 3: alphal00p_docs_builder::tests::checked_in_registry_is_valid
  479. 69.10 s gammaloop-nextest-docs> 4: <alphal00p_docs_builder::tests::checked_in_registry_is_valid::{closure#0} as core::ops::function::FnOnce<()>>::call_once
  480. 69.10 s gammaloop-nextest-docs> note: Some details are omitted, run with `RUST_BACKTRACE=full` for a verbose backtrace.
  481. 69.10 s gammaloop-nextest-docs>
  482. 69.10 s gammaloop-nextest-docs> 4. alphal00p-docs-builder::tests::every_product_requires_a_task_chooser_and_each_supported_interface
  483. 69.10 s gammaloop-nextest-docs> failure: test failure with exit code 101
  484. 69.10 s gammaloop-nextest-docs> thread 'tests::every_product_requires_a_task_chooser_and_each_supported_interface' (308) panicked at crates/alphal00p-docs-builder/src/lib.rs:12192:9:
  485. 69.10 s gammaloop-nextest-docs> assertion failed: format!("{error:#}").contains("has no quickstart page")
  486. 69.10 s gammaloop-nextest-docs> stack backtrace:
  487. 69.10 s gammaloop-nextest-docs> 0: __rustc::rust_begin_unwind
  488. 69.10 s gammaloop-nextest-docs> 1: core::panicking::panic_fmt
  489. 69.10 s gammaloop-nextest-docs> 2: core::panicking::panic
  490. 69.10 s gammaloop-nextest-docs> 3: alphal00p_docs_builder::tests::every_product_requires_a_task_chooser_and_each_supported_interface
  491. 69.10 s gammaloop-nextest-docs> 4: <alphal00p_docs_builder::tests::every_product_requires_a_task_chooser_and_each_supported_interface::{closure#0} as core::ops::function::FnOnce<()>>::call_once
  492. 69.10 s gammaloop-nextest-docs> note: Some details are omitted, run with `RUST_BACKTRACE=full` for a verbose backtrace.
  493. 69.10 s gammaloop-nextest-docs> system-out
  494. 69.10 s gammaloop-nextest-docs> running 1 test
  495. 69.10 s gammaloop-nextest-docs> test tests::every_product_requires_a_task_chooser_and_each_supported_interface ... FAILED
  496. 69.10 s gammaloop-nextest-docs>
  497. 69.10 s gammaloop-nextest-docs> failures:
  498. 69.10 s gammaloop-nextest-docs>
  499. 69.10 s gammaloop-nextest-docs> failures:
  500. 69.10 s gammaloop-nextest-docs> tests::every_product_requires_a_task_chooser_and_each_supported_interface
  501. 69.10 s gammaloop-nextest-docs>
  502. 69.10 s gammaloop-nextest-docs> test result: FAILED. 0 passed; 1 failed; 0 ignored; 0 measured; 128 filtered out; finished in 0.26s
  503. 69.10 s gammaloop-nextest-docs> system-err
  504. 69.10 s gammaloop-nextest-docs> thread 'tests::every_product_requires_a_task_chooser_and_each_supported_interface' (308) panicked at crates/alphal00p-docs-builder/src/lib.rs:12192:9:
  505. 69.10 s gammaloop-nextest-docs> assertion failed: format!("{error:#}").contains("has no quickstart page")
  506. 69.10 s gammaloop-nextest-docs> stack backtrace:
  507. 69.10 s gammaloop-nextest-docs> 0: __rustc::rust_begin_unwind
  508. 69.10 s gammaloop-nextest-docs> 1: core::panicking::panic_fmt
  509. 69.10 s gammaloop-nextest-docs> 2: core::panicking::panic
  510. 69.10 s gammaloop-nextest-docs> 3: alphal00p_docs_builder::tests::every_product_requires_a_task_chooser_and_each_supported_interface
  511. 69.10 s gammaloop-nextest-docs> 4: <alphal00p_docs_builder::tests::every_product_requires_a_task_chooser_and_each_supported_interface::{closure#0} as core::ops::function::FnOnce<()>>::call_once
  512. 69.10 s gammaloop-nextest-docs> note: Some details are omitted, run with `RUST_BACKTRACE=full` for a verbose backtrace.
  513. 69.10 s gammaloop-nextest-docs>
  514. 69.10 s gammaloop-nextest-docs> 5. alphal00p-docs-builder::tests::pdf_manual_chapter_order_must_match_the_page_registry
  515. 69.10 s gammaloop-nextest-docs> failure: test failure with exit code 101
  516. 69.10 s gammaloop-nextest-docs> thread 'tests::pdf_manual_chapter_order_must_match_the_page_registry' (440) panicked at crates/alphal00p-docs-builder/src/lib.rs:12243:9:
  517. 69.10 s gammaloop-nextest-docs> assertion failed: format!("{error:#}").contains("PDF manual chapter order differs")
  518. 69.10 s gammaloop-nextest-docs> stack backtrace:
  519. 69.10 s gammaloop-nextest-docs> 0: __rustc::rust_begin_unwind
  520. 69.10 s gammaloop-nextest-docs> 1: core::panicking::panic_fmt
  521. 69.10 s gammaloop-nextest-docs> 2: core::panicking::panic
  522. 69.10 s gammaloop-nextest-docs> 3: alphal00p_docs_builder::tests::pdf_manual_chapter_order_must_match_the_page_registry
  523. 69.10 s gammaloop-nextest-docs> 4: <alphal00p_docs_builder::tests::pdf_manual_chapter_order_must_match_the_page_registry::{closure#0} as core::ops::function::FnOnce<()>>::call_once
  524. 69.10 s gammaloop-nextest-docs> note: Some details are omitted, run with `RUST_BACKTRACE=full` for a verbose backtrace.
  525. 69.10 s gammaloop-nextest-docs> system-out
  526. 69.10 s gammaloop-nextest-docs> running 1 test
  527. 69.10 s gammaloop-nextest-docs> test tests::pdf_manual_chapter_order_must_match_the_page_registry ... FAILED
  528. 69.10 s gammaloop-nextest-docs>
  529. 69.10 s gammaloop-nextest-docs> failures:
  530. 69.10 s gammaloop-nextest-docs>
  531. 69.10 s gammaloop-nextest-docs> failures:
  532. 69.10 s gammaloop-nextest-docs> tests::pdf_manual_chapter_order_must_match_the_page_registry
  533. 69.10 s gammaloop-nextest-docs>
  534. 69.10 s gammaloop-nextest-docs> test result: FAILED. 0 passed; 1 failed; 0 ignored; 0 measured; 128 filtered out; finished in 0.27s
  535. 69.10 s gammaloop-nextest-docs> system-err
  536. 69.10 s gammaloop-nextest-docs> thread 'tests::pdf_manual_chapter_order_must_match_the_page_registry' (440) panicked at crates/alphal00p-docs-builder/src/lib.rs:12243:9:
  537. 69.10 s gammaloop-nextest-docs> assertion failed: format!("{error:#}").contains("PDF manual chapter order differs")
  538. 69.10 s gammaloop-nextest-docs> stack backtrace:
  539. 69.10 s gammaloop-nextest-docs> 0: __rustc::rust_begin_unwind
  540. 69.10 s gammaloop-nextest-docs> 1: core::panicking::panic_fmt
  541. 69.10 s gammaloop-nextest-docs> 2: core::panicking::panic
  542. 69.10 s gammaloop-nextest-docs> 3: alphal00p_docs_builder::tests::pdf_manual_chapter_order_must_match_the_page_registry
  543. 69.10 s gammaloop-nextest-docs> 4: <alphal00p_docs_builder::tests::pdf_manual_chapter_order_must_match_the_page_registry::{closure#0} as core::ops::function::FnOnce<()>>::call_once
  544. 69.10 s gammaloop-nextest-docs> note: Some details are omitted, run with `RUST_BACKTRACE=full` for a verbose backtrace.
  545. 69.10 s gammaloop-nextest-docs> =========================================
  546. 69.12 s gammaloop-nextest-docs> Extracting 2 binaries to /build/source
  547. 69.16 s gammaloop-nextest-docs> Extracted 5 files to /build/source in 0.04s
  548. 69.17 s gammaloop-nextest-docs> ------------
  549. 69.17 s gammaloop-nextest-docs> Nextest run ID 83404f65-5b1a-47f4-8948-d0f7c0d22cf5 with nextest profile: ci_gammaloop
  550. 69.17 s gammaloop-nextest-docs> Starting 22 tests across 2 binaries
  551. 69.19 s gammaloop-nextest-docs> ------------
  552. 69.19 s gammaloop-nextest-docs> Summary [ 0.022s] 22 tests run: 22 passed, 0 skipped
  553. 69.22 s gammaloop-nextest-docs>
  554. 69.22 s gammaloop-nextest-docs> ========== nextest test summary ==========
  555. 69.22 s gammaloop-nextest-docs> report: target/nextest/ci_gammaloop/junit.xml
  556. 69.22 s gammaloop-nextest-docs> tests: 22, failures: 0, errors: 0
  557. 69.22 s gammaloop-nextest-docs> No failing testcases found.
  558. 69.22 s gammaloop-nextest-docs> =========================================
  559. 69.24 s gammaloop-nextest-docs> Extracting 3 binaries (including 2 non-test binaries), 1 build script output directory, and 2 linked paths to /build/source
  560. 69.57 s gammaloop-nextest-docs> Extracted 22 files to /build/source in 0.33s
  561. 69.58 s gammaloop-nextest-docs> ------------
  562. 69.58 s gammaloop-nextest-docs> Nextest run ID 4652b2c0-2236-4a39-97a4-c132831d2543 with nextest profile: ci_gammaloop
  563. 69.58 s gammaloop-nextest-docs> Starting 89 tests across 1 binary
  564. 69.66 s gammaloop-nextest-docs> ------------
  565. 69.66 s gammaloop-nextest-docs> Summary [ 0.082s] 89 tests run: 89 passed, 0 skipped
  566. 69.70 s gammaloop-nextest-docs>
  567. 69.70 s gammaloop-nextest-docs> ========== nextest test summary ==========
  568. 69.70 s gammaloop-nextest-docs> report: target/nextest/ci_gammaloop/junit.xml
  569. 69.70 s gammaloop-nextest-docs> tests: 89, failures: 0, errors: 0
  570. 69.70 s gammaloop-nextest-docs> No failing testcases found.
  571. 69.70 s gammaloop-nextest-docs> =========================================
  572. 69.72 s gammaloop-nextest-docs> Extracting 2 binaries to /build/source
  573. 69.76 s gammaloop-nextest-docs> Extracted 5 files to /build/source in 0.05s
  574. 69.78 s gammaloop-nextest-docs> ------------
  575. 69.78 s gammaloop-nextest-docs> Nextest run ID b8e61b86-0715-418a-bd5c-c65687ec9df1 with nextest profile: ci_gammaloop
  576. 69.78 s gammaloop-nextest-docs> Starting 10 tests across 2 binaries
  577. 85.73 s gammaloop-nextest-docs> ------------
  578. 85.73 s gammaloop-nextest-docs> Summary [ 15.952s] 10 tests run: 10 passed, 0 skipped
  579. 85.77 s gammaloop-nextest-docs>
  580. 85.77 s gammaloop-nextest-docs> ========== nextest test summary ==========
  581. 85.77 s gammaloop-nextest-docs> report: target/nextest/ci_gammaloop/junit.xml
  582. 85.77 s gammaloop-nextest-docs> tests: 10, failures: 0, errors: 0
  583. 85.77 s gammaloop-nextest-docs> No failing testcases found.
  584. 85.77 s gammaloop-nextest-docs> =========================================
  585. 85.78 s gammaloop-nextest-docs> Extracting 1 binary to /build/source
  586. 85.83 s gammaloop-nextest-docs> Extracted 4 files to /build/source in 0.05s
  587. 85.84 s gammaloop-nextest-docs> ------------
  588. 85.84 s gammaloop-nextest-docs> Nextest run ID af36f01c-5871-4cc4-be34-d30572d86417 with nextest profile: ci_gammaloop
  589. 85.84 s gammaloop-nextest-docs> Starting 0 tests across 1 binary
  590. 85.84 s gammaloop-nextest-docs> ------------
  591. 85.84 s gammaloop-nextest-docs> Summary [ 0.000s] 0 tests run: 0 passed, 0 skipped
  592. 85.88 s gammaloop-nextest-docs>
  593. 85.88 s gammaloop-nextest-docs> ========== nextest test summary ==========
  594. 85.88 s gammaloop-nextest-docs> report: target/nextest/ci_gammaloop/junit.xml
  595. 85.88 s gammaloop-nextest-docs> tests: 0, failures: 0, errors: 0
  596. 85.88 s gammaloop-nextest-docs> No failing testcases found.
  597. 85.88 s gammaloop-nextest-docs> =========================================
  598. 85.90 s gammaloop-nextest-docs> Extracting 1 binary to /build/source
  599. 85.94 s gammaloop-nextest-docs> Extracted 4 files to /build/source in 0.04s
  600. 85.95 s gammaloop-nextest-docs> ------------
  601. 85.95 s gammaloop-nextest-docs> Nextest run ID c5f09761-23ea-4e4e-a29f-a8ff02ed1e63 with nextest profile: ci_gammaloop
  602. 85.95 s gammaloop-nextest-docs> Starting 5 tests across 1 binary
  603. 85.95 s gammaloop-nextest-docs> ------------
  604. 85.95 s gammaloop-nextest-docs> Summary [ 0.006s] 5 tests run: 5 passed, 0 skipped
  605. 85.99 s gammaloop-nextest-docs>
  606. 85.99 s gammaloop-nextest-docs> ========== nextest test summary ==========
  607. 85.99 s gammaloop-nextest-docs> report: target/nextest/ci_gammaloop/junit.xml
  608. 85.99 s gammaloop-nextest-docs> tests: 5, failures: 0, errors: 0
  609. 85.99 s gammaloop-nextest-docs> No failing testcases found.
  610. 85.99 s gammaloop-nextest-docs> =========================================
  611. 86.23 s [0 built (1 failed), 72 error: Cannot build '/nix/store/vj8wdqhcdhpl16s0z9h5y6gmk5iqkmvb-gammaloop-nextest-docs.drv'.
  612. 86.23 s Reason: builder failed with exit code 100.
  613. 86.23 s Output paths:
  614. 86.23 s /nix/store/ydqcrz3r95y4diyz90dlyicd9s8v4bln-gammaloop-nextest-docs
  615. 86.23 s Last 584 log lines:
  616. 86.23 s > Extracting 2 binaries to /build/source
  617. 86.23 s > Extracted 5 files to /build/source in 0.05s
  618. 86.23 s > ------------
  619. 86.23 s > Nextest run ID f6f9c216-f175-4d58-b410-38a939b7edc4 with nextest profile: ci_gammaloop
  620. 86.23 s > Starting 129 tests across 2 binaries
  621. 86.23 s > FAIL [ 0.214s] ( 62/129) alphal00p-docs-builder tests::developer_scope_ranges_ignore_unrelated_edits_and_warn_only_while_watching
  622. 86.23 s > stdout ---
  623. 86.23 s >
  624. 86.23 s > running 1 test
  625. 86.23 s > test tests::developer_scope_ranges_ignore_unrelated_edits_and_warn_only_while_watching ... FAILED
  626. 86.23 s >
  627. 86.23 s > failures:
  628. 86.23 s >
  629. 86.23 s > failures:
  630. 86.23 s > tests::developer_scope_ranges_ignore_unrelated_edits_and_warn_only_while_watching
  631. 86.23 s >
  632. 86.23 s > test result: FAILED. 0 passed; 1 failed; 0 ignored; 0 measured; 128 filtered out; finished in 0.21s
  633. 86.23 s >
  634. 86.23 s > stderr ---
  635. 86.23 s >
  636. 86.23 s > thread 'tests::developer_scope_ranges_ignore_unrelated_edits_and_warn_only_while_watching' (286) panicked at crates/alphal00p-docs-builder/src/lib.rs:12263:29:
  637. 86.23 s > called `Result::unwrap()` on an `Err` value: developer note nix-crane-cache-reuse verified scope nix/rust-workspace.nix changed (expected 66f700580ce13b9eaee90fe0111639e46968c531, found 0a568cb5712045aee37d96bfb2f91d3d32b7e9b9); owner review or an explicit no-impact attestation is required
  638. 86.23 s >
  639. 86.23 s > Location:
  640. 86.23 s > crates/alphal00p-docs-builder/src/lib.rs:992:29
  641. 86.23 s > stack backtrace:
  642. 86.23 s > 0: __rustc::rust_begin_unwind
  643. 86.23 s > 1: core::panicking::panic_fmt
  644. 86.23 s > 2: core::result::unwrap_failed
  645. 86.23 s > 3: alphal00p_docs_builder::tests::developer_scope_ranges_ignore_unrelated_edits_and_warn_only_while_watching
  646. 86.23 s > 4: <alphal00p_docs_builder::tests::developer_scope_ranges_ignore_unrelated_edits_and_warn_only_while_watching::{closure#0} as core::ops::function::FnOnce<()>>::call_once
  647. 86.23 s > note: Some details are omitted, run with `RUST_BACKTRACE=full` for a verbose backtrace.
  648. 86.23 s >
  649. 86.23 s > FAIL [ 0.274s] ( 66/129) alphal00p-docs-builder provenance_tests::each_build_captures_one_revision_before_rendering
  650. 86.23 s > stdout ---
  651. 86.23 s >
  652. 86.23 s > running 1 test
  653. 86.23 s >
  654. 86.23 s > running 1 test
  655. 86.23 s > test provenance_tests::each_build_captures_one_revision_before_rendering ... FAILED
  656. 86.23 s >
  657. 86.23 s > failures:
  658. 86.23 s >
  659. 86.23 s > failures:
  660. 86.23 s > provenance_tests::each_build_captures_one_revision_before_rendering
  661. 86.23 s >
  662. 86.23 s > test result: FAILED. 0 passed; 1 failed; 0 ignored; 0 measured; 128 filtered out; finished in 0.25s
  663. 86.23 s >
  664. 86.23 s > test provenance_tests::each_build_captures_one_revision_before_rendering ... FAILED
  665. 86.23 s >
  666. 86.23 s > failures:
  667. 86.23 s >
  668. 86.23 s > failures:
  669. 86.23 s > provenance_tests::each_build_captures_one_revision_before_rendering
  670. 86.23 s >
  671. 86.23 s > test result: FAILED. 0 passed; 1 failed; 0 ignored; 0 measured; 128 filtered out; finished in 0.27s
  672. 86.23 s >
  673. 86.23 s > stderr ---
  674. 86.23 s >
  675. 86.23 s > thread 'provenance_tests::each_build_captures_one_revision_before_rendering' (224) panicked at crates/alphal00p-docs-builder/src/provenance_tests.rs:297:14:
  676. 86.23 s > called `Result::unwrap()` on an `Err` value: developer note nix-crane-cache-reuse verified scope nix/rust-workspace.nix changed (expected 66f700580ce13b9eaee90fe0111639e46968c531, found 0a568cb5712045aee37d96bfb2f91d3d32b7e9b9); owner review or an explicit no-impact attestation is required
  677. 86.23 s >
  678. 86.23 s > Location:
  679. 86.23 s > crates/alphal00p-docs-builder/src/lib.rs:992:29
  680. 86.23 s > stack backtrace:
  681. 86.23 s > 0: __rustc::rust_begin_unwind
  682. 86.23 s > 1: core::panicking::panic_fmt
  683. 86.23 s > 2: core::result::unwrap_failed
  684. 86.23 s > 3: alphal00p_docs_builder::provenance_tests::each_build_captures_one_revision_before_rendering
  685. 86.23 s > 4: <alphal00p_docs_builder::provenance_tests::each_build_captures_one_revision_before_rendering::{closure#0} as core::ops::function::FnOnce<()>>::call_once
  686. 86.23 s > note: Some details are omitted, run with `RUST_BACKTRACE=full` for a verbose backtrace.
  687. 86.23 s >
  688. 86.23 s > thread 'provenance_tests::each_build_captures_one_revision_before_rendering' (163) panicked at crates/alphal00p-docs-builder/src/provenance_tests.rs:274:9:
  689. 86.23 s > assertion failed: command.status().unwrap().success()
  690. 86.23 s > stack backtrace:
  691. 86.23 s > 0: __rustc::rust_begin_unwind
  692. 86.23 s > 1: core::panicking::panic_fmt
  693. 86.23 s > 2: core::panicking::panic
  694. 86.23 s > 3: alphal00p_docs_builder::provenance_tests::each_build_captures_one_revision_before_rendering
  695. 86.23 s > 4: <alphal00p_docs_builder::provenance_tests::each_build_captures_one_revision_before_rendering::{closure#0} as core::ops::function::FnOnce<()>>::call_once
  696. 86.23 s > note: Some details are omitted, run with `RUST_BACKTRACE=full` for a verbose backtrace.
  697. 86.23 s >
  698. 86.23 s > FAIL [ 0.274s] ( 67/129) alphal00p-docs-builder tests::checked_in_registry_is_valid
  699. 86.23 s > stdout ---
  700. 86.23 s >
  701. 86.23 s > running 1 test
  702. 86.23 s > test tests::checked_in_registry_is_valid ... FAILED
  703. 86.23 s >
  704. 86.23 s > failures:
  705. 86.23 s >
  706. 86.23 s > failures:
  707. 86.23 s > tests::checked_in_registry_is_valid
  708. 86.23 s >
  709. 86.23 s > test result: FAILED. 0 passed; 1 failed; 0 ignored; 0 measured; 128 filtered out; finished in 0.26s
  710. 86.23 s >
  711. 86.23 s > stderr ---
  712. 86.23 s >
  713. 86.23 s > thread 'tests::checked_in_registry_is_valid' (213) panicked at crates/alphal00p-docs-builder/src/lib.rs:12178:50:
  714. 86.23 s > called `Result::unwrap()` on an `Err` value: developer note nix-crane-cache-reuse verified scope nix/rust-workspace.nix changed (expected 66f700580ce13b9eaee90fe0111639e46968c531, found 0a568cb5712045aee37d96bfb2f91d3d32b7e9b9); owner review or an explicit no-impact attestation is required
  715. 86.23 s >
  716. 86.23 s > Location:
  717. 86.23 s > crates/alphal00p-docs-builder/src/lib.rs:992:29
  718. 86.23 s > stack backtrace:
  719. 86.23 s > 0: __rustc::rust_begin_unwind
  720. 86.23 s > 1: core::panicking::panic_fmt
  721. 86.23 s > 2: core::result::unwrap_failed
  722. 86.23 s > 3: alphal00p_docs_builder::tests::checked_in_registry_is_valid
  723. 86.23 s > 4: <alphal00p_docs_builder::tests::checked_in_registry_is_valid::{closure#0} as core::ops::function::FnOnce<()>>::call_once
  724. 86.23 s > note: Some details are omitted, run with `RUST_BACKTRACE=full` for a verbose backtrace.
  725. 86.23 s >
  726. 86.23 s > FAIL [ 0.267s] ( 77/129) alphal00p-docs-builder tests::every_product_requires_a_task_chooser_and_each_supported_interface
  727. 86.23 s > stdout ---
  728. 86.23 s >
  729. 86.23 s > running 1 test
  730. 86.23 s > test tests::every_product_requires_a_task_chooser_and_each_supported_interface ... FAILED
  731. 86.23 s >
  732. 86.23 s > failures:
  733. 86.23 s >
  734. 86.23 s > failures:
  735. 86.23 s > tests::every_product_requires_a_task_chooser_and_each_supported_interface
  736. 86.23 s >
  737. 86.23 s > test result: FAILED. 0 passed; 1 failed; 0 ignored; 0 measured; 128 filtered out; finished in 0.26s
  738. 86.23 s >
  739. 86.23 s > stderr ---
  740. 86.23 s >
  741. 86.23 s > thread 'tests::every_product_requires_a_task_chooser_and_each_supported_interface' (308) panicked at crates/alphal00p-docs-builder/src/lib.rs:12192:9:
  742. 86.23 s > assertion failed: format!("{error:#}").contains("has no quickstart page")
  743. 86.23 s > stack backtrace:
  744. 86.23 s > 0: __rustc::rust_begin_unwind
  745. 86.23 s > 1: core::panicking::panic_fmt
  746. 86.23 s > 2: core::panicking::panic
  747. 86.23 s > 3: alphal00p_docs_builder::tests::every_product_requires_a_task_chooser_and_each_supported_interface
  748. 86.23 s > 4: <alphal00p_docs_builder::tests::every_product_requires_a_task_chooser_and_each_supported_interface::{closure#0} as core::ops::function::FnOnce<()>>::call_once
  749. 86.23 s > note: Some details are omitted, run with `RUST_BACKTRACE=full` for a verbose backtrace.
  750. 86.23 s >
  751. 86.23 s > FAIL [ 0.294s] (121/129) alphal00p-docs-builder tests::pdf_manual_chapter_order_must_match_the_page_registry
  752. 86.23 s > stdout ---
  753. 86.23 s >
  754. 86.23 s > running 1 test
  755. 86.23 s > test tests::pdf_manual_chapter_order_must_match_the_page_registry ... FAILED
  756. 86.23 s >
  757. 86.23 s > failures:
  758. 86.23 s >
  759. 86.23 s > failures:
  760. 86.23 s > tests::pdf_manual_chapter_order_must_match_the_page_registry
  761. 86.23 s >
  762. 86.23 s > test result: FAILED. 0 passed; 1 failed; 0 ignored; 0 measured; 128 filtered out; finished in 0.27s
  763. 86.23 s >
  764. 86.23 s > stderr ---
  765. 86.23 s >
  766. 86.23 s > thread 'tests::pdf_manual_chapter_order_must_match_the_page_registry' (440) panicked at crates/alphal00p-docs-builder/src/lib.rs:12243:9:
  767. 86.23 s > assertion failed: format!("{error:#}").contains("PDF manual chapter order differs")
  768. 86.23 s > stack backtrace:
  769. 86.23 s > 0: __rustc::rust_begin_unwind
  770. 86.23 s > 1: core::panicking::panic_fmt
  771. 86.23 s > 2: core::panicking::panic
  772. 86.23 s > 3: alphal00p_docs_builder::tests::pdf_manual_chapter_order_must_match_the_page_registry
  773. 86.23 s > 4: <alphal00p_docs_builder::tests::pdf_manual_chapter_order_must_match_the_page_registry::{closure#0} as core::ops::function::FnOnce<()>>::call_once
  774. 86.23 s > note: Some details are omitted, run with `RUST_BACKTRACE=full` for a verbose backtrace.
  775. 86.23 s >
  776. 86.23 s > ------------
  777. 86.23 s > Summary [ 17.240s] 129 tests run: 124 passed, 5 failed, 0 skipped
  778. 86.23 s > FAIL [ 0.214s] ( 62/129) alphal00p-docs-builder tests::developer_scope_ranges_ignore_unrelated_edits_and_warn_only_while_watching
  779. 86.23 s > stdout ---
  780. 86.23 s >
  781. 86.23 s > running 1 test
  782. 86.23 s > test tests::developer_scope_ranges_ignore_unrelated_edits_and_warn_only_while_watching ... FAILED
  783. 86.23 s >
  784. 86.23 s > failures:
  785. 86.23 s >
  786. 86.23 s > failures:
  787. 86.23 s > tests::developer_scope_ranges_ignore_unrelated_edits_and_warn_only_while_watching
  788. 86.23 s >
  789. 86.23 s > test result: FAILED. 0 passed; 1 failed; 0 ignored; 0 measured; 128 filtered out; finished in 0.21s
  790. 86.23 s >
  791. 86.23 s > stderr ---
  792. 86.23 s >
  793. 86.23 s > thread 'tests::developer_scope_ranges_ignore_unrelated_edits_and_warn_only_while_watching' (286) panicked at crates/alphal00p-docs-builder/src/lib.rs:12263:29:
  794. 86.23 s > called `Result::unwrap()` on an `Err` value: developer note nix-crane-cache-reuse verified scope nix/rust-workspace.nix changed (expected 66f700580ce13b9eaee90fe0111639e46968c531, found 0a568cb5712045aee37d96bfb2f91d3d32b7e9b9); owner review or an explicit no-impact attestation is required
  795. 86.23 s >
  796. 86.23 s > Location:
  797. 86.23 s > crates/alphal00p-docs-builder/src/lib.rs:992:29
  798. 86.23 s > stack backtrace:
  799. 86.23 s > 0: __rustc::rust_begin_unwind
  800. 86.23 s > 1: core::panicking::panic_fmt
  801. 86.23 s > 2: core::result::unwrap_failed
  802. 86.23 s > 3: alphal00p_docs_builder::tests::developer_scope_ranges_ignore_unrelated_edits_and_warn_only_while_watching
  803. 86.23 s > 4: <alphal00p_docs_builder::tests::developer_scope_ranges_ignore_unrelated_edits_and_warn_only_while_watching::{closure#0} as core::ops::function::FnOnce<()>>::call_once
  804. 86.23 s > note: Some details are omitted, run with `RUST_BACKTRACE=full` for a verbose backtrace.
  805. 86.23 s >
  806. 86.23 s > FAIL [ 0.274s] ( 66/129) alphal00p-docs-builder provenance_tests::each_build_captures_one_revision_before_rendering
  807. 86.23 s > stdout ---
  808. 86.23 s >
  809. 86.23 s > running 1 test
  810. 86.23 s >
  811. 86.23 s > running 1 test
  812. 86.23 s > test provenance_tests::each_build_captures_one_revision_before_rendering ... FAILED
  813. 86.23 s >
  814. 86.23 s > failures:
  815. 86.23 s >
  816. 86.23 s > failures:
  817. 86.23 s > provenance_tests::each_build_captures_one_revision_before_rendering
  818. 86.23 s >
  819. 86.23 s > test result: FAILED. 0 passed; 1 failed; 0 ignored; 0 measured; 128 filtered out; finished in 0.25s
  820. 86.23 s >
  821. 86.23 s > test provenance_tests::each_build_captures_one_revision_before_rendering ... FAILED
  822. 86.23 s >
  823. 86.23 s > failures:
  824. 86.23 s >
  825. 86.23 s > failures:
  826. 86.23 s > provenance_tests::each_build_captures_one_revision_before_rendering
  827. 86.23 s >
  828. 86.23 s > test result: FAILED. 0 passed; 1 failed; 0 ignored; 0 measured; 128 filtered out; finished in 0.27s
  829. 86.23 s >
  830. 86.23 s > stderr ---
  831. 86.23 s >
  832. 86.23 s > thread 'provenance_tests::each_build_captures_one_revision_before_rendering' (224) panicked at crates/alphal00p-docs-builder/src/provenance_tests.rs:297:14:
  833. 86.23 s > called `Result::unwrap()` on an `Err` value: developer note nix-crane-cache-reuse verified scope nix/rust-workspace.nix changed (expected 66f700580ce13b9eaee90fe0111639e46968c531, found 0a568cb5712045aee37d96bfb2f91d3d32b7e9b9); owner review or an explicit no-impact attestation is required
  834. 86.23 s >
  835. 86.23 s > Location:
  836. 86.23 s > crates/alphal00p-docs-builder/src/lib.rs:992:29
  837. 86.23 s > stack backtrace:
  838. 86.23 s > 0: __rustc::rust_begin_unwind
  839. 86.23 s > 1: core::panicking::panic_fmt
  840. 86.23 s > 2: core::result::unwrap_failed
  841. 86.23 s > 3: alphal00p_docs_builder::provenance_tests::each_build_captures_one_revision_before_rendering
  842. 86.23 s > 4: <alphal00p_docs_builder::provenance_tests::each_build_captures_one_revision_before_rendering::{closure#0} as core::ops::function::FnOnce<()>>::call_once
  843. 86.23 s > note: Some details are omitted, run with `RUST_BACKTRACE=full` for a verbose backtrace.
  844. 86.23 s >
  845. 86.23 s > thread 'provenance_tests::each_build_captures_one_revision_before_rendering' (163) panicked at crates/alphal00p-docs-builder/src/provenance_tests.rs:274:9:
  846. 86.23 s > assertion failed: command.status().unwrap().success()
  847. 86.23 s > stack backtrace:
  848. 86.23 s > 0: __rustc::rust_begin_unwind
  849. 86.23 s > 1: core::panicking::panic_fmt
  850. 86.23 s > 2: core::panicking::panic
  851. 86.23 s > 3: alphal00p_docs_builder::provenance_tests::each_build_captures_one_revision_before_rendering
  852. 86.23 s > 4: <alphal00p_docs_builder::provenance_tests::each_build_captures_one_revision_before_rendering::{closure#0} as core::ops::function::FnOnce<()>>::call_once
  853. 86.23 s > note: Some details are omitted, run with `RUST_BACKTRACE=full` for a verbose backtrace.
  854. 86.23 s >
  855. 86.23 s > FAIL [ 0.274s] ( 67/129) alphal00p-docs-builder tests::checked_in_registry_is_valid
  856. 86.23 s > stdout ---
  857. 86.23 s >
  858. 86.23 s > running 1 test
  859. 86.23 s > test tests::checked_in_registry_is_valid ... FAILED
  860. 86.23 s >
  861. 86.23 s > failures:
  862. 86.23 s >
  863. 86.23 s > failures:
  864. 86.23 s > tests::checked_in_registry_is_valid
  865. 86.23 s >
  866. 86.23 s > test result: FAILED. 0 passed; 1 failed; 0 ignored; 0 measured; 128 filtered out; finished in 0.26s
  867. 86.23 s >
  868. 86.23 s > stderr ---
  869. 86.23 s >
  870. 86.23 s > thread 'tests::checked_in_registry_is_valid' (213) panicked at crates/alphal00p-docs-builder/src/lib.rs:12178:50:
  871. 86.23 s > called `Result::unwrap()` on an `Err` value: developer note nix-crane-cache-reuse verified scope nix/rust-workspace.nix changed (expected 66f700580ce13b9eaee90fe0111639e46968c531, found 0a568cb5712045aee37d96bfb2f91d3d32b7e9b9); owner review or an explicit no-impact attestation is required
  872. 86.23 s >
  873. 86.23 s > Location:
  874. 86.23 s > crates/alphal00p-docs-builder/src/lib.rs:992:29
  875. 86.23 s > stack backtrace:
  876. 86.23 s > 0: __rustc::rust_begin_unwind
  877. 86.23 s > 1: core::panicking::panic_fmt
  878. 86.23 s > 2: core::result::unwrap_failed
  879. 86.23 s > 3: alphal00p_docs_builder::tests::checked_in_registry_is_valid
  880. 86.23 s > 4: <alphal00p_docs_builder::tests::checked_in_registry_is_valid::{closure#0} as core::ops::function::FnOnce<()>>::call_once
  881. 86.23 s > note: Some details are omitted, run with `RUST_BACKTRACE=full` for a verbose backtrace.
  882. 86.23 s >
  883. 86.23 s > FAIL [ 0.267s] ( 77/129) alphal00p-docs-builder tests::every_product_requires_a_task_chooser_and_each_supported_interface
  884. 86.23 s > stdout ---
  885. 86.23 s >
  886. 86.23 s > running 1 test
  887. 86.23 s > test tests::every_product_requires_a_task_chooser_and_each_supported_interface ... FAILED
  888. 86.23 s >
  889. 86.23 s > failures:
  890. 86.23 s >
  891. 86.23 s > failures:
  892. 86.23 s > tests::every_product_requires_a_task_chooser_and_each_supported_interface
  893. 86.23 s >
  894. 86.23 s > test result: FAILED. 0 passed; 1 failed; 0 ignored; 0 measured; 128 filtered out; finished in 0.26s
  895. 86.23 s >
  896. 86.23 s > stderr ---
  897. 86.23 s >
  898. 86.23 s > thread 'tests::every_product_requires_a_task_chooser_and_each_supported_interface' (308) panicked at crates/alphal00p-docs-builder/src/lib.rs:12192:9:
  899. 86.23 s > assertion failed: format!("{error:#}").contains("has no quickstart page")
  900. 86.23 s > stack backtrace:
  901. 86.23 s > 0: __rustc::rust_begin_unwind
  902. 86.23 s > 1: core::panicking::panic_fmt
  903. 86.23 s > 2: core::panicking::panic
  904. 86.23 s > 3: alphal00p_docs_builder::tests::every_product_requires_a_task_chooser_and_each_supported_interface
  905. 86.23 s > 4: <alphal00p_docs_builder::tests::every_product_requires_a_task_chooser_and_each_supported_interface::{closure#0} as core::ops::function::FnOnce<()>>::call_once
  906. 86.23 s > note: Some details are omitted, run with `RUST_BACKTRACE=full` for a verbose backtrace.
  907. 86.23 s >
  908. 86.23 s > FAIL [ 0.294s] (121/129) alphal00p-docs-builder tests::pdf_manual_chapter_order_must_match_the_page_registry
  909. 86.23 s > stdout ---
  910. 86.23 s >
  911. 86.23 s > running 1 test
  912. 86.23 s > test tests::pdf_manual_chapter_order_must_match_the_page_registry ... FAILED
  913. 86.23 s >
  914. 86.23 s > failures:
  915. 86.23 s >
  916. 86.23 s > failures:
  917. 86.23 s > tests::pdf_manual_chapter_order_must_match_the_page_registry
  918. 86.23 s >
  919. 86.23 s > test result: FAILED. 0 passed; 1 failed; 0 ignored; 0 measured; 128 filtered out; finished in 0.27s
  920. 86.23 s >
  921. 86.23 s > stderr ---
  922. 86.23 s >
  923. 86.23 s > thread 'tests::pdf_manual_chapter_order_must_match_the_page_registry' (440) panicked at crates/alphal00p-docs-builder/src/lib.rs:12243:9:
  924. 86.23 s > assertion failed: format!("{error:#}").contains("PDF manual chapter order differs")
  925. 86.23 s > stack backtrace:
  926. 86.23 s > 0: __rustc::rust_begin_unwind
  927. 86.23 s > 1: core::panicking::panic_fmt
  928. 86.23 s > 2: core::panicking::panic
  929. 86.23 s > 3: alphal00p_docs_builder::tests::pdf_manual_chapter_order_must_match_the_page_registry
  930. 86.23 s > 4: <alphal00p_docs_builder::tests::pdf_manual_chapter_order_must_match_the_page_registry::{closure#0} as core::ops::function::FnOnce<()>>::call_once
  931. 86.23 s > note: Some details are omitted, run with `RUST_BACKTRACE=full` for a verbose backtrace.
  932. 86.23 s >
  933. 86.23 s > error: test run failed
  934. 86.23 s >
  935. 86.23 s > ========== nextest test summary ==========
  936. 86.23 s > report: target/nextest/ci_gammaloop/junit.xml
  937. 86.23 s > tests: 129, failures: 5, errors: 0
  938. 86.23 s >
  939. 86.23 s > 1. alphal00p-docs-builder::tests::developer_scope_ranges_ignore_unrelated_edits_and_warn_only_while_watching
  940. 86.23 s > failure: test failure with exit code 101
  941. 86.23 s > thread 'tests::developer_scope_ranges_ignore_unrelated_edits_and_warn_only_while_watching' (286) panicked at crates/alphal00p-docs-builder/src/lib.rs:12263:29:
  942. 86.23 s > called `Result::unwrap()` on an `Err` value: developer note nix-crane-cache-reuse verified scope nix/rust-workspace.nix changed (expected 66f700580ce13b9eaee90fe0111639e46968c531, found 0a568cb5712045aee37d96bfb2f91d3d32b7e9b9); owner review or an explicit no-impact attestation is required
  943. 86.23 s >
  944. 86.23 s > Location:
  945. 86.23 s > crates/alphal00p-docs-builder/src/lib.rs:992:29
  946. 86.23 s > stack backtrace:
  947. 86.23 s > 0: __rustc::rust_begin_unwind
  948. 86.23 s > 1: core::panicking::panic_fmt
  949. 86.23 s > 2: core::result::unwrap_failed
  950. 86.23 s > 3: alphal00p_docs_builder::tests::developer_scope_ranges_ignore_unrelated_edits_and_warn_only_while_watching
  951. 86.23 s > 4: <alphal00p_docs_builder::tests::developer_scope_ranges_ignore_unrelated_edits_and_warn_only_while_watching::{closure#0} as core::ops::function::FnOnce<()>>::call_once
  952. 86.23 s > note: Some details are omitted, run with `RUST_BACKTRACE=full` for a verbose backtrace.
  953. 86.23 s > system-out
  954. 86.23 s > running 1 test
  955. 86.23 s > test tests::developer_scope_ranges_ignore_unrelated_edits_and_warn_only_while_watching ... FAILED
  956. 86.23 s >
  957. 86.23 s > failures:
  958. 86.23 s >
  959. 86.23 s > failures:
  960. 86.23 s > tests::developer_scope_ranges_ignore_unrelated_edits_and_warn_only_while_watching
  961. 86.23 s >
  962. 86.23 s > test result: FAILED. 0 passed; 1 failed; 0 ignored; 0 measured; 128 filtered out; finished in 0.21s
  963. 86.23 s > system-err
  964. 86.23 s > thread 'tests::developer_scope_ranges_ignore_unrelated_edits_and_warn_only_while_watching' (286) panicked at crates/alphal00p-docs-builder/src/lib.rs:12263:29:
  965. 86.23 s > called `Result::unwrap()` on an `Err` value: developer note nix-crane-cache-reuse verified scope nix/rust-workspace.nix changed (expected 66f700580ce13b9eaee90fe0111639e46968c531, found 0a568cb5712045aee37d96bfb2f91d3d32b7e9b9); owner review or an explicit no-impact attestation is required
  966. 86.23 s >
  967. 86.23 s > Location:
  968. 86.23 s > crates/alphal00p-docs-builder/src/lib.rs:992:29
  969. 86.23 s > stack backtrace:
  970. 86.23 s > 0: __rustc::rust_begin_unwind
  971. 86.23 s > 1: core::panicking::panic_fmt
  972. 86.23 s > 2: core::result::unwrap_failed
  973. 86.23 s > 3: alphal00p_docs_builder::tests::developer_scope_ranges_ignore_unrelated_edits_and_warn_only_while_watching
  974. 86.23 s > 4: <alphal00p_docs_builder::tests::developer_scope_ranges_ignore_unrelated_edits_and_warn_only_while_watching::{closure#0} as core::ops::function::FnOnce<()>>::call_once
  975. 86.23 s > note: Some details are omitted, run with `RUST_BACKTRACE=full` for a verbose backtrace.
  976. 86.23 s >
  977. 86.23 s > 2. alphal00p-docs-builder::provenance_tests::each_build_captures_one_revision_before_rendering
  978. 86.23 s > failure: test failure with exit code 101
  979. 86.23 s > thread 'provenance_tests::each_build_captures_one_revision_before_rendering' (163) panicked at crates/alphal00p-docs-builder/src/provenance_tests.rs:274:9:
  980. 86.23 s > assertion failed: command.status().unwrap().success()
  981. 86.23 s > stack backtrace:
  982. 86.23 s > 0: __rustc::rust_begin_unwind
  983. 86.23 s > 1: core::panicking::panic_fmt
  984. 86.23 s > 2: core::panicking::panic
  985. 86.23 s > 3: alphal00p_docs_builder::provenance_tests::each_build_captures_one_revision_before_rendering
  986. 86.23 s > 4: <alphal00p_docs_builder::provenance_tests::each_build_captures_one_revision_before_rendering::{closure#0} as core::ops::function::FnOnce<()>>::call_once
  987. 86.23 s > note: Some details are omitted, run with `RUST_BACKTRACE=full` for a verbose backtrace.
  988. 86.23 s > system-out
  989. 86.23 s > running 1 test
  990. 86.23 s >
  991. 86.23 s > running 1 test
  992. 86.23 s > test provenance_tests::each_build_captures_one_revision_before_rendering ... FAILED
  993. 86.23 s >
  994. 86.23 s > failures:
  995. 86.23 s >
  996. 86.23 s > failures:
  997. 86.23 s > provenance_tests::each_build_captures_one_revision_before_rendering
  998. 86.23 s >
  999. 86.23 s > test result: FAILED. 0 passed; 1 failed; 0 ignored; 0 measured; 128 filtered out; finished in 0.25s
  1000. 86.23 s >
  1001. 86.23 s > test provenance_tests::each_build_captures_one_revision_before_rendering ... FAILED
  1002. 86.23 s >
  1003. 86.23 s > failures:
  1004. 86.23 s >
  1005. 86.23 s > failures:
  1006. 86.23 s > provenance_tests::each_build_captures_one_revision_before_rendering
  1007. 86.23 s >
  1008. 86.23 s > test result: FAILED. 0 passed; 1 failed; 0 ignored; 0 measured; 128 filtered out; finished in 0.27s
  1009. 86.23 s > system-err
  1010. 86.23 s > thread 'provenance_tests::each_build_captures_one_revision_before_rendering' (224) panicked at crates/alphal00p-docs-builder/src/provenance_tests.rs:297:14:
  1011. 86.23 s > called `Result::unwrap()` on an `Err` value: developer note nix-crane-cache-reuse verified scope nix/rust-workspace.nix changed (expected 66f700580ce13b9eaee90fe0111639e46968c531, found 0a568cb5712045aee37d96bfb2f91d3d32b7e9b9); owner review or an explicit no-impact attestation is required
  1012. 86.23 s >
  1013. 86.23 s > Location:
  1014. 86.23 s > crates/alphal00p-docs-builder/src/lib.rs:992:29
  1015. 86.23 s > stack backtrace:
  1016. 86.23 s > 0: __rustc::rust_begin_unwind
  1017. 86.23 s > 1: core::panicking::panic_fmt
  1018. 86.23 s > 2: core::result::unwrap_failed
  1019. 86.23 s > 3: alphal00p_docs_builder::provenance_tests::each_build_captures_one_revision_before_rendering
  1020. 86.23 s > 4: <alphal00p_docs_builder::provenance_tests::each_build_captures_one_revision_before_rendering::{closure#0} as core::ops::function::FnOnce<()>>::call_once
  1021. 86.23 s > note: Some details are omitted, run with `RUST_BACKTRACE=full` for a verbose backtrace.
  1022. 86.23 s >
  1023. 86.23 s > thread 'provenance_tests::each_build_captures_one_revision_before_rendering' (163) panicked at crates/alphal00p-docs-builder/src/provenance_tests.rs:274:9:
  1024. 86.23 s > assertion failed: command.status().unwrap().success()
  1025. 86.23 s > stack backtrace:
  1026. 86.23 s > 0: __rustc::rust_begin_unwind
  1027. 86.23 s > 1: core::panicking::panic_fmt
  1028. 86.23 s > 2: core::panicking::panic
  1029. 86.23 s > 3: alphal00p_docs_builder::provenance_tests::each_build_captures_one_revision_before_rendering
  1030. 86.23 s > 4: <alphal00p_docs_builder::provenance_tests::each_build_captures_one_revision_before_rendering::{closure#0} as core::ops::function::FnOnce<()>>::call_once
  1031. 86.23 s > note: Some details are omitted, run with `RUST_BACKTRACE=full` for a verbose backtrace.
  1032. 86.23 s >
  1033. 86.23 s > 3. alphal00p-docs-builder::tests::checked_in_registry_is_valid
  1034. 86.23 s > failure: test failure with exit code 101
  1035. 86.23 s > thread 'tests::checked_in_registry_is_valid' (213) panicked at crates/alphal00p-docs-builder/src/lib.rs:12178:50:
  1036. 86.23 s > called `Result::unwrap()` on an `Err` value: developer note nix-crane-cache-reuse verified scope nix/rust-workspace.nix changed (expected 66f700580ce13b9eaee90fe0111639e46968c531, found 0a568cb5712045aee37d96bfb2f91d3d32b7e9b9); owner review or an explicit no-impact attestation is required
  1037. 86.23 s >
  1038. 86.23 s > Location:
  1039. 86.23 s > crates/alphal00p-docs-builder/src/lib.rs:992:29
  1040. 86.23 s > stack backtrace:
  1041. 86.23 s > 0: __rustc::rust_begin_unwind
  1042. 86.23 s > 1: core::panicking::panic_fmt
  1043. 86.23 s > 2: core::result::unwrap_failed
  1044. 86.23 s > 3: alphal00p_docs_builder::tests::checked_in_registry_is_valid
  1045. 86.23 s > 4: <alphal00p_docs_builder::tests::checked_in_registry_is_valid::{closure#0} as core::ops::function::FnOnce<()>>::call_once
  1046. 86.23 s > note: Some details are omitted, run with `RUST_BACKTRACE=full` for a verbose backtrace.
  1047. 86.23 s > system-out
  1048. 86.23 s > running 1 test
  1049. 86.23 s > test tests::checked_in_registry_is_valid ... FAILED
  1050. 86.23 s >
  1051. 86.23 s > failures:
  1052. 86.23 s >
  1053. 86.23 s > failures:
  1054. 86.23 s > tests::checked_in_registry_is_valid
  1055. 86.23 s >
  1056. 86.23 s > test result: FAILED. 0 passed; 1 failed; 0 ignored; 0 measured; 128 filtered out; finished in 0.26s
  1057. 86.23 s > system-err
  1058. 86.23 s > thread 'tests::checked_in_registry_is_valid' (213) panicked at crates/alphal00p-docs-builder/src/lib.rs:12178:50:
  1059. 86.23 s > called `Result::unwrap()` on an `Err` value: developer note nix-crane-cache-reuse verified scope nix/rust-workspace.nix changed (expected 66f700580ce13b9eaee90fe0111639e46968c531, found 0a568cb5712045aee37d96bfb2f91d3d32b7e9b9); owner review or an explicit no-impact attestation is required
  1060. 86.23 s >
  1061. 86.23 s > Location:
  1062. 86.23 s > crates/alphal00p-docs-builder/src/lib.rs:992:29
  1063. 86.23 s > stack backtrace:
  1064. 86.23 s > 0: __rustc::rust_begin_unwind
  1065. 86.23 s > 1: core::panicking::panic_fmt
  1066. 86.23 s > 2: core::result::unwrap_failed
  1067. 86.23 s > 3: alphal00p_docs_builder::tests::checked_in_registry_is_valid
  1068. 86.23 s > 4: <alphal00p_docs_builder::tests::checked_in_registry_is_valid::{closure#0} as core::ops::function::FnOnce<()>>::call_once
  1069. 86.23 s > note: Some details are omitted, run with `RUST_BACKTRACE=full` for a verbose backtrace.
  1070. 86.23 s >
  1071. 86.23 s > 4. alphal00p-docs-builder::tests::every_product_requires_a_task_chooser_and_each_supported_interface
  1072. 86.23 s > failure: test failure with exit code 101
  1073. 86.23 s > thread 'tests::every_product_requires_a_task_chooser_and_each_supported_interface' (308) panicked at crates/alphal00p-docs-builder/src/lib.rs:12192:9:
  1074. 86.23 s > assertion failed: format!("{error:#}").contains("has no quickstart page")
  1075. 86.23 s > stack backtrace:
  1076. 86.23 s > 0: __rustc::rust_begin_unwind
  1077. 86.23 s > 1: core::panicking::panic_fmt
  1078. 86.23 s > 2: core::panicking::panic
  1079. 86.23 s > 3: alphal00p_docs_builder::tests::every_product_requires_a_task_chooser_and_each_supported_interface
  1080. 86.23 s > 4: <alphal00p_docs_builder::tests::every_product_requires_a_task_chooser_and_each_supported_interface::{closure#0} as core::ops::function::FnOnce<()>>::call_once
  1081. 86.23 s > note: Some details are omitted, run with `RUST_BACKTRACE=full` for a verbose backtrace.
  1082. 86.23 s > system-out
  1083. 86.23 s > running 1 test
  1084. 86.23 s > test tests::every_product_requires_a_task_chooser_and_each_supported_interface ... FAILED
  1085. 86.23 s >
  1086. 86.23 s > failures:
  1087. 86.23 s >
  1088. 86.23 s > failures:
  1089. 86.23 s > tests::every_product_requires_a_task_chooser_and_each_supported_interface
  1090. 86.23 s >
  1091. 86.23 s > test result: FAILED. 0 passed; 1 failed; 0 ignored; 0 measured; 128 filtered out; finished in 0.26s
  1092. 86.23 s > system-err
  1093. 86.23 s > thread 'tests::every_product_requires_a_task_chooser_and_each_supported_interface' (308) panicked at crates/alphal00p-docs-builder/src/lib.rs:12192:9:
  1094. 86.23 s > assertion failed: format!("{error:#}").contains("has no quickstart page")
  1095. 86.23 s > stack backtrace:
  1096. 86.23 s > 0: __rustc::rust_begin_unwind
  1097. 86.23 s > 1: core::panicking::panic_fmt
  1098. 86.23 s > 2: core::panicking::panic
  1099. 86.23 s > 3: alphal00p_docs_builder::tests::every_product_requires_a_task_chooser_and_each_supported_interface
  1100. 86.23 s > 4: <alphal00p_docs_builder::tests::every_product_requires_a_task_chooser_and_each_supported_interface::{closure#0} as core::ops::function::FnOnce<()>>::call_once
  1101. 86.23 s > note: Some details are omitted, run with `RUST_BACKTRACE=full` for a verbose backtrace.
  1102. 86.23 s >
  1103. 86.23 s > 5. alphal00p-docs-builder::tests::pdf_manual_chapter_order_must_match_the_page_registry
  1104. 86.23 s > failure: test failure with exit code 101
  1105. 86.23 s > thread 'tests::pdf_manual_chapter_order_must_match_the_page_registry' (440) panicked at crates/alphal00p-docs-builder/src/lib.rs:12243:9:
  1106. 86.23 s > assertion failed: format!("{error:#}").contains("PDF manual chapter order differs")
  1107. 86.23 s > stack backtrace:
  1108. 86.23 s > 0: __rustc::rust_begin_unwind
  1109. 86.23 s > 1: core::panicking::panic_fmt
  1110. 86.23 s > 2: core::panicking::panic
  1111. 86.23 s > 3: alphal00p_docs_builder::tests::pdf_manual_chapter_order_must_match_the_page_registry
  1112. 86.23 s > 4: <alphal00p_docs_builder::tests::pdf_manual_chapter_order_must_match_the_page_registry::{closure#0} as core::ops::function::FnOnce<()>>::call_once
  1113. 86.23 s > note: Some details are omitted, run with `RUST_BACKTRACE=full` for a verbose backtrace.
  1114. 86.23 s > system-out
  1115. 86.23 s > running 1 test
  1116. 86.23 s > test tests::pdf_manual_chapter_order_must_match_the_page_registry ... FAILED
  1117. 86.23 s >
  1118. 86.23 s > failures:
  1119. 86.23 s >
  1120. 86.23 s > failures:
  1121. 86.23 s > tests::pdf_manual_chapter_order_must_match_the_page_registry
  1122. 86.23 s >
  1123. 86.23 s > test result: FAILED. 0 passed; 1 failed; 0 ignored; 0 measured; 128 filtered out; finished in 0.27s
  1124. 86.23 s > system-err
  1125. 86.23 s > thread 'tests::pdf_manual_chapter_order_must_match_the_page_registry' (440) panicked at crates/alphal00p-docs-builder/src/lib.rs:12243:9:
  1126. 86.23 s > assertion failed: format!("{error:#}").contains("PDF manual chapter order differs")
  1127. 86.23 s > stack backtrace:
  1128. 86.23 s > 0: __rustc::rust_begin_unwind
  1129. 86.23 s > 1: core::panicking::panic_fmt
  1130. 86.23 s > 2: core::panicking::panic
  1131. 86.23 s > 3: alphal00p_docs_builder::tests::pdf_manual_chapter_order_must_match_the_page_registry
  1132. 86.23 s > 4: <alphal00p_docs_builder::tests::pdf_manual_chapter_order_must_match_the_page_registry::{closure#0} as core::ops::function::FnOnce<()>>::call_once
  1133. 86.23 s > note: Some details are omitted, run with `RUST_BACKTRACE=full` for a verbose backtrace.
  1134. 86.23 s > =========================================
  1135. 86.23 s > Extracting 2 binaries to /build/source
  1136. 86.23 s > Extracted 5 files to /build/source in 0.04s
  1137. 86.23 s > ------------
  1138. 86.23 s > Nextest run ID 83404f65-5b1a-47f4-8948-d0f7c0d22cf5 with nextest profile: ci_gammaloop
  1139. 86.23 s > Starting 22 tests across 2 binaries
  1140. 86.23 s > ------------
  1141. 86.23 s > Summary [ 0.022s] 22 tests run: 22 passed, 0 skipped
  1142. 86.23 s >
  1143. 86.23 s > ========== nextest test summary ==========
  1144. 86.23 s > report: target/nextest/ci_gammaloop/junit.xml
  1145. 86.23 s > tests: 22, failures: 0, errors: 0
  1146. 86.23 s > No failing testcases found.
  1147. 86.23 s > =========================================
  1148. 86.23 s > Extracting 3 binaries (including 2 non-test binaries), 1 build script output directory, and 2 linked paths to /build/source
  1149. 86.23 s > Extracted 22 files to /build/source in 0.33s
  1150. 86.23 s > ------------
  1151. 86.23 s > Nextest run ID 4652b2c0-2236-4a39-97a4-c132831d2543 with nextest profile: ci_gammaloop
  1152. 86.23 s > Starting 89 tests across 1 binary
  1153. 86.23 s > ------------
  1154. 86.23 s > Summary [ 0.082s] 89 tests run: 89 passed, 0 skipped
  1155. 86.23 s >
  1156. 86.23 s > ========== nextest test summary ==========
  1157. 86.23 s > report: target/nextest/ci_gammaloop/junit.xml
  1158. 86.23 s > tests: 89, failures: 0, errors: 0
  1159. 86.23 s > No failing testcases found.
  1160. 86.23 s > =========================================
  1161. 86.23 s > Extracting 2 binaries to /build/source
  1162. 86.23 s > Extracted 5 files to /build/source in 0.05s
  1163. 86.23 s > ------------
  1164. 86.23 s > Nextest run ID b8e61b86-0715-418a-bd5c-c65687ec9df1 with nextest profile: ci_gammaloop
  1165. 86.23 s > Starting 10 tests across 2 binaries
  1166. 86.23 s > ------------
  1167. 86.23 s > Summary [ 15.952s] 10 tests run: 10 passed, 0 skipped
  1168. 86.23 s >
  1169. 86.23 s > ========== nextest test summary ==========
  1170. 86.23 s > report: target/nextest/ci_gammaloop/junit.xml
  1171. 86.23 s > tests: 10, failures: 0, errors: 0
  1172. 86.23 s > No failing testcases found.
  1173. 86.23 s > =========================================
  1174. 86.23 s > Extracting 1 binary to /build/source
  1175. 86.23 s > Extracted 4 files to /build/source in 0.05s
  1176. 86.23 s > ------------
  1177. 86.23 s > Nextest run ID af36f01c-5871-4cc4-be34-d30572d86417 with nextest profile: ci_gammaloop
  1178. 86.23 s > Starting 0 tests across 1 binary
  1179. 86.23 s > ------------
  1180. 86.23 s > Summary [ 0.000s] 0 tests run: 0 passed, 0 skipped
  1181. 86.23 s >
  1182. 86.23 s > ========== nextest test summary ==========
  1183. 86.23 s > report: target/nextest/ci_gammaloop/junit.xml
  1184. 86.23 s > tests: 0, failures: 0, errors: 0
  1185. 86.23 s > No failing testcases found.
  1186. 86.23 s > =========================================
  1187. 86.23 s > Extracting 1 binary to /build/source
  1188. 86.23 s > Extracted 4 files to /build/source in 0.04s
  1189. 86.23 s > ------------
  1190. 86.23 s > Nextest run ID c5f09761-23ea-4e4e-a29f-a8ff02ed1e63 with nextest profile: ci_gammaloop
  1191. 86.23 s > Starting 5 tests across 1 binary
  1192. 86.23 s > ------------
  1193. 86.23 s > Summary [ 0.006s] 5 tests run: 5 passed, 0 skipped
  1194. 86.23 s >
  1195. 86.23 s > ========== nextest test summary ==========
  1196. 86.23 s > report: target/nextest/ci_gammaloop/junit.xml
  1197. 86.23 s > tests: 5, failures: 0, errors: 0
  1198. 86.23 s > No failing testcases found.
  1199. 86.23 s > =========================================
  1200. 86.23 s For full logs, run:
  1201. 86.23 s nix log /nix/store/vj8wdqhcdhpl16s0z9h5y6gmk5iqkmvb-gammaloop-nextest-docs.drv
  1202. 86.43 s Run failed.