0.00 s
$ /nix/store/61685rbaxmpigwi3z23i33sv3jyfl70q-coreutils-9.11/bin/timeout --kill-after=15s 7200s /nix/store/wknkybkzrc16r11vk5vrykh4wmw7a353-nix-2.34.8/bin/nix --extra-experimental-features nix-command --extra-experimental-features flakes flake clone git+https://github.com/alphal00p/gammaloop --dest /tmp/nix-ci-worker/stable-pwd/repo/
0.13 s
Cloning into '/tmp/nix-ci-worker/stable-pwd/repo'...
0.85 s
remote: Enumerating objects: 110731, done.
0.98 s
remote: Counting objects: 0% (1/14562)
remote: Counting objects: 1% (146/14562)
remote: Counting objects: 2% (292/14562)
remote: Counting objects: 3% (437/14562)
remote: Counting objects: 4% (583/14562)
remote: Counting objects: 5% (729/14562)
remote: Counting objects: 6% (874/14562)
remote: Counting objects: 7% (1020/14562)
remote: Counting objects: 8% (1165/14562)
remote: Counting objects: 9% (1311/14562)
remote: Counting objects: 10% (1457/14562)
remote: Counting objects: 11% (1602/14562)
remote: Counting objects: 12% (1748/14562)
remote: Counting objects: 13% (1894/14562)
remote: Counting objects: 14% (2039/14562)
remote: Counting objects: 15% (2185/14562)
remote: Counting objects: 16% (2330/14562)
remote: Counting objects: 17% (2476/14562)
remote: Counting objects: 18% (2622/14562)
remote: Counting objects: 19% (2767/14562)
remote: Counting objects: 20% (2913/14562)
remote: Counting objects: 21% (3059/14562)
remote: Counting objects: 22% (3204/14562)
remote: Counting objects: 23% (3350/14562)
remote: Counting objects: 24% (3495/14562)
remote: Counting objects: 25% (3641/14562)
remote: Counting objects: 26% (3787/14562)
remote: Counting objects: 27% (3932/14562)
remote: Counting objects: 28% (4078/14562)
remote: Counting objects: 29% (4223/14562)
remote: Counting objects: 30% (4369/14562)
remote: Counting objects: 31% (4515/14562)
remote: Counting objects: 32% (4660/14562)
remote: Counting objects: 33% (4806/14562)
remote: Counting objects: 34% (4952/14562)
remote: Counting objects: 35% (5097/14562)
remote: Counting objects: 36% (5243/14562)
remote: Counting objects: 37% (5388/14562)
remote: Counting objects: 38% (5534/14562)
remote: Counting objects: 39% (5680/14562)
remote: Counting objects: 40% (5825/14562)
remote: Counting objects: 41% (5971/14562)
remote: Counting objects: 42% (6117/14562)
remote: Counting objects: 43% (6262/14562)
remote: Counting objects: 44% (6408/14562)
remote: Counting objects: 45% (6553/14562)
remote: Counting objects: 46% (6699/14562)
remote: Counting objects: 47% (6845/14562)
remote: Counting objects: 48% (6990/14562)
remote: Counting objects: 49% (7136/14562)
remote: Counting objects: 50% (7281/14562)
remote: Counting objects: 51% (7427/14562)
remote: Counting objects: 52% (7573/14562)
remote: Counting objects: 53% (7718/14562)
remote: Counting objects: 54% (7864/14562)
remote: Counting objects: 55% (8010/14562)
remote: Counting objects: 56% (8155/14562)
remote: Counting objects: 57% (8301/14562)
remote: Counting objects: 58% (8446/14562)
remote: Counting objects: 59% (8592/14562)
remote: Counting objects: 60% (8738/14562)
remote: Counting objects: 61% (8883/14562)
remote: Counting objects: 62% (9029/14562)
remote: Counting objects: 63% (9175/14562)
remote: Counting objects: 64% (9320/14562)
remote: Counting objects: 65% (9466/14562)
remote: Counting objects: 66% (9611/14562)
remote: Counting objects: 67% (9757/14562)
remote: Counting objects: 68% (9903/14562)
remote: Counting objects: 69% (10048/14562)
remote: Counting objects: 70% (10194/14562)
remote: Counting objects: 71% (10340/14562)
remote: Counting objects: 72% (10485/14562)
remote: Counting objects: 73% (10631/14562)
remote: Counting objects: 74% (10776/14562)
remote: Counting objects: 75% (10922/14562)
remote: Counting objects: 76% (11068/14562)
remote: Counting objects: 77% (11213/14562)
remote: Counting objects: 78% (11359/14562)
remote: Counting objects: 79% (11504/14562)
remote: Counting objects: 80% (11650/14562)
remote: Counting objects: 81% (11796/14562)
remote: Counting objects: 82% (11941/14562)
remote: Counting objects: 83% (12087/14562)
remote: Counting objects: 84% (12233/14562)
remote: Counting objects: 85% (12378/14562)
remote: Counting objects: 86% (12524/14562)
remote: Counting objects: 87% (12669/14562)
remote: Counting objects: 88% (12815/14562)
remote: Counting objects: 89% (12961/14562)
remote: Counting objects: 90% (13106/14562)
remote: Counting objects: 91% (13252/14562)
remote: Counting objects: 92% (13398/14562)
remote: Counting objects: 93% (13543/14562)
remote: Counting objects: 94% (13689/14562)
remote: Counting objects: 95% (13834/14562)
remote: Counting objects: 96% (13980/14562)
remote: Counting objects: 97% (14126/14562)
remote: Counting objects: 98% (14271/14562)
remote: Counting objects: 99% (14417/14562)
remote: Counting objects: 100% (14562/14562)
remote: Counting objects: 100% (14562/14562), done.
5.40 s
remote: Compressing objects: 0% (1/2921)
remote: Compressing objects: 1% (30/2921)
remote: Compressing objects: 2% (59/2921)
remote: Compressing objects: 3% (88/2921)
remote: Compressing objects: 4% (117/2921)
remote: Compressing objects: 5% (147/2921)
remote: Compressing objects: 6% (176/2921)
remote: Compressing objects: 7% (205/2921)
remote: Compressing objects: 8% (234/2921)
remote: Compressing objects: 9% (263/2921)
remote: Compressing objects: 10% (293/2921)
remote: Compressing objects: 11% (322/2921)
remote: Compressing objects: 11% (342/2921)
remote: Compressing objects: 12% (351/2921)
remote: Compressing objects: 13% (380/2921)
remote: Compressing objects: 13% (387/2921)
remote: Compressing objects: 14% (409/2921)
remote: Compressing objects: 15% (439/2921)
remote: Compressing objects: 16% (468/2921)
remote: Compressing objects: 17% (497/2921)
remote: Compressing objects: 17% (519/2921)
remote: Compressing objects: 18% (526/2921)
remote: Compressing objects: 19% (555/2921)
remote: Compressing objects: 20% (585/2921)
remote: Compressing objects: 21% (614/2921)
remote: Compressing objects: 22% (643/2921)
remote: Compressing objects: 23% (672/2921)
remote: Compressing objects: 24% (702/2921)
remote: Compressing objects: 25% (731/2921)
remote: Compressing objects: 26% (760/2921)
remote: Compressing objects: 26% (776/2921)
remote: Compressing objects: 27% (789/2921)
remote: Compressing objects: 28% (818/2921)
remote: Compressing objects: 29% (848/2921)
remote: Compressing objects: 30% (877/2921)
remote: Compressing objects: 31% (906/2921)
remote: Compressing objects: 32% (935/2921)
remote: Compressing objects: 33% (964/2921)
remote: Compressing objects: 34% (994/2921)
remote: Compressing objects: 35% (1023/2921)
remote: Compressing objects: 36% (1052/2921)
remote: Compressing objects: 37% (1081/2921)
remote: Compressing objects: 38% (1110/2921)
remote: Compressing objects: 39% (1140/2921)
remote: Compressing objects: 40% (1169/2921)
remote: Compressing objects: 41% (1198/2921)
remote: Compressing objects: 42% (1227/2921)
remote: Compressing objects: 43% (1257/2921)
remote: Compressing objects: 44% (1286/2921)
remote: Compressing objects: 45% (1315/2921)
remote: Compressing objects: 46% (1344/2921)
remote: Compressing objects: 47% (1373/2921)
remote: Compressing objects: 48% (1403/2921)
remote: Compressing objects: 49% (1432/2921)
remote: Compressing objects: 50% (1461/2921)
remote: Compressing objects: 51% (1490/2921)
remote: Compressing objects: 52% (1519/2921)
remote: Compressing objects: 53% (1549/2921)
remote: Compressing objects: 54% (1578/2921)
remote: Compressing objects: 55% (1607/2921)
remote: Compressing objects: 56% (1636/2921)
remote: Compressing objects: 57% (1665/2921)
remote: Compressing objects: 58% (1695/2921)
remote: Compressing objects: 59% (1724/2921)
remote: Compressing objects: 60% (1753/2921)
remote: Compressing objects: 61% (1782/2921)
remote: Compressing objects: 62% (1812/2921)
remote: Compressing objects: 63% (1841/2921)
remote: Compressing objects: 64% (1870/2921)
remote: Compressing objects: 65% (1899/2921)
remote: Compressing objects: 66% (1928/2921)
remote: Compressing objects: 67% (1958/2921)
remote: Compressing objects: 68% (1987/2921)
remote: Compressing objects: 69% (2016/2921)
remote: Compressing objects: 70% (2045/2921)
remote: Compressing objects: 71% (2074/2921)
remote: Compressing objects: 72% (2104/2921)
remote: Compressing objects: 73% (2133/2921)
remote: Compressing objects: 74% (2162/2921)
remote: Compressing objects: 75% (2191/2921)
remote: Compressing objects: 76% (2220/2921)
remote: Compressing objects: 77% (2250/2921)
remote: Compressing objects: 78% (2279/2921)
remote: Compressing objects: 79% (2308/2921)
remote: Compressing objects: 80% (2337/2921)
remote: Compressing objects: 81% (2367/2921)
remote: Compressing objects: 82% (2396/2921)
remote: Compressing objects: 83% (2425/2921)
remote: Compressing objects: 84% (2454/2921)
remote: Compressing objects: 85% (2483/2921)
remote: Compressing objects: 86% (2513/2921)
remote: Compressing objects: 87% (2542/2921)
remote: Compressing objects: 88% (2571/2921)
remote: Compressing objects: 89% (2600/2921)
remote: Compressing objects: 90% (2629/2921)
remote: Compressing objects: 91% (2659/2921)
remote: Compressing objects: 92% (2688/2921)
remote: Compressing objects: 93% (2717/2921)
remote: Compressing objects: 94% (2746/2921)
remote: Compressing objects: 95% (2775/2921)
remote: Compressing objects: 96% (2805/2921)
remote: Compressing objects: 97% (2834/2921)
remote: Compressing objects: 98% (2863/2921)
remote: Compressing objects: 99% (2892/2921)
remote: Compressing objects: 100% (2921/2921)
remote: Compressing objects: 100% (2921/2921), done.
15.99 s
Receiving objects: 0% (1/110731)
Receiving objects: 1% (1108/110731)
Receiving objects: 2% (2215/110731)
Receiving objects: 3% (3322/110731), 15.94 MiB | 31.86 MiB/s
Receiving objects: 4% (4430/110731), 15.94 MiB | 31.86 MiB/s
Receiving objects: 5% (5537/110731), 15.94 MiB | 31.86 MiB/s
Receiving objects: 6% (6644/110731), 15.94 MiB | 31.86 MiB/s
Receiving objects: 6% (7490/110731), 31.53 MiB | 31.33 MiB/s
Receiving objects: 7% (7752/110731), 31.53 MiB | 31.33 MiB/s
Receiving objects: 8% (8859/110731), 31.53 MiB | 31.33 MiB/s
Receiving objects: 9% (9966/110731), 31.53 MiB | 31.33 MiB/s
Receiving objects: 10% (11074/110731), 31.53 MiB | 31.33 MiB/s
Receiving objects: 10% (11662/110731), 47.28 MiB | 31.39 MiB/s
Receiving objects: 11% (12181/110731), 62.96 MiB | 31.37 MiB/s
Receiving objects: 12% (13288/110731), 62.96 MiB | 31.37 MiB/s
Receiving objects: 13% (14396/110731), 62.96 MiB | 31.37 MiB/s
Receiving objects: 14% (15503/110731), 62.96 MiB | 31.37 MiB/s
Receiving objects: 15% (16610/110731), 62.96 MiB | 31.37 MiB/s
Receiving objects: 16% (17717/110731), 74.83 MiB | 29.85 MiB/s
Receiving objects: 17% (18825/110731), 74.83 MiB | 29.85 MiB/s
Receiving objects: 18% (19932/110731), 74.83 MiB | 29.85 MiB/s
Receiving objects: 19% (21039/110731), 74.83 MiB | 29.85 MiB/s
Receiving objects: 20% (22147/110731), 74.83 MiB | 29.85 MiB/s
Receiving objects: 21% (23254/110731), 74.83 MiB | 29.85 MiB/s
Receiving objects: 22% (24361/110731), 74.83 MiB | 29.85 MiB/s
Receiving objects: 23% (25469/110731), 74.83 MiB | 29.85 MiB/s
Receiving objects: 24% (26576/110731), 74.83 MiB | 29.85 MiB/s
Receiving objects: 25% (27683/110731), 74.83 MiB | 29.85 MiB/s
Receiving objects: 26% (28791/110731), 74.83 MiB | 29.85 MiB/s
Receiving objects: 27% (29898/110731), 74.83 MiB | 29.85 MiB/s
Receiving objects: 28% (31005/110731), 74.83 MiB | 29.85 MiB/s
Receiving objects: 29% (32112/110731), 74.83 MiB | 29.85 MiB/s
Receiving objects: 30% (33220/110731), 74.83 MiB | 29.85 MiB/s
Receiving objects: 31% (34327/110731), 74.83 MiB | 29.85 MiB/s
Receiving objects: 32% (35434/110731), 74.83 MiB | 29.85 MiB/s
Receiving objects: 33% (36542/110731), 74.83 MiB | 29.85 MiB/s
Receiving objects: 34% (37649/110731), 74.83 MiB | 29.85 MiB/s
Receiving objects: 35% (38756/110731), 74.83 MiB | 29.85 MiB/s
Receiving objects: 36% (39864/110731), 74.83 MiB | 29.85 MiB/s
Receiving objects: 37% (40971/110731), 74.83 MiB | 29.85 MiB/s
Receiving objects: 38% (42078/110731), 74.83 MiB | 29.85 MiB/s
Receiving objects: 38% (42867/110731), 93.50 MiB | 31.10 MiB/s
Receiving objects: 39% (43186/110731), 93.50 MiB | 31.10 MiB/s
Receiving objects: 40% (44293/110731), 93.50 MiB | 31.10 MiB/s
Receiving objects: 41% (45400/110731), 93.50 MiB | 31.10 MiB/s
Receiving objects: 42% (46508/110731), 93.50 MiB | 31.10 MiB/s
Receiving objects: 43% (47615/110731), 93.50 MiB | 31.10 MiB/s
Receiving objects: 44% (48722/110731), 93.50 MiB | 31.10 MiB/s
Receiving objects: 45% (49829/110731), 93.50 MiB | 31.10 MiB/s
Receiving objects: 46% (50937/110731), 109.56 MiB | 31.25 MiB/s
Receiving objects: 47% (52044/110731), 109.56 MiB | 31.25 MiB/s
Receiving objects: 48% (53151/110731), 109.56 MiB | 31.25 MiB/s
Receiving objects: 49% (54259/110731), 109.56 MiB | 31.25 MiB/s
Receiving objects: 50% (55366/110731), 109.56 MiB | 31.25 MiB/s
Receiving objects: 51% (56473/110731), 109.56 MiB | 31.25 MiB/s
Receiving objects: 52% (57581/110731), 109.56 MiB | 31.25 MiB/s
Receiving objects: 53% (58688/110731), 109.56 MiB | 31.25 MiB/s
Receiving objects: 53% (59020/110731), 109.56 MiB | 31.25 MiB/s
Receiving objects: 54% (59795/110731), 124.82 MiB | 31.16 MiB/s
Receiving objects: 55% (60903/110731), 124.82 MiB | 31.16 MiB/s
Receiving objects: 56% (62010/110731), 124.82 MiB | 31.16 MiB/s
Receiving objects: 57% (63117/110731), 124.82 MiB | 31.16 MiB/s
Receiving objects: 58% (64224/110731), 124.82 MiB | 31.16 MiB/s
Receiving objects: 59% (65332/110731), 140.64 MiB | 31.21 MiB/s
Receiving objects: 60% (66439/110731), 140.64 MiB | 31.21 MiB/s
Receiving objects: 61% (67546/110731), 140.64 MiB | 31.21 MiB/s
Receiving objects: 61% (68174/110731), 156.29 MiB | 31.15 MiB/s
Receiving objects: 62% (68654/110731), 156.29 MiB | 31.15 MiB/s
Receiving objects: 63% (69761/110731), 156.29 MiB | 31.15 MiB/s
Receiving objects: 64% (70868/110731), 156.29 MiB | 31.15 MiB/s
Receiving objects: 65% (71976/110731), 156.29 MiB | 31.15 MiB/s
Receiving objects: 66% (73083/110731), 172.26 MiB | 31.27 MiB/s
Receiving objects: 67% (74190/110731), 172.26 MiB | 31.27 MiB/s
Receiving objects: 68% (75298/110731), 172.26 MiB | 31.27 MiB/s
Receiving objects: 69% (76405/110731), 172.26 MiB | 31.27 MiB/s
Receiving objects: 70% (77512/110731), 172.26 MiB | 31.27 MiB/s
Receiving objects: 71% (78620/110731), 172.26 MiB | 31.27 MiB/s
Receiving objects: 72% (79727/110731), 172.26 MiB | 31.27 MiB/s
Receiving objects: 72% (80699/110731), 172.26 MiB | 31.27 MiB/s
Receiving objects: 73% (80834/110731), 172.26 MiB | 31.27 MiB/s
Receiving objects: 74% (81941/110731), 187.53 MiB | 31.17 MiB/s
Receiving objects: 75% (83049/110731), 187.53 MiB | 31.17 MiB/s
Receiving objects: 76% (84156/110731), 187.53 MiB | 31.17 MiB/s
Receiving objects: 77% (85263/110731), 187.53 MiB | 31.17 MiB/s
Receiving objects: 78% (86371/110731), 187.53 MiB | 31.17 MiB/s
Receiving objects: 79% (87478/110731), 187.53 MiB | 31.17 MiB/s
Receiving objects: 80% (88585/110731), 203.11 MiB | 31.15 MiB/s
Receiving objects: 81% (89693/110731), 203.11 MiB | 31.15 MiB/s
Receiving objects: 81% (89701/110731), 219.22 MiB | 32.09 MiB/s
Receiving objects: 81% (89737/110731), 250.40 MiB | 31.30 MiB/s
Receiving objects: 82% (90800/110731), 250.40 MiB | 31.30 MiB/s
Receiving objects: 83% (91907/110731), 250.40 MiB | 31.30 MiB/s
Receiving objects: 84% (93015/110731), 265.84 MiB | 31.34 MiB/s
Receiving objects: 85% (94122/110731), 265.84 MiB | 31.34 MiB/s
Receiving objects: 85% (94731/110731), 265.84 MiB | 31.34 MiB/s
Receiving objects: 86% (95229/110731), 292.09 MiB | 30.03 MiB/s
Receiving objects: 87% (96336/110731), 292.09 MiB | 30.03 MiB/s
Receiving objects: 88% (97444/110731), 292.09 MiB | 30.03 MiB/s
Receiving objects: 89% (98551/110731), 292.09 MiB | 30.03 MiB/s
Receiving objects: 90% (99658/110731), 292.09 MiB | 30.03 MiB/s
Receiving objects: 91% (100766/110731), 292.09 MiB | 30.03 MiB/s
Receiving objects: 92% (101873/110731), 292.09 MiB | 30.03 MiB/s
Receiving objects: 93% (102980/110731), 292.09 MiB | 30.03 MiB/s
Receiving objects: 94% (104088/110731), 292.09 MiB | 30.03 MiB/s
Receiving objects: 95% (105195/110731), 292.09 MiB | 30.03 MiB/s
Receiving objects: 96% (106302/110731), 292.09 MiB | 30.03 MiB/s
Receiving objects: 97% (107410/110731), 292.09 MiB | 30.03 MiB/s
Receiving objects: 97% (108458/110731), 292.09 MiB | 30.03 MiB/s
Receiving objects: 98% (108517/110731), 292.09 MiB | 30.03 MiB/s
Receiving objects: 99% (109624/110731), 307.79 MiB | 29.96 MiB/s
remote: Total 110731 (delta 12254), reused 11928 (delta 11241), pack-reused 96169 (from 2)
16.00 s
Receiving objects: 100% (110731/110731), 323.53 MiB | 30.05 MiB/s
Receiving objects: 100% (110731/110731), 324.99 MiB | 30.68 MiB/s, done.
17.86 s
Resolving deltas: 0% (0/72611)
Resolving deltas: 1% (727/72611)
Resolving deltas: 2% (1453/72611)
Resolving deltas: 3% (2179/72611)
Resolving deltas: 4% (2905/72611)
Resolving deltas: 5% (3631/72611)
Resolving deltas: 6% (4357/72611)
Resolving deltas: 7% (5083/72611)
Resolving deltas: 8% (5809/72611)
Resolving deltas: 9% (6535/72611)
Resolving deltas: 10% (7262/72611)
Resolving deltas: 11% (7988/72611)
Resolving deltas: 12% (8715/72611)
Resolving deltas: 13% (9440/72611)
Resolving deltas: 14% (10166/72611)
Resolving deltas: 15% (10892/72611)
Resolving deltas: 16% (11618/72611)
Resolving deltas: 17% (12344/72611)
Resolving deltas: 18% (13070/72611)
Resolving deltas: 19% (13797/72611)
Resolving deltas: 20% (14525/72611)
Resolving deltas: 21% (15249/72611)
Resolving deltas: 22% (15975/72611)
Resolving deltas: 23% (16701/72611)
Resolving deltas: 24% (17427/72611)
Resolving deltas: 25% (18155/72611)
Resolving deltas: 26% (18879/72611)
Resolving deltas: 27% (19605/72611)
Resolving deltas: 28% (20332/72611)
Resolving deltas: 29% (21058/72611)
Resolving deltas: 30% (21784/72611)
Resolving deltas: 31% (22512/72611)
Resolving deltas: 32% (23236/72611)
Resolving deltas: 33% (23964/72611)
Resolving deltas: 34% (24688/72611)
Resolving deltas: 35% (25414/72611)
Resolving deltas: 36% (26140/72611)
Resolving deltas: 37% (26867/72611)
Resolving deltas: 38% (27593/72611)
Resolving deltas: 38% (28131/72611)
Resolving deltas: 39% (28319/72611)
Resolving deltas: 40% (29045/72611)
Resolving deltas: 41% (29771/72611)
Resolving deltas: 42% (30497/72611)
Resolving deltas: 43% (31223/72611)
Resolving deltas: 44% (31949/72611)
Resolving deltas: 45% (32675/72611)
Resolving deltas: 46% (33403/72611)
Resolving deltas: 47% (34128/72611)
Resolving deltas: 48% (34854/72611)
Resolving deltas: 49% (35582/72611)
Resolving deltas: 50% (36306/72611)
Resolving deltas: 51% (37032/72611)
Resolving deltas: 52% (37758/72611)
Resolving deltas: 53% (38484/72611)
Resolving deltas: 54% (39210/72611)
Resolving deltas: 55% (39937/72611)
Resolving deltas: 56% (40663/72611)
Resolving deltas: 57% (41390/72611)
Resolving deltas: 58% (42115/72611)
Resolving deltas: 59% (42842/72611)
Resolving deltas: 60% (43567/72611)
Resolving deltas: 61% (44293/72611)
Resolving deltas: 62% (45019/72611)
Resolving deltas: 63% (45745/72611)
Resolving deltas: 64% (46472/72611)
Resolving deltas: 65% (47198/72611)
Resolving deltas: 66% (47924/72611)
Resolving deltas: 67% (48650/72611)
Resolving deltas: 68% (49378/72611)
Resolving deltas: 69% (50102/72611)
Resolving deltas: 70% (50828/72611)
Resolving deltas: 71% (51555/72611)
Resolving deltas: 72% (52280/72611)
Resolving deltas: 73% (53007/72611)
Resolving deltas: 74% (53734/72611)
Resolving deltas: 75% (54459/72611)
Resolving deltas: 76% (55185/72611)
Resolving deltas: 77% (55911/72611)
Resolving deltas: 78% (56637/72611)
Resolving deltas: 79% (57364/72611)
Resolving deltas: 80% (58089/72611)
Resolving deltas: 81% (58815/72611)
Resolving deltas: 82% (59542/72611)
Resolving deltas: 83% (60268/72611)
Resolving deltas: 84% (60994/72611)
Resolving deltas: 85% (61720/72611)
Resolving deltas: 86% (62446/72611)
Resolving deltas: 87% (63172/72611)
Resolving deltas: 88% (63898/72611)
Resolving deltas: 89% (64624/72611)
Resolving deltas: 90% (65350/72611)
Resolving deltas: 91% (66077/72611)
Resolving deltas: 92% (66803/72611)
Resolving deltas: 93% (67529/72611)
Resolving deltas: 94% (68255/72611)
Resolving deltas: 95% (68981/72611)
Resolving deltas: 96% (69707/72611)
Resolving deltas: 97% (70437/72611)
Resolving deltas: 98% (71160/72611)
Resolving deltas: 99% (71885/72611)
Resolving deltas: 100% (72611/72611)
Resolving deltas: 100% (72611/72611), done.
18.42 s
Fetching commit 07b1d150507fa30cd2cd44f18a21e3387ba5063b for linnest-endpoints-momentum-layouts ...
18.42 s
$ /nix/store/5vpcfsdx1lcnlb2y4k7xyc74shp5qwbh-git-2.54.0/bin/git fetch origin 07b1d150507fa30cd2cd44f18a21e3387ba5063b
18.85 s
From https://github.com/alphal00p/gammaloop
18.85 s
* branch 07b1d150507fa30cd2cd44f18a21e3387ba5063b -> FETCH_HEAD
18.87 s
$ /nix/store/61685rbaxmpigwi3z23i33sv3jyfl70q-coreutils-9.11/bin/timeout --kill-after=15s 7200s /nix/store/5vpcfsdx1lcnlb2y4k7xyc74shp5qwbh-git-2.54.0/bin/git -c advice.detachedHead=false checkout 07b1d150507fa30cd2cd44f18a21e3387ba5063b
19.18 s
HEAD is now at 07b1d1505 extend linnest edge endpoints, momentum display, and partial layouts
19.18 s
$ /nix/store/61685rbaxmpigwi3z23i33sv3jyfl70q-coreutils-9.11/bin/timeout --kill-after=15s 7200s /nix/store/wknkybkzrc16r11vk5vrykh4wmw7a353-nix-2.34.8/bin/nix --extra-experimental-features nix-command --extra-experimental-features flakes --log-format internal-json run .#packages.x86_64-linux.nix-ci-check-gammaloop-nextest-docs --print-build-logs
19.29 s
warning: ignoring untrusted flake configuration setting 'extra-substituters'.
19.29 s
Pass '--accept-flake-config' to trust it
19.29 s
warning: ignoring untrusted flake configuration setting 'extra-trusted-public-keys'.
19.29 s
Pass '--accept-flake-config' to trust it
23.80 s
24.03 s
do you want to allow configuration setting 'extra-substituters' to be set to 'https://cache.nix-ci.com ' (y/N)? do you want to permanently mark this value as untrusted (y/N)? warning: ignoring untrusted flake configuration setting 'extra-substituters'.
24.03 s
Pass '--accept-flake-config' to trust it
24.03 s
evaluating derivation 'gdo you want to allow configuration setting 'extra-trusted-public-keys' to be set to 'nix-ci:g3xV5BDTLtIBZr/A00IU1x0EtKKlb7YLgBN2SgYgM6A= ' (y/N)? do you want to permanently mark this value as untrusted (y/N)? warning: ignoring untrusted flake configuration setting 'extra-trusted-public-keys'.
24.03 s
Pass '--accept-flake-config' to trust it
28.47 s
copying '/nix/store/gisz
evaluating derivation 'g
copying '/nix/store/gisz
evaluating derivation 'g
copying '/nix/store/gisz
evaluating derivation 'g
copying '/nix/store/gisz
evaluating derivation 'g
copying '/nix/store/gisz
evaluating derivation 'g
copying '/nix/store/gisz
evaluating derivation 'g
copying '/nix/store/gisz
evaluating derivation 'g
copying '/nix/store/gisz
evaluating derivation 'g
copying '/nix/store/gisz
evaluating derivation 'g
[1 /0 /1 copied (0.0 KiB /2
37.66 s
[1 /0 /1 copied (6.1 /201.4
[1 /0 /1 copied (25.2 /201.
[1 /0 /1 copied (42.2 /201.
[1 /0 /1 copied (53.5 /201.
[1 /0 /1 copied (58.2 /201.
[1 /0 /1 copied (74.2 /201.
[1 /0 /1 copied (79.8 /201.
[1 /0 /1 copied (93.6 /201.
[1 /0 /1 copied (113.1 /201
[1 /0 /1 copied (135.0 /201
[1 /0 /1 copied (162.6 /201
[1 /0 /1 copied (183.9 /201
[1 /0 /1 copied (196.4 /201
[1 copied (201.4 MiB), 4
51.76 s
[0 /9 built, 1 /80 copied
[0 /10 built, 16 /1 /72 cop
[0 /10 built, 9 /10 /72 cop
[0 /10 built, 12 /13 /72 co
[0 /10 built, 7 /21 /72 cop
[0 /10 built, 5 /24 /72 cop
[0 /10 built, 4 /25 /72 cop
[0 /10 built, 3 /26 /72 cop
[0 /10 built, 12 /43 /72 co
[0 /9 built, 12 /44 /72 cop
[0 /9 built, 11 /45 /72 cop
[0 /8 built, 7 /50 /72 copi
[0 /8 built, 4 /54 /72 copi
[0 /8 built, 3 /55 /72 copi
[0 /8 built, 2 /56 /72 copi
[0 /8 built, 5 /59 /72 copi
[0 /8 built, 7 /60 /72 copi
[0 /8 built, 6 /61 /72 copi
[0 /7 built, 5 /63 /72 copi
[0 /7 built, 4 /65 /72 copi
[0 /6 built, 3 /66 /72 copi
[0 /5 built, 2 /67 /72 copi
[0 /4 built, 1 /69 /72 copi
[0 /3 built, 72 copied (9
[0 /2 built, 72 copied (9
[1 /0 /1 built, 72 copied gammaloop-nextest-docs> Extracting 2 binaries to /build/source
51.81 s
gammaloop-nextest-docs> Extracted 5 files to /build/source in 0.05s
51.82 s
gammaloop-nextest-docs> ------------
51.82 s
gammaloop-nextest-docs> Nextest run ID f6f9c216-f175-4d58-b410-38a939b7edc4 with nextest profile: ci_gammaloop
51.82 s
gammaloop-nextest-docs> Starting 129 tests across 2 binaries
52.07 s
gammaloop-nextest-docs> FAIL [ 0.214s] ( 62/129) alphal00p-docs-builder tests :: developer_scope_ranges_ignore_unrelated_edits_and_warn_only_while_watching
52.07 s
gammaloop-nextest-docs> stdout ---
52.07 s
gammaloop-nextest-docs>
52.07 s
gammaloop-nextest-docs> running 1 test
52.07 s
gammaloop-nextest-docs> test tests::developer_scope_ranges_ignore_unrelated_edits_and_warn_only_while_watching ... FAILED
52.07 s
gammaloop-nextest-docs>
52.07 s
gammaloop-nextest-docs> failures:
52.07 s
gammaloop-nextest-docs>
52.07 s
gammaloop-nextest-docs> failures:
52.07 s
gammaloop-nextest-docs> tests::developer_scope_ranges_ignore_unrelated_edits_and_warn_only_while_watching
52.07 s
gammaloop-nextest-docs>
52.07 s
gammaloop-nextest-docs> test result: FAILED. 0 passed; 1 failed; 0 ignored; 0 measured; 128 filtered out; finished in 0.21s
52.07 s
gammaloop-nextest-docs>
52.07 s
gammaloop-nextest-docs> stderr ---
52.07 s
gammaloop-nextest-docs>
52.07 s
gammaloop-nextest-docs> thread 'tests::developer_scope_ranges_ignore_unrelated_edits_and_warn_only_while_watching' (286) panicked at crates/alphal00p-docs-builder/src/lib.rs:12263:29:
52.07 s
gammaloop-nextest-docs> called `Result::unwrap()` on an `Err` value: developer note nix-crane-cache-reuse verified scope nix/rust-workspace.nix changed (expected 66f700580ce13b9eaee90fe0111639e46968c531, found 0a568cb5712045aee37d96bfb2f91d3d32b7e9b9); owner review or an explicit no-impact attestation is required
52.07 s
gammaloop-nextest-docs>
52.07 s
gammaloop-nextest-docs> Location:
52.07 s
gammaloop-nextest-docs> crates/alphal00p-docs-builder/src/lib.rs:992:29
52.07 s
gammaloop-nextest-docs> stack backtrace:
52.07 s
gammaloop-nextest-docs> 0: __rustc::rust_begin_unwind
52.07 s
gammaloop-nextest-docs> 1: core::panicking::panic_fmt
52.07 s
gammaloop-nextest-docs> 2: core::result::unwrap_failed
52.07 s
gammaloop-nextest-docs> 3: alphal00p_docs_builder::tests::developer_scope_ranges_ignore_unrelated_edits_and_warn_only_while_watching
52.07 s
gammaloop-nextest-docs> 4: <alphal00p_docs_builder::tests::developer_scope_ranges_ignore_unrelated_edits_and_warn_only_while_watching::{closure#0} as core::ops::function::FnOnce<()>>::call_once
52.07 s
gammaloop-nextest-docs> note: Some details are omitted, run with `RUST_BACKTRACE=full` for a verbose backtrace.
52.07 s
gammaloop-nextest-docs>
52.10 s
gammaloop-nextest-docs> FAIL [ 0.274s] ( 66/129) alphal00p-docs-builder provenance_tests :: each_build_captures_one_revision_before_rendering
52.10 s
gammaloop-nextest-docs> stdout ---
52.10 s
gammaloop-nextest-docs>
52.10 s
gammaloop-nextest-docs> running 1 test
52.10 s
gammaloop-nextest-docs>
52.10 s
gammaloop-nextest-docs> running 1 test
52.10 s
gammaloop-nextest-docs> test provenance_tests::each_build_captures_one_revision_before_rendering ... FAILED
52.10 s
gammaloop-nextest-docs>
52.10 s
gammaloop-nextest-docs> failures:
52.10 s
gammaloop-nextest-docs>
52.10 s
gammaloop-nextest-docs> failures:
52.10 s
gammaloop-nextest-docs> provenance_tests::each_build_captures_one_revision_before_rendering
52.10 s
gammaloop-nextest-docs>
52.10 s
gammaloop-nextest-docs> test result: FAILED. 0 passed; 1 failed; 0 ignored; 0 measured; 128 filtered out; finished in 0.25s
52.10 s
gammaloop-nextest-docs>
52.10 s
gammaloop-nextest-docs> test provenance_tests::each_build_captures_one_revision_before_rendering ... FAILED
52.10 s
gammaloop-nextest-docs>
52.10 s
gammaloop-nextest-docs> failures:
52.10 s
gammaloop-nextest-docs>
52.10 s
gammaloop-nextest-docs> failures:
52.10 s
gammaloop-nextest-docs> provenance_tests::each_build_captures_one_revision_before_rendering
52.10 s
gammaloop-nextest-docs>
52.10 s
gammaloop-nextest-docs> test result: FAILED. 0 passed; 1 failed; 0 ignored; 0 measured; 128 filtered out; finished in 0.27s
52.10 s
gammaloop-nextest-docs>
52.10 s
gammaloop-nextest-docs> stderr ---
52.10 s
gammaloop-nextest-docs>
52.10 s
gammaloop-nextest-docs> thread 'provenance_tests::each_build_captures_one_revision_before_rendering' (224) panicked at crates/alphal00p-docs-builder/src/provenance_tests.rs:297:14:
52.10 s
gammaloop-nextest-docs> called `Result::unwrap()` on an `Err` value: developer note nix-crane-cache-reuse verified scope nix/rust-workspace.nix changed (expected 66f700580ce13b9eaee90fe0111639e46968c531, found 0a568cb5712045aee37d96bfb2f91d3d32b7e9b9); owner review or an explicit no-impact attestation is required
52.10 s
gammaloop-nextest-docs>
52.10 s
gammaloop-nextest-docs> Location:
52.10 s
gammaloop-nextest-docs> crates/alphal00p-docs-builder/src/lib.rs:992:29
52.10 s
gammaloop-nextest-docs> stack backtrace:
52.10 s
gammaloop-nextest-docs> 0: __rustc::rust_begin_unwind
52.10 s
gammaloop-nextest-docs> 1: core::panicking::panic_fmt
52.10 s
gammaloop-nextest-docs> 2: core::result::unwrap_failed
52.10 s
gammaloop-nextest-docs> 3: alphal00p_docs_builder::provenance_tests::each_build_captures_one_revision_before_rendering
52.10 s
gammaloop-nextest-docs> 4: <alphal00p_docs_builder::provenance_tests::each_build_captures_one_revision_before_rendering::{closure#0} as core::ops::function::FnOnce<()>>::call_once
52.10 s
gammaloop-nextest-docs> note: Some details are omitted, run with `RUST_BACKTRACE=full` for a verbose backtrace.
52.10 s
gammaloop-nextest-docs>
52.10 s
gammaloop-nextest-docs> thread 'provenance_tests::each_build_captures_one_revision_before_rendering' (163) panicked at crates/alphal00p-docs-builder/src/provenance_tests.rs:274:9:
52.10 s
gammaloop-nextest-docs> assertion failed: command.status().unwrap().success()
52.10 s
gammaloop-nextest-docs> stack backtrace:
52.10 s
gammaloop-nextest-docs> 0: __rustc::rust_begin_unwind
52.10 s
gammaloop-nextest-docs> 1: core::panicking::panic_fmt
52.10 s
gammaloop-nextest-docs> 2: core::panicking::panic
52.10 s
gammaloop-nextest-docs> 3: alphal00p_docs_builder::provenance_tests::each_build_captures_one_revision_before_rendering
52.10 s
gammaloop-nextest-docs> 4: <alphal00p_docs_builder::provenance_tests::each_build_captures_one_revision_before_rendering::{closure#0} as core::ops::function::FnOnce<()>>::call_once
52.10 s
gammaloop-nextest-docs> note: Some details are omitted, run with `RUST_BACKTRACE=full` for a verbose backtrace.
52.10 s
gammaloop-nextest-docs>
52.10 s
gammaloop-nextest-docs> FAIL [ 0.274s] ( 67/129) alphal00p-docs-builder tests :: checked_in_registry_is_valid
52.10 s
gammaloop-nextest-docs> stdout ---
52.10 s
gammaloop-nextest-docs>
52.10 s
gammaloop-nextest-docs> running 1 test
52.10 s
gammaloop-nextest-docs> test tests::checked_in_registry_is_valid ... FAILED
52.10 s
gammaloop-nextest-docs>
52.10 s
gammaloop-nextest-docs> failures:
52.10 s
gammaloop-nextest-docs>
52.10 s
gammaloop-nextest-docs> failures:
52.10 s
gammaloop-nextest-docs> tests::checked_in_registry_is_valid
52.10 s
gammaloop-nextest-docs>
52.10 s
gammaloop-nextest-docs> test result: FAILED. 0 passed; 1 failed; 0 ignored; 0 measured; 128 filtered out; finished in 0.26s
52.10 s
gammaloop-nextest-docs>
52.10 s
gammaloop-nextest-docs> stderr ---
52.10 s
gammaloop-nextest-docs>
52.10 s
gammaloop-nextest-docs> thread 'tests::checked_in_registry_is_valid' (213) panicked at crates/alphal00p-docs-builder/src/lib.rs:12178:50:
52.10 s
gammaloop-nextest-docs> called `Result::unwrap()` on an `Err` value: developer note nix-crane-cache-reuse verified scope nix/rust-workspace.nix changed (expected 66f700580ce13b9eaee90fe0111639e46968c531, found 0a568cb5712045aee37d96bfb2f91d3d32b7e9b9); owner review or an explicit no-impact attestation is required
52.10 s
gammaloop-nextest-docs>
52.10 s
gammaloop-nextest-docs> Location:
52.10 s
gammaloop-nextest-docs> crates/alphal00p-docs-builder/src/lib.rs:992:29
52.10 s
gammaloop-nextest-docs> stack backtrace:
52.10 s
gammaloop-nextest-docs> 0: __rustc::rust_begin_unwind
52.10 s
gammaloop-nextest-docs> 1: core::panicking::panic_fmt
52.10 s
gammaloop-nextest-docs> 2: core::result::unwrap_failed
52.10 s
gammaloop-nextest-docs> 3: alphal00p_docs_builder::tests::checked_in_registry_is_valid
52.10 s
gammaloop-nextest-docs> 4: <alphal00p_docs_builder::tests::checked_in_registry_is_valid::{closure#0} as core::ops::function::FnOnce<()>>::call_once
52.10 s
gammaloop-nextest-docs> note: Some details are omitted, run with `RUST_BACKTRACE=full` for a verbose backtrace.
52.10 s
gammaloop-nextest-docs>
52.13 s
gammaloop-nextest-docs> FAIL [ 0.267s] ( 77/129) alphal00p-docs-builder tests :: every_product_requires_a_task_chooser_and_each_supported_interface
52.13 s
gammaloop-nextest-docs> stdout ---
52.13 s
gammaloop-nextest-docs>
52.13 s
gammaloop-nextest-docs> running 1 test
52.13 s
gammaloop-nextest-docs> test tests::every_product_requires_a_task_chooser_and_each_supported_interface ... FAILED
52.13 s
gammaloop-nextest-docs>
52.13 s
gammaloop-nextest-docs> failures:
52.13 s
gammaloop-nextest-docs>
52.13 s
gammaloop-nextest-docs> failures:
52.13 s
gammaloop-nextest-docs> tests::every_product_requires_a_task_chooser_and_each_supported_interface
52.13 s
gammaloop-nextest-docs>
52.13 s
gammaloop-nextest-docs> test result: FAILED. 0 passed; 1 failed; 0 ignored; 0 measured; 128 filtered out; finished in 0.26s
52.13 s
gammaloop-nextest-docs>
52.13 s
gammaloop-nextest-docs> stderr ---
52.13 s
gammaloop-nextest-docs>
52.13 s
gammaloop-nextest-docs> thread 'tests::every_product_requires_a_task_chooser_and_each_supported_interface' (308) panicked at crates/alphal00p-docs-builder/src/lib.rs:12192:9:
52.13 s
gammaloop-nextest-docs> assertion failed: format!("{error:#}").contains("has no quickstart page")
52.13 s
gammaloop-nextest-docs> stack backtrace:
52.13 s
gammaloop-nextest-docs> 0: __rustc::rust_begin_unwind
52.13 s
gammaloop-nextest-docs> 1: core::panicking::panic_fmt
52.13 s
gammaloop-nextest-docs> 2: core::panicking::panic
52.13 s
gammaloop-nextest-docs> 3: alphal00p_docs_builder::tests::every_product_requires_a_task_chooser_and_each_supported_interface
52.13 s
gammaloop-nextest-docs> 4: <alphal00p_docs_builder::tests::every_product_requires_a_task_chooser_and_each_supported_interface::{closure#0} as core::ops::function::FnOnce<()>>::call_once
52.13 s
gammaloop-nextest-docs> note: Some details are omitted, run with `RUST_BACKTRACE=full` for a verbose backtrace.
52.13 s
gammaloop-nextest-docs>
52.24 s
gammaloop-nextest-docs> FAIL [ 0.294s] (121/129) alphal00p-docs-builder tests :: pdf_manual_chapter_order_must_match_the_page_registry
52.24 s
gammaloop-nextest-docs> stdout ---
52.24 s
gammaloop-nextest-docs>
52.24 s
gammaloop-nextest-docs> running 1 test
52.24 s
gammaloop-nextest-docs> test tests::pdf_manual_chapter_order_must_match_the_page_registry ... FAILED
52.24 s
gammaloop-nextest-docs>
52.24 s
gammaloop-nextest-docs> failures:
52.24 s
gammaloop-nextest-docs>
52.24 s
gammaloop-nextest-docs> failures:
52.24 s
gammaloop-nextest-docs> tests::pdf_manual_chapter_order_must_match_the_page_registry
52.24 s
gammaloop-nextest-docs>
52.24 s
gammaloop-nextest-docs> test result: FAILED. 0 passed; 1 failed; 0 ignored; 0 measured; 128 filtered out; finished in 0.27s
52.24 s
gammaloop-nextest-docs>
52.24 s
gammaloop-nextest-docs> stderr ---
52.24 s
gammaloop-nextest-docs>
52.24 s
gammaloop-nextest-docs> thread 'tests::pdf_manual_chapter_order_must_match_the_page_registry' (440) panicked at crates/alphal00p-docs-builder/src/lib.rs:12243:9:
52.24 s
gammaloop-nextest-docs> assertion failed: format!("{error:#}").contains("PDF manual chapter order differs")
52.24 s
gammaloop-nextest-docs> stack backtrace:
52.24 s
gammaloop-nextest-docs> 0: __rustc::rust_begin_unwind
52.24 s
gammaloop-nextest-docs> 1: core::panicking::panic_fmt
52.24 s
gammaloop-nextest-docs> 2: core::panicking::panic
52.24 s
gammaloop-nextest-docs> 3: alphal00p_docs_builder::tests::pdf_manual_chapter_order_must_match_the_page_registry
52.24 s
gammaloop-nextest-docs> 4: <alphal00p_docs_builder::tests::pdf_manual_chapter_order_must_match_the_page_registry::{closure#0} as core::ops::function::FnOnce<()>>::call_once
52.24 s
gammaloop-nextest-docs> note: Some details are omitted, run with `RUST_BACKTRACE=full` for a verbose backtrace.
52.24 s
gammaloop-nextest-docs>
69.06 s
gammaloop-nextest-docs> ------------
69.06 s
gammaloop-nextest-docs> Summary [ 17.240s] 129 tests run: 124 passed , 5 failed , 0 skipped
69.06 s
gammaloop-nextest-docs> FAIL [ 0.214s] ( 62/129) alphal00p-docs-builder tests :: developer_scope_ranges_ignore_unrelated_edits_and_warn_only_while_watching
69.06 s
gammaloop-nextest-docs> stdout ---
69.06 s
gammaloop-nextest-docs>
69.06 s
gammaloop-nextest-docs> running 1 test
69.06 s
gammaloop-nextest-docs> test tests::developer_scope_ranges_ignore_unrelated_edits_and_warn_only_while_watching ... FAILED
69.06 s
gammaloop-nextest-docs>
69.06 s
gammaloop-nextest-docs> failures:
69.06 s
gammaloop-nextest-docs>
69.06 s
gammaloop-nextest-docs> failures:
69.06 s
gammaloop-nextest-docs> tests::developer_scope_ranges_ignore_unrelated_edits_and_warn_only_while_watching
69.06 s
gammaloop-nextest-docs>
69.06 s
gammaloop-nextest-docs> test result: FAILED. 0 passed; 1 failed; 0 ignored; 0 measured; 128 filtered out; finished in 0.21s
69.06 s
gammaloop-nextest-docs>
69.06 s
gammaloop-nextest-docs> stderr ---
69.06 s
gammaloop-nextest-docs>
69.06 s
gammaloop-nextest-docs> thread 'tests::developer_scope_ranges_ignore_unrelated_edits_and_warn_only_while_watching' (286) panicked at crates/alphal00p-docs-builder/src/lib.rs:12263:29:
69.06 s
gammaloop-nextest-docs> called `Result::unwrap()` on an `Err` value: developer note nix-crane-cache-reuse verified scope nix/rust-workspace.nix changed (expected 66f700580ce13b9eaee90fe0111639e46968c531, found 0a568cb5712045aee37d96bfb2f91d3d32b7e9b9); owner review or an explicit no-impact attestation is required
69.06 s
gammaloop-nextest-docs>
69.06 s
gammaloop-nextest-docs> Location:
69.06 s
gammaloop-nextest-docs> crates/alphal00p-docs-builder/src/lib.rs:992:29
69.06 s
gammaloop-nextest-docs> stack backtrace:
69.06 s
gammaloop-nextest-docs> 0: __rustc::rust_begin_unwind
69.06 s
gammaloop-nextest-docs> 1: core::panicking::panic_fmt
69.06 s
gammaloop-nextest-docs> 2: core::result::unwrap_failed
69.06 s
gammaloop-nextest-docs> 3: alphal00p_docs_builder::tests::developer_scope_ranges_ignore_unrelated_edits_and_warn_only_while_watching
69.06 s
gammaloop-nextest-docs> 4: <alphal00p_docs_builder::tests::developer_scope_ranges_ignore_unrelated_edits_and_warn_only_while_watching::{closure#0} as core::ops::function::FnOnce<()>>::call_once
69.06 s
gammaloop-nextest-docs> note: Some details are omitted, run with `RUST_BACKTRACE=full` for a verbose backtrace.
69.06 s
gammaloop-nextest-docs>
69.06 s
gammaloop-nextest-docs> FAIL [ 0.274s] ( 66/129) alphal00p-docs-builder provenance_tests :: each_build_captures_one_revision_before_rendering
69.06 s
gammaloop-nextest-docs> stdout ---
69.06 s
gammaloop-nextest-docs>
69.06 s
gammaloop-nextest-docs> running 1 test
69.06 s
gammaloop-nextest-docs>
69.06 s
gammaloop-nextest-docs> running 1 test
69.06 s
gammaloop-nextest-docs> test provenance_tests::each_build_captures_one_revision_before_rendering ... FAILED
69.06 s
gammaloop-nextest-docs>
69.06 s
gammaloop-nextest-docs> failures:
69.06 s
gammaloop-nextest-docs>
69.06 s
gammaloop-nextest-docs> failures:
69.06 s
gammaloop-nextest-docs> provenance_tests::each_build_captures_one_revision_before_rendering
69.06 s
gammaloop-nextest-docs>
69.06 s
gammaloop-nextest-docs> test result: FAILED. 0 passed; 1 failed; 0 ignored; 0 measured; 128 filtered out; finished in 0.25s
69.06 s
gammaloop-nextest-docs>
69.06 s
gammaloop-nextest-docs> test provenance_tests::each_build_captures_one_revision_before_rendering ... FAILED
69.06 s
gammaloop-nextest-docs>
69.06 s
gammaloop-nextest-docs> failures:
69.06 s
gammaloop-nextest-docs>
69.06 s
gammaloop-nextest-docs> failures:
69.06 s
gammaloop-nextest-docs> provenance_tests::each_build_captures_one_revision_before_rendering
69.06 s
gammaloop-nextest-docs>
69.06 s
gammaloop-nextest-docs> test result: FAILED. 0 passed; 1 failed; 0 ignored; 0 measured; 128 filtered out; finished in 0.27s
69.06 s
gammaloop-nextest-docs>
69.06 s
gammaloop-nextest-docs> stderr ---
69.06 s
gammaloop-nextest-docs>
69.06 s
gammaloop-nextest-docs> thread 'provenance_tests::each_build_captures_one_revision_before_rendering' (224) panicked at crates/alphal00p-docs-builder/src/provenance_tests.rs:297:14:
69.06 s
gammaloop-nextest-docs> called `Result::unwrap()` on an `Err` value: developer note nix-crane-cache-reuse verified scope nix/rust-workspace.nix changed (expected 66f700580ce13b9eaee90fe0111639e46968c531, found 0a568cb5712045aee37d96bfb2f91d3d32b7e9b9); owner review or an explicit no-impact attestation is required
69.06 s
gammaloop-nextest-docs>
69.06 s
gammaloop-nextest-docs> Location:
69.06 s
gammaloop-nextest-docs> crates/alphal00p-docs-builder/src/lib.rs:992:29
69.06 s
gammaloop-nextest-docs> stack backtrace:
69.06 s
gammaloop-nextest-docs> 0: __rustc::rust_begin_unwind
69.06 s
gammaloop-nextest-docs> 1: core::panicking::panic_fmt
69.06 s
gammaloop-nextest-docs> 2: core::result::unwrap_failed
69.06 s
gammaloop-nextest-docs> 3: alphal00p_docs_builder::provenance_tests::each_build_captures_one_revision_before_rendering
69.06 s
gammaloop-nextest-docs> 4: <alphal00p_docs_builder::provenance_tests::each_build_captures_one_revision_before_rendering::{closure#0} as core::ops::function::FnOnce<()>>::call_once
69.06 s
gammaloop-nextest-docs> note: Some details are omitted, run with `RUST_BACKTRACE=full` for a verbose backtrace.
69.06 s
gammaloop-nextest-docs>
69.06 s
gammaloop-nextest-docs> thread 'provenance_tests::each_build_captures_one_revision_before_rendering' (163) panicked at crates/alphal00p-docs-builder/src/provenance_tests.rs:274:9:
69.06 s
gammaloop-nextest-docs> assertion failed: command.status().unwrap().success()
69.06 s
gammaloop-nextest-docs> stack backtrace:
69.06 s
gammaloop-nextest-docs> 0: __rustc::rust_begin_unwind
69.06 s
gammaloop-nextest-docs> 1: core::panicking::panic_fmt
69.06 s
gammaloop-nextest-docs> 2: core::panicking::panic
69.06 s
gammaloop-nextest-docs> 3: alphal00p_docs_builder::provenance_tests::each_build_captures_one_revision_before_rendering
69.06 s
gammaloop-nextest-docs> 4: <alphal00p_docs_builder::provenance_tests::each_build_captures_one_revision_before_rendering::{closure#0} as core::ops::function::FnOnce<()>>::call_once
69.06 s
gammaloop-nextest-docs> note: Some details are omitted, run with `RUST_BACKTRACE=full` for a verbose backtrace.
69.06 s
gammaloop-nextest-docs>
69.06 s
gammaloop-nextest-docs> FAIL [ 0.274s] ( 67/129) alphal00p-docs-builder tests :: checked_in_registry_is_valid
69.06 s
gammaloop-nextest-docs> stdout ---
69.06 s
gammaloop-nextest-docs>
69.06 s
gammaloop-nextest-docs> running 1 test
69.06 s
gammaloop-nextest-docs> test tests::checked_in_registry_is_valid ... FAILED
69.06 s
gammaloop-nextest-docs>
69.06 s
gammaloop-nextest-docs> failures:
69.06 s
gammaloop-nextest-docs>
69.06 s
gammaloop-nextest-docs> failures:
69.06 s
gammaloop-nextest-docs> tests::checked_in_registry_is_valid
69.06 s
gammaloop-nextest-docs>
69.06 s
gammaloop-nextest-docs> test result: FAILED. 0 passed; 1 failed; 0 ignored; 0 measured; 128 filtered out; finished in 0.26s
69.06 s
gammaloop-nextest-docs>
69.06 s
gammaloop-nextest-docs> stderr ---
69.06 s
gammaloop-nextest-docs>
69.06 s
gammaloop-nextest-docs> thread 'tests::checked_in_registry_is_valid' (213) panicked at crates/alphal00p-docs-builder/src/lib.rs:12178:50:
69.06 s
gammaloop-nextest-docs> called `Result::unwrap()` on an `Err` value: developer note nix-crane-cache-reuse verified scope nix/rust-workspace.nix changed (expected 66f700580ce13b9eaee90fe0111639e46968c531, found 0a568cb5712045aee37d96bfb2f91d3d32b7e9b9); owner review or an explicit no-impact attestation is required
69.06 s
gammaloop-nextest-docs>
69.06 s
gammaloop-nextest-docs> Location:
69.06 s
gammaloop-nextest-docs> crates/alphal00p-docs-builder/src/lib.rs:992:29
69.06 s
gammaloop-nextest-docs> stack backtrace:
69.06 s
gammaloop-nextest-docs> 0: __rustc::rust_begin_unwind
69.06 s
gammaloop-nextest-docs> 1: core::panicking::panic_fmt
69.06 s
gammaloop-nextest-docs> 2: core::result::unwrap_failed
69.06 s
gammaloop-nextest-docs> 3: alphal00p_docs_builder::tests::checked_in_registry_is_valid
69.06 s
gammaloop-nextest-docs> 4: <alphal00p_docs_builder::tests::checked_in_registry_is_valid::{closure#0} as core::ops::function::FnOnce<()>>::call_once
69.06 s
gammaloop-nextest-docs> note: Some details are omitted, run with `RUST_BACKTRACE=full` for a verbose backtrace.
69.06 s
gammaloop-nextest-docs>
69.06 s
gammaloop-nextest-docs> FAIL [ 0.267s] ( 77/129) alphal00p-docs-builder tests :: every_product_requires_a_task_chooser_and_each_supported_interface
69.06 s
gammaloop-nextest-docs> stdout ---
69.06 s
gammaloop-nextest-docs>
69.06 s
gammaloop-nextest-docs> running 1 test
69.06 s
gammaloop-nextest-docs> test tests::every_product_requires_a_task_chooser_and_each_supported_interface ... FAILED
69.06 s
gammaloop-nextest-docs>
69.06 s
gammaloop-nextest-docs> failures:
69.06 s
gammaloop-nextest-docs>
69.06 s
gammaloop-nextest-docs> failures:
69.06 s
gammaloop-nextest-docs> tests::every_product_requires_a_task_chooser_and_each_supported_interface
69.06 s
gammaloop-nextest-docs>
69.06 s
gammaloop-nextest-docs> test result: FAILED. 0 passed; 1 failed; 0 ignored; 0 measured; 128 filtered out; finished in 0.26s
69.06 s
gammaloop-nextest-docs>
69.06 s
gammaloop-nextest-docs> stderr ---
69.06 s
gammaloop-nextest-docs>
69.06 s
gammaloop-nextest-docs> thread 'tests::every_product_requires_a_task_chooser_and_each_supported_interface' (308) panicked at crates/alphal00p-docs-builder/src/lib.rs:12192:9:
69.06 s
gammaloop-nextest-docs> assertion failed: format!("{error:#}").contains("has no quickstart page")
69.06 s
gammaloop-nextest-docs> stack backtrace:
69.06 s
gammaloop-nextest-docs> 0: __rustc::rust_begin_unwind
69.06 s
gammaloop-nextest-docs> 1: core::panicking::panic_fmt
69.06 s
gammaloop-nextest-docs> 2: core::panicking::panic
69.06 s
gammaloop-nextest-docs> 3: alphal00p_docs_builder::tests::every_product_requires_a_task_chooser_and_each_supported_interface
69.06 s
gammaloop-nextest-docs> 4: <alphal00p_docs_builder::tests::every_product_requires_a_task_chooser_and_each_supported_interface::{closure#0} as core::ops::function::FnOnce<()>>::call_once
69.06 s
gammaloop-nextest-docs> note: Some details are omitted, run with `RUST_BACKTRACE=full` for a verbose backtrace.
69.06 s
gammaloop-nextest-docs>
69.06 s
gammaloop-nextest-docs> FAIL [ 0.294s] (121/129) alphal00p-docs-builder tests :: pdf_manual_chapter_order_must_match_the_page_registry
69.06 s
gammaloop-nextest-docs> stdout ---
69.06 s
gammaloop-nextest-docs>
69.06 s
gammaloop-nextest-docs> running 1 test
69.06 s
gammaloop-nextest-docs> test tests::pdf_manual_chapter_order_must_match_the_page_registry ... FAILED
69.06 s
gammaloop-nextest-docs>
69.06 s
gammaloop-nextest-docs> failures:
69.06 s
gammaloop-nextest-docs>
69.06 s
gammaloop-nextest-docs> failures:
69.06 s
gammaloop-nextest-docs> tests::pdf_manual_chapter_order_must_match_the_page_registry
69.06 s
gammaloop-nextest-docs>
69.06 s
gammaloop-nextest-docs> test result: FAILED. 0 passed; 1 failed; 0 ignored; 0 measured; 128 filtered out; finished in 0.27s
69.06 s
gammaloop-nextest-docs>
69.06 s
gammaloop-nextest-docs> stderr ---
69.06 s
gammaloop-nextest-docs>
69.06 s
gammaloop-nextest-docs> thread 'tests::pdf_manual_chapter_order_must_match_the_page_registry' (440) panicked at crates/alphal00p-docs-builder/src/lib.rs:12243:9:
69.06 s
gammaloop-nextest-docs> assertion failed: format!("{error:#}").contains("PDF manual chapter order differs")
69.06 s
gammaloop-nextest-docs> stack backtrace:
69.06 s
gammaloop-nextest-docs> 0: __rustc::rust_begin_unwind
69.06 s
gammaloop-nextest-docs> 1: core::panicking::panic_fmt
69.06 s
gammaloop-nextest-docs> 2: core::panicking::panic
69.06 s
gammaloop-nextest-docs> 3: alphal00p_docs_builder::tests::pdf_manual_chapter_order_must_match_the_page_registry
69.06 s
gammaloop-nextest-docs> 4: <alphal00p_docs_builder::tests::pdf_manual_chapter_order_must_match_the_page_registry::{closure#0} as core::ops::function::FnOnce<()>>::call_once
69.06 s
gammaloop-nextest-docs> note: Some details are omitted, run with `RUST_BACKTRACE=full` for a verbose backtrace.
69.06 s
gammaloop-nextest-docs>
69.07 s
gammaloop-nextest-docs> error : test run failed
69.10 s
gammaloop-nextest-docs>
69.10 s
gammaloop-nextest-docs> ========== nextest test summary ==========
69.10 s
gammaloop-nextest-docs> report: target/nextest/ci_gammaloop/junit.xml
69.10 s
gammaloop-nextest-docs> tests: 129, failures: 5, errors: 0
69.10 s
gammaloop-nextest-docs>
69.10 s
gammaloop-nextest-docs> 1. alphal00p-docs-builder::tests::developer_scope_ranges_ignore_unrelated_edits_and_warn_only_while_watching
69.10 s
gammaloop-nextest-docs> failure: test failure with exit code 101
69.10 s
gammaloop-nextest-docs> thread 'tests::developer_scope_ranges_ignore_unrelated_edits_and_warn_only_while_watching' (286) panicked at crates/alphal00p-docs-builder/src/lib.rs:12263:29:
69.10 s
gammaloop-nextest-docs> called `Result::unwrap()` on an `Err` value: developer note nix-crane-cache-reuse verified scope nix/rust-workspace.nix changed (expected 66f700580ce13b9eaee90fe0111639e46968c531, found 0a568cb5712045aee37d96bfb2f91d3d32b7e9b9); owner review or an explicit no-impact attestation is required
69.10 s
gammaloop-nextest-docs>
69.10 s
gammaloop-nextest-docs> Location:
69.10 s
gammaloop-nextest-docs> crates/alphal00p-docs-builder/src/lib.rs:992:29
69.10 s
gammaloop-nextest-docs> stack backtrace:
69.10 s
gammaloop-nextest-docs> 0: __rustc::rust_begin_unwind
69.10 s
gammaloop-nextest-docs> 1: core::panicking::panic_fmt
69.10 s
gammaloop-nextest-docs> 2: core::result::unwrap_failed
69.10 s
gammaloop-nextest-docs> 3: alphal00p_docs_builder::tests::developer_scope_ranges_ignore_unrelated_edits_and_warn_only_while_watching
69.10 s
gammaloop-nextest-docs> 4: <alphal00p_docs_builder::tests::developer_scope_ranges_ignore_unrelated_edits_and_warn_only_while_watching::{closure#0} as core::ops::function::FnOnce<()>>::call_once
69.10 s
gammaloop-nextest-docs> note: Some details are omitted, run with `RUST_BACKTRACE=full` for a verbose backtrace.
69.10 s
gammaloop-nextest-docs> system-out
69.10 s
gammaloop-nextest-docs> running 1 test
69.10 s
gammaloop-nextest-docs> test tests::developer_scope_ranges_ignore_unrelated_edits_and_warn_only_while_watching ... FAILED
69.10 s
gammaloop-nextest-docs>
69.10 s
gammaloop-nextest-docs> failures:
69.10 s
gammaloop-nextest-docs>
69.10 s
gammaloop-nextest-docs> failures:
69.10 s
gammaloop-nextest-docs> tests::developer_scope_ranges_ignore_unrelated_edits_and_warn_only_while_watching
69.10 s
gammaloop-nextest-docs>
69.10 s
gammaloop-nextest-docs> test result: FAILED. 0 passed; 1 failed; 0 ignored; 0 measured; 128 filtered out; finished in 0.21s
69.10 s
gammaloop-nextest-docs> system-err
69.10 s
gammaloop-nextest-docs> thread 'tests::developer_scope_ranges_ignore_unrelated_edits_and_warn_only_while_watching' (286) panicked at crates/alphal00p-docs-builder/src/lib.rs:12263:29:
69.10 s
gammaloop-nextest-docs> called `Result::unwrap()` on an `Err` value: developer note nix-crane-cache-reuse verified scope nix/rust-workspace.nix changed (expected 66f700580ce13b9eaee90fe0111639e46968c531, found 0a568cb5712045aee37d96bfb2f91d3d32b7e9b9); owner review or an explicit no-impact attestation is required
69.10 s
gammaloop-nextest-docs>
69.10 s
gammaloop-nextest-docs> Location:
69.10 s
gammaloop-nextest-docs> crates/alphal00p-docs-builder/src/lib.rs:992:29
69.10 s
gammaloop-nextest-docs> stack backtrace:
69.10 s
gammaloop-nextest-docs> 0: __rustc::rust_begin_unwind
69.10 s
gammaloop-nextest-docs> 1: core::panicking::panic_fmt
69.10 s
gammaloop-nextest-docs> 2: core::result::unwrap_failed
69.10 s
gammaloop-nextest-docs> 3: alphal00p_docs_builder::tests::developer_scope_ranges_ignore_unrelated_edits_and_warn_only_while_watching
69.10 s
gammaloop-nextest-docs> 4: <alphal00p_docs_builder::tests::developer_scope_ranges_ignore_unrelated_edits_and_warn_only_while_watching::{closure#0} as core::ops::function::FnOnce<()>>::call_once
69.10 s
gammaloop-nextest-docs> note: Some details are omitted, run with `RUST_BACKTRACE=full` for a verbose backtrace.
69.10 s
gammaloop-nextest-docs>
69.10 s
gammaloop-nextest-docs> 2. alphal00p-docs-builder::provenance_tests::each_build_captures_one_revision_before_rendering
69.10 s
gammaloop-nextest-docs> failure: test failure with exit code 101
69.10 s
gammaloop-nextest-docs> thread 'provenance_tests::each_build_captures_one_revision_before_rendering' (163) panicked at crates/alphal00p-docs-builder/src/provenance_tests.rs:274:9:
69.10 s
gammaloop-nextest-docs> assertion failed: command.status().unwrap().success()
69.10 s
gammaloop-nextest-docs> stack backtrace:
69.10 s
gammaloop-nextest-docs> 0: __rustc::rust_begin_unwind
69.10 s
gammaloop-nextest-docs> 1: core::panicking::panic_fmt
69.10 s
gammaloop-nextest-docs> 2: core::panicking::panic
69.10 s
gammaloop-nextest-docs> 3: alphal00p_docs_builder::provenance_tests::each_build_captures_one_revision_before_rendering
69.10 s
gammaloop-nextest-docs> 4: <alphal00p_docs_builder::provenance_tests::each_build_captures_one_revision_before_rendering::{closure#0} as core::ops::function::FnOnce<()>>::call_once
69.10 s
gammaloop-nextest-docs> note: Some details are omitted, run with `RUST_BACKTRACE=full` for a verbose backtrace.
69.10 s
gammaloop-nextest-docs> system-out
69.10 s
gammaloop-nextest-docs> running 1 test
69.10 s
gammaloop-nextest-docs>
69.10 s
gammaloop-nextest-docs> running 1 test
69.10 s
gammaloop-nextest-docs> test provenance_tests::each_build_captures_one_revision_before_rendering ... FAILED
69.10 s
gammaloop-nextest-docs>
69.10 s
gammaloop-nextest-docs> failures:
69.10 s
gammaloop-nextest-docs>
69.10 s
gammaloop-nextest-docs> failures:
69.10 s
gammaloop-nextest-docs> provenance_tests::each_build_captures_one_revision_before_rendering
69.10 s
gammaloop-nextest-docs>
69.10 s
gammaloop-nextest-docs> test result: FAILED. 0 passed; 1 failed; 0 ignored; 0 measured; 128 filtered out; finished in 0.25s
69.10 s
gammaloop-nextest-docs>
69.10 s
gammaloop-nextest-docs> test provenance_tests::each_build_captures_one_revision_before_rendering ... FAILED
69.10 s
gammaloop-nextest-docs>
69.10 s
gammaloop-nextest-docs> failures:
69.10 s
gammaloop-nextest-docs>
69.10 s
gammaloop-nextest-docs> failures:
69.10 s
gammaloop-nextest-docs> provenance_tests::each_build_captures_one_revision_before_rendering
69.10 s
gammaloop-nextest-docs>
69.10 s
gammaloop-nextest-docs> test result: FAILED. 0 passed; 1 failed; 0 ignored; 0 measured; 128 filtered out; finished in 0.27s
69.10 s
gammaloop-nextest-docs> system-err
69.10 s
gammaloop-nextest-docs> thread 'provenance_tests::each_build_captures_one_revision_before_rendering' (224) panicked at crates/alphal00p-docs-builder/src/provenance_tests.rs:297:14:
69.10 s
gammaloop-nextest-docs> called `Result::unwrap()` on an `Err` value: developer note nix-crane-cache-reuse verified scope nix/rust-workspace.nix changed (expected 66f700580ce13b9eaee90fe0111639e46968c531, found 0a568cb5712045aee37d96bfb2f91d3d32b7e9b9); owner review or an explicit no-impact attestation is required
69.10 s
gammaloop-nextest-docs>
69.10 s
gammaloop-nextest-docs> Location:
69.10 s
gammaloop-nextest-docs> crates/alphal00p-docs-builder/src/lib.rs:992:29
69.10 s
gammaloop-nextest-docs> stack backtrace:
69.10 s
gammaloop-nextest-docs> 0: __rustc::rust_begin_unwind
69.10 s
gammaloop-nextest-docs> 1: core::panicking::panic_fmt
69.10 s
gammaloop-nextest-docs> 2: core::result::unwrap_failed
69.10 s
gammaloop-nextest-docs> 3: alphal00p_docs_builder::provenance_tests::each_build_captures_one_revision_before_rendering
69.10 s
gammaloop-nextest-docs> 4: <alphal00p_docs_builder::provenance_tests::each_build_captures_one_revision_before_rendering::{closure#0} as core::ops::function::FnOnce<()>>::call_once
69.10 s
gammaloop-nextest-docs> note: Some details are omitted, run with `RUST_BACKTRACE=full` for a verbose backtrace.
69.10 s
gammaloop-nextest-docs>
69.10 s
gammaloop-nextest-docs> thread 'provenance_tests::each_build_captures_one_revision_before_rendering' (163) panicked at crates/alphal00p-docs-builder/src/provenance_tests.rs:274:9:
69.10 s
gammaloop-nextest-docs> assertion failed: command.status().unwrap().success()
69.10 s
gammaloop-nextest-docs> stack backtrace:
69.10 s
gammaloop-nextest-docs> 0: __rustc::rust_begin_unwind
69.10 s
gammaloop-nextest-docs> 1: core::panicking::panic_fmt
69.10 s
gammaloop-nextest-docs> 2: core::panicking::panic
69.10 s
gammaloop-nextest-docs> 3: alphal00p_docs_builder::provenance_tests::each_build_captures_one_revision_before_rendering
69.10 s
gammaloop-nextest-docs> 4: <alphal00p_docs_builder::provenance_tests::each_build_captures_one_revision_before_rendering::{closure#0} as core::ops::function::FnOnce<()>>::call_once
69.10 s
gammaloop-nextest-docs> note: Some details are omitted, run with `RUST_BACKTRACE=full` for a verbose backtrace.
69.10 s
gammaloop-nextest-docs>
69.10 s
gammaloop-nextest-docs> 3. alphal00p-docs-builder::tests::checked_in_registry_is_valid
69.10 s
gammaloop-nextest-docs> failure: test failure with exit code 101
69.10 s
gammaloop-nextest-docs> thread 'tests::checked_in_registry_is_valid' (213) panicked at crates/alphal00p-docs-builder/src/lib.rs:12178:50:
69.10 s
gammaloop-nextest-docs> called `Result::unwrap()` on an `Err` value: developer note nix-crane-cache-reuse verified scope nix/rust-workspace.nix changed (expected 66f700580ce13b9eaee90fe0111639e46968c531, found 0a568cb5712045aee37d96bfb2f91d3d32b7e9b9); owner review or an explicit no-impact attestation is required
69.10 s
gammaloop-nextest-docs>
69.10 s
gammaloop-nextest-docs> Location:
69.10 s
gammaloop-nextest-docs> crates/alphal00p-docs-builder/src/lib.rs:992:29
69.10 s
gammaloop-nextest-docs> stack backtrace:
69.10 s
gammaloop-nextest-docs> 0: __rustc::rust_begin_unwind
69.10 s
gammaloop-nextest-docs> 1: core::panicking::panic_fmt
69.10 s
gammaloop-nextest-docs> 2: core::result::unwrap_failed
69.10 s
gammaloop-nextest-docs> 3: alphal00p_docs_builder::tests::checked_in_registry_is_valid
69.10 s
gammaloop-nextest-docs> 4: <alphal00p_docs_builder::tests::checked_in_registry_is_valid::{closure#0} as core::ops::function::FnOnce<()>>::call_once
69.10 s
gammaloop-nextest-docs> note: Some details are omitted, run with `RUST_BACKTRACE=full` for a verbose backtrace.
69.10 s
gammaloop-nextest-docs> system-out
69.10 s
gammaloop-nextest-docs> running 1 test
69.10 s
gammaloop-nextest-docs> test tests::checked_in_registry_is_valid ... FAILED
69.10 s
gammaloop-nextest-docs>
69.10 s
gammaloop-nextest-docs> failures:
69.10 s
gammaloop-nextest-docs>
69.10 s
gammaloop-nextest-docs> failures:
69.10 s
gammaloop-nextest-docs> tests::checked_in_registry_is_valid
69.10 s
gammaloop-nextest-docs>
69.10 s
gammaloop-nextest-docs> test result: FAILED. 0 passed; 1 failed; 0 ignored; 0 measured; 128 filtered out; finished in 0.26s
69.10 s
gammaloop-nextest-docs> system-err
69.10 s
gammaloop-nextest-docs> thread 'tests::checked_in_registry_is_valid' (213) panicked at crates/alphal00p-docs-builder/src/lib.rs:12178:50:
69.10 s
gammaloop-nextest-docs> called `Result::unwrap()` on an `Err` value: developer note nix-crane-cache-reuse verified scope nix/rust-workspace.nix changed (expected 66f700580ce13b9eaee90fe0111639e46968c531, found 0a568cb5712045aee37d96bfb2f91d3d32b7e9b9); owner review or an explicit no-impact attestation is required
69.10 s
gammaloop-nextest-docs>
69.10 s
gammaloop-nextest-docs> Location:
69.10 s
gammaloop-nextest-docs> crates/alphal00p-docs-builder/src/lib.rs:992:29
69.10 s
gammaloop-nextest-docs> stack backtrace:
69.10 s
gammaloop-nextest-docs> 0: __rustc::rust_begin_unwind
69.10 s
gammaloop-nextest-docs> 1: core::panicking::panic_fmt
69.10 s
gammaloop-nextest-docs> 2: core::result::unwrap_failed
69.10 s
gammaloop-nextest-docs> 3: alphal00p_docs_builder::tests::checked_in_registry_is_valid
69.10 s
gammaloop-nextest-docs> 4: <alphal00p_docs_builder::tests::checked_in_registry_is_valid::{closure#0} as core::ops::function::FnOnce<()>>::call_once
69.10 s
gammaloop-nextest-docs> note: Some details are omitted, run with `RUST_BACKTRACE=full` for a verbose backtrace.
69.10 s
gammaloop-nextest-docs>
69.10 s
gammaloop-nextest-docs> 4. alphal00p-docs-builder::tests::every_product_requires_a_task_chooser_and_each_supported_interface
69.10 s
gammaloop-nextest-docs> failure: test failure with exit code 101
69.10 s
gammaloop-nextest-docs> thread 'tests::every_product_requires_a_task_chooser_and_each_supported_interface' (308) panicked at crates/alphal00p-docs-builder/src/lib.rs:12192:9:
69.10 s
gammaloop-nextest-docs> assertion failed: format!("{error:#}").contains("has no quickstart page")
69.10 s
gammaloop-nextest-docs> stack backtrace:
69.10 s
gammaloop-nextest-docs> 0: __rustc::rust_begin_unwind
69.10 s
gammaloop-nextest-docs> 1: core::panicking::panic_fmt
69.10 s
gammaloop-nextest-docs> 2: core::panicking::panic
69.10 s
gammaloop-nextest-docs> 3: alphal00p_docs_builder::tests::every_product_requires_a_task_chooser_and_each_supported_interface
69.10 s
gammaloop-nextest-docs> 4: <alphal00p_docs_builder::tests::every_product_requires_a_task_chooser_and_each_supported_interface::{closure#0} as core::ops::function::FnOnce<()>>::call_once
69.10 s
gammaloop-nextest-docs> note: Some details are omitted, run with `RUST_BACKTRACE=full` for a verbose backtrace.
69.10 s
gammaloop-nextest-docs> system-out
69.10 s
gammaloop-nextest-docs> running 1 test
69.10 s
gammaloop-nextest-docs> test tests::every_product_requires_a_task_chooser_and_each_supported_interface ... FAILED
69.10 s
gammaloop-nextest-docs>
69.10 s
gammaloop-nextest-docs> failures:
69.10 s
gammaloop-nextest-docs>
69.10 s
gammaloop-nextest-docs> failures:
69.10 s
gammaloop-nextest-docs> tests::every_product_requires_a_task_chooser_and_each_supported_interface
69.10 s
gammaloop-nextest-docs>
69.10 s
gammaloop-nextest-docs> test result: FAILED. 0 passed; 1 failed; 0 ignored; 0 measured; 128 filtered out; finished in 0.26s
69.10 s
gammaloop-nextest-docs> system-err
69.10 s
gammaloop-nextest-docs> thread 'tests::every_product_requires_a_task_chooser_and_each_supported_interface' (308) panicked at crates/alphal00p-docs-builder/src/lib.rs:12192:9:
69.10 s
gammaloop-nextest-docs> assertion failed: format!("{error:#}").contains("has no quickstart page")
69.10 s
gammaloop-nextest-docs> stack backtrace:
69.10 s
gammaloop-nextest-docs> 0: __rustc::rust_begin_unwind
69.10 s
gammaloop-nextest-docs> 1: core::panicking::panic_fmt
69.10 s
gammaloop-nextest-docs> 2: core::panicking::panic
69.10 s
gammaloop-nextest-docs> 3: alphal00p_docs_builder::tests::every_product_requires_a_task_chooser_and_each_supported_interface
69.10 s
gammaloop-nextest-docs> 4: <alphal00p_docs_builder::tests::every_product_requires_a_task_chooser_and_each_supported_interface::{closure#0} as core::ops::function::FnOnce<()>>::call_once
69.10 s
gammaloop-nextest-docs> note: Some details are omitted, run with `RUST_BACKTRACE=full` for a verbose backtrace.
69.10 s
gammaloop-nextest-docs>
69.10 s
gammaloop-nextest-docs> 5. alphal00p-docs-builder::tests::pdf_manual_chapter_order_must_match_the_page_registry
69.10 s
gammaloop-nextest-docs> failure: test failure with exit code 101
69.10 s
gammaloop-nextest-docs> thread 'tests::pdf_manual_chapter_order_must_match_the_page_registry' (440) panicked at crates/alphal00p-docs-builder/src/lib.rs:12243:9:
69.10 s
gammaloop-nextest-docs> assertion failed: format!("{error:#}").contains("PDF manual chapter order differs")
69.10 s
gammaloop-nextest-docs> stack backtrace:
69.10 s
gammaloop-nextest-docs> 0: __rustc::rust_begin_unwind
69.10 s
gammaloop-nextest-docs> 1: core::panicking::panic_fmt
69.10 s
gammaloop-nextest-docs> 2: core::panicking::panic
69.10 s
gammaloop-nextest-docs> 3: alphal00p_docs_builder::tests::pdf_manual_chapter_order_must_match_the_page_registry
69.10 s
gammaloop-nextest-docs> 4: <alphal00p_docs_builder::tests::pdf_manual_chapter_order_must_match_the_page_registry::{closure#0} as core::ops::function::FnOnce<()>>::call_once
69.10 s
gammaloop-nextest-docs> note: Some details are omitted, run with `RUST_BACKTRACE=full` for a verbose backtrace.
69.10 s
gammaloop-nextest-docs> system-out
69.10 s
gammaloop-nextest-docs> running 1 test
69.10 s
gammaloop-nextest-docs> test tests::pdf_manual_chapter_order_must_match_the_page_registry ... FAILED
69.10 s
gammaloop-nextest-docs>
69.10 s
gammaloop-nextest-docs> failures:
69.10 s
gammaloop-nextest-docs>
69.10 s
gammaloop-nextest-docs> failures:
69.10 s
gammaloop-nextest-docs> tests::pdf_manual_chapter_order_must_match_the_page_registry
69.10 s
gammaloop-nextest-docs>
69.10 s
gammaloop-nextest-docs> test result: FAILED. 0 passed; 1 failed; 0 ignored; 0 measured; 128 filtered out; finished in 0.27s
69.10 s
gammaloop-nextest-docs> system-err
69.10 s
gammaloop-nextest-docs> thread 'tests::pdf_manual_chapter_order_must_match_the_page_registry' (440) panicked at crates/alphal00p-docs-builder/src/lib.rs:12243:9:
69.10 s
gammaloop-nextest-docs> assertion failed: format!("{error:#}").contains("PDF manual chapter order differs")
69.10 s
gammaloop-nextest-docs> stack backtrace:
69.10 s
gammaloop-nextest-docs> 0: __rustc::rust_begin_unwind
69.10 s
gammaloop-nextest-docs> 1: core::panicking::panic_fmt
69.10 s
gammaloop-nextest-docs> 2: core::panicking::panic
69.10 s
gammaloop-nextest-docs> 3: alphal00p_docs_builder::tests::pdf_manual_chapter_order_must_match_the_page_registry
69.10 s
gammaloop-nextest-docs> 4: <alphal00p_docs_builder::tests::pdf_manual_chapter_order_must_match_the_page_registry::{closure#0} as core::ops::function::FnOnce<()>>::call_once
69.10 s
gammaloop-nextest-docs> note: Some details are omitted, run with `RUST_BACKTRACE=full` for a verbose backtrace.
69.10 s
gammaloop-nextest-docs> =========================================
69.12 s
gammaloop-nextest-docs> Extracting 2 binaries to /build/source
69.16 s
gammaloop-nextest-docs> Extracted 5 files to /build/source in 0.04s
69.17 s
gammaloop-nextest-docs> ------------
69.17 s
gammaloop-nextest-docs> Nextest run ID 83404f65-5b1a-47f4-8948-d0f7c0d22cf5 with nextest profile: ci_gammaloop
69.17 s
gammaloop-nextest-docs> Starting 22 tests across 2 binaries
69.19 s
gammaloop-nextest-docs> ------------
69.19 s
gammaloop-nextest-docs> Summary [ 0.022s] 22 tests run: 22 passed , 0 skipped
69.22 s
gammaloop-nextest-docs>
69.22 s
gammaloop-nextest-docs> ========== nextest test summary ==========
69.22 s
gammaloop-nextest-docs> report: target/nextest/ci_gammaloop/junit.xml
69.22 s
gammaloop-nextest-docs> tests: 22, failures: 0, errors: 0
69.22 s
gammaloop-nextest-docs> No failing testcases found.
69.22 s
gammaloop-nextest-docs> =========================================
69.24 s
gammaloop-nextest-docs> Extracting 3 binaries (including 2 non-test binaries), 1 build script output directory, and 2 linked paths to /build/source
69.57 s
gammaloop-nextest-docs> Extracted 22 files to /build/source in 0.33s
69.58 s
gammaloop-nextest-docs> ------------
69.58 s
gammaloop-nextest-docs> Nextest run ID 4652b2c0-2236-4a39-97a4-c132831d2543 with nextest profile: ci_gammaloop
69.58 s
gammaloop-nextest-docs> Starting 89 tests across 1 binary
69.66 s
gammaloop-nextest-docs> ------------
69.66 s
gammaloop-nextest-docs> Summary [ 0.082s] 89 tests run: 89 passed , 0 skipped
69.70 s
gammaloop-nextest-docs>
69.70 s
gammaloop-nextest-docs> ========== nextest test summary ==========
69.70 s
gammaloop-nextest-docs> report: target/nextest/ci_gammaloop/junit.xml
69.70 s
gammaloop-nextest-docs> tests: 89, failures: 0, errors: 0
69.70 s
gammaloop-nextest-docs> No failing testcases found.
69.70 s
gammaloop-nextest-docs> =========================================
69.72 s
gammaloop-nextest-docs> Extracting 2 binaries to /build/source
69.76 s
gammaloop-nextest-docs> Extracted 5 files to /build/source in 0.05s
69.78 s
gammaloop-nextest-docs> ------------
69.78 s
gammaloop-nextest-docs> Nextest run ID b8e61b86-0715-418a-bd5c-c65687ec9df1 with nextest profile: ci_gammaloop
69.78 s
gammaloop-nextest-docs> Starting 10 tests across 2 binaries
85.73 s
gammaloop-nextest-docs> ------------
85.73 s
gammaloop-nextest-docs> Summary [ 15.952s] 10 tests run: 10 passed , 0 skipped
85.77 s
gammaloop-nextest-docs>
85.77 s
gammaloop-nextest-docs> ========== nextest test summary ==========
85.77 s
gammaloop-nextest-docs> report: target/nextest/ci_gammaloop/junit.xml
85.77 s
gammaloop-nextest-docs> tests: 10, failures: 0, errors: 0
85.77 s
gammaloop-nextest-docs> No failing testcases found.
85.77 s
gammaloop-nextest-docs> =========================================
85.78 s
gammaloop-nextest-docs> Extracting 1 binary to /build/source
85.83 s
gammaloop-nextest-docs> Extracted 4 files to /build/source in 0.05s
85.84 s
gammaloop-nextest-docs> ------------
85.84 s
gammaloop-nextest-docs> Nextest run ID af36f01c-5871-4cc4-be34-d30572d86417 with nextest profile: ci_gammaloop
85.84 s
gammaloop-nextest-docs> Starting 0 tests across 1 binary
85.84 s
gammaloop-nextest-docs> ------------
85.84 s
gammaloop-nextest-docs> Summary [ 0.000s] 0 tests run: 0 passed , 0 skipped
85.88 s
gammaloop-nextest-docs>
85.88 s
gammaloop-nextest-docs> ========== nextest test summary ==========
85.88 s
gammaloop-nextest-docs> report: target/nextest/ci_gammaloop/junit.xml
85.88 s
gammaloop-nextest-docs> tests: 0, failures: 0, errors: 0
85.88 s
gammaloop-nextest-docs> No failing testcases found.
85.88 s
gammaloop-nextest-docs> =========================================
85.90 s
gammaloop-nextest-docs> Extracting 1 binary to /build/source
85.94 s
gammaloop-nextest-docs> Extracted 4 files to /build/source in 0.04s
85.95 s
gammaloop-nextest-docs> ------------
85.95 s
gammaloop-nextest-docs> Nextest run ID c5f09761-23ea-4e4e-a29f-a8ff02ed1e63 with nextest profile: ci_gammaloop
85.95 s
gammaloop-nextest-docs> Starting 5 tests across 1 binary
85.95 s
gammaloop-nextest-docs> ------------
85.95 s
gammaloop-nextest-docs> Summary [ 0.006s] 5 tests run: 5 passed , 0 skipped
85.99 s
gammaloop-nextest-docs>
85.99 s
gammaloop-nextest-docs> ========== nextest test summary ==========
85.99 s
gammaloop-nextest-docs> report: target/nextest/ci_gammaloop/junit.xml
85.99 s
gammaloop-nextest-docs> tests: 5, failures: 0, errors: 0
85.99 s
gammaloop-nextest-docs> No failing testcases found.
85.99 s
gammaloop-nextest-docs> =========================================
86.23 s
[0 built (1 failed ), 72 error: Cannot build '/nix/store/vj8wdqhcdhpl16s0z9h5y6gmk5iqkmvb-gammaloop-nextest-docs.drv '.
86.23 s
Reason: builder failed with exit code 100 .
86.23 s
Output paths:
86.23 s
/nix/store/ydqcrz3r95y4diyz90dlyicd9s8v4bln-gammaloop-nextest-docs
86.23 s
Last 584 log lines:
86.23 s
> Extracting 2 binaries to /build/source
86.23 s
> Extracted 5 files to /build/source in 0.05s
86.23 s
> ------------
86.23 s
> Nextest run ID f6f9c216-f175-4d58-b410-38a939b7edc4 with nextest profile: ci_gammaloop
86.23 s
> Starting 129 tests across 2 binaries
86.23 s
> FAIL [ 0.214s] ( 62/129) alphal00p-docs-builder tests :: developer_scope_ranges_ignore_unrelated_edits_and_warn_only_while_watching
86.23 s
> stdout ---
86.23 s
>
86.23 s
> running 1 test
86.23 s
> test tests::developer_scope_ranges_ignore_unrelated_edits_and_warn_only_while_watching ... FAILED
86.23 s
>
86.23 s
> failures:
86.23 s
>
86.23 s
> failures:
86.23 s
> tests::developer_scope_ranges_ignore_unrelated_edits_and_warn_only_while_watching
86.23 s
>
86.23 s
> test result: FAILED. 0 passed; 1 failed; 0 ignored; 0 measured; 128 filtered out; finished in 0.21s
86.23 s
>
86.23 s
> stderr ---
86.23 s
>
86.23 s
> thread 'tests::developer_scope_ranges_ignore_unrelated_edits_and_warn_only_while_watching' (286) panicked at crates/alphal00p-docs-builder/src/lib.rs:12263:29:
86.23 s
> called `Result::unwrap()` on an `Err` value: developer note nix-crane-cache-reuse verified scope nix/rust-workspace.nix changed (expected 66f700580ce13b9eaee90fe0111639e46968c531, found 0a568cb5712045aee37d96bfb2f91d3d32b7e9b9); owner review or an explicit no-impact attestation is required
86.23 s
>
86.23 s
> Location:
86.23 s
> crates/alphal00p-docs-builder/src/lib.rs:992:29
86.23 s
> stack backtrace:
86.23 s
> 0: __rustc::rust_begin_unwind
86.23 s
> 1: core::panicking::panic_fmt
86.23 s
> 2: core::result::unwrap_failed
86.23 s
> 3: alphal00p_docs_builder::tests::developer_scope_ranges_ignore_unrelated_edits_and_warn_only_while_watching
86.23 s
> 4: <alphal00p_docs_builder::tests::developer_scope_ranges_ignore_unrelated_edits_and_warn_only_while_watching::{closure#0} as core::ops::function::FnOnce<()>>::call_once
86.23 s
> note: Some details are omitted, run with `RUST_BACKTRACE=full` for a verbose backtrace.
86.23 s
>
86.23 s
> FAIL [ 0.274s] ( 66/129) alphal00p-docs-builder provenance_tests :: each_build_captures_one_revision_before_rendering
86.23 s
> stdout ---
86.23 s
>
86.23 s
> running 1 test
86.23 s
>
86.23 s
> running 1 test
86.23 s
> test provenance_tests::each_build_captures_one_revision_before_rendering ... FAILED
86.23 s
>
86.23 s
> failures:
86.23 s
>
86.23 s
> failures:
86.23 s
> provenance_tests::each_build_captures_one_revision_before_rendering
86.23 s
>
86.23 s
> test result: FAILED. 0 passed; 1 failed; 0 ignored; 0 measured; 128 filtered out; finished in 0.25s
86.23 s
>
86.23 s
> test provenance_tests::each_build_captures_one_revision_before_rendering ... FAILED
86.23 s
>
86.23 s
> failures:
86.23 s
>
86.23 s
> failures:
86.23 s
> provenance_tests::each_build_captures_one_revision_before_rendering
86.23 s
>
86.23 s
> test result: FAILED. 0 passed; 1 failed; 0 ignored; 0 measured; 128 filtered out; finished in 0.27s
86.23 s
>
86.23 s
> stderr ---
86.23 s
>
86.23 s
> thread 'provenance_tests::each_build_captures_one_revision_before_rendering' (224) panicked at crates/alphal00p-docs-builder/src/provenance_tests.rs:297:14:
86.23 s
> called `Result::unwrap()` on an `Err` value: developer note nix-crane-cache-reuse verified scope nix/rust-workspace.nix changed (expected 66f700580ce13b9eaee90fe0111639e46968c531, found 0a568cb5712045aee37d96bfb2f91d3d32b7e9b9); owner review or an explicit no-impact attestation is required
86.23 s
>
86.23 s
> Location:
86.23 s
> crates/alphal00p-docs-builder/src/lib.rs:992:29
86.23 s
> stack backtrace:
86.23 s
> 0: __rustc::rust_begin_unwind
86.23 s
> 1: core::panicking::panic_fmt
86.23 s
> 2: core::result::unwrap_failed
86.23 s
> 3: alphal00p_docs_builder::provenance_tests::each_build_captures_one_revision_before_rendering
86.23 s
> 4: <alphal00p_docs_builder::provenance_tests::each_build_captures_one_revision_before_rendering::{closure#0} as core::ops::function::FnOnce<()>>::call_once
86.23 s
> note: Some details are omitted, run with `RUST_BACKTRACE=full` for a verbose backtrace.
86.23 s
>
86.23 s
> thread 'provenance_tests::each_build_captures_one_revision_before_rendering' (163) panicked at crates/alphal00p-docs-builder/src/provenance_tests.rs:274:9:
86.23 s
> assertion failed: command.status().unwrap().success()
86.23 s
> stack backtrace:
86.23 s
> 0: __rustc::rust_begin_unwind
86.23 s
> 1: core::panicking::panic_fmt
86.23 s
> 2: core::panicking::panic
86.23 s
> 3: alphal00p_docs_builder::provenance_tests::each_build_captures_one_revision_before_rendering
86.23 s
> 4: <alphal00p_docs_builder::provenance_tests::each_build_captures_one_revision_before_rendering::{closure#0} as core::ops::function::FnOnce<()>>::call_once
86.23 s
> note: Some details are omitted, run with `RUST_BACKTRACE=full` for a verbose backtrace.
86.23 s
>
86.23 s
> FAIL [ 0.274s] ( 67/129) alphal00p-docs-builder tests :: checked_in_registry_is_valid
86.23 s
> stdout ---
86.23 s
>
86.23 s
> running 1 test
86.23 s
> test tests::checked_in_registry_is_valid ... FAILED
86.23 s
>
86.23 s
> failures:
86.23 s
>
86.23 s
> failures:
86.23 s
> tests::checked_in_registry_is_valid
86.23 s
>
86.23 s
> test result: FAILED. 0 passed; 1 failed; 0 ignored; 0 measured; 128 filtered out; finished in 0.26s
86.23 s
>
86.23 s
> stderr ---
86.23 s
>
86.23 s
> thread 'tests::checked_in_registry_is_valid' (213) panicked at crates/alphal00p-docs-builder/src/lib.rs:12178:50:
86.23 s
> called `Result::unwrap()` on an `Err` value: developer note nix-crane-cache-reuse verified scope nix/rust-workspace.nix changed (expected 66f700580ce13b9eaee90fe0111639e46968c531, found 0a568cb5712045aee37d96bfb2f91d3d32b7e9b9); owner review or an explicit no-impact attestation is required
86.23 s
>
86.23 s
> Location:
86.23 s
> crates/alphal00p-docs-builder/src/lib.rs:992:29
86.23 s
> stack backtrace:
86.23 s
> 0: __rustc::rust_begin_unwind
86.23 s
> 1: core::panicking::panic_fmt
86.23 s
> 2: core::result::unwrap_failed
86.23 s
> 3: alphal00p_docs_builder::tests::checked_in_registry_is_valid
86.23 s
> 4: <alphal00p_docs_builder::tests::checked_in_registry_is_valid::{closure#0} as core::ops::function::FnOnce<()>>::call_once
86.23 s
> note: Some details are omitted, run with `RUST_BACKTRACE=full` for a verbose backtrace.
86.23 s
>
86.23 s
> FAIL [ 0.267s] ( 77/129) alphal00p-docs-builder tests :: every_product_requires_a_task_chooser_and_each_supported_interface
86.23 s
> stdout ---
86.23 s
>
86.23 s
> running 1 test
86.23 s
> test tests::every_product_requires_a_task_chooser_and_each_supported_interface ... FAILED
86.23 s
>
86.23 s
> failures:
86.23 s
>
86.23 s
> failures:
86.23 s
> tests::every_product_requires_a_task_chooser_and_each_supported_interface
86.23 s
>
86.23 s
> test result: FAILED. 0 passed; 1 failed; 0 ignored; 0 measured; 128 filtered out; finished in 0.26s
86.23 s
>
86.23 s
> stderr ---
86.23 s
>
86.23 s
> thread 'tests::every_product_requires_a_task_chooser_and_each_supported_interface' (308) panicked at crates/alphal00p-docs-builder/src/lib.rs:12192:9:
86.23 s
> assertion failed: format!("{error:#}").contains("has no quickstart page")
86.23 s
> stack backtrace:
86.23 s
> 0: __rustc::rust_begin_unwind
86.23 s
> 1: core::panicking::panic_fmt
86.23 s
> 2: core::panicking::panic
86.23 s
> 3: alphal00p_docs_builder::tests::every_product_requires_a_task_chooser_and_each_supported_interface
86.23 s
> 4: <alphal00p_docs_builder::tests::every_product_requires_a_task_chooser_and_each_supported_interface::{closure#0} as core::ops::function::FnOnce<()>>::call_once
86.23 s
> note: Some details are omitted, run with `RUST_BACKTRACE=full` for a verbose backtrace.
86.23 s
>
86.23 s
> FAIL [ 0.294s] (121/129) alphal00p-docs-builder tests :: pdf_manual_chapter_order_must_match_the_page_registry
86.23 s
> stdout ---
86.23 s
>
86.23 s
> running 1 test
86.23 s
> test tests::pdf_manual_chapter_order_must_match_the_page_registry ... FAILED
86.23 s
>
86.23 s
> failures:
86.23 s
>
86.23 s
> failures:
86.23 s
> tests::pdf_manual_chapter_order_must_match_the_page_registry
86.23 s
>
86.23 s
> test result: FAILED. 0 passed; 1 failed; 0 ignored; 0 measured; 128 filtered out; finished in 0.27s
86.23 s
>
86.23 s
> stderr ---
86.23 s
>
86.23 s
> thread 'tests::pdf_manual_chapter_order_must_match_the_page_registry' (440) panicked at crates/alphal00p-docs-builder/src/lib.rs:12243:9:
86.23 s
> assertion failed: format!("{error:#}").contains("PDF manual chapter order differs")
86.23 s
> stack backtrace:
86.23 s
> 0: __rustc::rust_begin_unwind
86.23 s
> 1: core::panicking::panic_fmt
86.23 s
> 2: core::panicking::panic
86.23 s
> 3: alphal00p_docs_builder::tests::pdf_manual_chapter_order_must_match_the_page_registry
86.23 s
> 4: <alphal00p_docs_builder::tests::pdf_manual_chapter_order_must_match_the_page_registry::{closure#0} as core::ops::function::FnOnce<()>>::call_once
86.23 s
> note: Some details are omitted, run with `RUST_BACKTRACE=full` for a verbose backtrace.
86.23 s
>
86.23 s
> ------------
86.23 s
> Summary [ 17.240s] 129 tests run: 124 passed , 5 failed , 0 skipped
86.23 s
> FAIL [ 0.214s] ( 62/129) alphal00p-docs-builder tests :: developer_scope_ranges_ignore_unrelated_edits_and_warn_only_while_watching
86.23 s
> stdout ---
86.23 s
>
86.23 s
> running 1 test
86.23 s
> test tests::developer_scope_ranges_ignore_unrelated_edits_and_warn_only_while_watching ... FAILED
86.23 s
>
86.23 s
> failures:
86.23 s
>
86.23 s
> failures:
86.23 s
> tests::developer_scope_ranges_ignore_unrelated_edits_and_warn_only_while_watching
86.23 s
>
86.23 s
> test result: FAILED. 0 passed; 1 failed; 0 ignored; 0 measured; 128 filtered out; finished in 0.21s
86.23 s
>
86.23 s
> stderr ---
86.23 s
>
86.23 s
> thread 'tests::developer_scope_ranges_ignore_unrelated_edits_and_warn_only_while_watching' (286) panicked at crates/alphal00p-docs-builder/src/lib.rs:12263:29:
86.23 s
> called `Result::unwrap()` on an `Err` value: developer note nix-crane-cache-reuse verified scope nix/rust-workspace.nix changed (expected 66f700580ce13b9eaee90fe0111639e46968c531, found 0a568cb5712045aee37d96bfb2f91d3d32b7e9b9); owner review or an explicit no-impact attestation is required
86.23 s
>
86.23 s
> Location:
86.23 s
> crates/alphal00p-docs-builder/src/lib.rs:992:29
86.23 s
> stack backtrace:
86.23 s
> 0: __rustc::rust_begin_unwind
86.23 s
> 1: core::panicking::panic_fmt
86.23 s
> 2: core::result::unwrap_failed
86.23 s
> 3: alphal00p_docs_builder::tests::developer_scope_ranges_ignore_unrelated_edits_and_warn_only_while_watching
86.23 s
> 4: <alphal00p_docs_builder::tests::developer_scope_ranges_ignore_unrelated_edits_and_warn_only_while_watching::{closure#0} as core::ops::function::FnOnce<()>>::call_once
86.23 s
> note: Some details are omitted, run with `RUST_BACKTRACE=full` for a verbose backtrace.
86.23 s
>
86.23 s
> FAIL [ 0.274s] ( 66/129) alphal00p-docs-builder provenance_tests :: each_build_captures_one_revision_before_rendering
86.23 s
> stdout ---
86.23 s
>
86.23 s
> running 1 test
86.23 s
>
86.23 s
> running 1 test
86.23 s
> test provenance_tests::each_build_captures_one_revision_before_rendering ... FAILED
86.23 s
>
86.23 s
> failures:
86.23 s
>
86.23 s
> failures:
86.23 s
> provenance_tests::each_build_captures_one_revision_before_rendering
86.23 s
>
86.23 s
> test result: FAILED. 0 passed; 1 failed; 0 ignored; 0 measured; 128 filtered out; finished in 0.25s
86.23 s
>
86.23 s
> test provenance_tests::each_build_captures_one_revision_before_rendering ... FAILED
86.23 s
>
86.23 s
> failures:
86.23 s
>
86.23 s
> failures:
86.23 s
> provenance_tests::each_build_captures_one_revision_before_rendering
86.23 s
>
86.23 s
> test result: FAILED. 0 passed; 1 failed; 0 ignored; 0 measured; 128 filtered out; finished in 0.27s
86.23 s
>
86.23 s
> stderr ---
86.23 s
>
86.23 s
> thread 'provenance_tests::each_build_captures_one_revision_before_rendering' (224) panicked at crates/alphal00p-docs-builder/src/provenance_tests.rs:297:14:
86.23 s
> called `Result::unwrap()` on an `Err` value: developer note nix-crane-cache-reuse verified scope nix/rust-workspace.nix changed (expected 66f700580ce13b9eaee90fe0111639e46968c531, found 0a568cb5712045aee37d96bfb2f91d3d32b7e9b9); owner review or an explicit no-impact attestation is required
86.23 s
>
86.23 s
> Location:
86.23 s
> crates/alphal00p-docs-builder/src/lib.rs:992:29
86.23 s
> stack backtrace:
86.23 s
> 0: __rustc::rust_begin_unwind
86.23 s
> 1: core::panicking::panic_fmt
86.23 s
> 2: core::result::unwrap_failed
86.23 s
> 3: alphal00p_docs_builder::provenance_tests::each_build_captures_one_revision_before_rendering
86.23 s
> 4: <alphal00p_docs_builder::provenance_tests::each_build_captures_one_revision_before_rendering::{closure#0} as core::ops::function::FnOnce<()>>::call_once
86.23 s
> note: Some details are omitted, run with `RUST_BACKTRACE=full` for a verbose backtrace.
86.23 s
>
86.23 s
> thread 'provenance_tests::each_build_captures_one_revision_before_rendering' (163) panicked at crates/alphal00p-docs-builder/src/provenance_tests.rs:274:9:
86.23 s
> assertion failed: command.status().unwrap().success()
86.23 s
> stack backtrace:
86.23 s
> 0: __rustc::rust_begin_unwind
86.23 s
> 1: core::panicking::panic_fmt
86.23 s
> 2: core::panicking::panic
86.23 s
> 3: alphal00p_docs_builder::provenance_tests::each_build_captures_one_revision_before_rendering
86.23 s
> 4: <alphal00p_docs_builder::provenance_tests::each_build_captures_one_revision_before_rendering::{closure#0} as core::ops::function::FnOnce<()>>::call_once
86.23 s
> note: Some details are omitted, run with `RUST_BACKTRACE=full` for a verbose backtrace.
86.23 s
>
86.23 s
> FAIL [ 0.274s] ( 67/129) alphal00p-docs-builder tests :: checked_in_registry_is_valid
86.23 s
> stdout ---
86.23 s
>
86.23 s
> running 1 test
86.23 s
> test tests::checked_in_registry_is_valid ... FAILED
86.23 s
>
86.23 s
> failures:
86.23 s
>
86.23 s
> failures:
86.23 s
> tests::checked_in_registry_is_valid
86.23 s
>
86.23 s
> test result: FAILED. 0 passed; 1 failed; 0 ignored; 0 measured; 128 filtered out; finished in 0.26s
86.23 s
>
86.23 s
> stderr ---
86.23 s
>
86.23 s
> thread 'tests::checked_in_registry_is_valid' (213) panicked at crates/alphal00p-docs-builder/src/lib.rs:12178:50:
86.23 s
> called `Result::unwrap()` on an `Err` value: developer note nix-crane-cache-reuse verified scope nix/rust-workspace.nix changed (expected 66f700580ce13b9eaee90fe0111639e46968c531, found 0a568cb5712045aee37d96bfb2f91d3d32b7e9b9); owner review or an explicit no-impact attestation is required
86.23 s
>
86.23 s
> Location:
86.23 s
> crates/alphal00p-docs-builder/src/lib.rs:992:29
86.23 s
> stack backtrace:
86.23 s
> 0: __rustc::rust_begin_unwind
86.23 s
> 1: core::panicking::panic_fmt
86.23 s
> 2: core::result::unwrap_failed
86.23 s
> 3: alphal00p_docs_builder::tests::checked_in_registry_is_valid
86.23 s
> 4: <alphal00p_docs_builder::tests::checked_in_registry_is_valid::{closure#0} as core::ops::function::FnOnce<()>>::call_once
86.23 s
> note: Some details are omitted, run with `RUST_BACKTRACE=full` for a verbose backtrace.
86.23 s
>
86.23 s
> FAIL [ 0.267s] ( 77/129) alphal00p-docs-builder tests :: every_product_requires_a_task_chooser_and_each_supported_interface
86.23 s
> stdout ---
86.23 s
>
86.23 s
> running 1 test
86.23 s
> test tests::every_product_requires_a_task_chooser_and_each_supported_interface ... FAILED
86.23 s
>
86.23 s
> failures:
86.23 s
>
86.23 s
> failures:
86.23 s
> tests::every_product_requires_a_task_chooser_and_each_supported_interface
86.23 s
>
86.23 s
> test result: FAILED. 0 passed; 1 failed; 0 ignored; 0 measured; 128 filtered out; finished in 0.26s
86.23 s
>
86.23 s
> stderr ---
86.23 s
>
86.23 s
> thread 'tests::every_product_requires_a_task_chooser_and_each_supported_interface' (308) panicked at crates/alphal00p-docs-builder/src/lib.rs:12192:9:
86.23 s
> assertion failed: format!("{error:#}").contains("has no quickstart page")
86.23 s
> stack backtrace:
86.23 s
> 0: __rustc::rust_begin_unwind
86.23 s
> 1: core::panicking::panic_fmt
86.23 s
> 2: core::panicking::panic
86.23 s
> 3: alphal00p_docs_builder::tests::every_product_requires_a_task_chooser_and_each_supported_interface
86.23 s
> 4: <alphal00p_docs_builder::tests::every_product_requires_a_task_chooser_and_each_supported_interface::{closure#0} as core::ops::function::FnOnce<()>>::call_once
86.23 s
> note: Some details are omitted, run with `RUST_BACKTRACE=full` for a verbose backtrace.
86.23 s
>
86.23 s
> FAIL [ 0.294s] (121/129) alphal00p-docs-builder tests :: pdf_manual_chapter_order_must_match_the_page_registry
86.23 s
> stdout ---
86.23 s
>
86.23 s
> running 1 test
86.23 s
> test tests::pdf_manual_chapter_order_must_match_the_page_registry ... FAILED
86.23 s
>
86.23 s
> failures:
86.23 s
>
86.23 s
> failures:
86.23 s
> tests::pdf_manual_chapter_order_must_match_the_page_registry
86.23 s
>
86.23 s
> test result: FAILED. 0 passed; 1 failed; 0 ignored; 0 measured; 128 filtered out; finished in 0.27s
86.23 s
>
86.23 s
> stderr ---
86.23 s
>
86.23 s
> thread 'tests::pdf_manual_chapter_order_must_match_the_page_registry' (440) panicked at crates/alphal00p-docs-builder/src/lib.rs:12243:9:
86.23 s
> assertion failed: format!("{error:#}").contains("PDF manual chapter order differs")
86.23 s
> stack backtrace:
86.23 s
> 0: __rustc::rust_begin_unwind
86.23 s
> 1: core::panicking::panic_fmt
86.23 s
> 2: core::panicking::panic
86.23 s
> 3: alphal00p_docs_builder::tests::pdf_manual_chapter_order_must_match_the_page_registry
86.23 s
> 4: <alphal00p_docs_builder::tests::pdf_manual_chapter_order_must_match_the_page_registry::{closure#0} as core::ops::function::FnOnce<()>>::call_once
86.23 s
> note: Some details are omitted, run with `RUST_BACKTRACE=full` for a verbose backtrace.
86.23 s
>
86.23 s
> error : test run failed
86.23 s
>
86.23 s
> ========== nextest test summary ==========
86.23 s
> report: target/nextest/ci_gammaloop/junit.xml
86.23 s
> tests: 129, failures: 5, errors: 0
86.23 s
>
86.23 s
> 1. alphal00p-docs-builder::tests::developer_scope_ranges_ignore_unrelated_edits_and_warn_only_while_watching
86.23 s
> failure: test failure with exit code 101
86.23 s
> thread 'tests::developer_scope_ranges_ignore_unrelated_edits_and_warn_only_while_watching' (286) panicked at crates/alphal00p-docs-builder/src/lib.rs:12263:29:
86.23 s
> called `Result::unwrap()` on an `Err` value: developer note nix-crane-cache-reuse verified scope nix/rust-workspace.nix changed (expected 66f700580ce13b9eaee90fe0111639e46968c531, found 0a568cb5712045aee37d96bfb2f91d3d32b7e9b9); owner review or an explicit no-impact attestation is required
86.23 s
>
86.23 s
> Location:
86.23 s
> crates/alphal00p-docs-builder/src/lib.rs:992:29
86.23 s
> stack backtrace:
86.23 s
> 0: __rustc::rust_begin_unwind
86.23 s
> 1: core::panicking::panic_fmt
86.23 s
> 2: core::result::unwrap_failed
86.23 s
> 3: alphal00p_docs_builder::tests::developer_scope_ranges_ignore_unrelated_edits_and_warn_only_while_watching
86.23 s
> 4: <alphal00p_docs_builder::tests::developer_scope_ranges_ignore_unrelated_edits_and_warn_only_while_watching::{closure#0} as core::ops::function::FnOnce<()>>::call_once
86.23 s
> note: Some details are omitted, run with `RUST_BACKTRACE=full` for a verbose backtrace.
86.23 s
> system-out
86.23 s
> running 1 test
86.23 s
> test tests::developer_scope_ranges_ignore_unrelated_edits_and_warn_only_while_watching ... FAILED
86.23 s
>
86.23 s
> failures:
86.23 s
>
86.23 s
> failures:
86.23 s
> tests::developer_scope_ranges_ignore_unrelated_edits_and_warn_only_while_watching
86.23 s
>
86.23 s
> test result: FAILED. 0 passed; 1 failed; 0 ignored; 0 measured; 128 filtered out; finished in 0.21s
86.23 s
> system-err
86.23 s
> thread 'tests::developer_scope_ranges_ignore_unrelated_edits_and_warn_only_while_watching' (286) panicked at crates/alphal00p-docs-builder/src/lib.rs:12263:29:
86.23 s
> called `Result::unwrap()` on an `Err` value: developer note nix-crane-cache-reuse verified scope nix/rust-workspace.nix changed (expected 66f700580ce13b9eaee90fe0111639e46968c531, found 0a568cb5712045aee37d96bfb2f91d3d32b7e9b9); owner review or an explicit no-impact attestation is required
86.23 s
>
86.23 s
> Location:
86.23 s
> crates/alphal00p-docs-builder/src/lib.rs:992:29
86.23 s
> stack backtrace:
86.23 s
> 0: __rustc::rust_begin_unwind
86.23 s
> 1: core::panicking::panic_fmt
86.23 s
> 2: core::result::unwrap_failed
86.23 s
> 3: alphal00p_docs_builder::tests::developer_scope_ranges_ignore_unrelated_edits_and_warn_only_while_watching
86.23 s
> 4: <alphal00p_docs_builder::tests::developer_scope_ranges_ignore_unrelated_edits_and_warn_only_while_watching::{closure#0} as core::ops::function::FnOnce<()>>::call_once
86.23 s
> note: Some details are omitted, run with `RUST_BACKTRACE=full` for a verbose backtrace.
86.23 s
>
86.23 s
> 2. alphal00p-docs-builder::provenance_tests::each_build_captures_one_revision_before_rendering
86.23 s
> failure: test failure with exit code 101
86.23 s
> thread 'provenance_tests::each_build_captures_one_revision_before_rendering' (163) panicked at crates/alphal00p-docs-builder/src/provenance_tests.rs:274:9:
86.23 s
> assertion failed: command.status().unwrap().success()
86.23 s
> stack backtrace:
86.23 s
> 0: __rustc::rust_begin_unwind
86.23 s
> 1: core::panicking::panic_fmt
86.23 s
> 2: core::panicking::panic
86.23 s
> 3: alphal00p_docs_builder::provenance_tests::each_build_captures_one_revision_before_rendering
86.23 s
> 4: <alphal00p_docs_builder::provenance_tests::each_build_captures_one_revision_before_rendering::{closure#0} as core::ops::function::FnOnce<()>>::call_once
86.23 s
> note: Some details are omitted, run with `RUST_BACKTRACE=full` for a verbose backtrace.
86.23 s
> system-out
86.23 s
> running 1 test
86.23 s
>
86.23 s
> running 1 test
86.23 s
> test provenance_tests::each_build_captures_one_revision_before_rendering ... FAILED
86.23 s
>
86.23 s
> failures:
86.23 s
>
86.23 s
> failures:
86.23 s
> provenance_tests::each_build_captures_one_revision_before_rendering
86.23 s
>
86.23 s
> test result: FAILED. 0 passed; 1 failed; 0 ignored; 0 measured; 128 filtered out; finished in 0.25s
86.23 s
>
86.23 s
> test provenance_tests::each_build_captures_one_revision_before_rendering ... FAILED
86.23 s
>
86.23 s
> failures:
86.23 s
>
86.23 s
> failures:
86.23 s
> provenance_tests::each_build_captures_one_revision_before_rendering
86.23 s
>
86.23 s
> test result: FAILED. 0 passed; 1 failed; 0 ignored; 0 measured; 128 filtered out; finished in 0.27s
86.23 s
> system-err
86.23 s
> thread 'provenance_tests::each_build_captures_one_revision_before_rendering' (224) panicked at crates/alphal00p-docs-builder/src/provenance_tests.rs:297:14:
86.23 s
> called `Result::unwrap()` on an `Err` value: developer note nix-crane-cache-reuse verified scope nix/rust-workspace.nix changed (expected 66f700580ce13b9eaee90fe0111639e46968c531, found 0a568cb5712045aee37d96bfb2f91d3d32b7e9b9); owner review or an explicit no-impact attestation is required
86.23 s
>
86.23 s
> Location:
86.23 s
> crates/alphal00p-docs-builder/src/lib.rs:992:29
86.23 s
> stack backtrace:
86.23 s
> 0: __rustc::rust_begin_unwind
86.23 s
> 1: core::panicking::panic_fmt
86.23 s
> 2: core::result::unwrap_failed
86.23 s
> 3: alphal00p_docs_builder::provenance_tests::each_build_captures_one_revision_before_rendering
86.23 s
> 4: <alphal00p_docs_builder::provenance_tests::each_build_captures_one_revision_before_rendering::{closure#0} as core::ops::function::FnOnce<()>>::call_once
86.23 s
> note: Some details are omitted, run with `RUST_BACKTRACE=full` for a verbose backtrace.
86.23 s
>
86.23 s
> thread 'provenance_tests::each_build_captures_one_revision_before_rendering' (163) panicked at crates/alphal00p-docs-builder/src/provenance_tests.rs:274:9:
86.23 s
> assertion failed: command.status().unwrap().success()
86.23 s
> stack backtrace:
86.23 s
> 0: __rustc::rust_begin_unwind
86.23 s
> 1: core::panicking::panic_fmt
86.23 s
> 2: core::panicking::panic
86.23 s
> 3: alphal00p_docs_builder::provenance_tests::each_build_captures_one_revision_before_rendering
86.23 s
> 4: <alphal00p_docs_builder::provenance_tests::each_build_captures_one_revision_before_rendering::{closure#0} as core::ops::function::FnOnce<()>>::call_once
86.23 s
> note: Some details are omitted, run with `RUST_BACKTRACE=full` for a verbose backtrace.
86.23 s
>
86.23 s
> 3. alphal00p-docs-builder::tests::checked_in_registry_is_valid
86.23 s
> failure: test failure with exit code 101
86.23 s
> thread 'tests::checked_in_registry_is_valid' (213) panicked at crates/alphal00p-docs-builder/src/lib.rs:12178:50:
86.23 s
> called `Result::unwrap()` on an `Err` value: developer note nix-crane-cache-reuse verified scope nix/rust-workspace.nix changed (expected 66f700580ce13b9eaee90fe0111639e46968c531, found 0a568cb5712045aee37d96bfb2f91d3d32b7e9b9); owner review or an explicit no-impact attestation is required
86.23 s
>
86.23 s
> Location:
86.23 s
> crates/alphal00p-docs-builder/src/lib.rs:992:29
86.23 s
> stack backtrace:
86.23 s
> 0: __rustc::rust_begin_unwind
86.23 s
> 1: core::panicking::panic_fmt
86.23 s
> 2: core::result::unwrap_failed
86.23 s
> 3: alphal00p_docs_builder::tests::checked_in_registry_is_valid
86.23 s
> 4: <alphal00p_docs_builder::tests::checked_in_registry_is_valid::{closure#0} as core::ops::function::FnOnce<()>>::call_once
86.23 s
> note: Some details are omitted, run with `RUST_BACKTRACE=full` for a verbose backtrace.
86.23 s
> system-out
86.23 s
> running 1 test
86.23 s
> test tests::checked_in_registry_is_valid ... FAILED
86.23 s
>
86.23 s
> failures:
86.23 s
>
86.23 s
> failures:
86.23 s
> tests::checked_in_registry_is_valid
86.23 s
>
86.23 s
> test result: FAILED. 0 passed; 1 failed; 0 ignored; 0 measured; 128 filtered out; finished in 0.26s
86.23 s
> system-err
86.23 s
> thread 'tests::checked_in_registry_is_valid' (213) panicked at crates/alphal00p-docs-builder/src/lib.rs:12178:50:
86.23 s
> called `Result::unwrap()` on an `Err` value: developer note nix-crane-cache-reuse verified scope nix/rust-workspace.nix changed (expected 66f700580ce13b9eaee90fe0111639e46968c531, found 0a568cb5712045aee37d96bfb2f91d3d32b7e9b9); owner review or an explicit no-impact attestation is required
86.23 s
>
86.23 s
> Location:
86.23 s
> crates/alphal00p-docs-builder/src/lib.rs:992:29
86.23 s
> stack backtrace:
86.23 s
> 0: __rustc::rust_begin_unwind
86.23 s
> 1: core::panicking::panic_fmt
86.23 s
> 2: core::result::unwrap_failed
86.23 s
> 3: alphal00p_docs_builder::tests::checked_in_registry_is_valid
86.23 s
> 4: <alphal00p_docs_builder::tests::checked_in_registry_is_valid::{closure#0} as core::ops::function::FnOnce<()>>::call_once
86.23 s
> note: Some details are omitted, run with `RUST_BACKTRACE=full` for a verbose backtrace.
86.23 s
>
86.23 s
> 4. alphal00p-docs-builder::tests::every_product_requires_a_task_chooser_and_each_supported_interface
86.23 s
> failure: test failure with exit code 101
86.23 s
> thread 'tests::every_product_requires_a_task_chooser_and_each_supported_interface' (308) panicked at crates/alphal00p-docs-builder/src/lib.rs:12192:9:
86.23 s
> assertion failed: format!("{error:#}").contains("has no quickstart page")
86.23 s
> stack backtrace:
86.23 s
> 0: __rustc::rust_begin_unwind
86.23 s
> 1: core::panicking::panic_fmt
86.23 s
> 2: core::panicking::panic
86.23 s
> 3: alphal00p_docs_builder::tests::every_product_requires_a_task_chooser_and_each_supported_interface
86.23 s
> 4: <alphal00p_docs_builder::tests::every_product_requires_a_task_chooser_and_each_supported_interface::{closure#0} as core::ops::function::FnOnce<()>>::call_once
86.23 s
> note: Some details are omitted, run with `RUST_BACKTRACE=full` for a verbose backtrace.
86.23 s
> system-out
86.23 s
> running 1 test
86.23 s
> test tests::every_product_requires_a_task_chooser_and_each_supported_interface ... FAILED
86.23 s
>
86.23 s
> failures:
86.23 s
>
86.23 s
> failures:
86.23 s
> tests::every_product_requires_a_task_chooser_and_each_supported_interface
86.23 s
>
86.23 s
> test result: FAILED. 0 passed; 1 failed; 0 ignored; 0 measured; 128 filtered out; finished in 0.26s
86.23 s
> system-err
86.23 s
> thread 'tests::every_product_requires_a_task_chooser_and_each_supported_interface' (308) panicked at crates/alphal00p-docs-builder/src/lib.rs:12192:9:
86.23 s
> assertion failed: format!("{error:#}").contains("has no quickstart page")
86.23 s
> stack backtrace:
86.23 s
> 0: __rustc::rust_begin_unwind
86.23 s
> 1: core::panicking::panic_fmt
86.23 s
> 2: core::panicking::panic
86.23 s
> 3: alphal00p_docs_builder::tests::every_product_requires_a_task_chooser_and_each_supported_interface
86.23 s
> 4: <alphal00p_docs_builder::tests::every_product_requires_a_task_chooser_and_each_supported_interface::{closure#0} as core::ops::function::FnOnce<()>>::call_once
86.23 s
> note: Some details are omitted, run with `RUST_BACKTRACE=full` for a verbose backtrace.
86.23 s
>
86.23 s
> 5. alphal00p-docs-builder::tests::pdf_manual_chapter_order_must_match_the_page_registry
86.23 s
> failure: test failure with exit code 101
86.23 s
> thread 'tests::pdf_manual_chapter_order_must_match_the_page_registry' (440) panicked at crates/alphal00p-docs-builder/src/lib.rs:12243:9:
86.23 s
> assertion failed: format!("{error:#}").contains("PDF manual chapter order differs")
86.23 s
> stack backtrace:
86.23 s
> 0: __rustc::rust_begin_unwind
86.23 s
> 1: core::panicking::panic_fmt
86.23 s
> 2: core::panicking::panic
86.23 s
> 3: alphal00p_docs_builder::tests::pdf_manual_chapter_order_must_match_the_page_registry
86.23 s
> 4: <alphal00p_docs_builder::tests::pdf_manual_chapter_order_must_match_the_page_registry::{closure#0} as core::ops::function::FnOnce<()>>::call_once
86.23 s
> note: Some details are omitted, run with `RUST_BACKTRACE=full` for a verbose backtrace.
86.23 s
> system-out
86.23 s
> running 1 test
86.23 s
> test tests::pdf_manual_chapter_order_must_match_the_page_registry ... FAILED
86.23 s
>
86.23 s
> failures:
86.23 s
>
86.23 s
> failures:
86.23 s
> tests::pdf_manual_chapter_order_must_match_the_page_registry
86.23 s
>
86.23 s
> test result: FAILED. 0 passed; 1 failed; 0 ignored; 0 measured; 128 filtered out; finished in 0.27s
86.23 s
> system-err
86.23 s
> thread 'tests::pdf_manual_chapter_order_must_match_the_page_registry' (440) panicked at crates/alphal00p-docs-builder/src/lib.rs:12243:9:
86.23 s
> assertion failed: format!("{error:#}").contains("PDF manual chapter order differs")
86.23 s
> stack backtrace:
86.23 s
> 0: __rustc::rust_begin_unwind
86.23 s
> 1: core::panicking::panic_fmt
86.23 s
> 2: core::panicking::panic
86.23 s
> 3: alphal00p_docs_builder::tests::pdf_manual_chapter_order_must_match_the_page_registry
86.23 s
> 4: <alphal00p_docs_builder::tests::pdf_manual_chapter_order_must_match_the_page_registry::{closure#0} as core::ops::function::FnOnce<()>>::call_once
86.23 s
> note: Some details are omitted, run with `RUST_BACKTRACE=full` for a verbose backtrace.
86.23 s
> =========================================
86.23 s
> Extracting 2 binaries to /build/source
86.23 s
> Extracted 5 files to /build/source in 0.04s
86.23 s
> ------------
86.23 s
> Nextest run ID 83404f65-5b1a-47f4-8948-d0f7c0d22cf5 with nextest profile: ci_gammaloop
86.23 s
> Starting 22 tests across 2 binaries
86.23 s
> ------------
86.23 s
> Summary [ 0.022s] 22 tests run: 22 passed , 0 skipped
86.23 s
>
86.23 s
> ========== nextest test summary ==========
86.23 s
> report: target/nextest/ci_gammaloop/junit.xml
86.23 s
> tests: 22, failures: 0, errors: 0
86.23 s
> No failing testcases found.
86.23 s
> =========================================
86.23 s
> Extracting 3 binaries (including 2 non-test binaries), 1 build script output directory, and 2 linked paths to /build/source
86.23 s
> Extracted 22 files to /build/source in 0.33s
86.23 s
> ------------
86.23 s
> Nextest run ID 4652b2c0-2236-4a39-97a4-c132831d2543 with nextest profile: ci_gammaloop
86.23 s
> Starting 89 tests across 1 binary
86.23 s
> ------------
86.23 s
> Summary [ 0.082s] 89 tests run: 89 passed , 0 skipped
86.23 s
>
86.23 s
> ========== nextest test summary ==========
86.23 s
> report: target/nextest/ci_gammaloop/junit.xml
86.23 s
> tests: 89, failures: 0, errors: 0
86.23 s
> No failing testcases found.
86.23 s
> =========================================
86.23 s
> Extracting 2 binaries to /build/source
86.23 s
> Extracted 5 files to /build/source in 0.05s
86.23 s
> ------------
86.23 s
> Nextest run ID b8e61b86-0715-418a-bd5c-c65687ec9df1 with nextest profile: ci_gammaloop
86.23 s
> Starting 10 tests across 2 binaries
86.23 s
> ------------
86.23 s
> Summary [ 15.952s] 10 tests run: 10 passed , 0 skipped
86.23 s
>
86.23 s
> ========== nextest test summary ==========
86.23 s
> report: target/nextest/ci_gammaloop/junit.xml
86.23 s
> tests: 10, failures: 0, errors: 0
86.23 s
> No failing testcases found.
86.23 s
> =========================================
86.23 s
> Extracting 1 binary to /build/source
86.23 s
> Extracted 4 files to /build/source in 0.05s
86.23 s
> ------------
86.23 s
> Nextest run ID af36f01c-5871-4cc4-be34-d30572d86417 with nextest profile: ci_gammaloop
86.23 s
> Starting 0 tests across 1 binary
86.23 s
> ------------
86.23 s
> Summary [ 0.000s] 0 tests run: 0 passed , 0 skipped
86.23 s
>
86.23 s
> ========== nextest test summary ==========
86.23 s
> report: target/nextest/ci_gammaloop/junit.xml
86.23 s
> tests: 0, failures: 0, errors: 0
86.23 s
> No failing testcases found.
86.23 s
> =========================================
86.23 s
> Extracting 1 binary to /build/source
86.23 s
> Extracted 4 files to /build/source in 0.04s
86.23 s
> ------------
86.23 s
> Nextest run ID c5f09761-23ea-4e4e-a29f-a8ff02ed1e63 with nextest profile: ci_gammaloop
86.23 s
> Starting 5 tests across 1 binary
86.23 s
> ------------
86.23 s
> Summary [ 0.006s] 5 tests run: 5 passed , 0 skipped
86.23 s
>
86.23 s
> ========== nextest test summary ==========
86.23 s
> report: target/nextest/ci_gammaloop/junit.xml
86.23 s
> tests: 5, failures: 0, errors: 0
86.23 s
> No failing testcases found.
86.23 s
> =========================================
86.23 s
For full logs, run:
86.23 s
nix log /nix/store/vj8wdqhcdhpl16s0z9h5y6gmk5iqkmvb-gammaloop-nextest-docs.drv
86.43 s
Run failed.