test packages.x86_64-linux.nix-ci-check-gammaloop-nextest-clinnet

Reproduce this run
Retry Run
  1. 0.01 s $ /nix/store/61685rbaxmpigwi3z23i33sv3jyfl70q-coreutils-9.11/bin/timeout --kill-after=15s 7200s /nix/store/wknkybkzrc16r11vk5vrykh4wmw7a353-nix-2.34.8/bin/nix --extra-experimental-features nix-command --extra-experimental-features flakes flake clone git+https://github.com/alphal00p/gammaloop --dest /tmp/nix-ci-worker/stable-pwd/repo/
  2. 0.32 s Cloning into '/tmp/nix-ci-worker/stable-pwd/repo'...
  3. 1.28 s remote: Enumerating objects: 110731, done.
  4. 1.39 s remote: Counting objects: 0% (1/14562) remote: Counting objects: 1% (146/14562) remote: Counting objects: 2% (292/14562) remote: Counting objects: 3% (437/14562) remote: Counting objects: 4% (583/14562) remote: Counting objects: 5% (729/14562) remote: Counting objects: 6% (874/14562) remote: Counting objects: 7% (1020/14562) remote: Counting objects: 8% (1165/14562) remote: Counting objects: 9% (1311/14562) remote: Counting objects: 10% (1457/14562) remote: Counting objects: 11% (1602/14562) remote: Counting objects: 12% (1748/14562) remote: Counting objects: 13% (1894/14562) remote: Counting objects: 14% (2039/14562) remote: Counting objects: 15% (2185/14562) remote: Counting objects: 16% (2330/14562) remote: Counting objects: 17% (2476/14562) remote: Counting objects: 18% (2622/14562) remote: Counting objects: 19% (2767/14562) remote: Counting objects: 20% (2913/14562) remote: Counting objects: 21% (3059/14562) remote: Counting objects: 22% (3204/14562) remote: Counting objects: 23% (3350/14562) remote: Counting objects: 24% (3495/14562) remote: Counting objects: 25% (3641/14562) remote: Counting objects: 26% (3787/14562) remote: Counting objects: 27% (3932/14562) remote: Counting objects: 28% (4078/14562) remote: Counting objects: 29% (4223/14562) remote: Counting objects: 30% (4369/14562) remote: Counting objects: 31% (4515/14562) remote: Counting objects: 32% (4660/14562) remote: Counting objects: 33% (4806/14562) remote: Counting objects: 34% (4952/14562) remote: Counting objects: 35% (5097/14562) remote: Counting objects: 36% (5243/14562) remote: Counting objects: 37% (5388/14562) remote: Counting objects: 38% (5534/14562) remote: Counting objects: 39% (5680/14562) remote: Counting objects: 40% (5825/14562) remote: Counting objects: 41% (5971/14562) remote: Counting objects: 42% (6117/14562) remote: Counting objects: 43% (6262/14562) remote: Counting objects: 44% (6408/14562) remote: Counting objects: 45% (6553/14562) remote: Counting objects: 46% (6699/14562) remote: Counting objects: 47% (6845/14562) remote: Counting objects: 48% (6990/14562) remote: Counting objects: 49% (7136/14562) remote: Counting objects: 50% (7281/14562) remote: Counting objects: 51% (7427/14562) remote: Counting objects: 52% (7573/14562) remote: Counting objects: 53% (7718/14562) remote: Counting objects: 54% (7864/14562) remote: Counting objects: 55% (8010/14562) remote: Counting objects: 56% (8155/14562) remote: Counting objects: 57% (8301/14562) remote: Counting objects: 58% (8446/14562) remote: Counting objects: 59% (8592/14562) remote: Counting objects: 60% (8738/14562) remote: Counting objects: 61% (8883/14562) remote: Counting objects: 62% (9029/14562) remote: Counting objects: 63% (9175/14562) remote: Counting objects: 64% (9320/14562) remote: Counting objects: 65% (9466/14562) remote: Counting objects: 66% (9611/14562) remote: Counting objects: 67% (9757/14562) remote: Counting objects: 68% (9903/14562) remote: Counting objects: 69% (10048/14562) remote: Counting objects: 70% (10194/14562) remote: Counting objects: 71% (10340/14562) remote: Counting objects: 72% (10485/14562) remote: Counting objects: 73% (10631/14562) remote: Counting objects: 74% (10776/14562) remote: Counting objects: 75% (10922/14562) remote: Counting objects: 76% (11068/14562) remote: Counting objects: 77% (11213/14562) remote: Counting objects: 78% (11359/14562) remote: Counting objects: 79% (11504/14562) remote: Counting objects: 80% (11650/14562) remote: Counting objects: 81% (11796/14562) remote: Counting objects: 82% (11941/14562) remote: Counting objects: 83% (12087/14562) remote: Counting objects: 84% (12233/14562) remote: Counting objects: 85% (12378/14562) remote: Counting objects: 86% (12524/14562) remote: Counting objects: 87% (12669/14562) remote: Counting objects: 88% (12815/14562) remote: Counting objects: 89% (12961/14562) remote: Counting objects: 90% (13106/14562) remote: Counting objects: 91% (13252/14562) remote: Counting objects: 92% (13398/14562) remote: Counting objects: 93% (13543/14562) remote: Counting objects: 94% (13689/14562) remote: Counting objects: 95% (13834/14562) remote: Counting objects: 96% (13980/14562) remote: Counting objects: 97% (14126/14562) remote: Counting objects: 98% (14271/14562) remote: Counting objects: 99% (14417/14562) remote: Counting objects: 100% (14562/14562) remote: Counting objects: 100% (14562/14562), done.
  5. 5.86 s remote: Compressing objects: 0% (1/2921) remote: Compressing objects: 1% (30/2921) remote: Compressing objects: 2% (59/2921) remote: Compressing objects: 3% (88/2921) remote: Compressing objects: 4% (117/2921) remote: Compressing objects: 5% (147/2921) remote: Compressing objects: 6% (176/2921) remote: Compressing objects: 7% (205/2921) remote: Compressing objects: 8% (234/2921) remote: Compressing objects: 9% (263/2921) remote: Compressing objects: 10% (293/2921) remote: Compressing objects: 11% (322/2921) remote: Compressing objects: 11% (342/2921) remote: Compressing objects: 12% (351/2921) remote: Compressing objects: 13% (380/2921) remote: Compressing objects: 13% (388/2921) remote: Compressing objects: 14% (409/2921) remote: Compressing objects: 15% (439/2921) remote: Compressing objects: 16% (468/2921) remote: Compressing objects: 17% (497/2921) remote: Compressing objects: 17% (518/2921) remote: Compressing objects: 18% (526/2921) remote: Compressing objects: 19% (555/2921) remote: Compressing objects: 20% (585/2921) remote: Compressing objects: 21% (614/2921) remote: Compressing objects: 22% (643/2921) remote: Compressing objects: 23% (672/2921) remote: Compressing objects: 24% (702/2921) remote: Compressing objects: 25% (731/2921) remote: Compressing objects: 26% (760/2921) remote: Compressing objects: 26% (763/2921) remote: Compressing objects: 27% (789/2921) remote: Compressing objects: 28% (818/2921) remote: Compressing objects: 29% (848/2921) remote: Compressing objects: 30% (877/2921) remote: Compressing objects: 31% (906/2921) remote: Compressing objects: 32% (935/2921) remote: Compressing objects: 33% (964/2921) remote: Compressing objects: 34% (994/2921) remote: Compressing objects: 35% (1023/2921) remote: Compressing objects: 36% (1052/2921) remote: Compressing objects: 37% (1081/2921) remote: Compressing objects: 38% (1110/2921) remote: Compressing objects: 39% (1140/2921) remote: Compressing objects: 40% (1169/2921) remote: Compressing objects: 41% (1198/2921) remote: Compressing objects: 42% (1227/2921) remote: Compressing objects: 43% (1257/2921) remote: Compressing objects: 44% (1286/2921) remote: Compressing objects: 45% (1315/2921) remote: Compressing objects: 46% (1344/2921) remote: Compressing objects: 47% (1373/2921) remote: Compressing objects: 48% (1403/2921) remote: Compressing objects: 49% (1432/2921) remote: Compressing objects: 50% (1461/2921) remote: Compressing objects: 51% (1490/2921) remote: Compressing objects: 52% (1519/2921) remote: Compressing objects: 53% (1549/2921) remote: Compressing objects: 54% (1578/2921) remote: Compressing objects: 55% (1607/2921) remote: Compressing objects: 56% (1636/2921) remote: Compressing objects: 57% (1665/2921) remote: Compressing objects: 58% (1695/2921) remote: Compressing objects: 59% (1724/2921) remote: Compressing objects: 60% (1753/2921) remote: Compressing objects: 61% (1782/2921) remote: Compressing objects: 62% (1812/2921) remote: Compressing objects: 63% (1841/2921) remote: Compressing objects: 64% (1870/2921) remote: Compressing objects: 65% (1899/2921) remote: Compressing objects: 66% (1928/2921) remote: Compressing objects: 67% (1958/2921) remote: Compressing objects: 68% (1987/2921) remote: Compressing objects: 69% (2016/2921) remote: Compressing objects: 70% (2045/2921) remote: Compressing objects: 71% (2074/2921) remote: Compressing objects: 72% (2104/2921) remote: Compressing objects: 73% (2133/2921) remote: Compressing objects: 74% (2162/2921) remote: Compressing objects: 75% (2191/2921) remote: Compressing objects: 76% (2220/2921) remote: Compressing objects: 77% (2250/2921) remote: Compressing objects: 78% (2279/2921) remote: Compressing objects: 79% (2308/2921) remote: Compressing objects: 80% (2337/2921) remote: Compressing objects: 81% (2367/2921) remote: Compressing objects: 82% (2396/2921) remote: Compressing objects: 83% (2425/2921) remote: Compressing objects: 84% (2454/2921) remote: Compressing objects: 85% (2483/2921) remote: Compressing objects: 86% (2513/2921) remote: Compressing objects: 87% (2542/2921) remote: Compressing objects: 88% (2571/2921) remote: Compressing objects: 89% (2600/2921) remote: Compressing objects: 90% (2629/2921) remote: Compressing objects: 91% (2659/2921) remote: Compressing objects: 92% (2688/2921) remote: Compressing objects: 93% (2717/2921) remote: Compressing objects: 94% (2746/2921) remote: Compressing objects: 95% (2775/2921) remote: Compressing objects: 96% (2805/2921) remote: Compressing objects: 97% (2834/2921) remote: Compressing objects: 98% (2863/2921) remote: Compressing objects: 99% (2892/2921) remote: Compressing objects: 100% (2921/2921) remote: Compressing objects: 100% (2921/2921), done.
  6. 30.95 s Receiving objects: 0% (1/110731) Receiving objects: 0% (126/110731), 1.16 MiB | 1.11 MiB/s Receiving objects: 0% (128/110731), 3.57 MiB | 1.74 MiB/s Receiving objects: 0% (163/110731), 7.25 MiB | 2.38 MiB/s Receiving objects: 1% (1108/110731), 7.25 MiB | 2.38 MiB/s Receiving objects: 2% (2215/110731), 9.54 MiB | 2.69 MiB/s Receiving objects: 2% (2621/110731), 9.54 MiB | 2.69 MiB/s Receiving objects: 3% (3322/110731), 15.08 MiB | 3.31 MiB/s Receiving objects: 3% (3994/110731), 15.08 MiB | 3.31 MiB/s Receiving objects: 4% (4430/110731), 18.31 MiB | 3.95 MiB/s Receiving objects: 5% (5537/110731), 21.83 MiB | 4.58 MiB/s Receiving objects: 5% (5896/110731), 21.83 MiB | 4.58 MiB/s Receiving objects: 6% (6644/110731), 25.73 MiB | 5.21 MiB/s Receiving objects: 7% (7752/110731), 29.95 MiB | 5.84 MiB/s Receiving objects: 7% (8409/110731), 34.45 MiB | 6.46 MiB/s Receiving objects: 8% (8859/110731), 39.24 MiB | 7.08 MiB/s Receiving objects: 8% (9708/110731), 39.24 MiB | 7.08 MiB/s Receiving objects: 9% (9966/110731), 39.24 MiB | 7.08 MiB/s Receiving objects: 10% (11074/110731), 44.26 MiB | 7.70 MiB/s Receiving objects: 10% (11513/110731), 52.92 MiB | 8.38 MiB/s Receiving objects: 10% (11658/110731), 56.82 MiB | 8.53 MiB/s Receiving objects: 11% (12181/110731), 64.05 MiB | 8.49 MiB/s Receiving objects: 11% (12539/110731), 64.05 MiB | 8.49 MiB/s Receiving objects: 12% (13288/110731), 68.06 MiB | 8.44 MiB/s Receiving objects: 13% (14396/110731), 68.06 MiB | 8.44 MiB/s Receiving objects: 14% (15503/110731), 72.30 MiB | 8.38 MiB/s Receiving objects: 15% (16610/110731), 72.30 MiB | 8.38 MiB/s Receiving objects: 15% (17375/110731), 72.30 MiB | 8.38 MiB/s Receiving objects: 16% (17717/110731), 75.16 MiB | 7.95 MiB/s Receiving objects: 17% (18825/110731), 75.16 MiB | 7.95 MiB/s Receiving objects: 18% (19932/110731), 81.24 MiB | 8.17 MiB/s Receiving objects: 19% (21039/110731), 81.24 MiB | 8.17 MiB/s Receiving objects: 20% (22147/110731), 81.24 MiB | 8.17 MiB/s Receiving objects: 21% (23254/110731), 81.24 MiB | 8.17 MiB/s Receiving objects: 22% (24361/110731), 81.24 MiB | 8.17 MiB/s Receiving objects: 23% (25469/110731), 81.24 MiB | 8.17 MiB/s Receiving objects: 23% (26174/110731), 81.24 MiB | 8.17 MiB/s Receiving objects: 24% (26576/110731), 81.24 MiB | 8.17 MiB/s Receiving objects: 25% (27683/110731), 81.24 MiB | 8.17 MiB/s Receiving objects: 26% (28791/110731), 81.24 MiB | 8.17 MiB/s Receiving objects: 27% (29898/110731), 86.46 MiB | 8.35 MiB/s Receiving objects: 28% (31005/110731), 86.46 MiB | 8.35 MiB/s Receiving objects: 29% (32112/110731), 86.46 MiB | 8.35 MiB/s Receiving objects: 30% (33220/110731), 86.46 MiB | 8.35 MiB/s Receiving objects: 31% (34327/110731), 86.46 MiB | 8.35 MiB/s Receiving objects: 32% (35434/110731), 86.46 MiB | 8.35 MiB/s Receiving objects: 33% (36542/110731), 86.46 MiB | 8.35 MiB/s Receiving objects: 34% (37649/110731), 86.46 MiB | 8.35 MiB/s Receiving objects: 35% (38756/110731), 86.46 MiB | 8.35 MiB/s Receiving objects: 36% (39864/110731), 91.87 MiB | 8.61 MiB/s Receiving objects: 37% (40971/110731), 91.87 MiB | 8.61 MiB/s Receiving objects: 38% (42078/110731), 91.87 MiB | 8.61 MiB/s Receiving objects: 39% (43186/110731), 91.87 MiB | 8.61 MiB/s Receiving objects: 40% (44293/110731), 91.87 MiB | 8.61 MiB/s Receiving objects: 40% (44862/110731), 91.87 MiB | 8.61 MiB/s Receiving objects: 41% (45400/110731), 91.87 MiB | 8.61 MiB/s Receiving objects: 42% (46508/110731), 97.76 MiB | 9.05 MiB/s Receiving objects: 43% (47615/110731), 97.76 MiB | 9.05 MiB/s Receiving objects: 44% (48722/110731), 103.98 MiB | 9.65 MiB/s Receiving objects: 45% (49829/110731), 103.98 MiB | 9.65 MiB/s Receiving objects: 45% (50704/110731), 103.98 MiB | 9.65 MiB/s Receiving objects: 46% (50937/110731), 103.98 MiB | 9.65 MiB/s Receiving objects: 47% (52044/110731), 110.54 MiB | 10.27 MiB/s Receiving objects: 48% (53151/110731), 110.54 MiB | 10.27 MiB/s Receiving objects: 49% (54259/110731), 110.54 MiB | 10.27 MiB/s Receiving objects: 50% (55366/110731), 110.54 MiB | 10.27 MiB/s Receiving objects: 51% (56473/110731), 117.36 MiB | 10.90 MiB/s Receiving objects: 52% (57581/110731), 117.36 MiB | 10.90 MiB/s Receiving objects: 52% (58268/110731), 117.36 MiB | 10.90 MiB/s Receiving objects: 53% (58688/110731), 117.36 MiB | 10.90 MiB/s Receiving objects: 54% (59795/110731), 124.47 MiB | 11.54 MiB/s Receiving objects: 55% (60903/110731), 131.95 MiB | 12.56 MiB/s Receiving objects: 56% (62010/110731), 131.95 MiB | 12.56 MiB/s Receiving objects: 56% (63109/110731), 131.95 MiB | 12.56 MiB/s Receiving objects: 57% (63117/110731), 131.95 MiB | 12.56 MiB/s Receiving objects: 58% (64224/110731), 131.95 MiB | 12.56 MiB/s Receiving objects: 59% (65332/110731), 139.74 MiB | 12.96 MiB/s Receiving objects: 60% (66439/110731), 139.74 MiB | 12.96 MiB/s Receiving objects: 61% (67546/110731), 139.74 MiB | 12.96 MiB/s Receiving objects: 61% (68174/110731), 156.32 MiB | 14.29 MiB/s Receiving objects: 62% (68654/110731), 165.02 MiB | 14.93 MiB/s Receiving objects: 63% (69761/110731), 165.02 MiB | 14.93 MiB/s Receiving objects: 64% (70868/110731), 165.02 MiB | 14.93 MiB/s Receiving objects: 65% (71976/110731), 165.02 MiB | 14.93 MiB/s Receiving objects: 65% (72822/110731), 165.02 MiB | 14.93 MiB/s Receiving objects: 66% (73083/110731), 165.02 MiB | 14.93 MiB/s Receiving objects: 67% (74190/110731), 165.02 MiB | 14.93 MiB/s Receiving objects: 68% (75298/110731), 174.07 MiB | 15.56 MiB/s Receiving objects: 69% (76405/110731), 183.40 MiB | 16.18 MiB/s Receiving objects: 70% (77512/110731), 183.40 MiB | 16.18 MiB/s Receiving objects: 71% (78620/110731), 183.40 MiB | 16.18 MiB/s Receiving objects: 72% (79727/110731), 183.40 MiB | 16.18 MiB/s Receiving objects: 73% (80834/110731), 183.40 MiB | 16.18 MiB/s Receiving objects: 74% (81941/110731), 183.40 MiB | 16.18 MiB/s Receiving objects: 75% (83049/110731), 183.40 MiB | 16.18 MiB/s Receiving objects: 75% (83860/110731), 193.07 MiB | 16.82 MiB/s Receiving objects: 76% (84156/110731), 193.07 MiB | 16.82 MiB/s Receiving objects: 77% (85263/110731), 193.07 MiB | 16.82 MiB/s Receiving objects: 78% (86371/110731), 193.07 MiB | 16.82 MiB/s Receiving objects: 79% (87478/110731), 193.07 MiB | 16.82 MiB/s Receiving objects: 80% (88585/110731), 203.13 MiB | 17.45 MiB/s Receiving objects: 81% (89693/110731), 203.13 MiB | 17.45 MiB/s Receiving objects: 81% (89699/110731), 203.13 MiB | 17.45 MiB/s Receiving objects: 81% (89730/110731), 224.19 MiB | 18.73 MiB/s Receiving objects: 81% (90737/110731), 247.78 MiB | 20.28 MiB/s Receiving objects: 82% (90800/110731), 261.59 MiB | 21.42 MiB/s Receiving objects: 83% (91907/110731), 261.59 MiB | 21.42 MiB/s Receiving objects: 84% (93015/110731), 261.59 MiB | 21.42 MiB/s Receiving objects: 85% (94122/110731), 261.59 MiB | 21.42 MiB/s Receiving objects: 85% (95145/110731), 294.12 MiB | 24.56 MiB/s Receiving objects: 86% (95229/110731), 294.12 MiB | 24.56 MiB/s Receiving objects: 87% (96336/110731), 294.12 MiB | 24.56 MiB/s Receiving objects: 88% (97444/110731), 294.12 MiB | 24.56 MiB/s Receiving objects: 89% (98551/110731), 294.12 MiB | 24.56 MiB/s Receiving objects: 90% (99658/110731), 294.12 MiB | 24.56 MiB/s Receiving objects: 91% (100766/110731), 294.12 MiB | 24.56 MiB/s Receiving objects: 92% (101873/110731), 294.12 MiB | 24.56 MiB/s Receiving objects: 93% (102980/110731), 294.12 MiB | 24.56 MiB/s Receiving objects: 94% (104088/110731), 294.12 MiB | 24.56 MiB/s Receiving objects: 95% (105195/110731), 294.12 MiB | 24.56 MiB/s Receiving objects: 96% (106302/110731), 294.12 MiB | 24.56 MiB/s Receiving objects: 97% (107410/110731), 294.12 MiB | 24.56 MiB/s Receiving objects: 98% (108517/110731), 294.12 MiB | 24.56 MiB/s Receiving objects: 99% (109624/110731), 312.10 MiB | 26.40 MiB/s Receiving objects: 99% (110302/110731), 312.10 MiB | 26.40 MiB/s remote: Total 110731 (delta 12254), reused 11928 (delta 11241), pack-reused 96169 (from 2)
  7. 30.95 s Receiving objects: 100% (110731/110731), 312.10 MiB | 26.40 MiB/s Receiving objects: 100% (110731/110731), 324.99 MiB | 12.98 MiB/s, done.
  8. 32.37 s Resolving deltas: 0% (0/72611) Resolving deltas: 1% (727/72611) Resolving deltas: 2% (1453/72611) Resolving deltas: 3% (2181/72611) Resolving deltas: 4% (2905/72611) Resolving deltas: 5% (3631/72611) Resolving deltas: 6% (4358/72611) Resolving deltas: 7% (5083/72611) Resolving deltas: 8% (5811/72611) Resolving deltas: 9% (6535/72611) Resolving deltas: 10% (7262/72611) Resolving deltas: 11% (7989/72611) Resolving deltas: 12% (8714/72611) Resolving deltas: 13% (9440/72611) Resolving deltas: 14% (10166/72611) Resolving deltas: 15% (10892/72611) Resolving deltas: 16% (11618/72611) Resolving deltas: 17% (12345/72611) Resolving deltas: 18% (13072/72611) Resolving deltas: 19% (13802/72611) Resolving deltas: 20% (14523/72611) Resolving deltas: 21% (15249/72611) Resolving deltas: 22% (15976/72611) Resolving deltas: 23% (16702/72611) Resolving deltas: 24% (17427/72611) Resolving deltas: 25% (18153/72611) Resolving deltas: 26% (18879/72611) Resolving deltas: 27% (19605/72611) Resolving deltas: 28% (20332/72611) Resolving deltas: 29% (21058/72611) Resolving deltas: 30% (21784/72611) Resolving deltas: 31% (22510/72611) Resolving deltas: 32% (23236/72611) Resolving deltas: 33% (23963/72611) Resolving deltas: 34% (24688/72611) Resolving deltas: 35% (25414/72611) Resolving deltas: 36% (26140/72611) Resolving deltas: 37% (26867/72611) Resolving deltas: 38% (27593/72611) Resolving deltas: 39% (28319/72611) Resolving deltas: 40% (29046/72611) Resolving deltas: 41% (29771/72611) Resolving deltas: 42% (30497/72611) Resolving deltas: 43% (31223/72611) Resolving deltas: 44% (31949/72611) Resolving deltas: 45% (32675/72611) Resolving deltas: 46% (33402/72611) Resolving deltas: 47% (34128/72611) Resolving deltas: 48% (34855/72611) Resolving deltas: 49% (35581/72611) Resolving deltas: 50% (36306/72611) Resolving deltas: 51% (37032/72611) Resolving deltas: 52% (37758/72611) Resolving deltas: 53% (38485/72611) Resolving deltas: 54% (39210/72611) Resolving deltas: 55% (39937/72611) Resolving deltas: 56% (40663/72611) Resolving deltas: 57% (41389/72611) Resolving deltas: 58% (42118/72611) Resolving deltas: 59% (42841/72611) Resolving deltas: 60% (43567/72611) Resolving deltas: 61% (44293/72611) Resolving deltas: 62% (45019/72611) Resolving deltas: 63% (45746/72611) Resolving deltas: 64% (46472/72611) Resolving deltas: 65% (47198/72611) Resolving deltas: 66% (47924/72611) Resolving deltas: 67% (48650/72611) Resolving deltas: 68% (49377/72611) Resolving deltas: 69% (50102/72611) Resolving deltas: 70% (50828/72611) Resolving deltas: 71% (51554/72611) Resolving deltas: 72% (52280/72611) Resolving deltas: 73% (53007/72611) Resolving deltas: 74% (53735/72611) Resolving deltas: 75% (54459/72611) Resolving deltas: 76% (55185/72611) Resolving deltas: 77% (55911/72611) Resolving deltas: 77% (56089/72611) Resolving deltas: 78% (56637/72611) Resolving deltas: 79% (57366/72611) Resolving deltas: 80% (58089/72611) Resolving deltas: 81% (58816/72611) Resolving deltas: 82% (59542/72611) Resolving deltas: 83% (60268/72611) Resolving deltas: 84% (60994/72611) Resolving deltas: 85% (61720/72611) Resolving deltas: 86% (62446/72611) Resolving deltas: 87% (63172/72611) Resolving deltas: 88% (63898/72611) Resolving deltas: 89% (64624/72611) Resolving deltas: 90% (65350/72611) Resolving deltas: 91% (66077/72611) Resolving deltas: 92% (66803/72611) Resolving deltas: 93% (67533/72611) Resolving deltas: 94% (68255/72611) Resolving deltas: 95% (68981/72611) Resolving deltas: 96% (69707/72611) Resolving deltas: 97% (70433/72611) Resolving deltas: 98% (71159/72611) Resolving deltas: 99% (71885/72611) Resolving deltas: 100% (72611/72611) Resolving deltas: 100% (72611/72611), done.
  9. 32.93 s Fetching commit 07b1d150507fa30cd2cd44f18a21e3387ba5063b for linnest-endpoints-momentum-layouts ...
  10. 32.93 s $ /nix/store/5vpcfsdx1lcnlb2y4k7xyc74shp5qwbh-git-2.54.0/bin/git fetch origin 07b1d150507fa30cd2cd44f18a21e3387ba5063b
  11. 33.42 s From https://github.com/alphal00p/gammaloop
  12. 33.42 s * branch 07b1d150507fa30cd2cd44f18a21e3387ba5063b -> FETCH_HEAD
  13. 33.43 s $ /nix/store/61685rbaxmpigwi3z23i33sv3jyfl70q-coreutils-9.11/bin/timeout --kill-after=15s 7200s /nix/store/5vpcfsdx1lcnlb2y4k7xyc74shp5qwbh-git-2.54.0/bin/git -c advice.detachedHead=false checkout 07b1d150507fa30cd2cd44f18a21e3387ba5063b
  14. 33.66 s HEAD is now at 07b1d1505 extend linnest edge endpoints, momentum display, and partial layouts
  15. 33.67 s $ /nix/store/61685rbaxmpigwi3z23i33sv3jyfl70q-coreutils-9.11/bin/timeout --kill-after=15s 7200s /nix/store/wknkybkzrc16r11vk5vrykh4wmw7a353-nix-2.34.8/bin/nix --extra-experimental-features nix-command --extra-experimental-features flakes --log-format internal-json run .#packages.x86_64-linux.nix-ci-check-gammaloop-nextest-clinnet --print-build-logs
  16. 33.77 s warning: ignoring untrusted flake configuration setting 'extra-substituters'.
  17. 33.77 s Pass '--accept-flake-config' to trust it
  18. 33.77 s warning: ignoring untrusted flake configuration setting 'extra-trusted-public-keys'.
  19. 33.77 s Pass '--accept-flake-config' to trust it
  20. 36.87 s
  21. 37.04 s Downloading cached nix-ci-check-gammaloop-nextest-clinnet from https://cache.nix-ci.com
  22. 37.08 s Downloaded cached nix-ci-check-gammaloop-nextest-clinnet (1128 B) in 44ms
  23. 37.08 s Progress: 0 of 1 built, 1 of 1 downloaded from cache
  24. 37.19 s do you want to allow configuration setting 'extra-substituters' to be set to 'https://cache.nix-ci.com' (y/N)? do you want to permanently mark this value as untrusted (y/N)? warning: ignoring untrusted flake configuration setting 'extra-substituters'.
  25. 37.19 s Pass '--accept-flake-config' to trust it
  26. 37.19 s evaluating derivation 'gdo you want to allow configuration setting 'extra-trusted-public-keys' to be set to 'nix-ci:g3xV5BDTLtIBZr/A00IU1x0EtKKlb7YLgBN2SgYgM6A=' (y/N)? do you want to permanently mark this value as untrusted (y/N)? warning: ignoring untrusted flake configuration setting 'extra-trusted-public-keys'.
  27. 37.19 s Pass '--accept-flake-config' to trust it
  28. 45.08 s copying '/nix/store/gisz evaluating derivation 'g querying source on https [1/0/1 copied (0.0 KiB/2 [1/0/1 copied (2.5/201.4 [1/0/1 copied (6.5/201.4 [1/0/1 copied (9.4/201.4 [1/0/1 copied (12.9/201. [1/0/1 copied (16.6/201. [1/0/1 copied (20.6/201. [1/0/1 copied (22.5/201. [1/0/1 copied (24.8/201. [1/0/1 copied (32.2/201. [1/0/1 copied (35.2/201. [1/0/1 copied (37.7/201. [1/0/1 copied (39.4/201. [1/0/1 copied (41.2/201. [1/0/1 copied (43.1/201. [1/0/1 copied (46.4/201. [1/0/1 copied (47.7/201. [1/0/1 copied (50.0/201. [1/0/1 copied (51.3/201. [1/0/1 copied (53.2/201. [1/0/1 copied (54.3/201. [1/0/1 copied (56.1/201. [1/0/1 copied (57.4/201. [1/0/1 copied (59.4/201. [1/0/1 copied (60.6/201. [1/0/1 copied (62.1/201. [1/0/1 copied (63.2/201. [1/0/1 copied (64.3/201. [1/0/1 copied (65.4/201. [1/0/1 copied (67.4/201. [1/0/1 copied (69.9/201. [1/0/1 copied (71.9/201. [1/0/1 copied (73.3/201. [1/0/1 copied (74.2/201. [1/0/1 copied (75.1/201. [1/0/1 copied (76.2/201. [1/0/1 copied (77.4/201. [1/0/1 copied (79.3/201. [1/0/1 copied (80.4/201. [1/0/1 copied (82.4/201. [1/0/1 copied (84.3/201. [1/0/1 copied (86.0/201. [1/0/1 copied (87.2/201. [1/0/1 copied (88.4/201. [1/0/1 copied (89.6/201. [1/0/1 copied (91.1/201. [1/0/1 copied (92.4/201. [1/0/1 copied (94.4/201. [1/0/1 copied (96.2/201. [1/0/1 copied (97.2/201. [1/0/1 copied (98.4/201. [1/0/1 copied (100.5/201 [1/0/1 copied (102.1/201 [1/0/1 copied (104.0/201 [1/0/1 copied (106.0/201 [1/0/1 copied (107.3/201 [1/0/1 copied (108.2/201 [1/0/1 copied (110.4/201 [1/0/1 copied (112.4/201 [1/0/1 copied (114.2/201 [1/0/1 copied (115.3/201 [1/0/1 copied (116.7/201 [1/0/1 copied (118.0/201 [1/0/1 copied (129.0/201 [1/0/1 copied (131.4/201 [1/0/1 copied (133.5/201 [1/0/1 copied (145.9/201 [1/0/1 copied (152.3/201 [1/0/1 copied (158.0/201 [1/0/1 copied (158.9/201 [1/0/1 copied (160.3/201 [1/0/1 copied (161.1/201 [1/0/1 copied (162.0/201 [1/0/1 copied (162.6/201 [1/0/1 copied (163.6/201 [1/0/1 copied (164.2/201 [1/0/1 copied (165.1/201 [1/0/1 copied (166.0/201 [1/0/1 copied (166.9/201 [1/0/1 copied (167.8/201 [1/0/1 copied (168.7/201 [1/0/1 copied (169.8/201 [1/0/1 copied (170.5/201 [1/0/1 copied (171.4/201 [1/0/1 copied (172.3/201 [1/0/1 copied (173.2/201 [1/0/1 copied (174.3/201 [1/0/1 copied (175.1/201 [1/0/1 copied (176.1/201 [1/0/1 copied (177.1/201 [1/0/1 copied (185.0/201 [1/0/1 copied (187.7/201 [1/0/1 copied (189.0/201 [1/0/1 copied (190.5/201 [1/0/1 copied (192.7/201 [1/0/1 copied (195.1/201 [1/0/1 copied (201.4 MiB
  29. 50.95 s [1 copied (201.4 MiB), 4
  30. 64.88 s [0/17 built, 14/1/66 cop [0/16 built, 13/2/66 cop [0/14 built, 12/4/66 cop [0/12 built, 7/13/66 cop [0/12 built, 6/14/66 cop [0/11 built, 4/17/66 cop [0/10 built, 3/18/66 cop [1/0/10 built, 2/20/66 cgammaloop-nextest-binaries-clinnet (post)> Uploading to the NixCI cache: /nix/store/d45755425xm2lr2d92s9a64b8bm3wkx6-gammaloop-nextest-binaries-clinnet
  31. 64.96 s gammaloop-nextest-binaries-clinnet (post)> warning: 'warn-short-path-literals' is deprecated, use 'lint-short-path-literals = ignore' instead
  32. 65.09 s gammaloop-nextest-binaries-clinnet (post)> copying 0 paths...
  33. 65.17 s gammaloop-nextest-binaries-clinnet (post)> warning: 'warn-short-path-literals' is deprecated, use 'lint-short-path-literals = ignore' instead
  34. 65.44 s gammaloop-nextest-binaries-clinnet (post)> copying 0 paths...
  35. 66.18 s [1/10 built, 16/22/66 co [1/9 built, 16/25/66 cop [1/9 built, 14/30/66 cop [1/9 built, 14/36/66 cop [1/9 built, 12/41/66 cop [1/9 built, 10/46/66 cop [1/9 built, 6/52/66 copi [1/9 built, 7/55/66 copi [1/8 built, 5/58/66 copi [1/7 built, 4/59/66 copi [1/1/7 built, 4/59/66 cobuilder.pl> Running phase: patchPhase
  36. 66.19 s builder.pl> Running phase: updateAutotoolsGnuConfigScriptsPhase
  37. 66.20 s builder.pl> Running phase: configurePhase
  38. 66.21 s builder.pl> no configure script, doing nothing
  39. 66.22 s builder.pl> Running phase: buildPhase
  40. 66.23 s builder.pl> Running phase: checkPhase
  41. 66.24 s builder.pl> Running phase: installPhase
  42. 66.24 s [1/1/7 built, 4/60/66 cobuilder.pl> no Makefile or custom installPhase, doing nothing
  43. 66.24 s builder.pl> Running phase: fixupPhase
  44. 66.26 s builder.pl> shrinking RPATHs of ELF executables and libraries in /nix/store/zzmspl8wdn2a3ancrz8dg3kci887nw6d-builder.pl
  45. 66.26 s builder.pl> checking for references to /build/ in /nix/store/zzmspl8wdn2a3ancrz8dg3kci887nw6d-builder.pl...
  46. 66.28 s builder.pl> patching script interpreter paths in /nix/store/zzmspl8wdn2a3ancrz8dg3kci887nw6d-builder.pl
  47. 66.32 s builder.pl (post)> Uploading to the NixCI cache: /nix/store/zzmspl8wdn2a3ancrz8dg3kci887nw6d-builder.pl
  48. 66.39 s builder.pl (post)> warning: 'warn-short-path-literals' is deprecated, use 'lint-short-path-literals = ignore' instead
  49. 66.52 s builder.pl (post)> copying 0 paths...
  50. 66.62 s builder.pl (post)> warning: 'warn-short-path-literals' is deprecated, use 'lint-short-path-literals = ignore' instead
  51. 67.06 s builder.pl (post)> copying 0 paths...
  52. 67.44 s [2/5 built, 1/63/66 copi [2/5 built, 1/64/66 copi [2/5 built, 1/65/66 copi [2/4 built, 66 copied (8typst> structuredAttrs is enabled
  53. 67.51 s [1/2/4 built, 66 copied typst> created 4 symlinks in user environment
  54. 67.66 s typst (post)> Uploading to the NixCI cache: /nix/store/yc93gbspdkf53nwjsf1mbydbsaq9snxl-typst-0.15.1-env
  55. 67.71 s typst (post)> warning: 'warn-short-path-literals' is deprecated, use 'lint-short-path-literals = ignore' instead
  56. 67.84 s typst (post)> copying 0 paths...
  57. 67.91 s typst (post)> warning: 'warn-short-path-literals' is deprecated, use 'lint-short-path-literals = ignore' instead
  58. 68.41 s typst (post)> copying 0 paths...
  59. 68.80 s [3/5 built, 66 copied (8 [1/3/4 built, 66 copied gammaloop-nextest-clinnet> Extracting 4 binaries (including 1 non-test binary) and 1 linked path to /build/source
  60. 68.86 s gammaloop-nextest-clinnet> Extracted 15 files to /build/source in 0.06s
  61. 68.87 s gammaloop-nextest-clinnet> ------------
  62. 68.87 s gammaloop-nextest-clinnet> Nextest run ID 08789357-7861-44b8-b62a-632ef8ba2593 with nextest profile: ci_gammaloop
  63. 68.87 s gammaloop-nextest-clinnet> Starting 36 tests across 3 binaries
  64. 70.69 s gammaloop-nextest-clinnet> FAIL [ 1.807s] (16/36) clinnet tests::default_template_renders_generic_config_and_static_subgraphs_with_typst
  65. 70.69 s gammaloop-nextest-clinnet> stdout ---
  66. 70.69 s gammaloop-nextest-clinnet>
  67. 70.69 s gammaloop-nextest-clinnet> running 1 test
  68. 70.69 s gammaloop-nextest-clinnet> test tests::default_template_renders_generic_config_and_static_subgraphs_with_typst ... FAILED
  69. 70.69 s gammaloop-nextest-clinnet>
  70. 70.69 s gammaloop-nextest-clinnet> failures:
  71. 70.69 s gammaloop-nextest-clinnet>
  72. 70.69 s gammaloop-nextest-clinnet> failures:
  73. 70.69 s gammaloop-nextest-clinnet> tests::default_template_renders_generic_config_and_static_subgraphs_with_typst
  74. 70.69 s gammaloop-nextest-clinnet>
  75. 70.69 s gammaloop-nextest-clinnet> test result: FAILED. 0 passed; 1 failed; 0 ignored; 0 measured; 13 filtered out; finished in 1.80s
  76. 70.69 s gammaloop-nextest-clinnet>
  77. 70.69 s gammaloop-nextest-clinnet> stderr ---
  78. 70.69 s gammaloop-nextest-clinnet>
  79. 70.69 s gammaloop-nextest-clinnet> thread 'tests::default_template_renders_generic_config_and_static_subgraphs_with_typst' (185) panicked at crates/clinnet/src/lib.rs:1307:14:
  80. 70.69 s gammaloop-nextest-clinnet> called `Result::unwrap()` on an `Err` value: typst failed while compiling template /build/clinnet-real-typst-170-0/gamma-style-assertions.pdf
  81. 70.69 s gammaloop-nextest-clinnet>
  82. 70.69 s gammaloop-nextest-clinnet> Command executed:
  83. 70.69 s gammaloop-nextest-clinnet> "typst" "c" "/build/source/crates/clinnet/tests/resources/gamma-style-behavior.typ" "/build/clinnet-real-typst-170-0/gamma-style-assertions.pdf" "--root" "/build/source"
  84. 70.69 s gammaloop-nextest-clinnet>
  85. 70.69 s gammaloop-nextest-clinnet> File not found - check that all paths are correct and files exist
  86. 70.69 s gammaloop-nextest-clinnet>
  87. 70.69 s gammaloop-nextest-clinnet> Typst stdout:
  88. 70.69 s gammaloop-nextest-clinnet>
  89. 70.69 s gammaloop-nextest-clinnet>
  90. 70.69 s gammaloop-nextest-clinnet> Typst stderr:
  91. 70.69 s gammaloop-nextest-clinnet> error: file not found (searched at /build/source/docs/assets/typst/theme.typ)
  92. 70.69 s gammaloop-nextest-clinnet> ┌─ ../../docs/assets/typst/portal-graphs/edge-style.typ:5:8
  93. 70.69 s gammaloop-nextest-clinnet> │
  94. 70.69 s gammaloop-nextest-clinnet> 5 │ #import "../theme.typ": palette
  95. 70.69 s gammaloop-nextest-clinnet> │ ^^^^^^^^^^^^^^
  96. 70.69 s gammaloop-nextest-clinnet>
  97. 70.69 s gammaloop-nextest-clinnet> while importing `../../../../docs/assets/typst/portal-graphs/edge-style.typ` at tests/resources/gamma-style-behavior.typ:7:1
  98. 70.69 s gammaloop-nextest-clinnet> import "../../../../docs/assets/typst/portal-graphs/edge-style.typ" as model-style
  99. 70.69 s gammaloop-nextest-clinnet>
  100. 70.69 s gammaloop-nextest-clinnet> Location:
  101. 70.69 s gammaloop-nextest-clinnet> crates/clinnet/src/lib.rs:770:13
  102. 70.69 s gammaloop-nextest-clinnet> stack backtrace:
  103. 70.69 s gammaloop-nextest-clinnet> 0: __rustc::rust_begin_unwind
  104. 70.69 s gammaloop-nextest-clinnet> 1: core::panicking::panic_fmt
  105. 70.69 s gammaloop-nextest-clinnet> 2: core::result::unwrap_failed
  106. 70.69 s gammaloop-nextest-clinnet> 3: clinnet::tests::default_template_renders_generic_config_and_static_subgraphs_with_typst
  107. 70.69 s gammaloop-nextest-clinnet> 4: <clinnet::tests::default_template_renders_generic_config_and_static_subgraphs_with_typst::{closure#0} as core::ops::function::FnOnce<()>>::call_once
  108. 70.69 s gammaloop-nextest-clinnet> note: Some details are omitted, run with `RUST_BACKTRACE=full` for a verbose backtrace.
  109. 70.69 s gammaloop-nextest-clinnet>
  110. 100.65 s gammaloop-nextest-clinnet> ------------
  111. 100.65 s gammaloop-nextest-clinnet> Summary [ 31.777s] 36 tests run: 35 passed, 1 failed, 0 skipped
  112. 100.65 s gammaloop-nextest-clinnet> FAIL [ 1.807s] (16/36) clinnet tests::default_template_renders_generic_config_and_static_subgraphs_with_typst
  113. 100.65 s gammaloop-nextest-clinnet> stdout ---
  114. 100.65 s gammaloop-nextest-clinnet>
  115. 100.65 s gammaloop-nextest-clinnet> running 1 test
  116. 100.65 s gammaloop-nextest-clinnet> test tests::default_template_renders_generic_config_and_static_subgraphs_with_typst ... FAILED
  117. 100.65 s gammaloop-nextest-clinnet>
  118. 100.65 s gammaloop-nextest-clinnet> failures:
  119. 100.65 s gammaloop-nextest-clinnet>
  120. 100.65 s gammaloop-nextest-clinnet> failures:
  121. 100.66 s gammaloop-nextest-clinnet> tests::default_template_renders_generic_config_and_static_subgraphs_with_typst
  122. 100.66 s gammaloop-nextest-clinnet>
  123. 100.66 s gammaloop-nextest-clinnet> test result: FAILED. 0 passed; 1 failed; 0 ignored; 0 measured; 13 filtered out; finished in 1.80s
  124. 100.66 s gammaloop-nextest-clinnet>
  125. 100.66 s gammaloop-nextest-clinnet> stderr ---
  126. 100.66 s gammaloop-nextest-clinnet>
  127. 100.66 s gammaloop-nextest-clinnet> thread 'tests::default_template_renders_generic_config_and_static_subgraphs_with_typst' (185) panicked at crates/clinnet/src/lib.rs:1307:14:
  128. 100.66 s gammaloop-nextest-clinnet> called `Result::unwrap()` on an `Err` value: typst failed while compiling template /build/clinnet-real-typst-170-0/gamma-style-assertions.pdf
  129. 100.66 s gammaloop-nextest-clinnet>
  130. 100.66 s gammaloop-nextest-clinnet> Command executed:
  131. 100.66 s gammaloop-nextest-clinnet> "typst" "c" "/build/source/crates/clinnet/tests/resources/gamma-style-behavior.typ" "/build/clinnet-real-typst-170-0/gamma-style-assertions.pdf" "--root" "/build/source"
  132. 100.66 s gammaloop-nextest-clinnet>
  133. 100.66 s gammaloop-nextest-clinnet> File not found - check that all paths are correct and files exist
  134. 100.66 s gammaloop-nextest-clinnet>
  135. 100.66 s gammaloop-nextest-clinnet> Typst stdout:
  136. 100.66 s gammaloop-nextest-clinnet>
  137. 100.66 s gammaloop-nextest-clinnet>
  138. 100.66 s gammaloop-nextest-clinnet> Typst stderr:
  139. 100.66 s gammaloop-nextest-clinnet> error: file not found (searched at /build/source/docs/assets/typst/theme.typ)
  140. 100.66 s gammaloop-nextest-clinnet> ┌─ ../../docs/assets/typst/portal-graphs/edge-style.typ:5:8
  141. 100.66 s gammaloop-nextest-clinnet> │
  142. 100.66 s gammaloop-nextest-clinnet> 5 │ #import "../theme.typ": palette
  143. 100.66 s gammaloop-nextest-clinnet> │ ^^^^^^^^^^^^^^
  144. 100.66 s gammaloop-nextest-clinnet>
  145. 100.66 s gammaloop-nextest-clinnet> while importing `../../../../docs/assets/typst/portal-graphs/edge-style.typ` at tests/resources/gamma-style-behavior.typ:7:1
  146. 100.66 s gammaloop-nextest-clinnet> import "../../../../docs/assets/typst/portal-graphs/edge-style.typ" as model-style
  147. 100.66 s gammaloop-nextest-clinnet>
  148. 100.66 s gammaloop-nextest-clinnet> Location:
  149. 100.66 s gammaloop-nextest-clinnet> crates/clinnet/src/lib.rs:770:13
  150. 100.66 s gammaloop-nextest-clinnet> stack backtrace:
  151. 100.66 s gammaloop-nextest-clinnet> 0: __rustc::rust_begin_unwind
  152. 100.66 s gammaloop-nextest-clinnet> 1: core::panicking::panic_fmt
  153. 100.66 s gammaloop-nextest-clinnet> 2: core::result::unwrap_failed
  154. 100.66 s gammaloop-nextest-clinnet> 3: clinnet::tests::default_template_renders_generic_config_and_static_subgraphs_with_typst
  155. 100.66 s gammaloop-nextest-clinnet> 4: <clinnet::tests::default_template_renders_generic_config_and_static_subgraphs_with_typst::{closure#0} as core::ops::function::FnOnce<()>>::call_once
  156. 100.66 s gammaloop-nextest-clinnet> note: Some details are omitted, run with `RUST_BACKTRACE=full` for a verbose backtrace.
  157. 100.66 s gammaloop-nextest-clinnet>
  158. 100.67 s gammaloop-nextest-clinnet> error: test run failed
  159. 100.72 s gammaloop-nextest-clinnet>
  160. 100.72 s gammaloop-nextest-clinnet> ========== nextest test summary ==========
  161. 100.72 s gammaloop-nextest-clinnet> report: target/nextest/ci_gammaloop/junit.xml
  162. 100.72 s gammaloop-nextest-clinnet> tests: 36, failures: 1, errors: 0
  163. 100.72 s gammaloop-nextest-clinnet>
  164. 100.72 s gammaloop-nextest-clinnet> 1. clinnet::tests::default_template_renders_generic_config_and_static_subgraphs_with_typst
  165. 100.72 s gammaloop-nextest-clinnet> failure: test failure with exit code 101
  166. 100.72 s gammaloop-nextest-clinnet> thread 'tests::default_template_renders_generic_config_and_static_subgraphs_with_typst' (185) panicked at crates/clinnet/src/lib.rs:1307:14:
  167. 100.72 s gammaloop-nextest-clinnet> called `Result::unwrap()` on an `Err` value: typst failed while compiling template /build/clinnet-real-typst-170-0/gamma-style-assertions.pdf
  168. 100.72 s gammaloop-nextest-clinnet>
  169. 100.72 s gammaloop-nextest-clinnet> Command executed:
  170. 100.72 s gammaloop-nextest-clinnet> "typst" "c" "/build/source/crates/clinnet/tests/resources/gamma-style-behavior.typ" "/build/clinnet-real-typst-170-0/gamma-style-assertions.pdf" "--root" "/build/source"
  171. 100.72 s gammaloop-nextest-clinnet>
  172. 100.72 s gammaloop-nextest-clinnet> File not found - check that all paths are correct and files exist
  173. 100.72 s gammaloop-nextest-clinnet>
  174. 100.72 s gammaloop-nextest-clinnet> Typst stdout:
  175. 100.72 s gammaloop-nextest-clinnet>
  176. 100.72 s gammaloop-nextest-clinnet>
  177. 100.72 s gammaloop-nextest-clinnet> Typst stderr:
  178. 100.72 s gammaloop-nextest-clinnet> error: file not found (searched at /build/source/docs/assets/typst/theme.typ)
  179. 100.72 s gammaloop-nextest-clinnet> ┌─ ../../docs/assets/typst/portal-graphs/edge-style.typ:5:8
  180. 100.72 s gammaloop-nextest-clinnet> │
  181. 100.72 s gammaloop-nextest-clinnet> 5 │ #import "../theme.typ": palette
  182. 100.72 s gammaloop-nextest-clinnet> │ ^^^^^^^^^^^^^^
  183. 100.72 s gammaloop-nextest-clinnet>
  184. 100.72 s gammaloop-nextest-clinnet> while importing `../../../../docs/assets/typst/portal-graphs/edge-style.typ` at tests/resources/gamma-style-behavior.typ:7:1
  185. 100.72 s gammaloop-nextest-clinnet> import "../../../../docs/assets/typst/portal-graphs/edge-style.typ" as model-style
  186. 100.72 s gammaloop-nextest-clinnet>
  187. 100.72 s gammaloop-nextest-clinnet> Location:
  188. 100.72 s gammaloop-nextest-clinnet> crates/clinnet/src/lib.rs:770:13
  189. 100.72 s gammaloop-nextest-clinnet> stack backtrace:
  190. 100.72 s gammaloop-nextest-clinnet> 0: __rustc::rust_begin_unwind
  191. 100.72 s gammaloop-nextest-clinnet> 1: core::panicking::panic_fmt
  192. 100.72 s gammaloop-nextest-clinnet> 2: core::result::unwrap_failed
  193. 100.72 s gammaloop-nextest-clinnet> 3: clinnet::tests::default_template_renders_generic_config_and_static_subgraphs_with_typst
  194. 100.72 s gammaloop-nextest-clinnet> 4: <clinnet::tests::default_template_renders_generic_config_and_static_subgraphs_with_typst::{closure#0} as core::ops::function::FnOnce<()>>::call_once
  195. 100.72 s gammaloop-nextest-clinnet> note: Some details are omitted, run with `RUST_BACKTRACE=full` for a verbose backtrace.
  196. 100.72 s gammaloop-nextest-clinnet> system-out
  197. 100.72 s gammaloop-nextest-clinnet> running 1 test
  198. 100.72 s gammaloop-nextest-clinnet> test tests::default_template_renders_generic_config_and_static_subgraphs_with_typst ... FAILED
  199. 100.72 s gammaloop-nextest-clinnet>
  200. 100.72 s gammaloop-nextest-clinnet> failures:
  201. 100.72 s gammaloop-nextest-clinnet>
  202. 100.72 s gammaloop-nextest-clinnet> failures:
  203. 100.72 s gammaloop-nextest-clinnet> tests::default_template_renders_generic_config_and_static_subgraphs_with_typst
  204. 100.72 s gammaloop-nextest-clinnet>
  205. 100.72 s gammaloop-nextest-clinnet> test result: FAILED. 0 passed; 1 failed; 0 ignored; 0 measured; 13 filtered out; finished in 1.80s
  206. 100.72 s gammaloop-nextest-clinnet> system-err
  207. 100.72 s gammaloop-nextest-clinnet> thread 'tests::default_template_renders_generic_config_and_static_subgraphs_with_typst' (185) panicked at crates/clinnet/src/lib.rs:1307:14:
  208. 100.72 s gammaloop-nextest-clinnet> called `Result::unwrap()` on an `Err` value: typst failed while compiling template /build/clinnet-real-typst-170-0/gamma-style-assertions.pdf
  209. 100.72 s gammaloop-nextest-clinnet>
  210. 100.72 s gammaloop-nextest-clinnet> Command executed:
  211. 100.72 s gammaloop-nextest-clinnet> "typst" "c" "/build/source/crates/clinnet/tests/resources/gamma-style-behavior.typ" "/build/clinnet-real-typst-170-0/gamma-style-assertions.pdf" "--root" "/build/source"
  212. 100.72 s gammaloop-nextest-clinnet>
  213. 100.72 s gammaloop-nextest-clinnet> File not found - check that all paths are correct and files exist
  214. 100.72 s gammaloop-nextest-clinnet>
  215. 100.72 s gammaloop-nextest-clinnet> Typst stdout:
  216. 100.72 s gammaloop-nextest-clinnet>
  217. 100.72 s gammaloop-nextest-clinnet>
  218. 100.72 s gammaloop-nextest-clinnet> Typst stderr:
  219. 100.72 s gammaloop-nextest-clinnet> error: file not found (searched at /build/source/docs/assets/typst/theme.typ)
  220. 100.72 s gammaloop-nextest-clinnet> ┌─ ../../docs/assets/typst/portal-graphs/edge-style.typ:5:8
  221. 100.72 s gammaloop-nextest-clinnet> │
  222. 100.72 s gammaloop-nextest-clinnet> 5 │ #import "../theme.typ": palette
  223. 100.72 s gammaloop-nextest-clinnet> │ ^^^^^^^^^^^^^^
  224. 100.72 s gammaloop-nextest-clinnet>
  225. 100.72 s gammaloop-nextest-clinnet> while importing `../../../../docs/assets/typst/portal-graphs/edge-style.typ` at tests/resources/gamma-style-behavior.typ:7:1
  226. 100.72 s gammaloop-nextest-clinnet> import "../../../../docs/assets/typst/portal-graphs/edge-style.typ" as model-style
  227. 100.72 s gammaloop-nextest-clinnet>
  228. 100.72 s gammaloop-nextest-clinnet> Location:
  229. 100.72 s gammaloop-nextest-clinnet> crates/clinnet/src/lib.rs:770:13
  230. 100.72 s gammaloop-nextest-clinnet> stack backtrace:
  231. 100.72 s gammaloop-nextest-clinnet> 0: __rustc::rust_begin_unwind
  232. 100.72 s gammaloop-nextest-clinnet> 1: core::panicking::panic_fmt
  233. 100.72 s gammaloop-nextest-clinnet> 2: core::result::unwrap_failed
  234. 100.72 s gammaloop-nextest-clinnet> 3: clinnet::tests::default_template_renders_generic_config_and_static_subgraphs_with_typst
  235. 100.72 s gammaloop-nextest-clinnet> 4: <clinnet::tests::default_template_renders_generic_config_and_static_subgraphs_with_typst::{closure#0} as core::ops::function::FnOnce<()>>::call_once
  236. 100.72 s gammaloop-nextest-clinnet> note: Some details are omitted, run with `RUST_BACKTRACE=full` for a verbose backtrace.
  237. 100.72 s gammaloop-nextest-clinnet> =========================================
  238. 100.78 s [3 built (1 failed), 66 error: Cannot build '/nix/store/h7wfxf9is8d9pfbnnbafzbqf2ky01xla-gammaloop-nextest-clinnet.drv'.
  239. 100.78 s Reason: builder failed with exit code 100.
  240. 100.78 s Output paths:
  241. 100.78 s /nix/store/457wcp0rzgz0k62034js40b1iqyxmyf5-gammaloop-nextest-clinnet
  242. 100.78 s Last 179 log lines:
  243. 100.78 s > Extracting 4 binaries (including 1 non-test binary) and 1 linked path to /build/source
  244. 100.78 s > Extracted 15 files to /build/source in 0.06s
  245. 100.78 s > ------------
  246. 100.78 s > Nextest run ID 08789357-7861-44b8-b62a-632ef8ba2593 with nextest profile: ci_gammaloop
  247. 100.78 s > Starting 36 tests across 3 binaries
  248. 100.78 s > FAIL [ 1.807s] (16/36) clinnet tests::default_template_renders_generic_config_and_static_subgraphs_with_typst
  249. 100.78 s > stdout ---
  250. 100.78 s >
  251. 100.78 s > running 1 test
  252. 100.78 s > test tests::default_template_renders_generic_config_and_static_subgraphs_with_typst ... FAILED
  253. 100.78 s >
  254. 100.78 s > failures:
  255. 100.78 s >
  256. 100.78 s > failures:
  257. 100.78 s > tests::default_template_renders_generic_config_and_static_subgraphs_with_typst
  258. 100.78 s >
  259. 100.78 s > test result: FAILED. 0 passed; 1 failed; 0 ignored; 0 measured; 13 filtered out; finished in 1.80s
  260. 100.78 s >
  261. 100.78 s > stderr ---
  262. 100.78 s >
  263. 100.78 s > thread 'tests::default_template_renders_generic_config_and_static_subgraphs_with_typst' (185) panicked at crates/clinnet/src/lib.rs:1307:14:
  264. 100.78 s > called `Result::unwrap()` on an `Err` value: typst failed while compiling template /build/clinnet-real-typst-170-0/gamma-style-assertions.pdf
  265. 100.78 s >
  266. 100.78 s > Command executed:
  267. 100.78 s > "typst" "c" "/build/source/crates/clinnet/tests/resources/gamma-style-behavior.typ" "/build/clinnet-real-typst-170-0/gamma-style-assertions.pdf" "--root" "/build/source"
  268. 100.78 s >
  269. 100.78 s > File not found - check that all paths are correct and files exist
  270. 100.78 s >
  271. 100.78 s > Typst stdout:
  272. 100.78 s >
  273. 100.78 s >
  274. 100.78 s > Typst stderr:
  275. 100.78 s > error: file not found (searched at /build/source/docs/assets/typst/theme.typ)
  276. 100.78 s > ┌─ ../../docs/assets/typst/portal-graphs/edge-style.typ:5:8
  277. 100.78 s > │
  278. 100.78 s > 5 │ #import "../theme.typ": palette
  279. 100.78 s > │ ^^^^^^^^^^^^^^
  280. 100.78 s >
  281. 100.78 s > while importing `../../../../docs/assets/typst/portal-graphs/edge-style.typ` at tests/resources/gamma-style-behavior.typ:7:1
  282. 100.78 s > import "../../../../docs/assets/typst/portal-graphs/edge-style.typ" as model-style
  283. 100.78 s >
  284. 100.78 s > Location:
  285. 100.78 s > crates/clinnet/src/lib.rs:770:13
  286. 100.78 s > stack backtrace:
  287. 100.78 s > 0: __rustc::rust_begin_unwind
  288. 100.78 s > 1: core::panicking::panic_fmt
  289. 100.78 s > 2: core::result::unwrap_failed
  290. 100.78 s > 3: clinnet::tests::default_template_renders_generic_config_and_static_subgraphs_with_typst
  291. 100.78 s > 4: <clinnet::tests::default_template_renders_generic_config_and_static_subgraphs_with_typst::{closure#0} as core::ops::function::FnOnce<()>>::call_once
  292. 100.78 s > note: Some details are omitted, run with `RUST_BACKTRACE=full` for a verbose backtrace.
  293. 100.78 s >
  294. 100.78 s > ------------
  295. 100.78 s > Summary [ 31.777s] 36 tests run: 35 passed, 1 failed, 0 skipped
  296. 100.78 s > FAIL [ 1.807s] (16/36) clinnet tests::default_template_renders_generic_config_and_static_subgraphs_with_typst
  297. 100.78 s > stdout ---
  298. 100.78 s >
  299. 100.78 s > running 1 test
  300. 100.78 s > test tests::default_template_renders_generic_config_and_static_subgraphs_with_typst ... FAILED
  301. 100.78 s >
  302. 100.78 s > failures:
  303. 100.78 s >
  304. 100.78 s > failures:
  305. 100.78 s > tests::default_template_renders_generic_config_and_static_subgraphs_with_typst
  306. 100.78 s >
  307. 100.78 s > test result: FAILED. 0 passed; 1 failed; 0 ignored; 0 measured; 13 filtered out; finished in 1.80s
  308. 100.78 s >
  309. 100.78 s > stderr ---
  310. 100.78 s >
  311. 100.78 s > thread 'tests::default_template_renders_generic_config_and_static_subgraphs_with_typst' (185) panicked at crates/clinnet/src/lib.rs:1307:14:
  312. 100.78 s > called `Result::unwrap()` on an `Err` value: typst failed while compiling template /build/clinnet-real-typst-170-0/gamma-style-assertions.pdf
  313. 100.78 s >
  314. 100.78 s > Command executed:
  315. 100.78 s > "typst" "c" "/build/source/crates/clinnet/tests/resources/gamma-style-behavior.typ" "/build/clinnet-real-typst-170-0/gamma-style-assertions.pdf" "--root" "/build/source"
  316. 100.78 s >
  317. 100.78 s > File not found - check that all paths are correct and files exist
  318. 100.78 s >
  319. 100.78 s > Typst stdout:
  320. 100.78 s >
  321. 100.78 s >
  322. 100.78 s > Typst stderr:
  323. 100.78 s > error: file not found (searched at /build/source/docs/assets/typst/theme.typ)
  324. 100.78 s > ┌─ ../../docs/assets/typst/portal-graphs/edge-style.typ:5:8
  325. 100.78 s > │
  326. 100.78 s > 5 │ #import "../theme.typ": palette
  327. 100.78 s > │ ^^^^^^^^^^^^^^
  328. 100.78 s >
  329. 100.78 s > while importing `../../../../docs/assets/typst/portal-graphs/edge-style.typ` at tests/resources/gamma-style-behavior.typ:7:1
  330. 100.78 s > import "../../../../docs/assets/typst/portal-graphs/edge-style.typ" as model-style
  331. 100.78 s >
  332. 100.78 s > Location:
  333. 100.78 s > crates/clinnet/src/lib.rs:770:13
  334. 100.78 s > stack backtrace:
  335. 100.78 s > 0: __rustc::rust_begin_unwind
  336. 100.78 s > 1: core::panicking::panic_fmt
  337. 100.78 s > 2: core::result::unwrap_failed
  338. 100.78 s > 3: clinnet::tests::default_template_renders_generic_config_and_static_subgraphs_with_typst
  339. 100.78 s > 4: <clinnet::tests::default_template_renders_generic_config_and_static_subgraphs_with_typst::{closure#0} as core::ops::function::FnOnce<()>>::call_once
  340. 100.78 s > note: Some details are omitted, run with `RUST_BACKTRACE=full` for a verbose backtrace.
  341. 100.78 s >
  342. 100.78 s > error: test run failed
  343. 100.78 s >
  344. 100.78 s > ========== nextest test summary ==========
  345. 100.78 s > report: target/nextest/ci_gammaloop/junit.xml
  346. 100.78 s > tests: 36, failures: 1, errors: 0
  347. 100.78 s >
  348. 100.78 s > 1. clinnet::tests::default_template_renders_generic_config_and_static_subgraphs_with_typst
  349. 100.78 s > failure: test failure with exit code 101
  350. 100.78 s > thread 'tests::default_template_renders_generic_config_and_static_subgraphs_with_typst' (185) panicked at crates/clinnet/src/lib.rs:1307:14:
  351. 100.78 s > called `Result::unwrap()` on an `Err` value: typst failed while compiling template /build/clinnet-real-typst-170-0/gamma-style-assertions.pdf
  352. 100.78 s >
  353. 100.78 s > Command executed:
  354. 100.78 s > "typst" "c" "/build/source/crates/clinnet/tests/resources/gamma-style-behavior.typ" "/build/clinnet-real-typst-170-0/gamma-style-assertions.pdf" "--root" "/build/source"
  355. 100.78 s >
  356. 100.78 s > File not found - check that all paths are correct and files exist
  357. 100.78 s >
  358. 100.78 s > Typst stdout:
  359. 100.78 s >
  360. 100.78 s >
  361. 100.78 s > Typst stderr:
  362. 100.78 s > error: file not found (searched at /build/source/docs/assets/typst/theme.typ)
  363. 100.78 s > ┌─ ../../docs/assets/typst/portal-graphs/edge-style.typ:5:8
  364. 100.78 s > │
  365. 100.78 s > 5 │ #import "../theme.typ": palette
  366. 100.78 s > │ ^^^^^^^^^^^^^^
  367. 100.78 s >
  368. 100.78 s > while importing `../../../../docs/assets/typst/portal-graphs/edge-style.typ` at tests/resources/gamma-style-behavior.typ:7:1
  369. 100.78 s > import "../../../../docs/assets/typst/portal-graphs/edge-style.typ" as model-style
  370. 100.78 s >
  371. 100.78 s > Location:
  372. 100.78 s > crates/clinnet/src/lib.rs:770:13
  373. 100.78 s > stack backtrace:
  374. 100.78 s > 0: __rustc::rust_begin_unwind
  375. 100.78 s > 1: core::panicking::panic_fmt
  376. 100.78 s > 2: core::result::unwrap_failed
  377. 100.78 s > 3: clinnet::tests::default_template_renders_generic_config_and_static_subgraphs_with_typst
  378. 100.78 s > 4: <clinnet::tests::default_template_renders_generic_config_and_static_subgraphs_with_typst::{closure#0} as core::ops::function::FnOnce<()>>::call_once
  379. 100.78 s > note: Some details are omitted, run with `RUST_BACKTRACE=full` for a verbose backtrace.
  380. 100.78 s > system-out
  381. 100.78 s > running 1 test
  382. 100.78 s > test tests::default_template_renders_generic_config_and_static_subgraphs_with_typst ... FAILED
  383. 100.78 s >
  384. 100.78 s > failures:
  385. 100.78 s >
  386. 100.78 s > failures:
  387. 100.78 s > tests::default_template_renders_generic_config_and_static_subgraphs_with_typst
  388. 100.78 s >
  389. 100.78 s > test result: FAILED. 0 passed; 1 failed; 0 ignored; 0 measured; 13 filtered out; finished in 1.80s
  390. 100.78 s > system-err
  391. 100.78 s > thread 'tests::default_template_renders_generic_config_and_static_subgraphs_with_typst' (185) panicked at crates/clinnet/src/lib.rs:1307:14:
  392. 100.78 s > called `Result::unwrap()` on an `Err` value: typst failed while compiling template /build/clinnet-real-typst-170-0/gamma-style-assertions.pdf
  393. 100.78 s >
  394. 100.78 s > Command executed:
  395. 100.78 s > "typst" "c" "/build/source/crates/clinnet/tests/resources/gamma-style-behavior.typ" "/build/clinnet-real-typst-170-0/gamma-style-assertions.pdf" "--root" "/build/source"
  396. 100.78 s >
  397. 100.78 s > File not found - check that all paths are correct and files exist
  398. 100.78 s >
  399. 100.78 s > Typst stdout:
  400. 100.78 s >
  401. 100.78 s >
  402. 100.78 s > Typst stderr:
  403. 100.78 s > error: file not found (searched at /build/source/docs/assets/typst/theme.typ)
  404. 100.78 s > ┌─ ../../docs/assets/typst/portal-graphs/edge-style.typ:5:8
  405. 100.78 s > │
  406. 100.78 s > 5 │ #import "../theme.typ": palette
  407. 100.78 s > │ ^^^^^^^^^^^^^^
  408. 100.78 s >
  409. 100.78 s > while importing `../../../../docs/assets/typst/portal-graphs/edge-style.typ` at tests/resources/gamma-style-behavior.typ:7:1
  410. 100.78 s > import "../../../../docs/assets/typst/portal-graphs/edge-style.typ" as model-style
  411. 100.78 s >
  412. 100.78 s > Location:
  413. 100.78 s > crates/clinnet/src/lib.rs:770:13
  414. 100.78 s > stack backtrace:
  415. 100.78 s > 0: __rustc::rust_begin_unwind
  416. 100.78 s > 1: core::panicking::panic_fmt
  417. 100.78 s > 2: core::result::unwrap_failed
  418. 100.78 s > 3: clinnet::tests::default_template_renders_generic_config_and_static_subgraphs_with_typst
  419. 100.78 s > 4: <clinnet::tests::default_template_renders_generic_config_and_static_subgraphs_with_typst::{closure#0} as core::ops::function::FnOnce<()>>::call_once
  420. 100.78 s > note: Some details are omitted, run with `RUST_BACKTRACE=full` for a verbose backtrace.
  421. 100.78 s > =========================================
  422. 100.78 s For full logs, run:
  423. 100.78 s nix log /nix/store/h7wfxf9is8d9pfbnnbafzbqf2ky01xla-gammaloop-nextest-clinnet.drv
  424. 100.99 s Run failed.