test packages.x86_64-linux.nix-ci-check-gammaloop-nextest-clinnet

Reproduce this run
Original Run
  1. 0.02 s $ /nix/store/61685rbaxmpigwi3z23i33sv3jyfl70q-coreutils-9.11/bin/timeout --kill-after=15s 7200s /nix/store/wknkybkzrc16r11vk5vrykh4wmw7a353-nix-2.34.8/bin/nix --extra-experimental-features nix-command --extra-experimental-features flakes flake clone git+https://github.com/alphal00p/gammaloop --dest /tmp/nix-ci-worker/stable-pwd/repo/
  2. 0.32 s Cloning into '/tmp/nix-ci-worker/stable-pwd/repo'...
  3. 1.33 s remote: Enumerating objects: 110731, done.
  4. 1.57 s remote: Counting objects: 0% (1/14562) remote: Counting objects: 1% (146/14562) remote: Counting objects: 2% (292/14562) remote: Counting objects: 3% (437/14562) remote: Counting objects: 4% (583/14562) remote: Counting objects: 5% (729/14562) remote: Counting objects: 6% (874/14562) remote: Counting objects: 7% (1020/14562) remote: Counting objects: 8% (1165/14562) remote: Counting objects: 9% (1311/14562) remote: Counting objects: 10% (1457/14562) remote: Counting objects: 11% (1602/14562) remote: Counting objects: 12% (1748/14562) remote: Counting objects: 13% (1894/14562) remote: Counting objects: 14% (2039/14562) remote: Counting objects: 15% (2185/14562) remote: Counting objects: 16% (2330/14562) remote: Counting objects: 17% (2476/14562) remote: Counting objects: 18% (2622/14562) remote: Counting objects: 19% (2767/14562) remote: Counting objects: 20% (2913/14562) remote: Counting objects: 21% (3059/14562) remote: Counting objects: 22% (3204/14562) remote: Counting objects: 23% (3350/14562) remote: Counting objects: 24% (3495/14562) remote: Counting objects: 25% (3641/14562) remote: Counting objects: 26% (3787/14562) remote: Counting objects: 27% (3932/14562) remote: Counting objects: 28% (4078/14562) remote: Counting objects: 29% (4223/14562) remote: Counting objects: 30% (4369/14562) remote: Counting objects: 31% (4515/14562) remote: Counting objects: 32% (4660/14562) remote: Counting objects: 33% (4806/14562) remote: Counting objects: 34% (4952/14562) remote: Counting objects: 35% (5097/14562) remote: Counting objects: 36% (5243/14562) remote: Counting objects: 37% (5388/14562) remote: Counting objects: 38% (5534/14562) remote: Counting objects: 39% (5680/14562) remote: Counting objects: 40% (5825/14562) remote: Counting objects: 41% (5971/14562) remote: Counting objects: 42% (6117/14562) remote: Counting objects: 43% (6262/14562) remote: Counting objects: 44% (6408/14562) remote: Counting objects: 45% (6553/14562) remote: Counting objects: 46% (6699/14562) remote: Counting objects: 47% (6845/14562) remote: Counting objects: 48% (6990/14562) remote: Counting objects: 49% (7136/14562) remote: Counting objects: 50% (7281/14562) remote: Counting objects: 51% (7427/14562) remote: Counting objects: 52% (7573/14562) remote: Counting objects: 53% (7718/14562) remote: Counting objects: 54% (7864/14562) remote: Counting objects: 55% (8010/14562) remote: Counting objects: 56% (8155/14562) remote: Counting objects: 57% (8301/14562) remote: Counting objects: 58% (8446/14562) remote: Counting objects: 59% (8592/14562) remote: Counting objects: 60% (8738/14562) remote: Counting objects: 61% (8883/14562) remote: Counting objects: 62% (9029/14562) remote: Counting objects: 63% (9175/14562) remote: Counting objects: 64% (9320/14562) remote: Counting objects: 65% (9466/14562) remote: Counting objects: 66% (9611/14562) remote: Counting objects: 67% (9757/14562) remote: Counting objects: 68% (9903/14562) remote: Counting objects: 69% (10048/14562) remote: Counting objects: 70% (10194/14562) remote: Counting objects: 71% (10340/14562) remote: Counting objects: 72% (10485/14562) remote: Counting objects: 73% (10631/14562) remote: Counting objects: 74% (10776/14562) remote: Counting objects: 75% (10922/14562) remote: Counting objects: 76% (11068/14562) remote: Counting objects: 77% (11213/14562) remote: Counting objects: 78% (11359/14562) remote: Counting objects: 79% (11504/14562) remote: Counting objects: 80% (11650/14562) remote: Counting objects: 81% (11796/14562) remote: Counting objects: 82% (11941/14562) remote: Counting objects: 83% (12087/14562) remote: Counting objects: 84% (12233/14562) remote: Counting objects: 85% (12378/14562) remote: Counting objects: 86% (12524/14562) remote: Counting objects: 87% (12669/14562) remote: Counting objects: 88% (12815/14562) remote: Counting objects: 89% (12961/14562) remote: Counting objects: 90% (13106/14562) remote: Counting objects: 91% (13252/14562) remote: Counting objects: 92% (13398/14562) remote: Counting objects: 93% (13543/14562) remote: Counting objects: 94% (13689/14562) remote: Counting objects: 95% (13834/14562) remote: Counting objects: 96% (13980/14562) remote: Counting objects: 97% (14126/14562) remote: Counting objects: 98% (14271/14562) remote: Counting objects: 99% (14417/14562) remote: Counting objects: 100% (14562/14562) remote: Counting objects: 100% (14562/14562), done.
  5. 6.56 s remote: Compressing objects: 0% (1/2921) remote: Compressing objects: 1% (30/2921) remote: Compressing objects: 2% (59/2921) remote: Compressing objects: 3% (88/2921) remote: Compressing objects: 4% (117/2921) remote: Compressing objects: 5% (147/2921) remote: Compressing objects: 6% (176/2921) remote: Compressing objects: 7% (205/2921) remote: Compressing objects: 8% (234/2921) remote: Compressing objects: 9% (263/2921) remote: Compressing objects: 10% (293/2921) remote: Compressing objects: 11% (322/2921) remote: Compressing objects: 11% (342/2921) remote: Compressing objects: 12% (351/2921) remote: Compressing objects: 12% (364/2921) remote: Compressing objects: 13% (380/2921) remote: Compressing objects: 14% (409/2921) remote: Compressing objects: 15% (439/2921) remote: Compressing objects: 15% (464/2921) remote: Compressing objects: 16% (468/2921) remote: Compressing objects: 17% (497/2921) remote: Compressing objects: 18% (526/2921) remote: Compressing objects: 19% (555/2921) remote: Compressing objects: 20% (585/2921) remote: Compressing objects: 20% (604/2921) remote: Compressing objects: 21% (614/2921) remote: Compressing objects: 22% (643/2921) remote: Compressing objects: 23% (672/2921) remote: Compressing objects: 24% (702/2921) remote: Compressing objects: 25% (731/2921) remote: Compressing objects: 26% (760/2921) remote: Compressing objects: 27% (789/2921) remote: Compressing objects: 28% (818/2921) remote: Compressing objects: 29% (848/2921) remote: Compressing objects: 30% (877/2921) remote: Compressing objects: 31% (906/2921) remote: Compressing objects: 32% (935/2921) remote: Compressing objects: 33% (964/2921) remote: Compressing objects: 33% (970/2921) remote: Compressing objects: 34% (994/2921) remote: Compressing objects: 35% (1023/2921) remote: Compressing objects: 36% (1052/2921) remote: Compressing objects: 37% (1081/2921) remote: Compressing objects: 38% (1110/2921) remote: Compressing objects: 39% (1140/2921) remote: Compressing objects: 40% (1169/2921) remote: Compressing objects: 41% (1198/2921) remote: Compressing objects: 42% (1227/2921) remote: Compressing objects: 43% (1257/2921) remote: Compressing objects: 44% (1286/2921) remote: Compressing objects: 45% (1315/2921) remote: Compressing objects: 46% (1344/2921) remote: Compressing objects: 47% (1373/2921) remote: Compressing objects: 48% (1403/2921) remote: Compressing objects: 49% (1432/2921) remote: Compressing objects: 50% (1461/2921) remote: Compressing objects: 51% (1490/2921) remote: Compressing objects: 52% (1519/2921) remote: Compressing objects: 53% (1549/2921) remote: Compressing objects: 54% (1578/2921) remote: Compressing objects: 55% (1607/2921) remote: Compressing objects: 56% (1636/2921) remote: Compressing objects: 57% (1665/2921) remote: Compressing objects: 58% (1695/2921) remote: Compressing objects: 59% (1724/2921) remote: Compressing objects: 60% (1753/2921) remote: Compressing objects: 61% (1782/2921) remote: Compressing objects: 62% (1812/2921) remote: Compressing objects: 63% (1841/2921) remote: Compressing objects: 64% (1870/2921) remote: Compressing objects: 65% (1899/2921) remote: Compressing objects: 66% (1928/2921) remote: Compressing objects: 67% (1958/2921) remote: Compressing objects: 68% (1987/2921) remote: Compressing objects: 69% (2016/2921) remote: Compressing objects: 70% (2045/2921) remote: Compressing objects: 71% (2074/2921) remote: Compressing objects: 72% (2104/2921) remote: Compressing objects: 73% (2133/2921) remote: Compressing objects: 74% (2162/2921) remote: Compressing objects: 75% (2191/2921) remote: Compressing objects: 76% (2220/2921) remote: Compressing objects: 77% (2250/2921) remote: Compressing objects: 78% (2279/2921) remote: Compressing objects: 79% (2308/2921) remote: Compressing objects: 80% (2337/2921) remote: Compressing objects: 81% (2367/2921) remote: Compressing objects: 82% (2396/2921) remote: Compressing objects: 83% (2425/2921) remote: Compressing objects: 84% (2454/2921) remote: Compressing objects: 85% (2483/2921) remote: Compressing objects: 86% (2513/2921) remote: Compressing objects: 87% (2542/2921) remote: Compressing objects: 88% (2571/2921) remote: Compressing objects: 89% (2600/2921) remote: Compressing objects: 90% (2629/2921) remote: Compressing objects: 91% (2659/2921) remote: Compressing objects: 92% (2688/2921) remote: Compressing objects: 93% (2717/2921) remote: Compressing objects: 94% (2746/2921) remote: Compressing objects: 95% (2775/2921) remote: Compressing objects: 96% (2805/2921) remote: Compressing objects: 97% (2834/2921) remote: Compressing objects: 98% (2863/2921) remote: Compressing objects: 99% (2892/2921) remote: Compressing objects: 100% (2921/2921) remote: Compressing objects: 100% (2921/2921), done.
  6. 17.76 s Receiving objects: 0% (1/110731) Receiving objects: 1% (1108/110731) Receiving objects: 2% (2215/110731) Receiving objects: 3% (3322/110731), 13.14 MiB | 24.68 MiB/s Receiving objects: 4% (4430/110731), 13.14 MiB | 24.68 MiB/s Receiving objects: 5% (5537/110731), 13.14 MiB | 24.68 MiB/s Receiving objects: 5% (5902/110731), 13.14 MiB | 24.68 MiB/s Receiving objects: 6% (6644/110731), 29.12 MiB | 28.10 MiB/s Receiving objects: 7% (7752/110731), 29.12 MiB | 28.10 MiB/s Receiving objects: 8% (8859/110731), 29.12 MiB | 28.10 MiB/s Receiving objects: 9% (9966/110731), 43.11 MiB | 28.06 MiB/s Receiving objects: 10% (11074/110731), 43.11 MiB | 28.06 MiB/s Receiving objects: 10% (11585/110731), 55.31 MiB | 27.16 MiB/s Receiving objects: 11% (12181/110731), 55.31 MiB | 27.16 MiB/s Receiving objects: 12% (13288/110731), 67.89 MiB | 26.77 MiB/s Receiving objects: 13% (14396/110731), 67.89 MiB | 26.77 MiB/s Receiving objects: 14% (15503/110731), 67.89 MiB | 26.77 MiB/s Receiving objects: 15% (16610/110731), 67.89 MiB | 26.77 MiB/s Receiving objects: 16% (17717/110731), 67.89 MiB | 26.77 MiB/s Receiving objects: 17% (18825/110731), 67.89 MiB | 26.77 MiB/s Receiving objects: 17% (19603/110731), 80.15 MiB | 26.40 MiB/s Receiving objects: 18% (19932/110731), 80.15 MiB | 26.40 MiB/s Receiving objects: 19% (21039/110731), 80.15 MiB | 26.40 MiB/s Receiving objects: 20% (22147/110731), 80.15 MiB | 26.40 MiB/s Receiving objects: 21% (23254/110731), 80.15 MiB | 26.40 MiB/s Receiving objects: 22% (24361/110731), 80.15 MiB | 26.40 MiB/s Receiving objects: 23% (25469/110731), 80.15 MiB | 26.40 MiB/s Receiving objects: 24% (26576/110731), 80.15 MiB | 26.40 MiB/s Receiving objects: 25% (27683/110731), 80.15 MiB | 26.40 MiB/s Receiving objects: 26% (28791/110731), 80.15 MiB | 26.40 MiB/s Receiving objects: 27% (29898/110731), 80.15 MiB | 26.40 MiB/s Receiving objects: 28% (31005/110731), 80.15 MiB | 26.40 MiB/s Receiving objects: 29% (32112/110731), 80.15 MiB | 26.40 MiB/s Receiving objects: 30% (33220/110731), 80.15 MiB | 26.40 MiB/s Receiving objects: 31% (34327/110731), 80.15 MiB | 26.40 MiB/s Receiving objects: 32% (35434/110731), 80.15 MiB | 26.40 MiB/s Receiving objects: 33% (36542/110731), 80.15 MiB | 26.40 MiB/s Receiving objects: 34% (37649/110731), 80.15 MiB | 26.40 MiB/s Receiving objects: 35% (38756/110731), 80.15 MiB | 26.40 MiB/s Receiving objects: 36% (39864/110731), 80.15 MiB | 26.40 MiB/s Receiving objects: 37% (40971/110731), 80.15 MiB | 26.40 MiB/s Receiving objects: 38% (42078/110731), 80.15 MiB | 26.40 MiB/s Receiving objects: 39% (43186/110731), 93.60 MiB | 26.47 MiB/s Receiving objects: 40% (44293/110731), 93.60 MiB | 26.47 MiB/s Receiving objects: 41% (45400/110731), 93.60 MiB | 26.47 MiB/s Receiving objects: 42% (46508/110731), 93.60 MiB | 26.47 MiB/s Receiving objects: 43% (47615/110731), 93.60 MiB | 26.47 MiB/s Receiving objects: 44% (48722/110731), 93.60 MiB | 26.47 MiB/s Receiving objects: 44% (48947/110731), 93.60 MiB | 26.47 MiB/s Receiving objects: 45% (49829/110731), 107.25 MiB | 26.57 MiB/s Receiving objects: 46% (50937/110731), 107.25 MiB | 26.57 MiB/s Receiving objects: 47% (52044/110731), 107.25 MiB | 26.57 MiB/s Receiving objects: 48% (53151/110731), 107.25 MiB | 26.57 MiB/s Receiving objects: 49% (54259/110731), 107.25 MiB | 26.57 MiB/s Receiving objects: 50% (55366/110731), 107.25 MiB | 26.57 MiB/s Receiving objects: 51% (56473/110731), 107.25 MiB | 26.57 MiB/s Receiving objects: 52% (57581/110731), 121.05 MiB | 26.68 MiB/s Receiving objects: 53% (58688/110731), 121.05 MiB | 26.68 MiB/s Receiving objects: 54% (59795/110731), 121.05 MiB | 26.68 MiB/s Receiving objects: 55% (60903/110731), 121.05 MiB | 26.68 MiB/s Receiving objects: 55% (61565/110731), 121.05 MiB | 26.68 MiB/s Receiving objects: 56% (62010/110731), 121.05 MiB | 26.68 MiB/s Receiving objects: 57% (63117/110731), 135.19 MiB | 27.10 MiB/s Receiving objects: 58% (64224/110731), 135.19 MiB | 27.10 MiB/s Receiving objects: 59% (65332/110731), 135.19 MiB | 27.10 MiB/s Receiving objects: 60% (66439/110731), 135.19 MiB | 27.10 MiB/s Receiving objects: 61% (67546/110731), 135.19 MiB | 27.10 MiB/s Receiving objects: 61% (68175/110731), 149.39 MiB | 26.73 MiB/s Receiving objects: 62% (68654/110731), 163.76 MiB | 26.81 MiB/s Receiving objects: 63% (69761/110731), 163.76 MiB | 26.81 MiB/s Receiving objects: 64% (70868/110731), 163.76 MiB | 26.81 MiB/s Receiving objects: 65% (71976/110731), 163.76 MiB | 26.81 MiB/s Receiving objects: 66% (73083/110731), 163.76 MiB | 26.81 MiB/s Receiving objects: 67% (74190/110731), 163.76 MiB | 26.81 MiB/s Receiving objects: 68% (75298/110731), 178.50 MiB | 27.38 MiB/s Receiving objects: 69% (76405/110731), 178.50 MiB | 27.38 MiB/s Receiving objects: 70% (77512/110731), 178.50 MiB | 27.38 MiB/s Receiving objects: 71% (78620/110731), 178.50 MiB | 27.38 MiB/s Receiving objects: 72% (79727/110731), 178.50 MiB | 27.38 MiB/s Receiving objects: 73% (80834/110731), 178.50 MiB | 27.38 MiB/s Receiving objects: 74% (81941/110731), 178.50 MiB | 27.38 MiB/s Receiving objects: 75% (83049/110731), 178.50 MiB | 27.38 MiB/s Receiving objects: 75% (83860/110731), 193.57 MiB | 27.92 MiB/s Receiving objects: 76% (84156/110731), 193.57 MiB | 27.92 MiB/s Receiving objects: 77% (85263/110731), 193.57 MiB | 27.92 MiB/s Receiving objects: 78% (86371/110731), 193.57 MiB | 27.92 MiB/s Receiving objects: 79% (87478/110731), 193.57 MiB | 27.92 MiB/s Receiving objects: 80% (88585/110731), 193.57 MiB | 27.92 MiB/s Receiving objects: 81% (89693/110731), 193.57 MiB | 27.92 MiB/s Receiving objects: 81% (89701/110731), 224.54 MiB | 29.09 MiB/s Receiving objects: 81% (90676/110731), 240.61 MiB | 29.62 MiB/s Receiving objects: 82% (90800/110731), 256.77 MiB | 30.15 MiB/s Receiving objects: 83% (91907/110731), 256.77 MiB | 30.15 MiB/s Receiving objects: 84% (93015/110731), 256.77 MiB | 30.15 MiB/s Receiving objects: 85% (94122/110731), 273.34 MiB | 30.69 MiB/s Receiving objects: 85% (95145/110731), 290.18 MiB | 31.27 MiB/s Receiving objects: 86% (95229/110731), 290.18 MiB | 31.27 MiB/s Receiving objects: 87% (96336/110731), 290.18 MiB | 31.27 MiB/s Receiving objects: 88% (97444/110731), 290.18 MiB | 31.27 MiB/s Receiving objects: 89% (98551/110731), 290.18 MiB | 31.27 MiB/s Receiving objects: 90% (99658/110731), 290.18 MiB | 31.27 MiB/s Receiving objects: 91% (100766/110731), 290.18 MiB | 31.27 MiB/s Receiving objects: 92% (101873/110731), 290.18 MiB | 31.27 MiB/s Receiving objects: 93% (102980/110731), 290.18 MiB | 31.27 MiB/s Receiving objects: 94% (104088/110731), 290.18 MiB | 31.27 MiB/s Receiving objects: 95% (105195/110731), 290.18 MiB | 31.27 MiB/s Receiving objects: 96% (106302/110731), 290.18 MiB | 31.27 MiB/s Receiving objects: 97% (107410/110731), 290.18 MiB | 31.27 MiB/s Receiving objects: 98% (108517/110731), 305.71 MiB | 31.53 MiB/s Receiving objects: 98% (109398/110731), 305.71 MiB | 31.53 MiB/s Receiving objects: 99% (109624/110731), 321.39 MiB | 31.66 MiB/s remote: Total 110731 (delta 12254), reused 11928 (delta 11241), pack-reused 96169 (from 2)
  7. 17.76 s Receiving objects: 100% (110731/110731), 321.39 MiB | 31.66 MiB/s Receiving objects: 100% (110731/110731), 324.99 MiB | 29.08 MiB/s, done.
  8. 20.97 s Resolving deltas: 0% (0/72611) Resolving deltas: 1% (727/72611) Resolving deltas: 2% (1454/72611) Resolving deltas: 3% (2179/72611) Resolving deltas: 4% (2905/72611) Resolving deltas: 5% (3631/72611) Resolving deltas: 6% (4357/72611) Resolving deltas: 7% (5083/72611) Resolving deltas: 8% (5809/72611) Resolving deltas: 9% (6535/72611) Resolving deltas: 10% (7263/72611) Resolving deltas: 11% (7988/72611) Resolving deltas: 12% (8714/72611) Resolving deltas: 13% (9440/72611) Resolving deltas: 14% (10166/72611) Resolving deltas: 15% (10892/72611) Resolving deltas: 16% (11618/72611) Resolving deltas: 17% (12344/72611) Resolving deltas: 18% (13070/72611) Resolving deltas: 19% (13797/72611) Resolving deltas: 20% (14524/72611) Resolving deltas: 21% (15249/72611) Resolving deltas: 22% (15975/72611) Resolving deltas: 23% (16701/72611) Resolving deltas: 24% (17427/72611) Resolving deltas: 25% (18153/72611) Resolving deltas: 26% (18879/72611) Resolving deltas: 26% (19165/72611) Resolving deltas: 27% (19605/72611) Resolving deltas: 28% (20332/72611) Resolving deltas: 29% (21058/72611) Resolving deltas: 30% (21784/72611) Resolving deltas: 31% (22510/72611) Resolving deltas: 32% (23236/72611) Resolving deltas: 33% (23962/72611) Resolving deltas: 34% (24690/72611) Resolving deltas: 35% (25415/72611) Resolving deltas: 36% (26140/72611) Resolving deltas: 37% (26867/72611) Resolving deltas: 38% (27593/72611) Resolving deltas: 39% (28319/72611) Resolving deltas: 40% (29045/72611) Resolving deltas: 41% (29771/72611) Resolving deltas: 42% (30497/72611) Resolving deltas: 43% (31223/72611) Resolving deltas: 44% (31949/72611) Resolving deltas: 45% (32675/72611) Resolving deltas: 46% (33402/72611) Resolving deltas: 47% (34128/72611) Resolving deltas: 48% (34854/72611) Resolving deltas: 49% (35581/72611) Resolving deltas: 50% (36306/72611) Resolving deltas: 51% (37032/72611) Resolving deltas: 52% (37758/72611) Resolving deltas: 53% (38484/72611) Resolving deltas: 54% (39210/72611) Resolving deltas: 55% (39937/72611) Resolving deltas: 55% (40040/72611) Resolving deltas: 56% (40663/72611) Resolving deltas: 57% (41389/72611) Resolving deltas: 58% (42115/72611) Resolving deltas: 59% (42841/72611) Resolving deltas: 60% (43567/72611) Resolving deltas: 61% (44293/72611) Resolving deltas: 62% (45019/72611) Resolving deltas: 63% (45745/72611) Resolving deltas: 64% (46472/72611) Resolving deltas: 65% (47199/72611) Resolving deltas: 66% (47924/72611) Resolving deltas: 67% (48650/72611) Resolving deltas: 68% (49376/72611) Resolving deltas: 69% (50102/72611) Resolving deltas: 70% (50828/72611) Resolving deltas: 71% (51554/72611) Resolving deltas: 72% (52280/72611) Resolving deltas: 73% (53007/72611) Resolving deltas: 74% (53733/72611) Resolving deltas: 75% (54459/72611) Resolving deltas: 76% (55185/72611) Resolving deltas: 77% (55911/72611) Resolving deltas: 78% (56637/72611) Resolving deltas: 79% (57363/72611) Resolving deltas: 80% (58091/72611) Resolving deltas: 81% (58815/72611) Resolving deltas: 82% (59542/72611) Resolving deltas: 83% (60268/72611) Resolving deltas: 84% (60994/72611) Resolving deltas: 85% (61720/72611) Resolving deltas: 86% (62446/72611) Resolving deltas: 87% (63172/72611) Resolving deltas: 88% (63898/72611) Resolving deltas: 89% (64624/72611) Resolving deltas: 90% (65350/72611) Resolving deltas: 91% (66077/72611) Resolving deltas: 92% (66803/72611) Resolving deltas: 93% (67529/72611) Resolving deltas: 94% (68255/72611) Resolving deltas: 95% (68981/72611) Resolving deltas: 95% (69574/72611) Resolving deltas: 96% (69707/72611) Resolving deltas: 97% (70433/72611) Resolving deltas: 98% (71159/72611) Resolving deltas: 99% (71885/72611) Resolving deltas: 100% (72611/72611) Resolving deltas: 100% (72611/72611), done.
  9. 21.72 s Fetching commit 07b1d150507fa30cd2cd44f18a21e3387ba5063b for linnest-endpoints-momentum-layouts ...
  10. 21.72 s $ /nix/store/5vpcfsdx1lcnlb2y4k7xyc74shp5qwbh-git-2.54.0/bin/git fetch origin 07b1d150507fa30cd2cd44f18a21e3387ba5063b
  11. 22.39 s From https://github.com/alphal00p/gammaloop
  12. 22.39 s * branch 07b1d150507fa30cd2cd44f18a21e3387ba5063b -> FETCH_HEAD
  13. 22.47 s $ /nix/store/61685rbaxmpigwi3z23i33sv3jyfl70q-coreutils-9.11/bin/timeout --kill-after=15s 7200s /nix/store/5vpcfsdx1lcnlb2y4k7xyc74shp5qwbh-git-2.54.0/bin/git -c advice.detachedHead=false checkout 07b1d150507fa30cd2cd44f18a21e3387ba5063b
  14. 22.86 s HEAD is now at 07b1d1505 extend linnest edge endpoints, momentum display, and partial layouts
  15. 22.87 s $ /nix/store/61685rbaxmpigwi3z23i33sv3jyfl70q-coreutils-9.11/bin/timeout --kill-after=15s 7200s /nix/store/wknkybkzrc16r11vk5vrykh4wmw7a353-nix-2.34.8/bin/nix --extra-experimental-features nix-command --extra-experimental-features flakes --log-format internal-json run .#packages.x86_64-linux.nix-ci-check-gammaloop-nextest-clinnet --print-build-logs
  16. 23.28 s warning: ignoring untrusted flake configuration setting 'extra-substituters'.
  17. 23.28 s Pass '--accept-flake-config' to trust it
  18. 23.28 s warning: ignoring untrusted flake configuration setting 'extra-trusted-public-keys'.
  19. 23.28 s Pass '--accept-flake-config' to trust it
  20. 23.29 s
  21. 23.66 s evaluating derivation 'gdo you want to allow configuration setting 'extra-substituters' to be set to 'https://cache.nix-ci.com' (y/N)? do you want to permanently mark this value as untrusted (y/N)? warning: ignoring untrusted flake configuration setting 'extra-substituters'.
  22. 23.66 s Pass '--accept-flake-config' to trust it
  23. 23.66 s do you want to allow configuration setting 'extra-trusted-public-keys' to be set to 'nix-ci:g3xV5BDTLtIBZr/A00IU1x0EtKKlb7YLgBN2SgYgM6A=' (y/N)? do you want to permanently mark this value as untrusted (y/N)? warning: ignoring untrusted flake configuration setting 'extra-trusted-public-keys'.
  24. 23.66 s Pass '--accept-flake-config' to trust it
  25. 29.44 s [0/1 built] [1/0/1 built] building ggammaloop-nextest-clinnet> Extracting 4 binaries (including 1 non-test binary) and 1 linked path to /build/source
  26. 29.50 s gammaloop-nextest-clinnet> Extracted 15 files to /build/source in 0.07s
  27. 29.54 s gammaloop-nextest-clinnet> ------------
  28. 29.54 s gammaloop-nextest-clinnet> Nextest run ID f79947f6-492d-4209-9843-f0dbb3fd0d3e with nextest profile: ci_gammaloop
  29. 29.54 s gammaloop-nextest-clinnet> Starting 36 tests across 3 binaries
  30. 32.68 s gammaloop-nextest-clinnet> FAIL [ 3.133s] (22/36) clinnet tests::default_template_renders_generic_config_and_static_subgraphs_with_typst
  31. 32.68 s gammaloop-nextest-clinnet> stdout ---
  32. 32.68 s gammaloop-nextest-clinnet>
  33. 32.68 s gammaloop-nextest-clinnet> running 1 test
  34. 32.68 s gammaloop-nextest-clinnet> test tests::default_template_renders_generic_config_and_static_subgraphs_with_typst ... FAILED
  35. 32.68 s gammaloop-nextest-clinnet>
  36. 32.68 s gammaloop-nextest-clinnet> failures:
  37. 32.68 s gammaloop-nextest-clinnet>
  38. 32.68 s gammaloop-nextest-clinnet> failures:
  39. 32.68 s gammaloop-nextest-clinnet> tests::default_template_renders_generic_config_and_static_subgraphs_with_typst
  40. 32.68 s gammaloop-nextest-clinnet>
  41. 32.68 s gammaloop-nextest-clinnet> test result: FAILED. 0 passed; 1 failed; 0 ignored; 0 measured; 13 filtered out; finished in 3.12s
  42. 32.68 s gammaloop-nextest-clinnet>
  43. 32.68 s gammaloop-nextest-clinnet> stderr ---
  44. 32.68 s gammaloop-nextest-clinnet>
  45. 32.68 s gammaloop-nextest-clinnet> thread 'tests::default_template_renders_generic_config_and_static_subgraphs_with_typst' (183) panicked at crates/clinnet/src/lib.rs:1307:14:
  46. 32.68 s gammaloop-nextest-clinnet> called `Result::unwrap()` on an `Err` value: typst failed while compiling template /build/clinnet-real-typst-168-0/gamma-style-assertions.pdf
  47. 32.68 s gammaloop-nextest-clinnet>
  48. 32.68 s gammaloop-nextest-clinnet> Command executed:
  49. 32.68 s gammaloop-nextest-clinnet> "typst" "c" "/build/source/crates/clinnet/tests/resources/gamma-style-behavior.typ" "/build/clinnet-real-typst-168-0/gamma-style-assertions.pdf" "--root" "/build/source"
  50. 32.68 s gammaloop-nextest-clinnet>
  51. 32.68 s gammaloop-nextest-clinnet> File not found - check that all paths are correct and files exist
  52. 32.68 s gammaloop-nextest-clinnet>
  53. 32.68 s gammaloop-nextest-clinnet> Typst stdout:
  54. 32.68 s gammaloop-nextest-clinnet>
  55. 32.68 s gammaloop-nextest-clinnet>
  56. 32.68 s gammaloop-nextest-clinnet> Typst stderr:
  57. 32.68 s gammaloop-nextest-clinnet> error: file not found (searched at /build/source/docs/assets/typst/theme.typ)
  58. 32.68 s gammaloop-nextest-clinnet> ┌─ ../../docs/assets/typst/portal-graphs/edge-style.typ:5:8
  59. 32.68 s gammaloop-nextest-clinnet> │
  60. 32.68 s gammaloop-nextest-clinnet> 5 │ #import "../theme.typ": palette
  61. 32.68 s gammaloop-nextest-clinnet> │ ^^^^^^^^^^^^^^
  62. 32.68 s gammaloop-nextest-clinnet>
  63. 32.68 s gammaloop-nextest-clinnet> while importing `../../../../docs/assets/typst/portal-graphs/edge-style.typ` at tests/resources/gamma-style-behavior.typ:7:1
  64. 32.68 s gammaloop-nextest-clinnet> import "../../../../docs/assets/typst/portal-graphs/edge-style.typ" as model-style
  65. 32.68 s gammaloop-nextest-clinnet>
  66. 32.68 s gammaloop-nextest-clinnet> Location:
  67. 32.68 s gammaloop-nextest-clinnet> crates/clinnet/src/lib.rs:770:13
  68. 32.68 s gammaloop-nextest-clinnet> stack backtrace:
  69. 32.68 s gammaloop-nextest-clinnet> 0: __rustc::rust_begin_unwind
  70. 32.68 s gammaloop-nextest-clinnet> 1: core::panicking::panic_fmt
  71. 32.68 s gammaloop-nextest-clinnet> 2: core::result::unwrap_failed
  72. 32.68 s gammaloop-nextest-clinnet> 3: clinnet::tests::default_template_renders_generic_config_and_static_subgraphs_with_typst
  73. 32.68 s gammaloop-nextest-clinnet> 4: <clinnet::tests::default_template_renders_generic_config_and_static_subgraphs_with_typst::{closure#0} as core::ops::function::FnOnce<()>>::call_once
  74. 32.68 s gammaloop-nextest-clinnet> note: Some details are omitted, run with `RUST_BACKTRACE=full` for a verbose backtrace.
  75. 32.68 s gammaloop-nextest-clinnet>
  76. 72.34 s gammaloop-nextest-clinnet> ------------
  77. 72.34 s gammaloop-nextest-clinnet> Summary [ 42.802s] 36 tests run: 35 passed, 1 failed, 0 skipped
  78. 72.34 s gammaloop-nextest-clinnet> FAIL [ 3.133s] (22/36) clinnet tests::default_template_renders_generic_config_and_static_subgraphs_with_typst
  79. 72.34 s gammaloop-nextest-clinnet> stdout ---
  80. 72.34 s gammaloop-nextest-clinnet>
  81. 72.34 s gammaloop-nextest-clinnet> running 1 test
  82. 72.34 s gammaloop-nextest-clinnet> test tests::default_template_renders_generic_config_and_static_subgraphs_with_typst ... FAILED
  83. 72.34 s gammaloop-nextest-clinnet>
  84. 72.34 s gammaloop-nextest-clinnet> failures:
  85. 72.34 s gammaloop-nextest-clinnet>
  86. 72.34 s gammaloop-nextest-clinnet> failures:
  87. 72.34 s gammaloop-nextest-clinnet> tests::default_template_renders_generic_config_and_static_subgraphs_with_typst
  88. 72.34 s gammaloop-nextest-clinnet>
  89. 72.34 s gammaloop-nextest-clinnet> test result: FAILED. 0 passed; 1 failed; 0 ignored; 0 measured; 13 filtered out; finished in 3.12s
  90. 72.34 s gammaloop-nextest-clinnet>
  91. 72.34 s gammaloop-nextest-clinnet> stderr ---
  92. 72.34 s gammaloop-nextest-clinnet>
  93. 72.34 s gammaloop-nextest-clinnet> thread 'tests::default_template_renders_generic_config_and_static_subgraphs_with_typst' (183) panicked at crates/clinnet/src/lib.rs:1307:14:
  94. 72.34 s gammaloop-nextest-clinnet> called `Result::unwrap()` on an `Err` value: typst failed while compiling template /build/clinnet-real-typst-168-0/gamma-style-assertions.pdf
  95. 72.34 s gammaloop-nextest-clinnet>
  96. 72.34 s gammaloop-nextest-clinnet> Command executed:
  97. 72.34 s gammaloop-nextest-clinnet> "typst" "c" "/build/source/crates/clinnet/tests/resources/gamma-style-behavior.typ" "/build/clinnet-real-typst-168-0/gamma-style-assertions.pdf" "--root" "/build/source"
  98. 72.34 s gammaloop-nextest-clinnet>
  99. 72.34 s gammaloop-nextest-clinnet> File not found - check that all paths are correct and files exist
  100. 72.34 s gammaloop-nextest-clinnet>
  101. 72.34 s gammaloop-nextest-clinnet> Typst stdout:
  102. 72.34 s gammaloop-nextest-clinnet>
  103. 72.34 s gammaloop-nextest-clinnet>
  104. 72.34 s gammaloop-nextest-clinnet> Typst stderr:
  105. 72.34 s gammaloop-nextest-clinnet> error: file not found (searched at /build/source/docs/assets/typst/theme.typ)
  106. 72.34 s gammaloop-nextest-clinnet> ┌─ ../../docs/assets/typst/portal-graphs/edge-style.typ:5:8
  107. 72.34 s gammaloop-nextest-clinnet> │
  108. 72.34 s gammaloop-nextest-clinnet> 5 │ #import "../theme.typ": palette
  109. 72.34 s gammaloop-nextest-clinnet> │ ^^^^^^^^^^^^^^
  110. 72.34 s gammaloop-nextest-clinnet>
  111. 72.34 s gammaloop-nextest-clinnet> while importing `../../../../docs/assets/typst/portal-graphs/edge-style.typ` at tests/resources/gamma-style-behavior.typ:7:1
  112. 72.34 s gammaloop-nextest-clinnet> import "../../../../docs/assets/typst/portal-graphs/edge-style.typ" as model-style
  113. 72.34 s gammaloop-nextest-clinnet>
  114. 72.34 s gammaloop-nextest-clinnet> Location:
  115. 72.34 s gammaloop-nextest-clinnet> crates/clinnet/src/lib.rs:770:13
  116. 72.34 s gammaloop-nextest-clinnet> stack backtrace:
  117. 72.34 s gammaloop-nextest-clinnet> 0: __rustc::rust_begin_unwind
  118. 72.34 s gammaloop-nextest-clinnet> 1: core::panicking::panic_fmt
  119. 72.34 s gammaloop-nextest-clinnet> 2: core::result::unwrap_failed
  120. 72.34 s gammaloop-nextest-clinnet> 3: clinnet::tests::default_template_renders_generic_config_and_static_subgraphs_with_typst
  121. 72.34 s gammaloop-nextest-clinnet> 4: <clinnet::tests::default_template_renders_generic_config_and_static_subgraphs_with_typst::{closure#0} as core::ops::function::FnOnce<()>>::call_once
  122. 72.34 s gammaloop-nextest-clinnet> note: Some details are omitted, run with `RUST_BACKTRACE=full` for a verbose backtrace.
  123. 72.34 s gammaloop-nextest-clinnet>
  124. 72.35 s gammaloop-nextest-clinnet> error: test run failed
  125. 72.37 s gammaloop-nextest-clinnet>
  126. 72.37 s gammaloop-nextest-clinnet> ========== nextest test summary ==========
  127. 72.37 s gammaloop-nextest-clinnet> report: target/nextest/ci_gammaloop/junit.xml
  128. 72.37 s gammaloop-nextest-clinnet> tests: 36, failures: 1, errors: 0
  129. 72.37 s gammaloop-nextest-clinnet>
  130. 72.37 s gammaloop-nextest-clinnet> 1. clinnet::tests::default_template_renders_generic_config_and_static_subgraphs_with_typst
  131. 72.37 s gammaloop-nextest-clinnet> failure: test failure with exit code 101
  132. 72.37 s gammaloop-nextest-clinnet> thread 'tests::default_template_renders_generic_config_and_static_subgraphs_with_typst' (183) panicked at crates/clinnet/src/lib.rs:1307:14:
  133. 72.37 s gammaloop-nextest-clinnet> called `Result::unwrap()` on an `Err` value: typst failed while compiling template /build/clinnet-real-typst-168-0/gamma-style-assertions.pdf
  134. 72.37 s gammaloop-nextest-clinnet>
  135. 72.37 s gammaloop-nextest-clinnet> Command executed:
  136. 72.37 s gammaloop-nextest-clinnet> "typst" "c" "/build/source/crates/clinnet/tests/resources/gamma-style-behavior.typ" "/build/clinnet-real-typst-168-0/gamma-style-assertions.pdf" "--root" "/build/source"
  137. 72.37 s gammaloop-nextest-clinnet>
  138. 72.37 s gammaloop-nextest-clinnet> File not found - check that all paths are correct and files exist
  139. 72.37 s gammaloop-nextest-clinnet>
  140. 72.37 s gammaloop-nextest-clinnet> Typst stdout:
  141. 72.37 s gammaloop-nextest-clinnet>
  142. 72.37 s gammaloop-nextest-clinnet>
  143. 72.37 s gammaloop-nextest-clinnet> Typst stderr:
  144. 72.37 s gammaloop-nextest-clinnet> error: file not found (searched at /build/source/docs/assets/typst/theme.typ)
  145. 72.37 s gammaloop-nextest-clinnet> ┌─ ../../docs/assets/typst/portal-graphs/edge-style.typ:5:8
  146. 72.37 s gammaloop-nextest-clinnet> │
  147. 72.37 s gammaloop-nextest-clinnet> 5 │ #import "../theme.typ": palette
  148. 72.37 s gammaloop-nextest-clinnet> │ ^^^^^^^^^^^^^^
  149. 72.37 s gammaloop-nextest-clinnet>
  150. 72.37 s gammaloop-nextest-clinnet> while importing `../../../../docs/assets/typst/portal-graphs/edge-style.typ` at tests/resources/gamma-style-behavior.typ:7:1
  151. 72.37 s gammaloop-nextest-clinnet> import "../../../../docs/assets/typst/portal-graphs/edge-style.typ" as model-style
  152. 72.37 s gammaloop-nextest-clinnet>
  153. 72.37 s gammaloop-nextest-clinnet> Location:
  154. 72.37 s gammaloop-nextest-clinnet> crates/clinnet/src/lib.rs:770:13
  155. 72.37 s gammaloop-nextest-clinnet> stack backtrace:
  156. 72.37 s gammaloop-nextest-clinnet> 0: __rustc::rust_begin_unwind
  157. 72.37 s gammaloop-nextest-clinnet> 1: core::panicking::panic_fmt
  158. 72.37 s gammaloop-nextest-clinnet> 2: core::result::unwrap_failed
  159. 72.37 s gammaloop-nextest-clinnet> 3: clinnet::tests::default_template_renders_generic_config_and_static_subgraphs_with_typst
  160. 72.37 s gammaloop-nextest-clinnet> 4: <clinnet::tests::default_template_renders_generic_config_and_static_subgraphs_with_typst::{closure#0} as core::ops::function::FnOnce<()>>::call_once
  161. 72.37 s gammaloop-nextest-clinnet> note: Some details are omitted, run with `RUST_BACKTRACE=full` for a verbose backtrace.
  162. 72.37 s gammaloop-nextest-clinnet> system-out
  163. 72.37 s gammaloop-nextest-clinnet> running 1 test
  164. 72.37 s gammaloop-nextest-clinnet> test tests::default_template_renders_generic_config_and_static_subgraphs_with_typst ... FAILED
  165. 72.37 s gammaloop-nextest-clinnet>
  166. 72.37 s gammaloop-nextest-clinnet> failures:
  167. 72.37 s gammaloop-nextest-clinnet>
  168. 72.37 s gammaloop-nextest-clinnet> failures:
  169. 72.37 s gammaloop-nextest-clinnet> tests::default_template_renders_generic_config_and_static_subgraphs_with_typst
  170. 72.37 s gammaloop-nextest-clinnet>
  171. 72.37 s gammaloop-nextest-clinnet> test result: FAILED. 0 passed; 1 failed; 0 ignored; 0 measured; 13 filtered out; finished in 3.12s
  172. 72.37 s gammaloop-nextest-clinnet> system-err
  173. 72.37 s gammaloop-nextest-clinnet> thread 'tests::default_template_renders_generic_config_and_static_subgraphs_with_typst' (183) panicked at crates/clinnet/src/lib.rs:1307:14:
  174. 72.37 s gammaloop-nextest-clinnet> called `Result::unwrap()` on an `Err` value: typst failed while compiling template /build/clinnet-real-typst-168-0/gamma-style-assertions.pdf
  175. 72.37 s gammaloop-nextest-clinnet>
  176. 72.37 s gammaloop-nextest-clinnet> Command executed:
  177. 72.37 s gammaloop-nextest-clinnet> "typst" "c" "/build/source/crates/clinnet/tests/resources/gamma-style-behavior.typ" "/build/clinnet-real-typst-168-0/gamma-style-assertions.pdf" "--root" "/build/source"
  178. 72.37 s gammaloop-nextest-clinnet>
  179. 72.37 s gammaloop-nextest-clinnet> File not found - check that all paths are correct and files exist
  180. 72.37 s gammaloop-nextest-clinnet>
  181. 72.37 s gammaloop-nextest-clinnet> Typst stdout:
  182. 72.37 s gammaloop-nextest-clinnet>
  183. 72.37 s gammaloop-nextest-clinnet>
  184. 72.37 s gammaloop-nextest-clinnet> Typst stderr:
  185. 72.37 s gammaloop-nextest-clinnet> error: file not found (searched at /build/source/docs/assets/typst/theme.typ)
  186. 72.37 s gammaloop-nextest-clinnet> ┌─ ../../docs/assets/typst/portal-graphs/edge-style.typ:5:8
  187. 72.37 s gammaloop-nextest-clinnet> │
  188. 72.37 s gammaloop-nextest-clinnet> 5 │ #import "../theme.typ": palette
  189. 72.37 s gammaloop-nextest-clinnet> │ ^^^^^^^^^^^^^^
  190. 72.37 s gammaloop-nextest-clinnet>
  191. 72.37 s gammaloop-nextest-clinnet> while importing `../../../../docs/assets/typst/portal-graphs/edge-style.typ` at tests/resources/gamma-style-behavior.typ:7:1
  192. 72.37 s gammaloop-nextest-clinnet> import "../../../../docs/assets/typst/portal-graphs/edge-style.typ" as model-style
  193. 72.37 s gammaloop-nextest-clinnet>
  194. 72.37 s gammaloop-nextest-clinnet> Location:
  195. 72.37 s gammaloop-nextest-clinnet> crates/clinnet/src/lib.rs:770:13
  196. 72.37 s gammaloop-nextest-clinnet> stack backtrace:
  197. 72.37 s gammaloop-nextest-clinnet> 0: __rustc::rust_begin_unwind
  198. 72.37 s gammaloop-nextest-clinnet> 1: core::panicking::panic_fmt
  199. 72.37 s gammaloop-nextest-clinnet> 2: core::result::unwrap_failed
  200. 72.37 s gammaloop-nextest-clinnet> 3: clinnet::tests::default_template_renders_generic_config_and_static_subgraphs_with_typst
  201. 72.37 s gammaloop-nextest-clinnet> 4: <clinnet::tests::default_template_renders_generic_config_and_static_subgraphs_with_typst::{closure#0} as core::ops::function::FnOnce<()>>::call_once
  202. 72.37 s gammaloop-nextest-clinnet> note: Some details are omitted, run with `RUST_BACKTRACE=full` for a verbose backtrace.
  203. 72.37 s gammaloop-nextest-clinnet> =========================================
  204. 72.41 s error: Cannot build '/nix/store/h7wfxf9is8d9pfbnnbafzbqf2ky01xla-gammaloop-nextest-clinnet.drv'.
  205. 72.41 s Reason: builder failed with exit code 100.
  206. 72.41 s Output paths:
  207. 72.41 s /nix/store/457wcp0rzgz0k62034js40b1iqyxmyf5-gammaloop-nextest-clinnet
  208. 72.41 s Last 179 log lines:
  209. 72.41 s > Extracting 4 binaries (including 1 non-test binary) and 1 linked path to /build/source
  210. 72.41 s > Extracted 15 files to /build/source in 0.07s
  211. 72.41 s > ------------
  212. 72.41 s > Nextest run ID f79947f6-492d-4209-9843-f0dbb3fd0d3e with nextest profile: ci_gammaloop
  213. 72.41 s > Starting 36 tests across 3 binaries
  214. 72.41 s > FAIL [ 3.133s] (22/36) clinnet tests::default_template_renders_generic_config_and_static_subgraphs_with_typst
  215. 72.41 s > stdout ---
  216. 72.41 s >
  217. 72.41 s > running 1 test
  218. 72.41 s > test tests::default_template_renders_generic_config_and_static_subgraphs_with_typst ... FAILED
  219. 72.41 s >
  220. 72.41 s > failures:
  221. 72.41 s >
  222. 72.41 s > failures:
  223. 72.41 s > tests::default_template_renders_generic_config_and_static_subgraphs_with_typst
  224. 72.41 s >
  225. 72.41 s > test result: FAILED. 0 passed; 1 failed; 0 ignored; 0 measured; 13 filtered out; finished in 3.12s
  226. 72.41 s >
  227. 72.41 s > stderr ---
  228. 72.41 s >
  229. 72.41 s > thread 'tests::default_template_renders_generic_config_and_static_subgraphs_with_typst' (183) panicked at crates/clinnet/src/lib.rs:1307:14:
  230. 72.41 s > called `Result::unwrap()` on an `Err` value: typst failed while compiling template /build/clinnet-real-typst-168-0/gamma-style-assertions.pdf
  231. 72.41 s >
  232. 72.41 s > Command executed:
  233. 72.41 s > "typst" "c" "/build/source/crates/clinnet/tests/resources/gamma-style-behavior.typ" "/build/clinnet-real-typst-168-0/gamma-style-assertions.pdf" "--root" "/build/source"
  234. 72.41 s >
  235. 72.41 s > File not found - check that all paths are correct and files exist
  236. 72.41 s >
  237. 72.41 s > Typst stdout:
  238. 72.41 s >
  239. 72.41 s >
  240. 72.41 s > Typst stderr:
  241. 72.41 s > error: file not found (searched at /build/source/docs/assets/typst/theme.typ)
  242. 72.41 s > ┌─ ../../docs/assets/typst/portal-graphs/edge-style.typ:5:8
  243. 72.41 s > │
  244. 72.41 s > 5 │ #import "../theme.typ": palette
  245. 72.41 s > │ ^^^^^^^^^^^^^^
  246. 72.41 s >
  247. 72.41 s > while importing `../../../../docs/assets/typst/portal-graphs/edge-style.typ` at tests/resources/gamma-style-behavior.typ:7:1
  248. 72.41 s > import "../../../../docs/assets/typst/portal-graphs/edge-style.typ" as model-style
  249. 72.41 s >
  250. 72.41 s > Location:
  251. 72.41 s > crates/clinnet/src/lib.rs:770:13
  252. 72.41 s > stack backtrace:
  253. 72.41 s > 0: __rustc::rust_begin_unwind
  254. 72.41 s > 1: core::panicking::panic_fmt
  255. 72.41 s > 2: core::result::unwrap_failed
  256. 72.41 s > 3: clinnet::tests::default_template_renders_generic_config_and_static_subgraphs_with_typst
  257. 72.41 s > 4: <clinnet::tests::default_template_renders_generic_config_and_static_subgraphs_with_typst::{closure#0} as core::ops::function::FnOnce<()>>::call_once
  258. 72.41 s > note: Some details are omitted, run with `RUST_BACKTRACE=full` for a verbose backtrace.
  259. 72.41 s >
  260. 72.41 s > ------------
  261. 72.41 s > Summary [ 42.802s] 36 tests run: 35 passed, 1 failed, 0 skipped
  262. 72.41 s > FAIL [ 3.133s] (22/36) clinnet tests::default_template_renders_generic_config_and_static_subgraphs_with_typst
  263. 72.41 s > stdout ---
  264. 72.41 s >
  265. 72.41 s > running 1 test
  266. 72.41 s > test tests::default_template_renders_generic_config_and_static_subgraphs_with_typst ... FAILED
  267. 72.41 s >
  268. 72.41 s > failures:
  269. 72.41 s >
  270. 72.41 s > failures:
  271. 72.41 s > tests::default_template_renders_generic_config_and_static_subgraphs_with_typst
  272. 72.41 s >
  273. 72.41 s > test result: FAILED. 0 passed; 1 failed; 0 ignored; 0 measured; 13 filtered out; finished in 3.12s
  274. 72.41 s >
  275. 72.41 s > stderr ---
  276. 72.41 s >
  277. 72.41 s > thread 'tests::default_template_renders_generic_config_and_static_subgraphs_with_typst' (183) panicked at crates/clinnet/src/lib.rs:1307:14:
  278. 72.41 s > called `Result::unwrap()` on an `Err` value: typst failed while compiling template /build/clinnet-real-typst-168-0/gamma-style-assertions.pdf
  279. 72.41 s >
  280. 72.41 s > Command executed:
  281. 72.41 s > "typst" "c" "/build/source/crates/clinnet/tests/resources/gamma-style-behavior.typ" "/build/clinnet-real-typst-168-0/gamma-style-assertions.pdf" "--root" "/build/source"
  282. 72.41 s >
  283. 72.41 s > File not found - check that all paths are correct and files exist
  284. 72.41 s >
  285. 72.41 s > Typst stdout:
  286. 72.41 s >
  287. 72.41 s >
  288. 72.41 s > Typst stderr:
  289. 72.41 s > error: file not found (searched at /build/source/docs/assets/typst/theme.typ)
  290. 72.41 s > ┌─ ../../docs/assets/typst/portal-graphs/edge-style.typ:5:8
  291. 72.41 s > │
  292. 72.41 s > 5 │ #import "../theme.typ": palette
  293. 72.41 s > │ ^^^^^^^^^^^^^^
  294. 72.41 s >
  295. 72.41 s > while importing `../../../../docs/assets/typst/portal-graphs/edge-style.typ` at tests/resources/gamma-style-behavior.typ:7:1
  296. 72.41 s > import "../../../../docs/assets/typst/portal-graphs/edge-style.typ" as model-style
  297. 72.41 s >
  298. 72.41 s > Location:
  299. 72.41 s > crates/clinnet/src/lib.rs:770:13
  300. 72.41 s > stack backtrace:
  301. 72.41 s > 0: __rustc::rust_begin_unwind
  302. 72.41 s > 1: core::panicking::panic_fmt
  303. 72.41 s > 2: core::result::unwrap_failed
  304. 72.41 s > 3: clinnet::tests::default_template_renders_generic_config_and_static_subgraphs_with_typst
  305. 72.41 s > 4: <clinnet::tests::default_template_renders_generic_config_and_static_subgraphs_with_typst::{closure#0} as core::ops::function::FnOnce<()>>::call_once
  306. 72.41 s > note: Some details are omitted, run with `RUST_BACKTRACE=full` for a verbose backtrace.
  307. 72.41 s >
  308. 72.41 s > error: test run failed
  309. 72.41 s >
  310. 72.41 s > ========== nextest test summary ==========
  311. 72.41 s > report: target/nextest/ci_gammaloop/junit.xml
  312. 72.41 s > tests: 36, failures: 1, errors: 0
  313. 72.41 s >
  314. 72.41 s > 1. clinnet::tests::default_template_renders_generic_config_and_static_subgraphs_with_typst
  315. 72.41 s > failure: test failure with exit code 101
  316. 72.41 s > thread 'tests::default_template_renders_generic_config_and_static_subgraphs_with_typst' (183) panicked at crates/clinnet/src/lib.rs:1307:14:
  317. 72.41 s > called `Result::unwrap()` on an `Err` value: typst failed while compiling template /build/clinnet-real-typst-168-0/gamma-style-assertions.pdf
  318. 72.41 s >
  319. 72.41 s > Command executed:
  320. 72.41 s > "typst" "c" "/build/source/crates/clinnet/tests/resources/gamma-style-behavior.typ" "/build/clinnet-real-typst-168-0/gamma-style-assertions.pdf" "--root" "/build/source"
  321. 72.41 s >
  322. 72.41 s > File not found - check that all paths are correct and files exist
  323. 72.41 s >
  324. 72.41 s > Typst stdout:
  325. 72.41 s >
  326. 72.41 s >
  327. 72.41 s > Typst stderr:
  328. 72.41 s > error: file not found (searched at /build/source/docs/assets/typst/theme.typ)
  329. 72.41 s > ┌─ ../../docs/assets/typst/portal-graphs/edge-style.typ:5:8
  330. 72.41 s > │
  331. 72.41 s > 5 │ #import "../theme.typ": palette
  332. 72.41 s > │ ^^^^^^^^^^^^^^
  333. 72.41 s >
  334. 72.41 s > while importing `../../../../docs/assets/typst/portal-graphs/edge-style.typ` at tests/resources/gamma-style-behavior.typ:7:1
  335. 72.41 s > import "../../../../docs/assets/typst/portal-graphs/edge-style.typ" as model-style
  336. 72.41 s >
  337. 72.41 s > Location:
  338. 72.41 s > crates/clinnet/src/lib.rs:770:13
  339. 72.41 s > stack backtrace:
  340. 72.41 s > 0: __rustc::rust_begin_unwind
  341. 72.41 s > 1: core::panicking::panic_fmt
  342. 72.41 s > 2: core::result::unwrap_failed
  343. 72.41 s > 3: clinnet::tests::default_template_renders_generic_config_and_static_subgraphs_with_typst
  344. 72.41 s > 4: <clinnet::tests::default_template_renders_generic_config_and_static_subgraphs_with_typst::{closure#0} as core::ops::function::FnOnce<()>>::call_once
  345. 72.41 s > note: Some details are omitted, run with `RUST_BACKTRACE=full` for a verbose backtrace.
  346. 72.41 s > system-out
  347. 72.41 s > running 1 test
  348. 72.41 s > test tests::default_template_renders_generic_config_and_static_subgraphs_with_typst ... FAILED
  349. 72.41 s >
  350. 72.41 s > failures:
  351. 72.41 s >
  352. 72.41 s > failures:
  353. 72.41 s > tests::default_template_renders_generic_config_and_static_subgraphs_with_typst
  354. 72.41 s >
  355. 72.41 s > test result: FAILED. 0 passed; 1 failed; 0 ignored; 0 measured; 13 filtered out; finished in 3.12s
  356. 72.41 s > system-err
  357. 72.41 s > thread 'tests::default_template_renders_generic_config_and_static_subgraphs_with_typst' (183) panicked at crates/clinnet/src/lib.rs:1307:14:
  358. 72.41 s > called `Result::unwrap()` on an `Err` value: typst failed while compiling template /build/clinnet-real-typst-168-0/gamma-style-assertions.pdf
  359. 72.41 s >
  360. 72.41 s > Command executed:
  361. 72.41 s > "typst" "c" "/build/source/crates/clinnet/tests/resources/gamma-style-behavior.typ" "/build/clinnet-real-typst-168-0/gamma-style-assertions.pdf" "--root" "/build/source"
  362. 72.41 s >
  363. 72.41 s > File not found - check that all paths are correct and files exist
  364. 72.41 s >
  365. 72.41 s > Typst stdout:
  366. 72.41 s >
  367. 72.41 s >
  368. 72.41 s > Typst stderr:
  369. 72.41 s > error: file not found (searched at /build/source/docs/assets/typst/theme.typ)
  370. 72.41 s > ┌─ ../../docs/assets/typst/portal-graphs/edge-style.typ:5:8
  371. 72.41 s > │
  372. 72.41 s > 5 │ #import "../theme.typ": palette
  373. 72.41 s > │ ^^^^^^^^^^^^^^
  374. 72.41 s >
  375. 72.41 s > while importing `../../../../docs/assets/typst/portal-graphs/edge-style.typ` at tests/resources/gamma-style-behavior.typ:7:1
  376. 72.41 s > import "../../../../docs/assets/typst/portal-graphs/edge-style.typ" as model-style
  377. 72.41 s >
  378. 72.41 s > Location:
  379. 72.41 s > crates/clinnet/src/lib.rs:770:13
  380. 72.41 s > stack backtrace:
  381. 72.41 s > 0: __rustc::rust_begin_unwind
  382. 72.41 s > 1: core::panicking::panic_fmt
  383. 72.41 s > 2: core::result::unwrap_failed
  384. 72.41 s > 3: clinnet::tests::default_template_renders_generic_config_and_static_subgraphs_with_typst
  385. 72.41 s > 4: <clinnet::tests::default_template_renders_generic_config_and_static_subgraphs_with_typst::{closure#0} as core::ops::function::FnOnce<()>>::call_once
  386. 72.41 s > note: Some details are omitted, run with `RUST_BACKTRACE=full` for a verbose backtrace.
  387. 72.41 s > =========================================
  388. 72.41 s For full logs, run:
  389. 72.41 s nix log /nix/store/h7wfxf9is8d9pfbnnbafzbqf2ky01xla-gammaloop-nextest-clinnet.drv
  390. 72.57 s [0 built (1 failed)]Run failed.