test packages.x86_64-linux.nix-ci-check-gammaloop-nextest-integration

Reproduce this run
Retry Run
  1. 0.00 s $ /nix/store/bhv6xyvqw6gjs3j488gi1z6wdv18bdpa-coreutils-9.11/bin/timeout --kill-after=15s 7200s /nix/store/5np0yidzrnyjbb243hvgqpgpss865p0n-nix-2.34.9/bin/nix --extra-experimental-features nix-command --extra-experimental-features flakes flake clone git+https://github.com/alphal00p/gammaloop --dest /tmp/nix-ci-worker/stable-pwd/repo/
  2. 0.10 s Cloning into '/tmp/nix-ci-worker/stable-pwd/repo'...
  3. 0.93 s remote: Enumerating objects: 172467, done.
  4. 1.04 s remote: Counting objects: 0% (1/14839) remote: Counting objects: 1% (149/14839) remote: Counting objects: 2% (297/14839) remote: Counting objects: 3% (446/14839) remote: Counting objects: 4% (594/14839) remote: Counting objects: 5% (742/14839) remote: Counting objects: 6% (891/14839) remote: Counting objects: 7% (1039/14839) remote: Counting objects: 8% (1188/14839) remote: Counting objects: 9% (1336/14839) remote: Counting objects: 10% (1484/14839) remote: Counting objects: 11% (1633/14839) remote: Counting objects: 12% (1781/14839) remote: Counting objects: 13% (1930/14839) remote: Counting objects: 14% (2078/14839) remote: Counting objects: 15% (2226/14839) remote: Counting objects: 16% (2375/14839) remote: Counting objects: 17% (2523/14839) remote: Counting objects: 18% (2672/14839) remote: Counting objects: 19% (2820/14839) remote: Counting objects: 20% (2968/14839) remote: Counting objects: 21% (3117/14839) remote: Counting objects: 22% (3265/14839) remote: Counting objects: 23% (3413/14839) remote: Counting objects: 24% (3562/14839) remote: Counting objects: 25% (3710/14839) remote: Counting objects: 26% (3859/14839) remote: Counting objects: 27% (4007/14839) remote: Counting objects: 28% (4155/14839) remote: Counting objects: 29% (4304/14839) remote: Counting objects: 30% (4452/14839) remote: Counting objects: 31% (4601/14839) remote: Counting objects: 32% (4749/14839) remote: Counting objects: 33% (4897/14839) remote: Counting objects: 34% (5046/14839) remote: Counting objects: 35% (5194/14839) remote: Counting objects: 36% (5343/14839) remote: Counting objects: 37% (5491/14839) remote: Counting objects: 38% (5639/14839) remote: Counting objects: 39% (5788/14839) remote: Counting objects: 40% (5936/14839) remote: Counting objects: 41% (6084/14839) remote: Counting objects: 42% (6233/14839) remote: Counting objects: 43% (6381/14839) remote: Counting objects: 44% (6530/14839) remote: Counting objects: 45% (6678/14839) remote: Counting objects: 46% (6826/14839) remote: Counting objects: 47% (6975/14839) remote: Counting objects: 48% (7123/14839) remote: Counting objects: 49% (7272/14839) remote: Counting objects: 50% (7420/14839) remote: Counting objects: 51% (7568/14839) remote: Counting objects: 52% (7717/14839) remote: Counting objects: 53% (7865/14839) remote: Counting objects: 54% (8014/14839) remote: Counting objects: 55% (8162/14839) remote: Counting objects: 56% (8310/14839) remote: Counting objects: 57% (8459/14839) remote: Counting objects: 58% (8607/14839) remote: Counting objects: 59% (8756/14839) remote: Counting objects: 60% (8904/14839) remote: Counting objects: 61% (9052/14839) remote: Counting objects: 62% (9201/14839) remote: Counting objects: 63% (9349/14839) remote: Counting objects: 64% (9497/14839) remote: Counting objects: 65% (9646/14839) remote: Counting objects: 66% (9794/14839) remote: Counting objects: 67% (9943/14839) remote: Counting objects: 68% (10091/14839) remote: Counting objects: 69% (10239/14839) remote: Counting objects: 70% (10388/14839) remote: Counting objects: 71% (10536/14839) remote: Counting objects: 72% (10685/14839) remote: Counting objects: 73% (10833/14839) remote: Counting objects: 74% (10981/14839) remote: Counting objects: 75% (11130/14839) remote: Counting objects: 76% (11278/14839) remote: Counting objects: 77% (11427/14839) remote: Counting objects: 78% (11575/14839) remote: Counting objects: 79% (11723/14839) remote: Counting objects: 80% (11872/14839) remote: Counting objects: 81% (12020/14839) remote: Counting objects: 82% (12168/14839) remote: Counting objects: 83% (12317/14839) remote: Counting objects: 84% (12465/14839) remote: Counting objects: 85% (12614/14839) remote: Counting objects: 86% (12762/14839) remote: Counting objects: 87% (12910/14839) remote: Counting objects: 88% (13059/14839) remote: Counting objects: 89% (13207/14839) remote: Counting objects: 90% (13356/14839) remote: Counting objects: 91% (13504/14839) remote: Counting objects: 92% (13652/14839) remote: Counting objects: 93% (13801/14839) remote: Counting objects: 94% (13949/14839) remote: Counting objects: 95% (14098/14839) remote: Counting objects: 96% (14246/14839) remote: Counting objects: 97% (14394/14839) remote: Counting objects: 98% (14543/14839) remote: Counting objects: 99% (14691/14839) remote: Counting objects: 100% (14839/14839) remote: Counting objects: 100% (14839/14839), done.
  5. 5.06 s remote: Compressing objects: 0% (1/3073) remote: Compressing objects: 1% (31/3073) remote: Compressing objects: 2% (62/3073) remote: Compressing objects: 3% (93/3073) remote: Compressing objects: 4% (123/3073) remote: Compressing objects: 5% (154/3073) remote: Compressing objects: 5% (173/3073) remote: Compressing objects: 6% (185/3073) remote: Compressing objects: 7% (216/3073) remote: Compressing objects: 7% (222/3073) remote: Compressing objects: 8% (246/3073) remote: Compressing objects: 9% (277/3073) remote: Compressing objects: 9% (292/3073) remote: Compressing objects: 10% (308/3073) remote: Compressing objects: 11% (339/3073) remote: Compressing objects: 12% (369/3073) remote: Compressing objects: 13% (400/3073) remote: Compressing objects: 13% (416/3073)
  6. 7.40 s remote: Compressing objects: 14% (431/3073) remote: Compressing objects: 15% (461/3073) remote: Compressing objects: 16% (492/3073) remote: Compressing objects: 17% (523/3073) remote: Compressing objects: 18% (554/3073) remote: Compressing objects: 18% (574/3073) remote: Compressing objects: 19% (584/3073) remote: Compressing objects: 20% (615/3073) remote: Compressing objects: 21% (646/3073) remote: Compressing objects: 22% (677/3073) remote: Compressing objects: 23% (707/3073) remote: Compressing objects: 24% (738/3073) remote: Compressing objects: 25% (769/3073) remote: Compressing objects: 26% (799/3073) remote: Compressing objects: 27% (830/3073) remote: Compressing objects: 28% (861/3073) remote: Compressing objects: 28% (891/3073) remote: Compressing objects: 29% (892/3073) remote: Compressing objects: 30% (922/3073) remote: Compressing objects: 31% (953/3073) remote: Compressing objects: 32% (984/3073) remote: Compressing objects: 33% (1015/3073) remote: Compressing objects: 34% (1045/3073) remote: Compressing objects: 35% (1076/3073) remote: Compressing objects: 36% (1107/3073) remote: Compressing objects: 37% (1138/3073) remote: Compressing objects: 38% (1168/3073) remote: Compressing objects: 39% (1199/3073) remote: Compressing objects: 40% (1230/3073) remote: Compressing objects: 41% (1260/3073) remote: Compressing objects: 42% (1291/3073) remote: Compressing objects: 43% (1322/3073) remote: Compressing objects: 44% (1353/3073) remote: Compressing objects: 45% (1383/3073) remote: Compressing objects: 46% (1414/3073) remote: Compressing objects: 47% (1445/3073) remote: Compressing objects: 48% (1476/3073) remote: Compressing objects: 49% (1506/3073) remote: Compressing objects: 50% (1537/3073) remote: Compressing objects: 51% (1568/3073) remote: Compressing objects: 52% (1598/3073) remote: Compressing objects: 53% (1629/3073) remote: Compressing objects: 54% (1660/3073) remote: Compressing objects: 55% (1691/3073) remote: Compressing objects: 56% (1721/3073) remote: Compressing objects: 57% (1752/3073) remote: Compressing objects: 58% (1783/3073) remote: Compressing objects: 59% (1814/3073) remote: Compressing objects: 60% (1844/3073) remote: Compressing objects: 61% (1875/3073) remote: Compressing objects: 62% (1906/3073) remote: Compressing objects: 63% (1936/3073) remote: Compressing objects: 64% (1967/3073) remote: Compressing objects: 65% (1998/3073) remote: Compressing objects: 66% (2029/3073) remote: Compressing objects: 67% (2059/3073) remote: Compressing objects: 68% (2090/3073) remote: Compressing objects: 69% (2121/3073) remote: Compressing objects: 70% (2152/3073) remote: Compressing objects: 71% (2182/3073) remote: Compressing objects: 72% (2213/3073) remote: Compressing objects: 73% (2244/3073) remote: Compressing objects: 74% (2275/3073) remote: Compressing objects: 75% (2305/3073) remote: Compressing objects: 76% (2336/3073) remote: Compressing objects: 77% (2367/3073) remote: Compressing objects: 78% (2397/3073) remote: Compressing objects: 79% (2428/3073) remote: Compressing objects: 80% (2459/3073) remote: Compressing objects: 81% (2490/3073) remote: Compressing objects: 82% (2520/3073) remote: Compressing objects: 83% (2551/3073) remote: Compressing objects: 84% (2582/3073) remote: Compressing objects: 85% (2613/3073) remote: Compressing objects: 86% (2643/3073) remote: Compressing objects: 87% (2674/3073) remote: Compressing objects: 88% (2705/3073) remote: Compressing objects: 89% (2735/3073) remote: Compressing objects: 90% (2766/3073) remote: Compressing objects: 91% (2797/3073) remote: Compressing objects: 92% (2828/3073) remote: Compressing objects: 93% (2858/3073) remote: Compressing objects: 94% (2889/3073) remote: Compressing objects: 95% (2920/3073) remote: Compressing objects: 96% (2951/3073) remote: Compressing objects: 97% (2981/3073) remote: Compressing objects: 98% (3012/3073) remote: Compressing objects: 99% (3043/3073) remote: Compressing objects: 100% (3073/3073) remote: Compressing objects: 100% (3073/3073), done.
  7. 10.13 s Receiving objects: 0% (1/172467) Receiving objects: 1% (1725/172467) Receiving objects: 2% (3450/172467) Receiving objects: 3% (5175/172467), 17.89 MiB | 35.77 MiB/s Receiving objects: 4% (6899/172467), 17.89 MiB | 35.77 MiB/s Receiving objects: 4% (8419/172467), 35.66 MiB | 34.97 MiB/s Receiving objects: 5% (8624/172467), 35.66 MiB | 34.97 MiB/s Receiving objects: 6% (10349/172467), 35.66 MiB | 34.97 MiB/s Receiving objects: 7% (12073/172467), 53.23 MiB | 35.02 MiB/s Receiving objects: 7% (13766/172467), 53.23 MiB | 35.02 MiB/s Receiving objects: 8% (13798/172467), 70.15 MiB | 34.73 MiB/s Receiving objects: 9% (15523/172467), 70.15 MiB | 34.73 MiB/s Receiving objects: 10% (17247/172467), 70.15 MiB | 34.73 MiB/s Receiving objects: 11% (18972/172467), 70.15 MiB | 34.73 MiB/s Receiving objects: 12% (20697/172467), 82.41 MiB | 32.71 MiB/s Receiving objects: 13% (22421/172467), 82.41 MiB | 32.71 MiB/s Receiving objects: 14% (24146/172467), 82.41 MiB | 32.71 MiB/s Receiving objects: 15% (25871/172467), 82.41 MiB | 32.71 MiB/s Receiving objects: 16% (27595/172467), 82.41 MiB | 32.71 MiB/s Receiving objects: 17% (29320/172467), 82.41 MiB | 32.71 MiB/s Receiving objects: 18% (31045/172467), 82.41 MiB | 32.71 MiB/s Receiving objects: 19% (32769/172467), 82.41 MiB | 32.71 MiB/s Receiving objects: 20% (34494/172467), 82.41 MiB | 32.71 MiB/s Receiving objects: 21% (36219/172467), 82.41 MiB | 32.71 MiB/s
  8. 14.95 s Receiving objects: 22% (37943/172467), 82.41 MiB | 32.71 MiB/s Receiving objects: 23% (39668/172467), 82.41 MiB | 32.71 MiB/s Receiving objects: 24% (41393/172467), 82.41 MiB | 32.71 MiB/s Receiving objects: 25% (43117/172467), 82.41 MiB | 32.71 MiB/s Receiving objects: 26% (44842/172467), 82.41 MiB | 32.71 MiB/s Receiving objects: 27% (46567/172467), 82.41 MiB | 32.71 MiB/s Receiving objects: 28% (48291/172467), 82.41 MiB | 32.71 MiB/s Receiving objects: 28% (48663/172467), 82.41 MiB | 32.71 MiB/s Receiving objects: 29% (50016/172467), 104.69 MiB | 34.67 MiB/s Receiving objects: 30% (51741/172467), 104.69 MiB | 34.67 MiB/s Receiving objects: 31% (53465/172467), 104.69 MiB | 34.67 MiB/s Receiving objects: 32% (55190/172467), 104.69 MiB | 34.67 MiB/s Receiving objects: 33% (56915/172467), 104.69 MiB | 34.67 MiB/s Receiving objects: 34% (58639/172467), 122.52 MiB | 34.65 MiB/s Receiving objects: 35% (60364/172467), 122.52 MiB | 34.65 MiB/s Receiving objects: 36% (62089/172467), 122.52 MiB | 34.65 MiB/s Receiving objects: 36% (63293/172467), 122.52 MiB | 34.65 MiB/s Receiving objects: 37% (63813/172467), 122.52 MiB | 34.65 MiB/s Receiving objects: 38% (65538/172467), 139.75 MiB | 34.62 MiB/s Receiving objects: 39% (67263/172467), 139.75 MiB | 34.62 MiB/s Receiving objects: 40% (68987/172467), 157.92 MiB | 34.61 MiB/s Receiving objects: 41% (70712/172467), 157.92 MiB | 34.61 MiB/s Receiving objects: 42% (72437/172467), 157.92 MiB | 34.61 MiB/s Receiving objects: 42% (73901/172467), 157.92 MiB | 34.61 MiB/s Receiving objects: 43% (74161/172467), 157.92 MiB | 34.61 MiB/s Receiving objects: 44% (75886/172467), 175.26 MiB | 34.49 MiB/s Receiving objects: 45% (77611/172467), 175.26 MiB | 34.49 MiB/s Receiving objects: 46% (79335/172467), 175.26 MiB | 34.49 MiB/s Receiving objects: 47% (81060/172467), 175.26 MiB | 34.49 MiB/s Receiving objects: 48% (82785/172467), 175.26 MiB | 34.49 MiB/s Receiving objects: 49% (84509/172467), 192.94 MiB | 34.62 MiB/s Receiving objects: 50% (86234/172467), 192.94 MiB | 34.62 MiB/s Receiving objects: 51% (87959/172467), 192.94 MiB | 34.62 MiB/s Receiving objects: 52% (89683/172467), 192.94 MiB | 34.62 MiB/s Receiving objects: 52% (89711/172467), 192.94 MiB | 34.62 MiB/s Receiving objects: 52% (89807/172467), 244.19 MiB | 35.51 MiB/s Receiving objects: 53% (91408/172467), 244.19 MiB | 35.51 MiB/s
  9. 20.15 s Receiving objects: 53% (92927/172467), 261.07 MiB | 34.33 MiB/s Receiving objects: 54% (93133/172467), 261.07 MiB | 34.33 MiB/s Receiving objects: 55% (94857/172467), 279.50 MiB | 34.36 MiB/s Receiving objects: 56% (96582/172467), 279.50 MiB | 34.36 MiB/s Receiving objects: 57% (98307/172467), 279.50 MiB | 34.36 MiB/s Receiving objects: 58% (100031/172467), 279.50 MiB | 34.36 MiB/s Receiving objects: 59% (101756/172467), 279.50 MiB | 34.36 MiB/s Receiving objects: 60% (103481/172467), 279.50 MiB | 34.36 MiB/s Receiving objects: 61% (105205/172467), 279.50 MiB | 34.36 MiB/s Receiving objects: 62% (106930/172467), 279.50 MiB | 34.36 MiB/s Receiving objects: 63% (108655/172467), 279.50 MiB | 34.36 MiB/s Receiving objects: 64% (110379/172467), 296.59 MiB | 34.33 MiB/s Receiving objects: 65% (112104/172467), 296.59 MiB | 34.33 MiB/s Receiving objects: 65% (113680/172467), 296.59 MiB | 34.33 MiB/s Receiving objects: 66% (113829/172467), 315.29 MiB | 34.44 MiB/s Receiving objects: 67% (115553/172467), 315.29 MiB | 34.44 MiB/s Receiving objects: 68% (117278/172467), 315.29 MiB | 34.44 MiB/s Receiving objects: 69% (119003/172467), 333.36 MiB | 34.60 MiB/s Receiving objects: 70% (120727/172467), 333.36 MiB | 34.60 MiB/s Receiving objects: 71% (122452/172467), 333.36 MiB | 34.60 MiB/s Receiving objects: 71% (123939/172467), 333.36 MiB | 34.60 MiB/s Receiving objects: 72% (124177/172467), 350.93 MiB | 34.36 MiB/s Receiving objects: 73% (125901/172467), 368.29 MiB | 34.53 MiB/s Receiving objects: 73% (126125/172467), 368.29 MiB | 34.53 MiB/s Receiving objects: 74% (127626/172467), 386.68 MiB | 34.52 MiB/s Receiving objects: 75% (129351/172467), 386.68 MiB | 34.52 MiB/s Receiving objects: 76% (131075/172467), 404.15 MiB | 34.67 MiB/s Receiving objects: 76% (132249/172467), 404.15 MiB | 34.67 MiB/s Receiving objects: 77% (132800/172467), 422.35 MiB | 34.96 MiB/s Receiving objects: 78% (134525/172467), 422.35 MiB | 34.96 MiB/s Receiving objects: 79% (136249/172467), 438.61 MiB | 34.71 MiB/s
  10. 24.44 s Receiving objects: 79% (137850/172467), 438.61 MiB | 34.71 MiB/s Receiving objects: 80% (137974/172467), 438.61 MiB | 34.71 MiB/s Receiving objects: 81% (139699/172467), 456.33 MiB | 34.85 MiB/s Receiving objects: 82% (141423/172467), 473.96 MiB | 34.72 MiB/s Receiving objects: 82% (141544/172467), 473.96 MiB | 34.72 MiB/s Receiving objects: 83% (143148/172467), 490.92 MiB | 34.47 MiB/s Receiving objects: 83% (144004/172467), 508.84 MiB | 34.76 MiB/s Receiving objects: 84% (144873/172467), 508.84 MiB | 34.76 MiB/s Receiving objects: 85% (146597/172467), 525.92 MiB | 34.70 MiB/s Receiving objects: 85% (147536/172467), 542.83 MiB | 34.59 MiB/s Receiving objects: 85% (147551/172467), 578.07 MiB | 34.40 MiB/s
  11. 30.17 s Receiving objects: 85% (147552/172467), 630.16 MiB | 34.61 MiB/s Receiving objects: 85% (147554/172467), 646.82 MiB | 34.46 MiB/s Receiving objects: 85% (147565/172467), 698.82 MiB | 34.48 MiB/s Receiving objects: 85% (147565/172467), 734.25 MiB | 34.50 MiB/s Receiving objects: 86% (148322/172467), 734.25 MiB | 34.50 MiB/s Receiving objects: 87% (150047/172467), 734.25 MiB | 34.50 MiB/s Receiving objects: 88% (151771/172467), 734.25 MiB | 34.50 MiB/s Receiving objects: 88% (152106/172467), 750.97 MiB | 34.35 MiB/s Receiving objects: 89% (153496/172467), 750.97 MiB | 34.35 MiB/s Receiving objects: 90% (155221/172467), 768.84 MiB | 34.58 MiB/s Receiving objects: 91% (156945/172467), 768.84 MiB | 34.58 MiB/s Receiving objects: 92% (158670/172467), 768.84 MiB | 34.58 MiB/s Receiving objects: 93% (160395/172467), 768.84 MiB | 34.58 MiB/s Receiving objects: 94% (162119/172467), 768.84 MiB | 34.58 MiB/s Receiving objects: 95% (163844/172467), 768.84 MiB | 34.58 MiB/s Receiving objects: 96% (165569/172467), 768.84 MiB | 34.58 MiB/s Receiving objects: 97% (167293/172467), 768.84 MiB | 34.58 MiB/s Receiving objects: 98% (169018/172467), 768.84 MiB | 34.58 MiB/s Receiving objects: 99% (170743/172467), 784.54 MiB | 34.10 MiB/s
  12. 30.72 s Receiving objects: 99% (172354/172467), 784.54 MiB | 34.10 MiB/s remote: Total 172467 (delta 12813), reused 11932 (delta 11758), pack-reused 157628 (from 3)
  13. 30.73 s Receiving objects: 100% (172467/172467), 796.94 MiB | 33.24 MiB/s Receiving objects: 100% (172467/172467), 798.59 MiB | 34.23 MiB/s, done.
  14. 35.20 s Resolving deltas: 0% (0/106083) Resolving deltas: 1% (1061/106083) Resolving deltas: 2% (2122/106083) Resolving deltas: 3% (3183/106083) Resolving deltas: 4% (4244/106083) Resolving deltas: 5% (5305/106083) Resolving deltas: 6% (6365/106083) Resolving deltas: 7% (7426/106083) Resolving deltas: 8% (8487/106083) Resolving deltas: 9% (9549/106083) Resolving deltas: 10% (10609/106083) Resolving deltas: 11% (11671/106083) Resolving deltas: 12% (12730/106083) Resolving deltas: 13% (13791/106083) Resolving deltas: 14% (14852/106083) Resolving deltas: 15% (15913/106083) Resolving deltas: 16% (16974/106083) Resolving deltas: 16% (17161/106083) Resolving deltas: 17% (18035/106083) Resolving deltas: 18% (19095/106083) Resolving deltas: 19% (20156/106083) Resolving deltas: 20% (21217/106083) Resolving deltas: 21% (22278/106083) Resolving deltas: 22% (23340/106083) Resolving deltas: 23% (24400/106083) Resolving deltas: 24% (25461/106083) Resolving deltas: 25% (26521/106083) Resolving deltas: 26% (27582/106083) Resolving deltas: 26% (28391/106083) Resolving deltas: 27% (28643/106083) Resolving deltas: 28% (29704/106083) Resolving deltas: 29% (30765/106083) Resolving deltas: 30% (31825/106083) Resolving deltas: 31% (32886/106083) Resolving deltas: 32% (33947/106083) Resolving deltas: 33% (35008/106083) Resolving deltas: 34% (36069/106083) Resolving deltas: 35% (37130/106083) Resolving deltas: 36% (38190/106083) Resolving deltas: 37% (39251/106083) Resolving deltas: 38% (40312/106083) Resolving deltas: 39% (41373/106083) Resolving deltas: 40% (42435/106083) Resolving deltas: 41% (43495/106083) Resolving deltas: 42% (44555/106083) Resolving deltas: 43% (45616/106083) Resolving deltas: 44% (46677/106083) Resolving deltas: 45% (47738/106083) Resolving deltas: 46% (48799/106083) Resolving deltas: 47% (49860/106083) Resolving deltas: 48% (50920/106083) Resolving deltas: 49% (51981/106083) Resolving deltas: 50% (53042/106083) Resolving deltas: 51% (54103/106083) Resolving deltas: 52% (55164/106083) Resolving deltas: 53% (56224/106083) Resolving deltas: 54% (57285/106083) Resolving deltas: 54% (57937/106083) Resolving deltas: 55% (58346/106083) Resolving deltas: 56% (59407/106083) Resolving deltas: 57% (60469/106083) Resolving deltas: 58% (61529/106083) Resolving deltas: 59% (62589/106083) Resolving deltas: 60% (63650/106083) Resolving deltas: 61% (64711/106083) Resolving deltas: 62% (65772/106083) Resolving deltas: 63% (66833/106083) Resolving deltas: 64% (67894/106083) Resolving deltas: 65% (68954/106083) Resolving deltas: 66% (70015/106083) Resolving deltas: 67% (71076/106083) Resolving deltas: 68% (72137/106083) Resolving deltas: 69% (73198/106083) Resolving deltas: 70% (74259/106083) Resolving deltas: 71% (75319/106083) Resolving deltas: 72% (76380/106083) Resolving deltas: 73% (77441/106083) Resolving deltas: 74% (78502/106083) Resolving deltas: 75% (79563/106083) Resolving deltas: 76% (80624/106083) Resolving deltas: 77% (81684/106083) Resolving deltas: 78% (82745/106083) Resolving deltas: 79% (83806/106083) Resolving deltas: 79% (84018/106083) Resolving deltas: 80% (84868/106083) Resolving deltas: 81% (85928/106083) Resolving deltas: 82% (86989/106083) Resolving deltas: 83% (88049/106083)
  15. 36.12 s Resolving deltas: 84% (89110/106083) Resolving deltas: 85% (90171/106083) Resolving deltas: 86% (91232/106083) Resolving deltas: 87% (92293/106083) Resolving deltas: 88% (93354/106083) Resolving deltas: 89% (94414/106083) Resolving deltas: 90% (95475/106083) Resolving deltas: 91% (96536/106083) Resolving deltas: 92% (97597/106083) Resolving deltas: 93% (98658/106083) Resolving deltas: 94% (99719/106083) Resolving deltas: 95% (100779/106083) Resolving deltas: 95% (101262/106083) Resolving deltas: 96% (101840/106083) Resolving deltas: 97% (102901/106083) Resolving deltas: 98% (103962/106083) Resolving deltas: 99% (105023/106083) Resolving deltas: 100% (106083/106083) Resolving deltas: 100% (106083/106083), done.
  16. 37.17 s Fetching commit 3fab91cd4d2e773be97d81cf93421a58a94bdffa for ltd_support ...
  17. 37.17 s $ /nix/store/b1wn5clix1mz4vpfih7x9cnj9qfh7c6h-git-2.54.0/bin/git fetch origin 3fab91cd4d2e773be97d81cf93421a58a94bdffa
  18. 37.73 s From https://github.com/alphal00p/gammaloop
  19. 37.73 s * branch 3fab91cd4d2e773be97d81cf93421a58a94bdffa -> FETCH_HEAD
  20. 37.79 s $ /nix/store/bhv6xyvqw6gjs3j488gi1z6wdv18bdpa-coreutils-9.11/bin/timeout --kill-after=15s 7200s /nix/store/b1wn5clix1mz4vpfih7x9cnj9qfh7c6h-git-2.54.0/bin/git -c advice.detachedHead=false checkout 3fab91cd4d2e773be97d81cf93421a58a94bdffa
  21. 38.14 s HEAD is now at 3fab91cd4 finish standalone export cleanup and defer center test metadata
  22. 38.17 s $ /nix/store/bhv6xyvqw6gjs3j488gi1z6wdv18bdpa-coreutils-9.11/bin/timeout --kill-after=15s 7200s /nix/store/5np0yidzrnyjbb243hvgqpgpss865p0n-nix-2.34.9/bin/nix --extra-experimental-features nix-command --extra-experimental-features flakes --log-format internal-json run .#packages.x86_64-linux.nix-ci-check-gammaloop-nextest-integration --print-build-logs
  23. 38.38 s warning: ignoring untrusted flake configuration setting 'extra-substituters'.
  24. 38.38 s Pass '--accept-flake-config' to trust it
  25. 38.38 s warning: ignoring untrusted flake configuration setting 'extra-trusted-public-keys'.
  26. 38.38 s Pass '--accept-flake-config' to trust it
  27. 52.27 s
  28. 52.40 s Downloading cached boehm-gc from https://cache.nix-ci.com
  29. 52.40 s Downloading cached busybox from https://cache.nix-ci.com
  30. 52.40 s Downloading cached aws-c-common from https://cache.nix-ci.com
  31. 52.40 s Downloading cached brotli-1.2.0-lib from https://cache.nix-ci.com
  32. 52.40 s Downloading cached editline-1.17.1-unstable-2025-05 from https://cache.nix-ci.com
  33. 52.40 s Downloading cached libcpuid from https://cache.nix-ci.com
  34. 52.40 s Downloading cached libseccomp-2.6.1-lib from https://cache.nix-ci.com
  35. 52.40 s Downloading cached libsodium-1.0.22-unstable-2026-08 from https://cache.nix-ci.com
  36. 52.40 s Downloading cached lowdown-3.0.1-lib from https://cache.nix-ci.com
  37. 52.40 s Downloading cached publicsuffix-list-0-unstable-2026-09 from https://cache.nix-ci.com
  38. 52.40 s Downloading cached icu4c from https://cache.nix-ci.com
  39. 52.40 s Downloading cached libssh2 from https://cache.nix-ci.com
  40. 52.40 s Downloading cached libxml2 from https://cache.nix-ci.com
  41. 52.40 s Downloading cached llhttp from https://cache.nix-ci.com
  42. 52.40 s Downloading cached nghttp3 from https://cache.nix-ci.com
  43. 52.40 s Downloading cached nghttp2-1.70.0-lib from https://cache.nix-ci.com
  44. 52.72 s Downloaded cached publicsuffix-list-0-unstable-2026-09 (330 KiB) in 319ms
  45. 52.72 s Progress: 0 of 1 built, 1 of 50 downloaded from cache (15 downloading)
  46. 52.72 s Downloading cached hwloc-2.14.0-lib from https://cache.nix-ci.com
  47. 52.78 s Downloaded cached editline-1.17.1-unstable-2025-05 (58 KiB) in 387ms
  48. 52.79 s Progress: 0 of 1 built, 2 of 50 downloaded from cache (15 downloading)
  49. 52.79 s Downloading cached keyutils-1.6.3-lib from https://cache.nix-ci.com
  50. 52.84 s Downloaded cached libseccomp-2.6.1-lib (189 KiB) in 438ms
  51. 52.84 s Progress: 0 of 1 built, 3 of 50 downloaded from cache (15 downloading)
  52. 52.84 s Downloading cached libpsl from https://cache.nix-ci.com
  53. 52.87 s Downloaded cached libcpuid (326 KiB) in 473ms
  54. 52.87 s Progress: 0 of 1 built, 4 of 50 downloaded from cache (15 downloading)
  55. 52.87 s Downloading cached ngtcp2 from https://cache.nix-ci.com
  56. 52.89 s Downloaded cached boehm-gc (312 KiB) in 499ms
  57. 52.89 s Progress: 0 of 1 built, 5 of 50 downloaded from cache (15 downloading)
  58. 52.89 s Downloading cached s2n-tls from https://cache.nix-ci.com
  59. 52.95 s Downloaded cached nghttp2-1.70.0-lib (225 KiB) in 549ms
  60. 52.95 s Progress: 0 of 1 built, 6 of 50 downloaded from cache (15 downloading)
  61. 52.98 s Downloaded cached busybox (230 KiB) in 582ms
  62. 52.98 s Progress: 0 of 1 built, 7 of 50 downloaded from cache (14 downloading)
  63. 53.02 s Downloaded cached llhttp (89 KiB) in 625ms
  64. 53.02 s Progress: 0 of 1 built, 8 of 50 downloaded from cache (13 downloading)
  65. 53.04 s Downloaded cached libssh2 (330 KiB) in 642ms
  66. 53.04 s Progress: 0 of 1 built, 9 of 50 downloaded from cache (12 downloading)
  67. 53.04 s Downloading cached libgit2-1.9.7-lib from https://cache.nix-ci.com
  68. 53.06 s Downloaded cached libsodium-1.0.22-unstable-2026-08 (669 KiB) in 661ms
  69. 53.06 s Progress: 0 of 1 built, 10 of 50 downloaded from cache (12 downloading)
  70. 53.08 s Downloaded cached lowdown-3.0.1-lib (341 KiB) in 681ms
  71. 53.08 s Progress: 0 of 1 built, 11 of 50 downloaded from cache (11 downloading)
  72. 53.12 s Downloaded cached aws-c-common (1.1 MiB) in 722ms
  73. 53.12 s Progress: 0 of 1 built, 12 of 50 downloaded from cache (10 downloading)
  74. 53.12 s Downloading cached aws-c-cal from https://cache.nix-ci.com
  75. 53.12 s Downloading cached aws-c-compression from https://cache.nix-ci.com
  76. 53.12 s Downloading cached aws-checksums from https://cache.nix-ci.com
  77. 53.12 s Downloading cached aws-c-sdkutils from https://cache.nix-ci.com
  78. 53.15 s Downloaded cached nghttp3 (228 KiB) in 750ms
  79. 53.15 s Progress: 0 of 1 built, 13 of 50 downloaded from cache (13 downloading)
  80. 53.24 s Downloaded cached brotli-1.2.0-lib (961 KiB) in 837ms
  81. 53.24 s Progress: 0 of 1 built, 14 of 50 downloaded from cache (12 downloading)
  82. 53.26 s Downloaded cached libxml2 (1.4 MiB) in 863ms
  83. 53.26 s Progress: 0 of 1 built, 15 of 50 downloaded from cache (11 downloading)
  84. 53.26 s Downloading cached libarchive-3.8.9-lib from https://cache.nix-ci.com
  85. 53.27 s Downloaded cached hwloc-2.14.0-lib (458 KiB) in 550ms
  86. 53.27 s Progress: 0 of 1 built, 16 of 50 downloaded from cache (11 downloading)
  87. 53.27 s Downloading cached onetbb from https://cache.nix-ci.com
  88. 53.29 s Downloaded cached keyutils-1.6.3-lib (41 KiB) in 505ms
  89. 53.29 s Progress: 0 of 1 built, 17 of 50 downloaded from cache (11 downloading)
  90. 53.29 s Downloading cached krb5-1.22.2-lib from https://cache.nix-ci.com
  91. 53.35 s Downloaded cached libpsl (114 KiB) in 508ms
  92. 53.35 s Progress: 0 of 1 built, 18 of 50 downloaded from cache (11 downloading)
  93. 53.49 s Downloaded cached ngtcp2 (515 KiB) in 614ms
  94. 53.49 s Progress: 0 of 1 built, 19 of 50 downloaded from cache (10 downloading)
  95. 53.49 s Downloaded cached libgit2-1.9.7-lib (1.6 MiB) in 444ms
  96. 53.49 s Progress: 0 of 1 built, 20 of 50 downloaded from cache (9 downloading)
  97. 53.49 s Downloaded cached s2n-tls (1.3 MiB) in 591ms
  98. 53.49 s Progress: 0 of 1 built, 21 of 50 downloaded from cache (8 downloading)
  99. 53.49 s Downloaded cached aws-c-sdkutils (155 KiB) in 368ms
  100. 53.49 s Progress: 0 of 1 built, 22 of 50 downloaded from cache (7 downloading)
  101. 53.49 s Downloaded cached aws-c-cal (158 KiB) in 369ms
  102. 53.49 s Progress: 0 of 1 built, 23 of 50 downloaded from cache (6 downloading)
  103. 53.49 s Downloaded cached aws-c-compression (31 KiB) in 369ms
  104. 53.49 s Progress: 0 of 1 built, 24 of 50 downloaded from cache (6 downloading)
  105. 53.49 s Downloading cached aws-c-io from https://cache.nix-ci.com
  106. 53.49 s Downloaded cached aws-checksums (86 KiB) in 369ms
  107. 53.49 s Progress: 0 of 1 built, 25 of 50 downloaded from cache (5 downloading)
  108. 53.57 s Downloaded cached icu4c (39.5 MiB) in 1.1s
  109. 53.57 s Progress: 0 of 1 built, 26 of 50 downloaded from cache (4 downloading)
  110. 53.57 s Downloading cached boost from https://cache.nix-ci.com
  111. 53.59 s Downloaded cached libarchive-3.8.9-lib (961 KiB) in 328ms
  112. 53.59 s Progress: 0 of 1 built, 27 of 50 downloaded from cache (4 downloading)
  113. 53.59 s Downloaded cached onetbb (626 KiB) in 321ms
  114. 53.59 s Progress: 0 of 1 built, 28 of 50 downloaded from cache (3 downloading)
  115. 53.59 s Downloading cached libblake3 from https://cache.nix-ci.com
  116. 53.77 s Downloaded cached aws-c-io (648 KiB) in 280ms
  117. 53.77 s Progress: 0 of 1 built, 29 of 50 downloaded from cache (3 downloading)
  118. 53.77 s Downloading cached aws-c-event-stream from https://cache.nix-ci.com
  119. 53.77 s Downloading cached aws-c-http from https://cache.nix-ci.com
  120. 53.77 s Downloaded cached krb5-1.22.2-lib (2.7 MiB) in 480ms
  121. 53.77 s Progress: 0 of 1 built, 30 of 50 downloaded from cache (4 downloading)
  122. 53.77 s Downloading cached curl from https://cache.nix-ci.com
  123. 53.89 s Downloaded cached libblake3 (117 KiB) in 298ms
  124. 53.89 s Progress: 0 of 1 built, 31 of 50 downloaded from cache (4 downloading)
  125. 53.90 s Downloaded cached aws-c-event-stream (176 KiB) in 129ms
  126. 53.90 s Progress: 0 of 1 built, 32 of 50 downloaded from cache (3 downloading)
  127. 53.90 s Downloaded cached aws-c-http (641 KiB) in 129ms
  128. 53.90 s Progress: 0 of 1 built, 33 of 50 downloaded from cache (2 downloading)
  129. 53.90 s Downloading cached aws-c-auth from https://cache.nix-ci.com
  130. 53.90 s Downloading cached aws-c-mqtt from https://cache.nix-ci.com
  131. 53.90 s Downloaded cached boost (14.5 MiB) in 336ms
  132. 53.90 s Progress: 0 of 1 built, 34 of 50 downloaded from cache (3 downloading)
  133. 53.90 s Downloading cached nix-util from https://cache.nix-ci.com
  134. 53.91 s Downloaded cached curl (1.2 MiB) in 137ms
  135. 53.91 s Progress: 0 of 1 built, 35 of 50 downloaded from cache (3 downloading)
  136. 53.94 s Downloaded cached aws-c-auth (387 KiB) in 40ms
  137. 53.94 s Progress: 0 of 1 built, 36 of 50 downloaded from cache (2 downloading)
  138. 53.94 s Downloading cached aws-c-s3 from https://cache.nix-ci.com
  139. 54.00 s Downloaded cached aws-c-mqtt (557 KiB) in 101ms
  140. 54.00 s Progress: 0 of 1 built, 37 of 50 downloaded from cache (2 downloading)
  141. 54.48 s Downloaded cached nix-util (2.4 MiB) in 570ms
  142. 54.48 s Progress: 0 of 1 built, 38 of 50 downloaded from cache (1 downloading)
  143. 54.48 s Downloading cached nix-nswrapper from https://cache.nix-ci.com
  144. 54.48 s Downloaded cached aws-c-s3 (384 KiB) in 532ms
  145. 54.48 s Progress: 0 of 1 built, 39 of 50 downloaded from cache (1 downloading)
  146. 54.48 s Downloading cached aws-crt-cpp from https://cache.nix-ci.com
  147. 54.48 s Downloaded cached nix-nswrapper (131 KiB) in 0ms
  148. 54.48 s Progress: 0 of 1 built, 40 of 50 downloaded from cache (1 downloading)
  149. 54.48 s Downloaded cached aws-crt-cpp (979 KiB) in 1ms
  150. 54.48 s Progress: 0 of 1 built, 41 of 50 downloaded from cache
  151. 54.48 s Downloading cached nix-store from https://cache.nix-ci.com
  152. 54.53 s Downloaded cached nix-store (5.8 MiB) in 53ms
  153. 54.53 s Progress: 0 of 1 built, 42 of 50 downloaded from cache
  154. 54.53 s Downloading cached nix-fetchers from https://cache.nix-ci.com
  155. 54.53 s Downloading cached nix-main from https://cache.nix-ci.com
  156. 54.71 s Downloaded cached nix-main (393 KiB) in 180ms
  157. 54.71 s Progress: 0 of 1 built, 43 of 50 downloaded from cache (1 downloading)
  158. 54.71 s Downloaded cached nix-fetchers (1.5 MiB) in 180ms
  159. 54.71 s Progress: 0 of 1 built, 44 of 50 downloaded from cache
  160. 54.71 s Downloading cached nix-expr from https://cache.nix-ci.com
  161. 54.86 s Downloaded cached nix-expr (3.3 MiB) in 149ms
  162. 54.86 s Progress: 0 of 1 built, 45 of 50 downloaded from cache
  163. 54.86 s Downloading cached nix-flake from https://cache.nix-ci.com
  164. 54.95 s Downloaded cached nix-flake (956 KiB) in 87ms
  165. 54.95 s Progress: 0 of 1 built, 46 of 50 downloaded from cache
  166. 54.95 s Downloading cached nix-cmd from https://cache.nix-ci.com
  167. 55.03 s Downloaded cached nix-cmd (1 MiB) in 82ms
  168. 55.03 s Progress: 0 of 1 built, 47 of 50 downloaded from cache
  169. 55.03 s Downloading cached nix from https://cache.nix-ci.com
  170. 55.16 s Downloaded cached nix (3.9 MiB) in 123ms
  171. 55.16 s Progress: 0 of 1 built, 48 of 50 downloaded from cache
  172. 55.16 s Downloading cached nix from https://cache.nix-ci.com
  173. 55.22 s Downloaded cached nix (8848 B) in 67ms
  174. 55.22 s Progress: 0 of 1 built, 49 of 50 downloaded from cache
  175. 55.22 s Downloading cached nix-ci-check-gammaloop-nextest-integration from https://cache.nix-ci.com
  176. 55.28 s Downloaded cached nix-ci-check-gammaloop-nextest-integration (1144 B) in 60ms
  177. 55.28 s Progress: 0 of 1 built, 50 of 50 downloaded from cache
  178. 56.92 s evaluating derivation 'gdo you want to allow configuration setting 'extra-substituters' to be set to 'https://cache.nix-ci.com' (y/N)? do you want to permanently mark this value as untrusted (y/N)? warning: ignoring untrusted flake configuration setting 'extra-substituters'.
  179. 56.92 s Pass '--accept-flake-config' to trust it
  180. 56.92 s do you want to allow configuration setting 'extra-trusted-public-keys' to be set to 'nix-ci:g3xV5BDTLtIBZr/A00IU1x0EtKKlb7YLgBN2SgYgM6A=' (y/N)? do you want to permanently mark this value as untrusted (y/N)? warning: ignoring untrusted flake configuration setting 'extra-trusted-public-keys'.
  181. 56.92 s Pass '--accept-flake-config' to trust it
  182. 62.00 s copying '/nix/store/vxqg evaluating derivation 'g copying '/nix/store/vxqg evaluating derivation 'g copying '/nix/store/vxqg evaluating derivation 'g
  183. 66.73 s copying '/nix/store/vxqg evaluating derivation 'g copying '/nix/store/vxqg evaluating derivation 'g copying '/nix/store/vxqg evaluating derivation 'g copying '/nix/store/vxqg evaluating derivation 'g copying '/nix/store/vxqg evaluating derivation 'g copying '/nix/store/vxqg evaluating derivation 'g copying '/nix/store/vxqg evaluating derivation 'g copying '/nix/store/vxqg evaluating derivation 'g copying '/nix/store/vxqg evaluating derivation 'g copying '/nix/store/vxqg evaluating derivation 'g copying '/nix/store/vxqg evaluating derivation 'g copying '/nix/store/vxqg evaluating derivation 'g copying '/nix/store/vxqg evaluating derivation 'g copying '/nix/store/vxqg evaluating derivation 'g
  184. 68.68 s querying gammaloop-nexte querying info about miss querying gammaloop-nexte [2.2 KiB DL] querying in [0/3 built, 3/1/7 copied [0/3 built, 2/3/7 copied [0/2 built, 1/4/7 copied [0/2 built, 1/5/7 copied [0/2 built, 1/6/7 copied [0/1 built, 7 copied (94 [1/0/1 built, 7 copied (gammaloop-nextest-integration> Nextest worker budget: 16
  185. 68.69 s gammaloop-nextest-integration> Extracting 13 binaries (including 2 non-test binaries), 1 build script output directory, and 3 linked paths to /build/source
  186. 72.90 s gammaloop-nextest-integration> Extracted 32 files to /build/source in 4.21s
  187. 72.94 s gammaloop-nextest-integration> ------------
  188. 72.94 s gammaloop-nextest-integration> Nextest run ID 118cdc53-f243-4329-b1d5-869d4d6c75e8 with nextest profile: ci_gammaloop
  189. 72.94 s gammaloop-nextest-integration> Starting 380 tests across 11 binaries (65 tests skipped, including 61 tests via profile.default.default-filter)
  190. 95.22 s gammaloop-nextest-integration> FAIL [ 0.444s] ( 49/380) gammaloop-integration-tests::test_feyngen cross_section_standalone_export_writes_archive_and_loader
  191. 95.22 s gammaloop-nextest-integration> stdout ---
  192. 95.22 s gammaloop-nextest-integration>
  193. 95.22 s gammaloop-nextest-integration> running 1 test
  194. 95.22 s gammaloop-nextest-integration> test cross_section_standalone_export_writes_archive_and_loader ... FAILED
  195. 95.22 s gammaloop-nextest-integration>
  196. 95.22 s gammaloop-nextest-integration> failures:
  197. 95.22 s gammaloop-nextest-integration>
  198. 95.22 s gammaloop-nextest-integration> failures:
  199. 95.22 s gammaloop-nextest-integration> cross_section_standalone_export_writes_archive_and_loader
  200. 95.22 s gammaloop-nextest-integration>
  201. 95.22 s gammaloop-nextest-integration> test result: FAILED. 0 passed; 1 failed; 0 ignored; 0 measured; 37 filtered out; finished in 0.43s
  202. 95.22 s gammaloop-nextest-integration>
  203. 95.22 s gammaloop-nextest-integration> stderr ---
  204. 95.22 s gammaloop-nextest-integration> [2026-10-19 13:33:41.547] @gammaloop_api::se... INFO : Running command import model sm-default
  205. 95.22 s gammaloop-nextest-integration> [2026-10-19 13:33:41.547] @import::model INFO : Loading built-in JSON model sm-default
  206. 95.22 s gammaloop-nextest-integration> [2026-10-19 13:33:41.598] @gammalooprs::model INFO : The following 22 external parameters were forced to zero by the restriction card:
  207. 95.22 s gammaloop-nextest-integration> lamWS, AWS, rhoWS, etaWS, ymc, yme, ymm, MS, MC, Me, MM, WTau, muB, muQ, muLe, muLmu, muLtau, ymu, ymd, yms, MU, MD
  208. 95.22 s gammaloop-nextest-integration> [2026-10-19 13:33:41.599] @gammalooprs::model INFO : The following 44 vertex rules were removed by the restriction card:
  209. 95.22 s gammaloop-nextest-integration> V_82 -> (c~, d, G+) | V_83 -> (t~, d, G+) | V_84 -> (c~, s, G+) | V_85 -> (t~, s, G+) | V_86 -> (u~, b, G+) | V_87 -> (c~, b, G+) | V_90 -> (c~, d, W+) | V_91 -> (t~, d, W+) | V_92 -> (u~, s, W+) | V_94 -> (t~, s, W+) | V_95 -> (u~, b, W+) | V_96 -> (c~, b, W+) | V_101 -> (e+, e-, G0) | V_102 -> (mu+, mu-, G0) | V_104 -> (e+, e-, H) | V_105 -> (mu+, mu-, H) | V_110 -> (ve~, e-, G+) | V_111 -> (vm~, mu-, G+) | V_116 -> (b~, u, G-) | V_117 -> (d~, c, G-) | V_118 -> (s~, c, G-) | V_119 -> (b~, c, G-) | V_120 -> (d~, t, G-) | V_121 -> (s~, t, G-) | V_124 -> (s~, u, W-) | V_125 -> (b~, u, W-) | V_126 -> (d~, c, W-) | V_128 -> (b~, c, W-) | V_129 -> (d~, t, W-) | V_130 -> (s~, t, W-) | V_138 -> (c~, c, G0) | V_140 -> (c~, c, H) | V_145 -> (e+, ve, G-) | V_146 -> (mu+, vm, G-) | V_154 -> (u~, u, H) | V_155 -> (u~, u, G0) | V_156 -> (d~, d, H) | V_157 -> (d~, d, G0) | V_158 -> (s~, s, H) | V_159 -> (s~, s, G0) | V_160 -> (u~, d, G+) | V_161 -> (d~, u, G-) | V_162 -> (u~, s, G+) | V_163 -> (s~, u, G-)
  210. 95.22 s gammaloop-nextest-integration> [2026-10-19 13:33:41.599] @gammalooprs::model INFO : The following 60 couplings were removed by the restriction card:
  211. 95.22 s gammaloop-nextest-integration> GC_13, GC_14, GC_16, GC_17, GC_18, GC_19, GC_20, GC_22, GC_23, GC_24, GC_25, GC_26, GC_28, GC_29, GC_42, GC_43, GC_44, GC_46, GC_47, GC_48, GC_84, GC_85, GC_86, GC_87, GC_88, GC_89, GC_90, GC_91, GC_92, GC_93, GC_101, GC_102, GC_103, GC_105, GC_106, GC_107, GC_109, GC_110, GC_111, GC_112, GC_113, GC_114, GC_115, GC_116, GC_117, GC_118, GC_119, GC_120, GC_121, GC_122, GC_123, GC_124, GC_125, GC_126, GC_127, GC_128, GC_129, GC_130, GC_131, GC_132
  212. 95.22 s gammaloop-nextest-integration> [2026-10-19 13:33:41.610] @gammaloop_api::se... INFO : Running command set global kv global.n_cores.feyngen=1
  213. 95.22 s gammaloop-nextest-integration> [2026-10-19 13:33:41.674] @gammaloop_api::se... INFO : Running command set global kv global.generation.evaluator.store_atom=true
  214. 95.22 s gammaloop-nextest-integration> [2026-10-19 13:33:41.676] @gammaloop_api::se... INFO : Running command generate xs z > d d~
  215. 95.22 s gammaloop-nextest-integration> [2026-10-19 13:33:41.679] @feyngen::diagram_... INFO : 0s | Δ=0s | Starting Feynman graph generation with Symbolica...
  216. 95.22 s gammaloop-nextest-integration> [2026-10-19 13:33:41.680] @feyngen::diagram_... INFO : 0s | Δ=0s | Number of graphs resulting from Symbolica generation: 24
  217. 95.22 s gammaloop-nextest-integration> [2026-10-19 13:33:41.681] @feyngen::diagram_... INFO : 0s | Δ=0s | Number of graphs retained after enforcing supergraph particle content: 1
  218. 95.22 s gammaloop-nextest-integration> [2026-10-19 13:33:41.682] @feyngen::diagram_... INFO : 0s | Δ=0s | Number of graphs retained after removal of vetoed topologies: 1
  219. 95.22 s gammaloop-nextest-integration> [2026-10-19 13:33:41.682] @feyngen::diagram_... INFO : 0s | Δ=0s | Number of graphs after vertex info assignment: 1
  220. 95.22 s gammaloop-nextest-integration> [2026-10-19 13:33:41.682] @feyngen::diagram_... INFO : 0s | Δ=0s | Number of graphs after all complete graphs filters are applied: 1
  221. 95.22 s gammaloop-nextest-integration> [2026-10-19 13:33:41.682] @feyngen::diagram_... INFO : 0s | Δ=0s | Number of graphs after closed anticommutating chains analysis: 1
  222. 95.22 s gammaloop-nextest-integration> [2026-10-19 13:33:41.682] @feyngen::diagram_... INFO : 0s | Δ=0s | Number of graphs after fast Cutkosky cut filter is applied: 1
  223. 95.22 s gammaloop-nextest-integration> [2026-10-19 13:33:41.682] @feyngen::diagram_... INFO : 0s | Δ=0s | Number of graphs after symmetrization of external states: 1
  224. 95.22 s gammaloop-nextest-integration> [2026-10-19 13:33:41.683] @feyngen::diagram_... INFO : 0s | Δ=0s | Number of graphs after canonization of vertices, edges and flows (graph labels assigned here): 1
  225. 95.22 s gammaloop-nextest-integration> [2026-10-19 13:33:41.778] @feyngen::diagram_... INFO : 0s | Δ=0s | Number of graphs after numerator-aware grouping with strategy 'up to a scalar rescaling': 1 (1 isomorphically unique graph, 0 color zero, 0 lorentz zero, 0 grouped and 0 cancellation)
  226. 95.22 s gammaloop-nextest-integration> [2026-10-19 13:33:41.778] @feyngen::diagram_... INFO : ( Sum of the symmetry factors from each graph generated = -1 )
  227. 95.22 s gammaloop-nextest-integration> [2026-10-19 13:33:41.779] @commands::generate INFO : Generated cross-section 1 graphs.
  228. 95.22 s gammaloop-nextest-integration> [2026-10-19 13:33:41.816] @commands::generate INFO :
  229. 95.22 s gammaloop-nextest-integration> Integrand generation summary
  230. 95.22 s gammaloop-nextest-integration> peak RAM 97.78 MiB | cores 1
  231. 95.22 s gammaloop-nextest-integration> ╭───────────┬───────┬────────┬─────────┬─────────────┬────────────┬─────────────┬────────────────┬─────────────╮
  232. 95.22 s gammaloop-nextest-integration> │ integrand │ graph │ scope │ # evals │ total work │ expr build │ spenso │ symbolica eval │ compile │
  233. 95.22 s gammaloop-nextest-integration> ├───────────┼───────┼────────┼─────────┼─────────────┼────────────┼─────────────┼────────────────┼─────────────┤
  234. 95.22 s gammaloop-nextest-integration> │ default │ GL0 │ all │ 3 │ 35ms (100%) │ 17ms (49%) │ 9ms (27%) │ 8ms (24%) │ 0ms (0.00%) │
  235. 95.22 s gammaloop-nextest-integration> │ default │ GL0 │ shared │ 1 │ 10ms (29%) │ 8ms (25%) │ 0ms (0.00%) │ 1ms (3.7%) │ 0ms (0.00%) │
  236. 95.22 s gammaloop-nextest-integration> │ default │ GL0 │ cff │ 2 │ 25ms (71%) │ 8ms (24%) │ 9ms (27%) │ 7ms (20%) │ 0ms (0.00%) │
  237. 95.22 s gammaloop-nextest-integration> ├───────────┼───────┼────────┼─────────┼─────────────┼────────────┼─────────────┼────────────────┼─────────────┤
  238. 95.22 s gammaloop-nextest-integration> │ Total │ │ all │ 3 │ 35ms (100%) │ 17ms (49%) │ 9ms (27%) │ 8ms (24%) │ 0ms (0.00%) │
  239. 95.22 s gammaloop-nextest-integration> │ Total │ │ shared │ 1 │ 10ms (29%) │ 8ms (25%) │ 0ms (0.00%) │ 1ms (3.7%) │ 0ms (0.00%) │
  240. 95.22 s gammaloop-nextest-integration> │ Total │ │ cff │ 2 │ 25ms (71%) │ 8ms (24%) │ 9ms (27%) │ 7ms (20%) │ 0ms (0.00%) │
  241. 95.22 s gammaloop-nextest-integration> ╰───────────┴───────┴────────┴─────────┴─────────────┴────────────┴─────────────┴────────────────┴─────────────╯
  242. 95.22 s gammaloop-nextest-integration> Common graph/UV preparation and helpers are counted once. Representation rows partition the remaining work; percentages refer to the aggregate. Summed graph durations can overlap during parallel generation.
  243. 95.22 s gammaloop-nextest-integration> [2026-10-19 13:33:41.818] @gammaloop_api::se... INFO : Running command generate
  244. 95.22 s gammaloop-nextest-integration> [2026-10-19 13:33:41.850] @commands::generate INFO :
  245. 95.22 s gammaloop-nextest-integration> Integrand generation summary
  246. 95.22 s gammaloop-nextest-integration> peak RAM 104.05 MiB | cores 1
  247. 95.22 s gammaloop-nextest-integration> ╭───────────┬───────┬────────┬─────────┬─────────────┬────────────┬─────────────┬────────────────┬─────────────╮
  248. 95.22 s gammaloop-nextest-integration> │ integrand │ graph │ scope │ # evals │ total work │ expr build │ spenso │ symbolica eval │ compile │
  249. 95.22 s gammaloop-nextest-integration> ├───────────┼───────┼────────┼─────────┼─────────────┼────────────┼─────────────┼────────────────┼─────────────┤
  250. 95.22 s gammaloop-nextest-integration> │ default │ GL0 │ all │ 3 │ 31ms (100%) │ 15ms (48%) │ 8ms (27%) │ 7ms (25%) │ 0ms (0.00%) │
  251. 95.22 s gammaloop-nextest-integration> │ default │ GL0 │ shared │ 1 │ 8ms (29%) │ 7ms (25%) │ 0ms (0.00%) │ 1ms (3.6%) │ 0ms (0.00%) │
  252. 95.22 s gammaloop-nextest-integration> │ default │ GL0 │ cff │ 2 │ 22ms (71%) │ 7ms (23%) │ 8ms (27%) │ 6ms (21%) │ 0ms (0.00%) │
  253. 95.22 s gammaloop-nextest-integration> ├───────────┼───────┼────────┼─────────┼─────────────┼────────────┼─────────────┼────────────────┼─────────────┤
  254. 95.22 s gammaloop-nextest-integration> │ Total │ │ all │ 3 │ 31ms (100%) │ 15ms (48%) │ 8ms (27%) │ 7ms (25%) │ 0ms (0.00%) │
  255. 95.22 s gammaloop-nextest-integration> │ Total │ │ shared │ 1 │ 8ms (29%) │ 7ms (25%) │ 0ms (0.00%) │ 1ms (3.6%) │ 0ms (0.00%) │
  256. 95.22 s gammaloop-nextest-integration> │ Total │ │ cff │ 2 │ 22ms (71%) │ 7ms (23%) │ 8ms (27%) │ 6ms (21%) │ 0ms (0.00%) │
  257. 95.22 s gammaloop-nextest-integration> ╰───────────┴───────┴────────┴─────────┴─────────────┴────────────┴─────────────┴────────────────┴─────────────╯
  258. 95.22 s gammaloop-nextest-integration> Common graph/UV preparation and helpers are counted once. Representation rows partition the remaining work; percentages refer to the aggregate. Summed graph durations can overlap during parallel generation.
  259. 95.22 s gammaloop-nextest-integration> Error:
  260. 95.22 s gammaloop-nextest-integration> 0: standalone graph term has no cut-group integrands
  261. 95.22 s gammaloop-nextest-integration>
  262. 95.22 s gammaloop-nextest-integration> Location:
  263. 95.22 s gammaloop-nextest-integration> tests/tests/test_feyngen.rs:869
  264. 95.22 s gammaloop-nextest-integration>
  265. 95.22 s gammaloop-nextest-integration> ━━━━━━━━━━━━━━━━━━━━━━━━━━━━━━━━━━ BACKTRACE ━━━━━━━━━━━━━━━━━━━━━━━━━━━━━━━━━━━
  266. 95.22 s gammaloop-nextest-integration> 1: <color_eyre[dc2f931ed52a6dec]::config::EyreHook>::into_eyre_hook::{closure#0}<unknown>
  267. 95.22 s gammaloop-nextest-integration> at <unknown source file>:<unknown line>
  268. 95.22 s gammaloop-nextest-integration> 2: eyre[cd75025c43f23a9b]::capture_handler<unknown>
  269. 95.22 s gammaloop-nextest-integration> at <unknown source file>:<unknown line>
  270. 95.22 s gammaloop-nextest-integration> 3: eyre[cd75025c43f23a9b]::private::format_err<unknown>
  271. 95.22 s gammaloop-nextest-integration> at <unknown source file>:<unknown line>
  272. 95.22 s gammaloop-nextest-integration> 4: <test_feyngen[10c70d8025b0d425]::cross_section_standalone_export_writes_archive_and_loader::{closure#0} as core[c0acaeba6ab4c2e0]::ops::function::FnOnce<()>>::call_once<unknown>
  273. 95.22 s gammaloop-nextest-integration> at <unknown source file>:<unknown line>
  274. 95.22 s gammaloop-nextest-integration> 5: test[69f9176bb4e5faed]::__rust_begin_short_backtrace::<core[c0acaeba6ab4c2e0]::result::Result<(), alloc[12e961f32105355]::string::String>, fn() -> core[c0acaeba6ab4c2e0]::result::Result<(), alloc[12e961f32105355]::string::String>><unknown>
  275. 95.22 s gammaloop-nextest-integration> at <unknown source file>:<unknown line>
  276. 95.22 s gammaloop-nextest-integration> 6: test[69f9176bb4e5faed]::run_test::{closure#0}<unknown>
  277. 95.22 s gammaloop-nextest-integration> at <unknown source file>:<unknown line>
  278. 95.22 s gammaloop-nextest-integration> 7: std[6c98fd8553dbae28]::sys::backtrace::__rust_begin_short_backtrace::<test[69f9176bb4e5faed]::run_test::{closure#1}, ()><unknown>
  279. 95.22 s gammaloop-nextest-integration> at <unknown source file>:<unknown line>
  280. 95.22 s gammaloop-nextest-integration> 8: <std[6c98fd8553dbae28]::thread::lifecycle::spawn_unchecked<test[69f9176bb4e5faed]::run_test::{closure#1}, ()>::{closure#1} as core[c0acaeba6ab4c2e0]::ops::function::FnOnce<()>>::call_once::{shim:vtable#0}<unknown>
  281. 95.22 s gammaloop-nextest-integration> at <unknown source file>:<unknown line>
  282. 95.22 s gammaloop-nextest-integration> 9: <std[6c98fd8553dbae28]::sys::thread::unix::Thread>::new::thread_start<unknown>
  283. 95.22 s gammaloop-nextest-integration> at <unknown source file>:<unknown line>
  284. 95.22 s gammaloop-nextest-integration> 10: start_thread<unknown>
  285. 95.22 s gammaloop-nextest-integration> at <unknown source file>:<unknown line>
  286. 95.22 s gammaloop-nextest-integration> 11: __clone3<unknown>
  287. 95.22 s gammaloop-nextest-integration> at <unknown source file>:<unknown line>
  288. 95.22 s gammaloop-nextest-integration>
  289. 95.22 s gammaloop-nextest-integration> Run with COLORBT_SHOW_HIDDEN=1 environment variable to disable frame filtering.
  290. 95.22 s gammaloop-nextest-integration> Run with RUST_BACKTRACE=full to include source snippets.
  291. 95.22 s gammaloop-nextest-integration>
  292. 2257.16 s gammaloop-nextest-integration> ------------
  293. 2257.16 s gammaloop-nextest-integration> Summary [2184.229s] 380 tests run: 379 passed (5 slow), 1 failed, 65 skipped
  294. 2257.16 s gammaloop-nextest-integration> FAIL [ 0.444s] ( 49/380) gammaloop-integration-tests::test_feyngen cross_section_standalone_export_writes_archive_and_loader
  295. 2257.16 s gammaloop-nextest-integration> stdout ---
  296. 2257.16 s gammaloop-nextest-integration>
  297. 2257.16 s gammaloop-nextest-integration> running 1 test
  298. 2257.16 s gammaloop-nextest-integration> test cross_section_standalone_export_writes_archive_and_loader ... FAILED
  299. 2257.16 s gammaloop-nextest-integration>
  300. 2257.16 s gammaloop-nextest-integration> failures:
  301. 2257.16 s gammaloop-nextest-integration>
  302. 2257.16 s gammaloop-nextest-integration> failures:
  303. 2257.16 s gammaloop-nextest-integration> cross_section_standalone_export_writes_archive_and_loader
  304. 2257.16 s gammaloop-nextest-integration>
  305. 2257.16 s gammaloop-nextest-integration> test result: FAILED. 0 passed; 1 failed; 0 ignored; 0 measured; 37 filtered out; finished in 0.43s
  306. 2257.16 s gammaloop-nextest-integration>
  307. 2257.16 s gammaloop-nextest-integration> stderr ---
  308. 2257.16 s gammaloop-nextest-integration> [2026-10-19 13:33:41.547] @gammaloop_api::se... INFO : Running command import model sm-default
  309. 2257.16 s gammaloop-nextest-integration> [2026-10-19 13:33:41.547] @import::model INFO : Loading built-in JSON model sm-default
  310. 2257.16 s gammaloop-nextest-integration> [2026-10-19 13:33:41.598] @gammalooprs::model INFO : The following 22 external parameters were forced to zero by the restriction card:
  311. 2257.16 s gammaloop-nextest-integration> lamWS, AWS, rhoWS, etaWS, ymc, yme, ymm, MS, MC, Me, MM, WTau, muB, muQ, muLe, muLmu, muLtau, ymu, ymd, yms, MU, MD
  312. 2257.16 s gammaloop-nextest-integration> [2026-10-19 13:33:41.599] @gammalooprs::model INFO : The following 44 vertex rules were removed by the restriction card:
  313. 2257.17 s gammaloop-nextest-integration> V_82 -> (c~, d, G+) | V_83 -> (t~, d, G+) | V_84 -> (c~, s, G+) | V_85 -> (t~, s, G+) | V_86 -> (u~, b, G+) | V_87 -> (c~, b, G+) | V_90 -> (c~, d, W+) | V_91 -> (t~, d, W+) | V_92 -> (u~, s, W+) | V_94 -> (t~, s, W+) | V_95 -> (u~, b, W+) | V_96 -> (c~, b, W+) | V_101 -> (e+, e-, G0) | V_102 -> (mu+, mu-, G0) | V_104 -> (e+, e-, H) | V_105 -> (mu+, mu-, H) | V_110 -> (ve~, e-, G+) | V_111 -> (vm~, mu-, G+) | V_116 -> (b~, u, G-) | V_117 -> (d~, c, G-) | V_118 -> (s~, c, G-) | V_119 -> (b~, c, G-) | V_120 -> (d~, t, G-) | V_121 -> (s~, t, G-) | V_124 -> (s~, u, W-) | V_125 -> (b~, u, W-) | V_126 -> (d~, c, W-) | V_128 -> (b~, c, W-) | V_129 -> (d~, t, W-) | V_130 -> (s~, t, W-) | V_138 -> (c~, c, G0) | V_140 -> (c~, c, H) | V_145 -> (e+, ve, G-) | V_146 -> (mu+, vm, G-) | V_154 -> (u~, u, H) | V_155 -> (u~, u, G0) | V_156 -> (d~, d, H) | V_157 -> (d~, d, G0) | V_158 -> (s~, s, H) | V_159 -> (s~, s, G0) | V_160 -> (u~, d, G+) | V_161 -> (d~, u, G-) | V_162 -> (u~, s, G+) | V_163 -> (s~, u, G-)
  314. 2257.17 s gammaloop-nextest-integration> [2026-10-19 13:33:41.599] @gammalooprs::model INFO : The following 60 couplings were removed by the restriction card:
  315. 2257.17 s gammaloop-nextest-integration> GC_13, GC_14, GC_16, GC_17, GC_18, GC_19, GC_20, GC_22, GC_23, GC_24, GC_25, GC_26, GC_28, GC_29, GC_42, GC_43, GC_44, GC_46, GC_47, GC_48, GC_84, GC_85, GC_86, GC_87, GC_88, GC_89, GC_90, GC_91, GC_92, GC_93, GC_101, GC_102, GC_103, GC_105, GC_106, GC_107, GC_109, GC_110, GC_111, GC_112, GC_113, GC_114, GC_115, GC_116, GC_117, GC_118, GC_119, GC_120, GC_121, GC_122, GC_123, GC_124, GC_125, GC_126, GC_127, GC_128, GC_129, GC_130, GC_131, GC_132
  316. 2257.17 s gammaloop-nextest-integration> [2026-10-19 13:33:41.610] @gammaloop_api::se... INFO : Running command set global kv global.n_cores.feyngen=1
  317. 2257.17 s gammaloop-nextest-integration> [2026-10-19 13:33:41.674] @gammaloop_api::se... INFO : Running command set global kv global.generation.evaluator.store_atom=true
  318. 2257.17 s gammaloop-nextest-integration> [2026-10-19 13:33:41.676] @gammaloop_api::se... INFO : Running command generate xs z > d d~
  319. 2257.17 s gammaloop-nextest-integration> [2026-10-19 13:33:41.679] @feyngen::diagram_... INFO : 0s | Δ=0s | Starting Feynman graph generation with Symbolica...
  320. 2257.17 s gammaloop-nextest-integration> [2026-10-19 13:33:41.680] @feyngen::diagram_... INFO : 0s | Δ=0s | Number of graphs resulting from Symbolica generation: 24
  321. 2257.17 s gammaloop-nextest-integration> [2026-10-19 13:33:41.681] @feyngen::diagram_... INFO : 0s | Δ=0s | Number of graphs retained after enforcing supergraph particle content: 1
  322. 2257.17 s gammaloop-nextest-integration> [2026-10-19 13:33:41.682] @feyngen::diagram_... INFO : 0s | Δ=0s | Number of graphs retained after removal of vetoed topologies: 1
  323. 2257.17 s gammaloop-nextest-integration> [2026-10-19 13:33:41.682] @feyngen::diagram_... INFO : 0s | Δ=0s | Number of graphs after vertex info assignment: 1
  324. 2257.17 s gammaloop-nextest-integration> [2026-10-19 13:33:41.682] @feyngen::diagram_... INFO : 0s | Δ=0s | Number of graphs after all complete graphs filters are applied: 1
  325. 2257.17 s gammaloop-nextest-integration> [2026-10-19 13:33:41.682] @feyngen::diagram_... INFO : 0s | Δ=0s | Number of graphs after closed anticommutating chains analysis: 1
  326. 2257.17 s gammaloop-nextest-integration> [2026-10-19 13:33:41.682] @feyngen::diagram_... INFO : 0s | Δ=0s | Number of graphs after fast Cutkosky cut filter is applied: 1
  327. 2257.17 s gammaloop-nextest-integration> [2026-10-19 13:33:41.682] @feyngen::diagram_... INFO : 0s | Δ=0s | Number of graphs after symmetrization of external states: 1
  328. 2257.17 s gammaloop-nextest-integration> [2026-10-19 13:33:41.683] @feyngen::diagram_... INFO : 0s | Δ=0s | Number of graphs after canonization of vertices, edges and flows (graph labels assigned here): 1
  329. 2257.17 s gammaloop-nextest-integration> [2026-10-19 13:33:41.778] @feyngen::diagram_... INFO : 0s | Δ=0s | Number of graphs after numerator-aware grouping with strategy 'up to a scalar rescaling': 1 (1 isomorphically unique graph, 0 color zero, 0 lorentz zero, 0 grouped and 0 cancellation)
  330. 2257.17 s gammaloop-nextest-integration> [2026-10-19 13:33:41.778] @feyngen::diagram_... INFO : ( Sum of the symmetry factors from each graph generated = -1 )
  331. 2257.17 s gammaloop-nextest-integration> [2026-10-19 13:33:41.779] @commands::generate INFO : Generated cross-section 1 graphs.
  332. 2257.17 s gammaloop-nextest-integration> [2026-10-19 13:33:41.816] @commands::generate INFO :
  333. 2257.17 s gammaloop-nextest-integration> Integrand generation summary
  334. 2257.17 s gammaloop-nextest-integration> peak RAM 97.78 MiB | cores 1
  335. 2257.17 s gammaloop-nextest-integration> ╭───────────┬───────┬────────┬─────────┬─────────────┬────────────┬─────────────┬────────────────┬─────────────╮
  336. 2257.17 s gammaloop-nextest-integration> │ integrand │ graph │ scope │ # evals │ total work │ expr build │ spenso │ symbolica eval │ compile │
  337. 2257.17 s gammaloop-nextest-integration> ├───────────┼───────┼────────┼─────────┼─────────────┼────────────┼─────────────┼────────────────┼─────────────┤
  338. 2257.17 s gammaloop-nextest-integration> │ default │ GL0 │ all │ 3 │ 35ms (100%) │ 17ms (49%) │ 9ms (27%) │ 8ms (24%) │ 0ms (0.00%) │
  339. 2257.17 s gammaloop-nextest-integration> │ default │ GL0 │ shared │ 1 │ 10ms (29%) │ 8ms (25%) │ 0ms (0.00%) │ 1ms (3.7%) │ 0ms (0.00%) │
  340. 2257.17 s gammaloop-nextest-integration> │ default │ GL0 │ cff │ 2 │ 25ms (71%) │ 8ms (24%) │ 9ms (27%) │ 7ms (20%) │ 0ms (0.00%) │
  341. 2257.17 s gammaloop-nextest-integration> ├───────────┼───────┼────────┼─────────┼─────────────┼────────────┼─────────────┼────────────────┼─────────────┤
  342. 2257.17 s gammaloop-nextest-integration> │ Total │ │ all │ 3 │ 35ms (100%) │ 17ms (49%) │ 9ms (27%) │ 8ms (24%) │ 0ms (0.00%) │
  343. 2257.17 s gammaloop-nextest-integration> │ Total │ │ shared │ 1 │ 10ms (29%) │ 8ms (25%) │ 0ms (0.00%) │ 1ms (3.7%) │ 0ms (0.00%) │
  344. 2257.17 s gammaloop-nextest-integration> │ Total │ │ cff │ 2 │ 25ms (71%) │ 8ms (24%) │ 9ms (27%) │ 7ms (20%) │ 0ms (0.00%) │
  345. 2257.17 s gammaloop-nextest-integration> ╰───────────┴───────┴────────┴─────────┴─────────────┴────────────┴─────────────┴────────────────┴─────────────╯
  346. 2257.17 s gammaloop-nextest-integration> Common graph/UV preparation and helpers are counted once. Representation rows partition the remaining work; percentages refer to the aggregate. Summed graph durations can overlap during parallel generation.
  347. 2257.17 s gammaloop-nextest-integration> [2026-10-19 13:33:41.818] @gammaloop_api::se... INFO : Running command generate
  348. 2257.17 s gammaloop-nextest-integration> [2026-10-19 13:33:41.850] @commands::generate INFO :
  349. 2257.17 s gammaloop-nextest-integration> Integrand generation summary
  350. 2257.17 s gammaloop-nextest-integration> peak RAM 104.05 MiB | cores 1
  351. 2257.17 s gammaloop-nextest-integration> ╭───────────┬───────┬────────┬─────────┬─────────────┬────────────┬─────────────┬────────────────┬─────────────╮
  352. 2257.17 s gammaloop-nextest-integration> │ integrand │ graph │ scope │ # evals │ total work │ expr build │ spenso │ symbolica eval │ compile │
  353. 2257.17 s gammaloop-nextest-integration> ├───────────┼───────┼────────┼─────────┼─────────────┼────────────┼─────────────┼────────────────┼─────────────┤
  354. 2257.17 s gammaloop-nextest-integration> │ default │ GL0 │ all │ 3 │ 31ms (100%) │ 15ms (48%) │ 8ms (27%) │ 7ms (25%) │ 0ms (0.00%) │
  355. 2257.17 s gammaloop-nextest-integration> │ default │ GL0 │ shared │ 1 │ 8ms (29%) │ 7ms (25%) │ 0ms (0.00%) │ 1ms (3.6%) │ 0ms (0.00%) │
  356. 2257.17 s gammaloop-nextest-integration> │ default │ GL0 │ cff │ 2 │ 22ms (71%) │ 7ms (23%) │ 8ms (27%) │ 6ms (21%) │ 0ms (0.00%) │
  357. 2257.17 s gammaloop-nextest-integration> ├───────────┼───────┼────────┼─────────┼─────────────┼────────────┼─────────────┼────────────────┼─────────────┤
  358. 2257.17 s gammaloop-nextest-integration> │ Total │ │ all │ 3 │ 31ms (100%) │ 15ms (48%) │ 8ms (27%) │ 7ms (25%) │ 0ms (0.00%) │
  359. 2257.17 s gammaloop-nextest-integration> │ Total │ │ shared │ 1 │ 8ms (29%) │ 7ms (25%) │ 0ms (0.00%) │ 1ms (3.6%) │ 0ms (0.00%) │
  360. 2257.17 s gammaloop-nextest-integration> │ Total │ │ cff │ 2 │ 22ms (71%) │ 7ms (23%) │ 8ms (27%) │ 6ms (21%) │ 0ms (0.00%) │
  361. 2257.17 s gammaloop-nextest-integration> ╰───────────┴───────┴────────┴─────────┴─────────────┴────────────┴─────────────┴────────────────┴─────────────╯
  362. 2257.17 s gammaloop-nextest-integration> Common graph/UV preparation and helpers are counted once. Representation rows partition the remaining work; percentages refer to the aggregate. Summed graph durations can overlap during parallel generation.
  363. 2257.17 s gammaloop-nextest-integration> Error:
  364. 2257.17 s gammaloop-nextest-integration> 0: standalone graph term has no cut-group integrands
  365. 2257.17 s gammaloop-nextest-integration>
  366. 2257.17 s gammaloop-nextest-integration> Location:
  367. 2257.17 s gammaloop-nextest-integration> tests/tests/test_feyngen.rs:869
  368. 2257.17 s gammaloop-nextest-integration>
  369. 2257.17 s gammaloop-nextest-integration> ━━━━━━━━━━━━━━━━━━━━━━━━━━━━━━━━━━ BACKTRACE ━━━━━━━━━━━━━━━━━━━━━━━━━━━━━━━━━━━
  370. 2257.17 s gammaloop-nextest-integration> 1: <color_eyre[dc2f931ed52a6dec]::config::EyreHook>::into_eyre_hook::{closure#0}<unknown>
  371. 2257.17 s gammaloop-nextest-integration> at <unknown source file>:<unknown line>
  372. 2257.17 s gammaloop-nextest-integration> 2: eyre[cd75025c43f23a9b]::capture_handler<unknown>
  373. 2257.17 s gammaloop-nextest-integration> at <unknown source file>:<unknown line>
  374. 2257.17 s gammaloop-nextest-integration> 3: eyre[cd75025c43f23a9b]::private::format_err<unknown>
  375. 2257.17 s gammaloop-nextest-integration> at <unknown source file>:<unknown line>
  376. 2257.17 s gammaloop-nextest-integration> 4: <test_feyngen[10c70d8025b0d425]::cross_section_standalone_export_writes_archive_and_loader::{closure#0} as core[c0acaeba6ab4c2e0]::ops::function::FnOnce<()>>::call_once<unknown>
  377. 2257.17 s gammaloop-nextest-integration> at <unknown source file>:<unknown line>
  378. 2257.17 s gammaloop-nextest-integration> 5: test[69f9176bb4e5faed]::__rust_begin_short_backtrace::<core[c0acaeba6ab4c2e0]::result::Result<(), alloc[12e961f32105355]::string::String>, fn() -> core[c0acaeba6ab4c2e0]::result::Result<(), alloc[12e961f32105355]::string::String>><unknown>
  379. 2257.17 s gammaloop-nextest-integration> at <unknown source file>:<unknown line>
  380. 2257.17 s gammaloop-nextest-integration> 6: test[69f9176bb4e5faed]::run_test::{closure#0}<unknown>
  381. 2257.17 s gammaloop-nextest-integration> at <unknown source file>:<unknown line>
  382. 2257.17 s gammaloop-nextest-integration> 7: std[6c98fd8553dbae28]::sys::backtrace::__rust_begin_short_backtrace::<test[69f9176bb4e5faed]::run_test::{closure#1}, ()><unknown>
  383. 2257.17 s gammaloop-nextest-integration> at <unknown source file>:<unknown line>
  384. 2257.17 s gammaloop-nextest-integration> 8: <std[6c98fd8553dbae28]::thread::lifecycle::spawn_unchecked<test[69f9176bb4e5faed]::run_test::{closure#1}, ()>::{closure#1} as core[c0acaeba6ab4c2e0]::ops::function::FnOnce<()>>::call_once::{shim:vtable#0}<unknown>
  385. 2257.17 s gammaloop-nextest-integration> at <unknown source file>:<unknown line>
  386. 2257.17 s gammaloop-nextest-integration> 9: <std[6c98fd8553dbae28]::sys::thread::unix::Thread>::new::thread_start<unknown>
  387. 2257.17 s gammaloop-nextest-integration> at <unknown source file>:<unknown line>
  388. 2257.17 s gammaloop-nextest-integration> 10: start_thread<unknown>
  389. 2257.17 s gammaloop-nextest-integration> at <unknown source file>:<unknown line>
  390. 2257.17 s gammaloop-nextest-integration> 11: __clone3<unknown>
  391. 2257.17 s gammaloop-nextest-integration> at <unknown source file>:<unknown line>
  392. 2257.17 s gammaloop-nextest-integration>
  393. 2257.17 s gammaloop-nextest-integration> Run with COLORBT_SHOW_HIDDEN=1 environment variable to disable frame filtering.
  394. 2257.17 s gammaloop-nextest-integration> Run with RUST_BACKTRACE=full to include source snippets.
  395. 2257.17 s gammaloop-nextest-integration>
  396. 2257.18 s gammaloop-nextest-integration> error: test run failed
  397. 2257.21 s gammaloop-nextest-integration>
  398. 2257.21 s gammaloop-nextest-integration> ========== nextest test summary ==========
  399. 2257.21 s gammaloop-nextest-integration> report: target/nextest/ci_gammaloop/junit.xml
  400. 2257.21 s gammaloop-nextest-integration> tests: 380, failures: 1, errors: 0
  401. 2257.21 s gammaloop-nextest-integration>
  402. 2257.21 s gammaloop-nextest-integration> 1. gammaloop-integration-tests::test_feyngen::cross_section_standalone_export_writes_archive_and_loader
  403. 2257.21 s gammaloop-nextest-integration> failure: test failure with exit code 101
  404. 2257.21 s gammaloop-nextest-integration> Error:
  405. 2257.21 s gammaloop-nextest-integration> 0: standalone graph term has no cut-group integrands
  406. 2257.21 s gammaloop-nextest-integration>
  407. 2257.21 s gammaloop-nextest-integration> Location:
  408. 2257.21 s gammaloop-nextest-integration> tests/tests/test_feyngen.rs:869
  409. 2257.21 s gammaloop-nextest-integration>
  410. 2257.21 s gammaloop-nextest-integration> ━━━━━━━━━━━━━━━━━━━━━━━━━━━━━━━━━━ BACKTRACE ━━━━━━━━━━━━━━━━━━━━━━━━━━━━━━━━━━━
  411. 2257.21 s gammaloop-nextest-integration> 1: <color_eyre[dc2f931ed52a6dec]::config::EyreHook>::into_eyre_hook::{closure#0}<unknown>
  412. 2257.21 s gammaloop-nextest-integration> at <unknown source file>:<unknown line>
  413. 2257.21 s gammaloop-nextest-integration> 2: eyre[cd75025c43f23a9b]::capture_handler<unknown>
  414. 2257.21 s gammaloop-nextest-integration> at <unknown source file>:<unknown line>
  415. 2257.21 s gammaloop-nextest-integration> 3: eyre[cd75025c43f23a9b]::private::format_err<unknown>
  416. 2257.21 s gammaloop-nextest-integration> at <unknown source file>:<unknown line>
  417. 2257.21 s gammaloop-nextest-integration> 4: <test_feyngen[10c70d8025b0d425]::cross_section_standalone_export_writes_archive_and_loader::{closure#0} as core[c0acaeba6ab4c2e0]::ops::function::FnOnce<()>>::call_once<unknown>
  418. 2257.21 s gammaloop-nextest-integration> at <unknown source file>:<unknown line>
  419. 2257.21 s gammaloop-nextest-integration> 5: test[69f9176bb4e5faed]::__rust_begin_short_backtrace::<core[c0acaeba6ab4c2e0]::result::Result<(), alloc[12e961f32105355]::string::String>, fn() -> core[c0acaeba6ab4c2e0]::result::Result<(), alloc[12e961f32105355]::string::String>><unknown>
  420. 2257.21 s gammaloop-nextest-integration> at <unknown source file>:<unknown line>
  421. 2257.21 s gammaloop-nextest-integration> 6: test[69f9176bb4e5faed]::run_test::{closure#0}<unknown>
  422. 2257.21 s gammaloop-nextest-integration> at <unknown source file>:<unknown line>
  423. 2257.21 s gammaloop-nextest-integration> 7: std[6c98fd8553dbae28]::sys::backtrace::__rust_begin_short_backtrace::<test[69f9176bb4e5faed]::run_test::{closure#1}, ()><unknown>
  424. 2257.21 s gammaloop-nextest-integration> at <unknown source file>:<unknown line>
  425. 2257.21 s gammaloop-nextest-integration> 8: <std[6c98fd8553dbae28]::thread::lifecycle::spawn_unchecked<test[69f9176bb4e5faed]::run_test::{closure#1}, ()>::{closure#1} as core[c0acaeba6ab4c2e0]::ops::function::FnOnce<()>>::call_once::{shim:vtable#0}<unknown>
  426. 2257.21 s gammaloop-nextest-integration> at <unknown source file>:<unknown line>
  427. 2257.21 s gammaloop-nextest-integration> 9: <std[6c98fd8553dbae28]::sys::thread::unix::Thread>::new::thread_start<unknown>
  428. 2257.21 s gammaloop-nextest-integration> at <unknown source file>:<unknown line>
  429. 2257.21 s gammaloop-nextest-integration> 10: start_thread<unknown>
  430. 2257.21 s gammaloop-nextest-integration> at <unknown source file>:<unknown line>
  431. 2257.21 s gammaloop-nextest-integration> 11: __clone3<unknown>
  432. 2257.21 s gammaloop-nextest-integration> at <unknown source file>:<unknown line>
  433. 2257.21 s gammaloop-nextest-integration>
  434. 2257.21 s gammaloop-nextest-integration> Run with COLORBT_SHOW_HIDDEN=1 environment variable to disable frame filtering.
  435. 2257.21 s gammaloop-nextest-integration> Run with RUST_BACKTRACE=full to include source snippets.
  436. 2257.21 s gammaloop-nextest-integration> system-out
  437. 2257.21 s gammaloop-nextest-integration> running 1 test
  438. 2257.21 s gammaloop-nextest-integration> test cross_section_standalone_export_writes_archive_and_loader ... FAILED
  439. 2257.21 s gammaloop-nextest-integration>
  440. 2257.21 s gammaloop-nextest-integration> failures:
  441. 2257.21 s gammaloop-nextest-integration>
  442. 2257.21 s gammaloop-nextest-integration> failures:
  443. 2257.21 s gammaloop-nextest-integration> cross_section_standalone_export_writes_archive_and_loader
  444. 2257.21 s gammaloop-nextest-integration>
  445. 2257.21 s gammaloop-nextest-integration> test result: FAILED. 0 passed; 1 failed; 0 ignored; 0 measured; 37 filtered out; finished in 0.43s
  446. 2257.21 s gammaloop-nextest-integration> system-err
  447. 2257.21 s gammaloop-nextest-integration> [2026-10-19 13:33:41.547] @gammaloop_api::se... INFO : Running command import model sm-default
  448. 2257.21 s gammaloop-nextest-integration> [2026-10-19 13:33:41.547] @import::model INFO : Loading built-in JSON model sm-default
  449. 2257.21 s gammaloop-nextest-integration> [2026-10-19 13:33:41.598] @gammalooprs::model INFO : The following 22 external parameters were forced to zero by the restriction card:
  450. 2257.21 s gammaloop-nextest-integration> lamWS, AWS, rhoWS, etaWS, ymc, yme, ymm, MS, MC, Me, MM, WTau, muB, muQ, muLe, muLmu, muLtau, ymu, ymd, yms, MU, MD
  451. 2257.21 s gammaloop-nextest-integration> [2026-10-19 13:33:41.599] @gammalooprs::model INFO : The following 44 vertex rules were removed by the restriction card:
  452. 2257.21 s gammaloop-nextest-integration> V_82 -> (c~, d, G+) | V_83 -> (t~, d, G+) | V_84 -> (c~, s, G+) | V_85 -> (t~, s, G+) | V_86 -> (u~, b, G+) | V_87 -> (c~, b, G+) | V_90 -> (c~, d, W+) | V_91 -> (t~, d, W+) | V_92 -> (u~, s, W+) | V_94 -> (t~, s, W+) | V_95 -> (u~, b, W+) | V_96 -> (c~, b, W+) | V_101 -> (e+, e-, G0) | V_102 -> (mu+, mu-, G0) | V_104 -> (e+, e-, H) | V_105 -> (mu+, mu-, H) | V_110 -> (ve~, e-, G+) | V_111 -> (vm~, mu-, G+) | V_116 -> (b~, u, G-) | V_117 -> (d~, c, G-) | V_118 -> (s~, c, G-) | V_119 -> (b~, c, G-) | V_120 -> (d~, t, G-) | V_121 -> (s~, t, G-) | V_124 -> (s~, u, W-) | V_125 -> (b~, u, W-) | V_126 -> (d~, c, W-) | V_128 -> (b~, c, W-) | V_129 -> (d~, t, W-) | V_130 -> (s~, t, W-) | V_138 -> (c~, c, G0) | V_140 -> (c~, c, H) | V_145 -> (e+, ve, G-) | V_146 -> (mu+, vm, G-) | V_154 -> (u~, u, H) | V_155 -> (u~, u, G0) | V_156 -> (d~, d, H) | V_157 -> (d~, d, G0) | V_158 -> (s~, s, H) | V_159 -> (s~, s, G0) | V_160 -> (u~, d, G+) | V_161 -> (d~, u, G-) | V_162 -> (u~, s, G+) | V_163 -> (s~, u, G-)
  453. 2257.21 s gammaloop-nextest-integration> [2026-10-19 13:33:41.599] @gammalooprs::model INFO : The following 60 couplings were removed by the restriction card:
  454. 2257.21 s gammaloop-nextest-integration> GC_13, GC_14, GC_16, GC_17, GC_18, GC_19, GC_20, GC_22, GC_23, GC_24, GC_25, GC_26, GC_28, GC_29, GC_42, GC_43, GC_44, GC_46, GC_47, GC_48, GC_84, GC_85, GC_86, GC_87, GC_88, GC_89, GC_90, GC_91, GC_92, GC_93, GC_101, GC_102, GC_103, GC_105, GC_106, GC_107, GC_109, GC_110, GC_111, GC_112, GC_113, GC_114, GC_115, GC_116, GC_117, GC_118, GC_119, GC_120, GC_121, GC_122, GC_123, GC_124, GC_125, GC_126, GC_127, GC_128, GC_129, GC_130, GC_131, GC_132
  455. 2257.21 s gammaloop-nextest-integration> [2026-10-19 13:33:41.610] @gammaloop_api::se... INFO : Running command set global kv global.n_cores.feyngen=1
  456. 2257.21 s gammaloop-nextest-integration> [2026-10-19 13:33:41.674] @gammaloop_api::se... INFO : Running command set global kv global.generation.evaluator.store_atom=true
  457. 2257.21 s gammaloop-nextest-integration> [2026-10-19 13:33:41.676] @gammaloop_api::se... INFO : Running command generate xs z > d d~
  458. 2257.21 s gammaloop-nextest-integration> [2026-10-19 13:33:41.679] @feyngen::diagram_... INFO : 0s | Δ=0s | Starting Feynman graph generation with Symbolica...
  459. 2257.21 s gammaloop-nextest-integration> [2026-10-19 13:33:41.680] @feyngen::diagram_... INFO : 0s | Δ=0s | Number of graphs resulting from Symbolica generation: 24
  460. 2257.21 s gammaloop-nextest-integration> [2026-10-19 13:33:41.681] @feyngen::diagram_... INFO : 0s | Δ=0s | Number of graphs retained after enforcing supergraph particle content: 1
  461. 2257.21 s gammaloop-nextest-integration> [2026-10-19 13:33:41.682] @feyngen::diagram_... INFO : 0s | Δ=0s | Number of graphs retained after removal of vetoed topologies: 1
  462. 2257.21 s gammaloop-nextest-integration> [2026-10-19 13:33:41.682] @feyngen::diagram_... INFO : 0s | Δ=0s | Number of graphs after vertex info assignment: 1
  463. 2257.22 s gammaloop-nextest-integration> [2026-10-19 13:33:41.682] @feyngen::diagram_... INFO : 0s | Δ=0s | Number of graphs after all complete graphs filters are applied: 1
  464. 2257.22 s gammaloop-nextest-integration> [2026-10-19 13:33:41.682] @feyngen::diagram_... INFO : 0s | Δ=0s | Number of graphs after closed anticommutating chains analysis: 1
  465. 2257.22 s gammaloop-nextest-integration> [2026-10-19 13:33:41.682] @feyngen::diagram_... INFO : 0s | Δ=0s | Number of graphs after fast Cutkosky cut filter is applied: 1
  466. 2257.22 s gammaloop-nextest-integration> [2026-10-19 13:33:41.682] @feyngen::diagram_... INFO : 0s | Δ=0s | Number of graphs after symmetrization of external states: 1
  467. 2257.22 s gammaloop-nextest-integration> [2026-10-19 13:33:41.683] @feyngen::diagram_... INFO : 0s | Δ=0s | Number of graphs after canonization of vertices, edges and flows (graph labels assigned here): 1
  468. 2257.22 s gammaloop-nextest-integration> [2026-10-19 13:33:41.778] @feyngen::diagram_... INFO : 0s | Δ=0s | Number of graphs after numerator-aware grouping with strategy 'up to a scalar rescaling': 1 (1 isomorphically unique graph, 0 color zero, 0 lorentz zero, 0 grouped and 0 cancellation)
  469. 2257.22 s gammaloop-nextest-integration> [2026-10-19 13:33:41.778] @feyngen::diagram_... INFO : ( Sum of the symmetry factors from each graph generated = -1 )
  470. 2257.22 s gammaloop-nextest-integration> [2026-10-19 13:33:41.779] @commands::generate INFO : Generated cross-section 1 graphs.
  471. 2257.22 s gammaloop-nextest-integration> [2026-10-19 13:33:41.816] @commands::generate INFO :
  472. 2257.22 s gammaloop-nextest-integration> Integrand generation summary
  473. 2257.22 s gammaloop-nextest-integration> peak RAM 97.78 MiB | cores 1
  474. 2257.22 s gammaloop-nextest-integration> ╭───────────┬───────┬────────┬─────────┬─────────────┬────────────┬─────────────┬────────────────┬─────────────╮
  475. 2257.22 s gammaloop-nextest-integration> │ integrand │ graph │ scope │ # evals │ total work │ expr build │ spenso │ symbolica eval │ compile │
  476. 2257.22 s gammaloop-nextest-integration> ├───────────┼───────┼────────┼─────────┼─────────────┼────────────┼─────────────┼────────────────┼─────────────┤
  477. 2257.22 s gammaloop-nextest-integration> │ default │ GL0 │ all │ 3 │ 35ms (100%) │ 17ms (49%) │ 9ms (27%) │ 8ms (24%) │ 0ms (0.00%) │
  478. 2257.22 s gammaloop-nextest-integration> │ default │ GL0 │ shared │ 1 │ 10ms (29%) │ 8ms (25%) │ 0ms (0.00%) │ 1ms (3.7%) │ 0ms (0.00%) │
  479. 2257.22 s gammaloop-nextest-integration> │ default │ GL0 │ cff │ 2 │ 25ms (71%) │ 8ms (24%) │ 9ms (27%) │ 7ms (20%) │ 0ms (0.00%) │
  480. 2257.22 s gammaloop-nextest-integration> ├───────────┼───────┼────────┼─────────┼─────────────┼────────────┼─────────────┼────────────────┼─────────────┤
  481. 2257.22 s gammaloop-nextest-integration> │ Total │ │ all │ 3 │ 35ms (100%) │ 17ms (49%) │ 9ms (27%) │ 8ms (24%) │ 0ms (0.00%) │
  482. 2257.22 s gammaloop-nextest-integration> │ Total │ │ shared │ 1 │ 10ms (29%) │ 8ms (25%) │ 0ms (0.00%) │ 1ms (3.7%) │ 0ms (0.00%) │
  483. 2257.22 s gammaloop-nextest-integration> │ Total │ │ cff │ 2 │ 25ms (71%) │ 8ms (24%) │ 9ms (27%) │ 7ms (20%) │ 0ms (0.00%) │
  484. 2257.22 s gammaloop-nextest-integration> ╰───────────┴───────┴────────┴─────────┴─────────────┴────────────┴─────────────┴────────────────┴─────────────╯
  485. 2257.22 s gammaloop-nextest-integration> Common graph/UV preparation and helpers are counted once. Representation rows partition the remaining work; percentages refer to the aggregate. Summed graph durations can overlap during parallel generation.
  486. 2257.22 s gammaloop-nextest-integration> [2026-10-19 13:33:41.818] @gammaloop_api::se... INFO : Running command generate
  487. 2257.22 s gammaloop-nextest-integration> [2026-10-19 13:33:41.850] @commands::generate INFO :
  488. 2257.22 s gammaloop-nextest-integration> Integrand generation summary
  489. 2257.22 s gammaloop-nextest-integration> peak RAM 104.05 MiB | cores 1
  490. 2257.22 s gammaloop-nextest-integration> ╭───────────┬───────┬────────┬─────────┬─────────────┬────────────┬─────────────┬────────────────┬─────────────╮
  491. 2257.22 s gammaloop-nextest-integration> │ integrand │ graph │ scope │ # evals │ total work │ expr build │ spenso │ symbolica eval │ compile │
  492. 2257.22 s gammaloop-nextest-integration> ├───────────┼───────┼────────┼─────────┼─────────────┼────────────┼─────────────┼────────────────┼─────────────┤
  493. 2257.22 s gammaloop-nextest-integration> │ default │ GL0 │ all │ 3 │ 31ms (100%) │ 15ms (48%) │ 8ms (27%) │ 7ms (25%) │ 0ms (0.00%) │
  494. 2257.22 s gammaloop-nextest-integration> │ default │ GL0 │ shared │ 1 │ 8ms (29%) │ 7ms (25%) │ 0ms (0.00%) │ 1ms (3.6%) │ 0ms (0.00%) │
  495. 2257.22 s gammaloop-nextest-integration> │ default │ GL0 │ cff │ 2 │ 22ms (71%) │ 7ms (23%) │ 8ms (27%) │ 6ms (21%) │ 0ms (0.00%) │
  496. 2257.22 s gammaloop-nextest-integration> ├───────────┼───────┼────────┼─────────┼─────────────┼────────────┼─────────────┼────────────────┼─────────────┤
  497. 2257.22 s gammaloop-nextest-integration> │ Total │ │ all │ 3 │ 31ms (100%) │ 15ms (48%) │ 8ms (27%) │ 7ms (25%) │ 0ms (0.00%) │
  498. 2257.22 s gammaloop-nextest-integration> │ Total │ │ shared │ 1 │ 8ms (29%) │ 7ms (25%) │ 0ms (0.00%) │ 1ms (3.6%) │ 0ms (0.00%) │
  499. 2257.22 s gammaloop-nextest-integration> │ Total │ │ cff │ 2 │ 22ms (71%) │ 7ms (23%) │ 8ms (27%) │ 6ms (21%) │ 0ms (0.00%) │
  500. 2257.22 s gammaloop-nextest-integration> ╰───────────┴───────┴────────┴─────────┴─────────────┴────────────┴─────────────┴────────────────┴─────────────╯
  501. 2257.22 s gammaloop-nextest-integration> Common graph/UV preparation and helpers are counted once. Representation rows partition the remaining work; percentages refer to the aggregate. Summed graph durations can overlap during parallel generation.
  502. 2257.22 s gammaloop-nextest-integration> Error:
  503. 2257.22 s gammaloop-nextest-integration> 0: standalone graph term has no cut-group integrands
  504. 2257.22 s gammaloop-nextest-integration>
  505. 2257.22 s gammaloop-nextest-integration> Location:
  506. 2257.22 s gammaloop-nextest-integration> tests/tests/test_feyngen.rs:869
  507. 2257.22 s gammaloop-nextest-integration>
  508. 2257.22 s gammaloop-nextest-integration> ━━━━━━━━━━━━━━━━━━━━━━━━━━━━━━━━━━ BACKTRACE ━━━━━━━━━━━━━━━━━━━━━━━━━━━━━━━━━━━
  509. 2257.22 s gammaloop-nextest-integration> 1: <color_eyre[dc2f931ed52a6dec]::config::EyreHook>::into_eyre_hook::{closure#0}<unknown>
  510. 2257.22 s gammaloop-nextest-integration> at <unknown source file>:<unknown line>
  511. 2257.22 s gammaloop-nextest-integration> 2: eyre[cd75025c43f23a9b]::capture_handler<unknown>
  512. 2257.22 s gammaloop-nextest-integration> at <unknown source file>:<unknown line>
  513. 2257.22 s gammaloop-nextest-integration> 3: eyre[cd75025c43f23a9b]::private::format_err<unknown>
  514. 2257.22 s gammaloop-nextest-integration> at <unknown source file>:<unknown line>
  515. 2257.22 s gammaloop-nextest-integration> 4: <test_feyngen[10c70d8025b0d425]::cross_section_standalone_export_writes_archive_and_loader::{closure#0} as core[c0acaeba6ab4c2e0]::ops::function::FnOnce<()>>::call_once<unknown>
  516. 2257.22 s gammaloop-nextest-integration> at <unknown source file>:<unknown line>
  517. 2257.22 s gammaloop-nextest-integration> 5: test[69f9176bb4e5faed]::__rust_begin_short_backtrace::<core[c0acaeba6ab4c2e0]::result::Result<(), alloc[12e961f32105355]::string::String>, fn() -> core[c0acaeba6ab4c2e0]::result::Result<(), alloc[12e961f32105355]::string::String>><unknown>
  518. 2257.22 s gammaloop-nextest-integration> at <unknown source file>:<unknown line>
  519. 2257.22 s gammaloop-nextest-integration> 6: test[69f9176bb4e5faed]::run_test::{closure#0}<unknown>
  520. 2257.22 s gammaloop-nextest-integration> at <unknown source file>:<unknown line>
  521. 2257.22 s gammaloop-nextest-integration> 7: std[6c98fd8553dbae28]::sys::backtrace::__rust_begin_short_backtrace::<test[69f9176bb4e5faed]::run_test::{closure#1}, ()><unknown>
  522. 2257.22 s gammaloop-nextest-integration> at <unknown source file>:<unknown line>
  523. 2257.22 s gammaloop-nextest-integration> 8: <std[6c98fd8553dbae28]::thread::lifecycle::spawn_unchecked<test[69f9176bb4e5faed]::run_test::{closure#1}, ()>::{closure#1} as core[c0acaeba6ab4c2e0]::ops::function::FnOnce<()>>::call_once::{shim:vtable#0}<unknown>
  524. 2257.22 s gammaloop-nextest-integration> at <unknown source file>:<unknown line>
  525. 2257.22 s gammaloop-nextest-integration> 9: <std[6c98fd8553dbae28]::sys::thread::unix::Thread>::new::thread_start<unknown>
  526. 2257.22 s gammaloop-nextest-integration> at <unknown source file>:<unknown line>
  527. 2257.22 s gammaloop-nextest-integration> 10: start_thread<unknown>
  528. 2257.22 s gammaloop-nextest-integration> at <unknown source file>:<unknown line>
  529. 2257.22 s gammaloop-nextest-integration> 11: __clone3<unknown>
  530. 2257.22 s gammaloop-nextest-integration> at <unknown source file>:<unknown line>
  531. 2257.22 s gammaloop-nextest-integration>
  532. 2257.22 s gammaloop-nextest-integration> Run with COLORBT_SHOW_HIDDEN=1 environment variable to disable frame filtering.
  533. 2257.22 s gammaloop-nextest-integration> Run with RUST_BACKTRACE=full to include source snippets.
  534. 2257.22 s gammaloop-nextest-integration> =========================================
  535. 2257.84 s error: Cannot build '/nix/store/x2iz5qc4w97m9cdhy2bcp2l2hw1pfpw5-gammaloop-nextest-integration.drv'.
  536. 2257.84 s Reason: builder failed with exit code 100.
  537. 2257.84 s Output paths:
  538. 2257.84 s /nix/store/12yf3xmzm8whr0nhwchcvdfvzdxll6yk-gammaloop-nextest-integration
  539. 2257.84 s Last 351 log lines:
  540. 2257.84 s > Nextest worker budget: 16
  541. 2257.84 s > Extracting 13 binaries (including 2 non-test binaries), 1 build script output directory, and 3 linked paths to /build/source
  542. 2257.84 s > Extracted 32 files to /build/source in 4.21s
  543. 2257.84 s > ------------
  544. 2257.84 s > Nextest run ID 118cdc53-f243-4329-b1d5-869d4d6c75e8 with nextest profile: ci_gammaloop
  545. 2257.84 s > Starting 380 tests across 11 binaries (65 tests skipped, including 61 tests via profile.default.default-filter)
  546. 2257.84 s > FAIL [ 0.444s] ( 49/380) gammaloop-integration-tests::test_feyngen cross_section_standalone_export_writes_archive_and_loader
  547. 2257.84 s > stdout ---
  548. 2257.84 s >
  549. 2257.84 s > running 1 test
  550. 2257.84 s > test cross_section_standalone_export_writes_archive_and_loader ... FAILED
  551. 2257.84 s >
  552. 2257.84 s > failures:
  553. 2257.84 s >
  554. 2257.84 s > failures:
  555. 2257.84 s > cross_section_standalone_export_writes_archive_and_loader
  556. 2257.84 s >
  557. 2257.84 s > test result: FAILED. 0 passed; 1 failed; 0 ignored; 0 measured; 37 filtered out; finished in 0.43s
  558. 2257.84 s >
  559. 2257.84 s > stderr ---
  560. 2257.84 s > [2026-10-19 13:33:41.547] @gammaloop_api::se... INFO : Running command import model sm-default
  561. 2257.84 s > [2026-10-19 13:33:41.547] @import::model INFO : Loading built-in JSON model sm-default
  562. 2257.84 s > [2026-10-19 13:33:41.598] @gammalooprs::model INFO : The following 22 external parameters were forced to zero by the restriction card:
  563. 2257.84 s > lamWS, AWS, rhoWS, etaWS, ymc, yme, ymm, MS, MC, Me, MM, WTau, muB, muQ, muLe, muLmu, muLtau, ymu, ymd, yms, MU, MD
  564. 2257.84 s > [2026-10-19 13:33:41.599] @gammalooprs::model INFO : The following 44 vertex rules were removed by the restriction card:
  565. 2257.84 s > V_82 -> (c~, d, G+) | V_83 -> (t~, d, G+) | V_84 -> (c~, s, G+) | V_85 -> (t~, s, G+) | V_86 -> (u~, b, G+) | V_87 -> (c~, b, G+) | V_90 -> (c~, d, W+) | V_91 -> (t~, d, W+) | V_92 -> (u~, s, W+) | V_94 -> (t~, s, W+) | V_95 -> (u~, b, W+) | V_96 -> (c~, b, W+) | V_101 -> (e+, e-, G0) | V_102 -> (mu+, mu-, G0) | V_104 -> (e+, e-, H) | V_105 -> (mu+, mu-, H) | V_110 -> (ve~, e-, G+) | V_111 -> (vm~, mu-, G+) | V_116 -> (b~, u, G-) | V_117 -> (d~, c, G-) | V_118 -> (s~, c, G-) | V_119 -> (b~, c, G-) | V_120 -> (d~, t, G-) | V_121 -> (s~, t, G-) | V_124 -> (s~, u, W-) | V_125 -> (b~, u, W-) | V_126 -> (d~, c, W-) | V_128 -> (b~, c, W-) | V_129 -> (d~, t, W-) | V_130 -> (s~, t, W-) | V_138 -> (c~, c, G0) | V_140 -> (c~, c, H) | V_145 -> (e+, ve, G-) | V_146 -> (mu+, vm, G-) | V_154 -> (u~, u, H) | V_155 -> (u~, u, G0) | V_156 -> (d~, d, H) | V_157 -> (d~, d, G0) | V_158 -> (s~, s, H) | V_159 -> (s~, s, G0) | V_160 -> (u~, d, G+) | V_161 -> (d~, u, G-) | V_162 -> (u~, s, G+) | V_163 -> (s~, u, G-)
  566. 2257.84 s > [2026-10-19 13:33:41.599] @gammalooprs::model INFO : The following 60 couplings were removed by the restriction card:
  567. 2257.84 s > GC_13, GC_14, GC_16, GC_17, GC_18, GC_19, GC_20, GC_22, GC_23, GC_24, GC_25, GC_26, GC_28, GC_29, GC_42, GC_43, GC_44, GC_46, GC_47, GC_48, GC_84, GC_85, GC_86, GC_87, GC_88, GC_89, GC_90, GC_91, GC_92, GC_93, GC_101, GC_102, GC_103, GC_105, GC_106, GC_107, GC_109, GC_110, GC_111, GC_112, GC_113, GC_114, GC_115, GC_116, GC_117, GC_118, GC_119, GC_120, GC_121, GC_122, GC_123, GC_124, GC_125, GC_126, GC_127, GC_128, GC_129, GC_130, GC_131, GC_132
  568. 2257.84 s > [2026-10-19 13:33:41.610] @gammaloop_api::se... INFO : Running command set global kv global.n_cores.feyngen=1
  569. 2257.84 s > [2026-10-19 13:33:41.674] @gammaloop_api::se... INFO : Running command set global kv global.generation.evaluator.store_atom=true
  570. 2257.84 s > [2026-10-19 13:33:41.676] @gammaloop_api::se... INFO : Running command generate xs z > d d~
  571. 2257.84 s > [2026-10-19 13:33:41.679] @feyngen::diagram_... INFO : 0s | Δ=0s | Starting Feynman graph generation with Symbolica...
  572. 2257.84 s > [2026-10-19 13:33:41.680] @feyngen::diagram_... INFO : 0s | Δ=0s | Number of graphs resulting from Symbolica generation: 24
  573. 2257.84 s > [2026-10-19 13:33:41.681] @feyngen::diagram_... INFO : 0s | Δ=0s | Number of graphs retained after enforcing supergraph particle content: 1
  574. 2257.84 s > [2026-10-19 13:33:41.682] @feyngen::diagram_... INFO : 0s | Δ=0s | Number of graphs retained after removal of vetoed topologies: 1
  575. 2257.84 s > [2026-10-19 13:33:41.682] @feyngen::diagram_... INFO : 0s | Δ=0s | Number of graphs after vertex info assignment: 1
  576. 2257.84 s > [2026-10-19 13:33:41.682] @feyngen::diagram_... INFO : 0s | Δ=0s | Number of graphs after all complete graphs filters are applied: 1
  577. 2257.84 s > [2026-10-19 13:33:41.682] @feyngen::diagram_... INFO : 0s | Δ=0s | Number of graphs after closed anticommutating chains analysis: 1
  578. 2257.84 s > [2026-10-19 13:33:41.682] @feyngen::diagram_... INFO : 0s | Δ=0s | Number of graphs after fast Cutkosky cut filter is applied: 1
  579. 2257.84 s > [2026-10-19 13:33:41.682] @feyngen::diagram_... INFO : 0s | Δ=0s | Number of graphs after symmetrization of external states: 1
  580. 2257.84 s > [2026-10-19 13:33:41.683] @feyngen::diagram_... INFO : 0s | Δ=0s | Number of graphs after canonization of vertices, edges and flows (graph labels assigned here): 1
  581. 2257.84 s > [2026-10-19 13:33:41.778] @feyngen::diagram_... INFO : 0s | Δ=0s | Number of graphs after numerator-aware grouping with strategy 'up to a scalar rescaling': 1 (1 isomorphically unique graph, 0 color zero, 0 lorentz zero, 0 grouped and 0 cancellation)
  582. 2257.84 s > [2026-10-19 13:33:41.778] @feyngen::diagram_... INFO : ( Sum of the symmetry factors from each graph generated = -1 )
  583. 2257.84 s > [2026-10-19 13:33:41.779] @commands::generate INFO : Generated cross-section 1 graphs.
  584. 2257.84 s > [2026-10-19 13:33:41.816] @commands::generate INFO :
  585. 2257.84 s > Integrand generation summary
  586. 2257.84 s > peak RAM 97.78 MiB | cores 1
  587. 2257.84 s > ╭───────────┬───────┬────────┬─────────┬─────────────┬────────────┬─────────────┬────────────────┬─────────────╮
  588. 2257.84 s > │ integrand │ graph │ scope │ # evals │ total work │ expr build │ spenso │ symbolica eval │ compile │
  589. 2257.84 s > ├───────────┼───────┼────────┼─────────┼─────────────┼────────────┼─────────────┼────────────────┼─────────────┤
  590. 2257.84 s > │ default │ GL0 │ all │ 3 │ 35ms (100%) │ 17ms (49%) │ 9ms (27%) │ 8ms (24%) │ 0ms (0.00%) │
  591. 2257.84 s > │ default │ GL0 │ shared │ 1 │ 10ms (29%) │ 8ms (25%) │ 0ms (0.00%) │ 1ms (3.7%) │ 0ms (0.00%) │
  592. 2257.84 s > │ default │ GL0 │ cff │ 2 │ 25ms (71%) │ 8ms (24%) │ 9ms (27%) │ 7ms (20%) │ 0ms (0.00%) │
  593. 2257.84 s > ├───────────┼───────┼────────┼─────────┼─────────────┼────────────┼─────────────┼────────────────┼─────────────┤
  594. 2257.84 s > │ Total │ │ all │ 3 │ 35ms (100%) │ 17ms (49%) │ 9ms (27%) │ 8ms (24%) │ 0ms (0.00%) │
  595. 2257.84 s > │ Total │ │ shared │ 1 │ 10ms (29%) │ 8ms (25%) │ 0ms (0.00%) │ 1ms (3.7%) │ 0ms (0.00%) │
  596. 2257.84 s > │ Total │ │ cff │ 2 │ 25ms (71%) │ 8ms (24%) │ 9ms (27%) │ 7ms (20%) │ 0ms (0.00%) │
  597. 2257.84 s > ╰───────────┴───────┴────────┴─────────┴─────────────┴────────────┴─────────────┴────────────────┴─────────────╯
  598. 2257.84 s > Common graph/UV preparation and helpers are counted once. Representation rows partition the remaining work; percentages refer to the aggregate. Summed graph durations can overlap during parallel generation.
  599. 2257.84 s > [2026-10-19 13:33:41.818] @gammaloop_api::se... INFO : Running command generate
  600. 2257.84 s > [2026-10-19 13:33:41.850] @commands::generate INFO :
  601. 2257.84 s > Integrand generation summary
  602. 2257.84 s > peak RAM 104.05 MiB | cores 1
  603. 2257.84 s > ╭───────────┬───────┬────────┬─────────┬─────────────┬────────────┬─────────────┬────────────────┬─────────────╮
  604. 2257.84 s > │ integrand │ graph │ scope │ # evals │ total work │ expr build │ spenso │ symbolica eval │ compile │
  605. 2257.84 s > ├───────────┼───────┼────────┼─────────┼─────────────┼────────────┼─────────────┼────────────────┼─────────────┤
  606. 2257.84 s > │ default │ GL0 │ all │ 3 │ 31ms (100%) │ 15ms (48%) │ 8ms (27%) │ 7ms (25%) │ 0ms (0.00%) │
  607. 2257.84 s > │ default │ GL0 │ shared │ 1 │ 8ms (29%) │ 7ms (25%) │ 0ms (0.00%) │ 1ms (3.6%) │ 0ms (0.00%) │
  608. 2257.84 s > │ default │ GL0 │ cff │ 2 │ 22ms (71%) │ 7ms (23%) │ 8ms (27%) │ 6ms (21%) │ 0ms (0.00%) │
  609. 2257.84 s > ├───────────┼───────┼────────┼─────────┼─────────────┼────────────┼─────────────┼────────────────┼─────────────┤
  610. 2257.84 s > │ Total │ │ all │ 3 │ 31ms (100%) │ 15ms (48%) │ 8ms (27%) │ 7ms (25%) │ 0ms (0.00%) │
  611. 2257.84 s > │ Total │ │ shared │ 1 │ 8ms (29%) │ 7ms (25%) │ 0ms (0.00%) │ 1ms (3.6%) │ 0ms (0.00%) │
  612. 2257.84 s > │ Total │ │ cff │ 2 │ 22ms (71%) │ 7ms (23%) │ 8ms (27%) │ 6ms (21%) │ 0ms (0.00%) │
  613. 2257.84 s > ╰───────────┴───────┴────────┴─────────┴─────────────┴────────────┴─────────────┴────────────────┴─────────────╯
  614. 2257.84 s > Common graph/UV preparation and helpers are counted once. Representation rows partition the remaining work; percentages refer to the aggregate. Summed graph durations can overlap during parallel generation.
  615. 2257.84 s > Error:
  616. 2257.84 s > 0: standalone graph term has no cut-group integrands
  617. 2257.84 s >
  618. 2257.84 s > Location:
  619. 2257.84 s > tests/tests/test_feyngen.rs:869
  620. 2257.84 s >
  621. 2257.84 s > ━━━━━━━━━━━━━━━━━━━━━━━━━━━━━━━━━━ BACKTRACE ━━━━━━━━━━━━━━━━━━━━━━━━━━━━━━━━━━━
  622. 2257.84 s > 1: <color_eyre[dc2f931ed52a6dec]::config::EyreHook>::into_eyre_hook::{closure#0}<unknown>
  623. 2257.84 s > at <unknown source file>:<unknown line>
  624. 2257.84 s > 2: eyre[cd75025c43f23a9b]::capture_handler<unknown>
  625. 2257.84 s > at <unknown source file>:<unknown line>
  626. 2257.84 s > 3: eyre[cd75025c43f23a9b]::private::format_err<unknown>
  627. 2257.84 s > at <unknown source file>:<unknown line>
  628. 2257.84 s > 4: <test_feyngen[10c70d8025b0d425]::cross_section_standalone_export_writes_archive_and_loader::{closure#0} as core[c0acaeba6ab4c2e0]::ops::function::FnOnce<()>>::call_once<unknown>
  629. 2257.84 s > at <unknown source file>:<unknown line>
  630. 2257.84 s > 5: test[69f9176bb4e5faed]::__rust_begin_short_backtrace::<core[c0acaeba6ab4c2e0]::result::Result<(), alloc[12e961f32105355]::string::String>, fn() -> core[c0acaeba6ab4c2e0]::result::Result<(), alloc[12e961f32105355]::string::String>><unknown>
  631. 2257.84 s > at <unknown source file>:<unknown line>
  632. 2257.84 s > 6: test[69f9176bb4e5faed]::run_test::{closure#0}<unknown>
  633. 2257.84 s > at <unknown source file>:<unknown line>
  634. 2257.84 s > 7: std[6c98fd8553dbae28]::sys::backtrace::__rust_begin_short_backtrace::<test[69f9176bb4e5faed]::run_test::{closure#1}, ()><unknown>
  635. 2257.84 s > at <unknown source file>:<unknown line>
  636. 2257.84 s > 8: <std[6c98fd8553dbae28]::thread::lifecycle::spawn_unchecked<test[69f9176bb4e5faed]::run_test::{closure#1}, ()>::{closure#1} as core[c0acaeba6ab4c2e0]::ops::function::FnOnce<()>>::call_once::{shim:vtable#0}<unknown>
  637. 2257.84 s > at <unknown source file>:<unknown line>
  638. 2257.84 s > 9: <std[6c98fd8553dbae28]::sys::thread::unix::Thread>::new::thread_start<unknown>
  639. 2257.84 s > at <unknown source file>:<unknown line>
  640. 2257.84 s > 10: start_thread<unknown>
  641. 2257.84 s > at <unknown source file>:<unknown line>
  642. 2257.84 s > 11: __clone3<unknown>
  643. 2257.84 s > at <unknown source file>:<unknown line>
  644. 2257.84 s >
  645. 2257.84 s > Run with COLORBT_SHOW_HIDDEN=1 environment variable to disable frame filtering.
  646. 2257.84 s > Run with RUST_BACKTRACE=full to include source snippets.
  647. 2257.84 s >
  648. 2257.84 s > ------------
  649. 2257.84 s > Summary [2184.229s] 380 tests run: 379 passed (5 slow), 1 failed, 65 skipped
  650. 2257.84 s > FAIL [ 0.444s] ( 49/380) gammaloop-integration-tests::test_feyngen cross_section_standalone_export_writes_archive_and_loader
  651. 2257.84 s > stdout ---
  652. 2257.84 s >
  653. 2257.84 s > running 1 test
  654. 2257.84 s > test cross_section_standalone_export_writes_archive_and_loader ... FAILED
  655. 2257.84 s >
  656. 2257.84 s > failures:
  657. 2257.84 s >
  658. 2257.84 s > failures:
  659. 2257.84 s > cross_section_standalone_export_writes_archive_and_loader
  660. 2257.84 s >
  661. 2257.84 s > test result: FAILED. 0 passed; 1 failed; 0 ignored; 0 measured; 37 filtered out; finished in 0.43s
  662. 2257.84 s >
  663. 2257.84 s > stderr ---
  664. 2257.84 s > [2026-10-19 13:33:41.547] @gammaloop_api::se... INFO : Running command import model sm-default
  665. 2257.84 s > [2026-10-19 13:33:41.547] @import::model INFO : Loading built-in JSON model sm-default
  666. 2257.84 s > [2026-10-19 13:33:41.598] @gammalooprs::model INFO : The following 22 external parameters were forced to zero by the restriction card:
  667. 2257.84 s > lamWS, AWS, rhoWS, etaWS, ymc, yme, ymm, MS, MC, Me, MM, WTau, muB, muQ, muLe, muLmu, muLtau, ymu, ymd, yms, MU, MD
  668. 2257.84 s > [2026-10-19 13:33:41.599] @gammalooprs::model INFO : The following 44 vertex rules were removed by the restriction card:
  669. 2257.84 s > V_82 -> (c~, d, G+) | V_83 -> (t~, d, G+) | V_84 -> (c~, s, G+) | V_85 -> (t~, s, G+) | V_86 -> (u~, b, G+) | V_87 -> (c~, b, G+) | V_90 -> (c~, d, W+) | V_91 -> (t~, d, W+) | V_92 -> (u~, s, W+) | V_94 -> (t~, s, W+) | V_95 -> (u~, b, W+) | V_96 -> (c~, b, W+) | V_101 -> (e+, e-, G0) | V_102 -> (mu+, mu-, G0) | V_104 -> (e+, e-, H) | V_105 -> (mu+, mu-, H) | V_110 -> (ve~, e-, G+) | V_111 -> (vm~, mu-, G+) | V_116 -> (b~, u, G-) | V_117 -> (d~, c, G-) | V_118 -> (s~, c, G-) | V_119 -> (b~, c, G-) | V_120 -> (d~, t, G-) | V_121 -> (s~, t, G-) | V_124 -> (s~, u, W-) | V_125 -> (b~, u, W-) | V_126 -> (d~, c, W-) | V_128 -> (b~, c, W-) | V_129 -> (d~, t, W-) | V_130 -> (s~, t, W-) | V_138 -> (c~, c, G0) | V_140 -> (c~, c, H) | V_145 -> (e+, ve, G-) | V_146 -> (mu+, vm, G-) | V_154 -> (u~, u, H) | V_155 -> (u~, u, G0) | V_156 -> (d~, d, H) | V_157 -> (d~, d, G0) | V_158 -> (s~, s, H) | V_159 -> (s~, s, G0) | V_160 -> (u~, d, G+) | V_161 -> (d~, u, G-) | V_162 -> (u~, s, G+) | V_163 -> (s~, u, G-)
  670. 2257.84 s > [2026-10-19 13:33:41.599] @gammalooprs::model INFO : The following 60 couplings were removed by the restriction card:
  671. 2257.84 s > GC_13, GC_14, GC_16, GC_17, GC_18, GC_19, GC_20, GC_22, GC_23, GC_24, GC_25, GC_26, GC_28, GC_29, GC_42, GC_43, GC_44, GC_46, GC_47, GC_48, GC_84, GC_85, GC_86, GC_87, GC_88, GC_89, GC_90, GC_91, GC_92, GC_93, GC_101, GC_102, GC_103, GC_105, GC_106, GC_107, GC_109, GC_110, GC_111, GC_112, GC_113, GC_114, GC_115, GC_116, GC_117, GC_118, GC_119, GC_120, GC_121, GC_122, GC_123, GC_124, GC_125, GC_126, GC_127, GC_128, GC_129, GC_130, GC_131, GC_132
  672. 2257.84 s > [2026-10-19 13:33:41.610] @gammaloop_api::se... INFO : Running command set global kv global.n_cores.feyngen=1
  673. 2257.84 s > [2026-10-19 13:33:41.674] @gammaloop_api::se... INFO : Running command set global kv global.generation.evaluator.store_atom=true
  674. 2257.84 s > [2026-10-19 13:33:41.676] @gammaloop_api::se... INFO : Running command generate xs z > d d~
  675. 2257.84 s > [2026-10-19 13:33:41.679] @feyngen::diagram_... INFO : 0s | Δ=0s | Starting Feynman graph generation with Symbolica...
  676. 2257.84 s > [2026-10-19 13:33:41.680] @feyngen::diagram_... INFO : 0s | Δ=0s | Number of graphs resulting from Symbolica generation: 24
  677. 2257.84 s > [2026-10-19 13:33:41.681] @feyngen::diagram_... INFO : 0s | Δ=0s | Number of graphs retained after enforcing supergraph particle content: 1
  678. 2257.84 s > [2026-10-19 13:33:41.682] @feyngen::diagram_... INFO : 0s | Δ=0s | Number of graphs retained after removal of vetoed topologies: 1
  679. 2257.84 s > [2026-10-19 13:33:41.682] @feyngen::diagram_... INFO : 0s | Δ=0s | Number of graphs after vertex info assignment: 1
  680. 2257.84 s > [2026-10-19 13:33:41.682] @feyngen::diagram_... INFO : 0s | Δ=0s | Number of graphs after all complete graphs filters are applied: 1
  681. 2257.84 s > [2026-10-19 13:33:41.682] @feyngen::diagram_... INFO : 0s | Δ=0s | Number of graphs after closed anticommutating chains analysis: 1
  682. 2257.84 s > [2026-10-19 13:33:41.682] @feyngen::diagram_... INFO : 0s | Δ=0s | Number of graphs after fast Cutkosky cut filter is applied: 1
  683. 2257.84 s > [2026-10-19 13:33:41.682] @feyngen::diagram_... INFO : 0s | Δ=0s | Number of graphs after symmetrization of external states: 1
  684. 2257.84 s > [2026-10-19 13:33:41.683] @feyngen::diagram_... INFO : 0s | Δ=0s | Number of graphs after canonization of vertices, edges and flows (graph labels assigned here): 1
  685. 2257.84 s > [2026-10-19 13:33:41.778] @feyngen::diagram_... INFO : 0s | Δ=0s | Number of graphs after numerator-aware grouping with strategy 'up to a scalar rescaling': 1 (1 isomorphically unique graph, 0 color zero, 0 lorentz zero, 0 grouped and 0 cancellation)
  686. 2257.84 s > [2026-10-19 13:33:41.778] @feyngen::diagram_... INFO : ( Sum of the symmetry factors from each graph generated = -1 )
  687. 2257.84 s > [2026-10-19 13:33:41.779] @commands::generate INFO : Generated cross-section 1 graphs.
  688. 2257.84 s > [2026-10-19 13:33:41.816] @commands::generate INFO :
  689. 2257.84 s > Integrand generation summary
  690. 2257.84 s > peak RAM 97.78 MiB | cores 1
  691. 2257.84 s > ╭───────────┬───────┬────────┬─────────┬─────────────┬────────────┬─────────────┬────────────────┬─────────────╮
  692. 2257.84 s > │ integrand │ graph │ scope │ # evals │ total work │ expr build │ spenso │ symbolica eval │ compile │
  693. 2257.84 s > ├───────────┼───────┼────────┼─────────┼─────────────┼────────────┼─────────────┼────────────────┼─────────────┤
  694. 2257.84 s > │ default │ GL0 │ all │ 3 │ 35ms (100%) │ 17ms (49%) │ 9ms (27%) │ 8ms (24%) │ 0ms (0.00%) │
  695. 2257.84 s > │ default │ GL0 │ shared │ 1 │ 10ms (29%) │ 8ms (25%) │ 0ms (0.00%) │ 1ms (3.7%) │ 0ms (0.00%) │
  696. 2257.84 s > │ default │ GL0 │ cff │ 2 │ 25ms (71%) │ 8ms (24%) │ 9ms (27%) │ 7ms (20%) │ 0ms (0.00%) │
  697. 2257.84 s > ├───────────┼───────┼────────┼─────────┼─────────────┼────────────┼─────────────┼────────────────┼─────────────┤
  698. 2257.84 s > │ Total │ │ all │ 3 │ 35ms (100%) │ 17ms (49%) │ 9ms (27%) │ 8ms (24%) │ 0ms (0.00%) │
  699. 2257.84 s > │ Total │ │ shared │ 1 │ 10ms (29%) │ 8ms (25%) │ 0ms (0.00%) │ 1ms (3.7%) │ 0ms (0.00%) │
  700. 2257.84 s > │ Total │ │ cff │ 2 │ 25ms (71%) │ 8ms (24%) │ 9ms (27%) │ 7ms (20%) │ 0ms (0.00%) │
  701. 2257.84 s > ╰───────────┴───────┴────────┴─────────┴─────────────┴────────────┴─────────────┴────────────────┴─────────────╯
  702. 2257.84 s > Common graph/UV preparation and helpers are counted once. Representation rows partition the remaining work; percentages refer to the aggregate. Summed graph durations can overlap during parallel generation.
  703. 2257.84 s > [2026-10-19 13:33:41.818] @gammaloop_api::se... INFO : Running command generate
  704. 2257.84 s > [2026-10-19 13:33:41.850] @commands::generate INFO :
  705. 2257.84 s > Integrand generation summary
  706. 2257.84 s > peak RAM 104.05 MiB | cores 1
  707. 2257.84 s > ╭───────────┬───────┬────────┬─────────┬─────────────┬────────────┬─────────────┬────────────────┬─────────────╮
  708. 2257.84 s > │ integrand │ graph │ scope │ # evals │ total work │ expr build │ spenso │ symbolica eval │ compile │
  709. 2257.84 s > ├───────────┼───────┼────────┼─────────┼─────────────┼────────────┼─────────────┼────────────────┼─────────────┤
  710. 2257.84 s > │ default │ GL0 │ all │ 3 │ 31ms (100%) │ 15ms (48%) │ 8ms (27%) │ 7ms (25%) │ 0ms (0.00%) │
  711. 2257.84 s > │ default │ GL0 │ shared │ 1 │ 8ms (29%) │ 7ms (25%) │ 0ms (0.00%) │ 1ms (3.6%) │ 0ms (0.00%) │
  712. 2257.84 s > │ default │ GL0 │ cff │ 2 │ 22ms (71%) │ 7ms (23%) │ 8ms (27%) │ 6ms (21%) │ 0ms (0.00%) │
  713. 2257.84 s > ├───────────┼───────┼────────┼─────────┼─────────────┼────────────┼─────────────┼────────────────┼─────────────┤
  714. 2257.84 s > │ Total │ │ all │ 3 │ 31ms (100%) │ 15ms (48%) │ 8ms (27%) │ 7ms (25%) │ 0ms (0.00%) │
  715. 2257.84 s > │ Total │ │ shared │ 1 │ 8ms (29%) │ 7ms (25%) │ 0ms (0.00%) │ 1ms (3.6%) │ 0ms (0.00%) │
  716. 2257.84 s > │ Total │ │ cff │ 2 │ 22ms (71%) │ 7ms (23%) │ 8ms (27%) │ 6ms (21%) │ 0ms (0.00%) │
  717. 2257.84 s > ╰───────────┴───────┴────────┴─────────┴─────────────┴────────────┴─────────────┴────────────────┴─────────────╯
  718. 2257.84 s > Common graph/UV preparation and helpers are counted once. Representation rows partition the remaining work; percentages refer to the aggregate. Summed graph durations can overlap during parallel generation.
  719. 2257.84 s > Error:
  720. 2257.84 s > 0: standalone graph term has no cut-group integrands
  721. 2257.84 s >
  722. 2257.84 s > Location:
  723. 2257.84 s > tests/tests/test_feyngen.rs:869
  724. 2257.84 s >
  725. 2257.84 s > ━━━━━━━━━━━━━━━━━━━━━━━━━━━━━━━━━━ BACKTRACE ━━━━━━━━━━━━━━━━━━━━━━━━━━━━━━━━━━━
  726. 2257.84 s > 1: <color_eyre[dc2f931ed52a6dec]::config::EyreHook>::into_eyre_hook::{closure#0}<unknown>
  727. 2257.84 s > at <unknown source file>:<unknown line>
  728. 2257.84 s > 2: eyre[cd75025c43f23a9b]::capture_handler<unknown>
  729. 2257.84 s > at <unknown source file>:<unknown line>
  730. 2257.84 s > 3: eyre[cd75025c43f23a9b]::private::format_err<unknown>
  731. 2257.84 s > at <unknown source file>:<unknown line>
  732. 2257.84 s > 4: <test_feyngen[10c70d8025b0d425]::cross_section_standalone_export_writes_archive_and_loader::{closure#0} as core[c0acaeba6ab4c2e0]::ops::function::FnOnce<()>>::call_once<unknown>
  733. 2257.84 s > at <unknown source file>:<unknown line>
  734. 2257.84 s > 5: test[69f9176bb4e5faed]::__rust_begin_short_backtrace::<core[c0acaeba6ab4c2e0]::result::Result<(), alloc[12e961f32105355]::string::String>, fn() -> core[c0acaeba6ab4c2e0]::result::Result<(), alloc[12e961f32105355]::string::String>><unknown>
  735. 2257.84 s > at <unknown source file>:<unknown line>
  736. 2257.84 s > 6: test[69f9176bb4e5faed]::run_test::{closure#0}<unknown>
  737. 2257.84 s > at <unknown source file>:<unknown line>
  738. 2257.84 s > 7: std[6c98fd8553dbae28]::sys::backtrace::__rust_begin_short_backtrace::<test[69f9176bb4e5faed]::run_test::{closure#1}, ()><unknown>
  739. 2257.84 s > at <unknown source file>:<unknown line>
  740. 2257.84 s > 8: <std[6c98fd8553dbae28]::thread::lifecycle::spawn_unchecked<test[69f9176bb4e5faed]::run_test::{closure#1}, ()>::{closure#1} as core[c0acaeba6ab4c2e0]::ops::function::FnOnce<()>>::call_once::{shim:vtable#0}<unknown>
  741. 2257.84 s > at <unknown source file>:<unknown line>
  742. 2257.84 s > 9: <std[6c98fd8553dbae28]::sys::thread::unix::Thread>::new::thread_start<unknown>
  743. 2257.84 s > at <unknown source file>:<unknown line>
  744. 2257.84 s > 10: start_thread<unknown>
  745. 2257.84 s > at <unknown source file>:<unknown line>
  746. 2257.84 s > 11: __clone3<unknown>
  747. 2257.84 s > at <unknown source file>:<unknown line>
  748. 2257.84 s >
  749. 2257.84 s > Run with COLORBT_SHOW_HIDDEN=1 environment variable to disable frame filtering.
  750. 2257.84 s > Run with RUST_BACKTRACE=full to include source snippets.
  751. 2257.84 s >
  752. 2257.84 s > error: test run failed
  753. 2257.84 s >
  754. 2257.84 s > ========== nextest test summary ==========
  755. 2257.84 s > report: target/nextest/ci_gammaloop/junit.xml
  756. 2257.84 s > tests: 380, failures: 1, errors: 0
  757. 2257.84 s >
  758. 2257.84 s > 1. gammaloop-integration-tests::test_feyngen::cross_section_standalone_export_writes_archive_and_loader
  759. 2257.84 s > failure: test failure with exit code 101
  760. 2257.84 s > Error:
  761. 2257.84 s > 0: standalone graph term has no cut-group integrands
  762. 2257.84 s >
  763. 2257.84 s > Location:
  764. 2257.84 s > tests/tests/test_feyngen.rs:869
  765. 2257.84 s >
  766. 2257.84 s > ━━━━━━━━━━━━━━━━━━━━━━━━━━━━━━━━━━ BACKTRACE ━━━━━━━━━━━━━━━━━━━━━━━━━━━━━━━━━━━
  767. 2257.84 s > 1: <color_eyre[dc2f931ed52a6dec]::config::EyreHook>::into_eyre_hook::{closure#0}<unknown>
  768. 2257.84 s > at <unknown source file>:<unknown line>
  769. 2257.84 s > 2: eyre[cd75025c43f23a9b]::capture_handler<unknown>
  770. 2257.84 s > at <unknown source file>:<unknown line>
  771. 2257.84 s > 3: eyre[cd75025c43f23a9b]::private::format_err<unknown>
  772. 2257.84 s > at <unknown source file>:<unknown line>
  773. 2257.84 s > 4: <test_feyngen[10c70d8025b0d425]::cross_section_standalone_export_writes_archive_and_loader::{closure#0} as core[c0acaeba6ab4c2e0]::ops::function::FnOnce<()>>::call_once<unknown>
  774. 2257.84 s > at <unknown source file>:<unknown line>
  775. 2257.84 s > 5: test[69f9176bb4e5faed]::__rust_begin_short_backtrace::<core[c0acaeba6ab4c2e0]::result::Result<(), alloc[12e961f32105355]::string::String>, fn() -> core[c0acaeba6ab4c2e0]::result::Result<(), alloc[12e961f32105355]::string::String>><unknown>
  776. 2257.84 s > at <unknown source file>:<unknown line>
  777. 2257.84 s > 6: test[69f9176bb4e5faed]::run_test::{closure#0}<unknown>
  778. 2257.84 s > at <unknown source file>:<unknown line>
  779. 2257.84 s > 7: std[6c98fd8553dbae28]::sys::backtrace::__rust_begin_short_backtrace::<test[69f9176bb4e5faed]::run_test::{closure#1}, ()><unknown>
  780. 2257.84 s > at <unknown source file>:<unknown line>
  781. 2257.84 s > 8: <std[6c98fd8553dbae28]::thread::lifecycle::spawn_unchecked<test[69f9176bb4e5faed]::run_test::{closure#1}, ()>::{closure#1} as core[c0acaeba6ab4c2e0]::ops::function::FnOnce<()>>::call_once::{shim:vtable#0}<unknown>
  782. 2257.84 s > at <unknown source file>:<unknown line>
  783. 2257.84 s > 9: <std[6c98fd8553dbae28]::sys::thread::unix::Thread>::new::thread_start<unknown>
  784. 2257.84 s > at <unknown source file>:<unknown line>
  785. 2257.84 s > 10: start_thread<unknown>
  786. 2257.84 s > at <unknown source file>:<unknown line>
  787. 2257.84 s > 11: __clone3<unknown>
  788. 2257.84 s > at <unknown source file>:<unknown line>
  789. 2257.84 s >
  790. 2257.84 s > Run with COLORBT_SHOW_HIDDEN=1 environment variable to disable frame filtering.
  791. 2257.84 s > Run with RUST_BACKTRACE=full to include source snippets.
  792. 2257.84 s > system-out
  793. 2257.84 s > running 1 test
  794. 2257.84 s > test cross_section_standalone_export_writes_archive_and_loader ... FAILED
  795. 2257.84 s >
  796. 2257.84 s > failures:
  797. 2257.84 s >
  798. 2257.84 s > failures:
  799. 2257.84 s > cross_section_standalone_export_writes_archive_and_loader
  800. 2257.84 s >
  801. 2257.84 s > test result: FAILED. 0 passed; 1 failed; 0 ignored; 0 measured; 37 filtered out; finished in 0.43s
  802. 2257.84 s > system-err
  803. 2257.84 s > [2026-10-19 13:33:41.547] @gammaloop_api::se... INFO : Running command import model sm-default
  804. 2257.84 s > [2026-10-19 13:33:41.547] @import::model INFO : Loading built-in JSON model sm-default
  805. 2257.84 s > [2026-10-19 13:33:41.598] @gammalooprs::model INFO : The following 22 external parameters were forced to zero by the restriction card:
  806. 2257.84 s > lamWS, AWS, rhoWS, etaWS, ymc, yme, ymm, MS, MC, Me, MM, WTau, muB, muQ, muLe, muLmu, muLtau, ymu, ymd, yms, MU, MD
  807. 2257.84 s > [2026-10-19 13:33:41.599] @gammalooprs::model INFO : The following 44 vertex rules were removed by the restriction card:
  808. 2257.84 s > V_82 -> (c~, d, G+) | V_83 -> (t~, d, G+) | V_84 -> (c~, s, G+) | V_85 -> (t~, s, G+) | V_86 -> (u~, b, G+) | V_87 -> (c~, b, G+) | V_90 -> (c~, d, W+) | V_91 -> (t~, d, W+) | V_92 -> (u~, s, W+) | V_94 -> (t~, s, W+) | V_95 -> (u~, b, W+) | V_96 -> (c~, b, W+) | V_101 -> (e+, e-, G0) | V_102 -> (mu+, mu-, G0) | V_104 -> (e+, e-, H) | V_105 -> (mu+, mu-, H) | V_110 -> (ve~, e-, G+) | V_111 -> (vm~, mu-, G+) | V_116 -> (b~, u, G-) | V_117 -> (d~, c, G-) | V_118 -> (s~, c, G-) | V_119 -> (b~, c, G-) | V_120 -> (d~, t, G-) | V_121 -> (s~, t, G-) | V_124 -> (s~, u, W-) | V_125 -> (b~, u, W-) | V_126 -> (d~, c, W-) | V_128 -> (b~, c, W-) | V_129 -> (d~, t, W-) | V_130 -> (s~, t, W-) | V_138 -> (c~, c, G0) | V_140 -> (c~, c, H) | V_145 -> (e+, ve, G-) | V_146 -> (mu+, vm, G-) | V_154 -> (u~, u, H) | V_155 -> (u~, u, G0) | V_156 -> (d~, d, H) | V_157 -> (d~, d, G0) | V_158 -> (s~, s, H) | V_159 -> (s~, s, G0) | V_160 -> (u~, d, G+) | V_161 -> (d~, u, G-) | V_162 -> (u~, s, G+) | V_163 -> (s~, u, G-)
  809. 2257.84 s > [2026-10-19 13:33:41.599] @gammalooprs::model INFO : The following 60 couplings were removed by the restriction card:
  810. 2257.84 s > GC_13, GC_14, GC_16, GC_17, GC_18, GC_19, GC_20, GC_22, GC_23, GC_24, GC_25, GC_26, GC_28, GC_29, GC_42, GC_43, GC_44, GC_46, GC_47, GC_48, GC_84, GC_85, GC_86, GC_87, GC_88, GC_89, GC_90, GC_91, GC_92, GC_93, GC_101, GC_102, GC_103, GC_105, GC_106, GC_107, GC_109, GC_110, GC_111, GC_112, GC_113, GC_114, GC_115, GC_116, GC_117, GC_118, GC_119, GC_120, GC_121, GC_122, GC_123, GC_124, GC_125, GC_126, GC_127, GC_128, GC_129, GC_130, GC_131, GC_132
  811. 2257.84 s > [2026-10-19 13:33:41.610] @gammaloop_api::se... INFO : Running command set global kv global.n_cores.feyngen=1
  812. 2257.84 s > [2026-10-19 13:33:41.674] @gammaloop_api::se... INFO : Running command set global kv global.generation.evaluator.store_atom=true
  813. 2257.84 s > [2026-10-19 13:33:41.676] @gammaloop_api::se... INFO : Running command generate xs z > d d~
  814. 2257.84 s > [2026-10-19 13:33:41.679] @feyngen::diagram_... INFO : 0s | Δ=0s | Starting Feynman graph generation with Symbolica...
  815. 2257.84 s > [2026-10-19 13:33:41.680] @feyngen::diagram_... INFO : 0s | Δ=0s | Number of graphs resulting from Symbolica generation: 24
  816. 2257.84 s > [2026-10-19 13:33:41.681] @feyngen::diagram_... INFO : 0s | Δ=0s | Number of graphs retained after enforcing supergraph particle content: 1
  817. 2257.84 s > [2026-10-19 13:33:41.682] @feyngen::diagram_... INFO : 0s | Δ=0s | Number of graphs retained after removal of vetoed topologies: 1
  818. 2257.84 s > [2026-10-19 13:33:41.682] @feyngen::diagram_... INFO : 0s | Δ=0s | Number of graphs after vertex info assignment: 1
  819. 2257.84 s > [2026-10-19 13:33:41.682] @feyngen::diagram_... INFO : 0s | Δ=0s | Number of graphs after all complete graphs filters are applied: 1
  820. 2257.84 s > [2026-10-19 13:33:41.682] @feyngen::diagram_... INFO : 0s | Δ=0s | Number of graphs after closed anticommutating chains analysis: 1
  821. 2257.84 s > [2026-10-19 13:33:41.682] @feyngen::diagram_... INFO : 0s | Δ=0s | Number of graphs after fast Cutkosky cut filter is applied: 1
  822. 2257.84 s > [2026-10-19 13:33:41.682] @feyngen::diagram_... INFO : 0s | Δ=0s | Number of graphs after symmetrization of external states: 1
  823. 2257.84 s > [2026-10-19 13:33:41.683] @feyngen::diagram_... INFO : 0s | Δ=0s | Number of graphs after canonization of vertices, edges and flows (graph labels assigned here): 1
  824. 2257.84 s > [2026-10-19 13:33:41.778] @feyngen::diagram_... INFO : 0s | Δ=0s | Number of graphs after numerator-aware grouping with strategy 'up to a scalar rescaling': 1 (1 isomorphically unique graph, 0 color zero, 0 lorentz zero, 0 grouped and 0 cancellation)
  825. 2257.84 s > [2026-10-19 13:33:41.778] @feyngen::diagram_... INFO : ( Sum of the symmetry factors from each graph generated = -1 )
  826. 2257.84 s > [2026-10-19 13:33:41.779] @commands::generate INFO : Generated cross-section 1 graphs.
  827. 2257.84 s > [2026-10-19 13:33:41.816] @commands::generate INFO :
  828. 2257.84 s > Integrand generation summary
  829. 2257.84 s > peak RAM 97.78 MiB | cores 1
  830. 2257.84 s > ╭───────────┬───────┬────────┬─────────┬─────────────┬────────────┬─────────────┬────────────────┬─────────────╮
  831. 2257.84 s > │ integrand │ graph │ scope │ # evals │ total work │ expr build │ spenso │ symbolica eval │ compile │
  832. 2257.84 s > ├───────────┼───────┼────────┼─────────┼─────────────┼────────────┼─────────────┼────────────────┼─────────────┤
  833. 2257.84 s > │ default │ GL0 │ all │ 3 │ 35ms (100%) │ 17ms (49%) │ 9ms (27%) │ 8ms (24%) │ 0ms (0.00%) │
  834. 2257.84 s > │ default │ GL0 │ shared │ 1 │ 10ms (29%) │ 8ms (25%) │ 0ms (0.00%) │ 1ms (3.7%) │ 0ms (0.00%) │
  835. 2257.84 s > │ default │ GL0 │ cff │ 2 │ 25ms (71%) │ 8ms (24%) │ 9ms (27%) │ 7ms (20%) │ 0ms (0.00%) │
  836. 2257.84 s > ├───────────┼───────┼────────┼─────────┼─────────────┼────────────┼─────────────┼────────────────┼─────────────┤
  837. 2257.84 s > │ Total │ │ all │ 3 │ 35ms (100%) │ 17ms (49%) │ 9ms (27%) │ 8ms (24%) │ 0ms (0.00%) │
  838. 2257.84 s > │ Total │ │ shared │ 1 │ 10ms (29%) │ 8ms (25%) │ 0ms (0.00%) │ 1ms (3.7%) │ 0ms (0.00%) │
  839. 2257.84 s > │ Total │ │ cff │ 2 │ 25ms (71%) │ 8ms (24%) │ 9ms (27%) │ 7ms (20%) │ 0ms (0.00%) │
  840. 2257.84 s > ╰───────────┴───────┴────────┴─────────┴─────────────┴────────────┴─────────────┴────────────────┴─────────────╯
  841. 2257.84 s > Common graph/UV preparation and helpers are counted once. Representation rows partition the remaining work; percentages refer to the aggregate. Summed graph durations can overlap during parallel generation.
  842. 2257.84 s > [2026-10-19 13:33:41.818] @gammaloop_api::se... INFO : Running command generate
  843. 2257.84 s > [2026-10-19 13:33:41.850] @commands::generate INFO :
  844. 2257.84 s > Integrand generation summary
  845. 2257.84 s > peak RAM 104.05 MiB | cores 1
  846. 2257.84 s > ╭───────────┬───────┬────────┬─────────┬─────────────┬────────────┬─────────────┬────────────────┬─────────────╮
  847. 2257.84 s > │ integrand │ graph │ scope │ # evals │ total work │ expr build │ spenso │ symbolica eval │ compile │
  848. 2257.84 s > ├───────────┼───────┼────────┼─────────┼─────────────┼────────────┼─────────────┼────────────────┼─────────────┤
  849. 2257.84 s > │ default │ GL0 │ all │ 3 │ 31ms (100%) │ 15ms (48%) │ 8ms (27%) │ 7ms (25%) │ 0ms (0.00%) │
  850. 2257.84 s > │ default │ GL0 │ shared │ 1 │ 8ms (29%) │ 7ms (25%) │ 0ms (0.00%) │ 1ms (3.6%) │ 0ms (0.00%) │
  851. 2257.84 s > │ default │ GL0 │ cff │ 2 │ 22ms (71%) │ 7ms (23%) │ 8ms (27%) │ 6ms (21%) │ 0ms (0.00%) │
  852. 2257.84 s > ├───────────┼───────┼────────┼─────────┼─────────────┼────────────┼─────────────┼────────────────┼─────────────┤
  853. 2257.84 s > │ Total │ │ all │ 3 │ 31ms (100%) │ 15ms (48%) │ 8ms (27%) │ 7ms (25%) │ 0ms (0.00%) │
  854. 2257.84 s > │ Total │ │ shared │ 1 │ 8ms (29%) │ 7ms (25%) │ 0ms (0.00%) │ 1ms (3.6%) │ 0ms (0.00%) │
  855. 2257.84 s > │ Total │ │ cff │ 2 │ 22ms (71%) │ 7ms (23%) │ 8ms (27%) │ 6ms (21%) │ 0ms (0.00%) │
  856. 2257.84 s > ╰───────────┴───────┴────────┴─────────┴─────────────┴────────────┴─────────────┴────────────────┴─────────────╯
  857. 2257.84 s > Common graph/UV preparation and helpers are counted once. Representation rows partition the remaining work; percentages refer to the aggregate. Summed graph durations can overlap during parallel generation.
  858. 2257.84 s > Error:
  859. 2257.84 s > 0: standalone graph term has no cut-group integrands
  860. 2257.84 s >
  861. 2257.84 s > Location:
  862. 2257.84 s > tests/tests/test_feyngen.rs:869
  863. 2257.84 s >
  864. 2257.84 s > ━━━━━━━━━━━━━━━━━━━━━━━━━━━━━━━━━━ BACKTRACE ━━━━━━━━━━━━━━━━━━━━━━━━━━━━━━━━━━━
  865. 2257.84 s > 1: <color_eyre[dc2f931ed52a6dec]::config::EyreHook>::into_eyre_hook::{closure#0}<unknown>
  866. 2257.84 s > at <unknown source file>:<unknown line>
  867. 2257.84 s > 2: eyre[cd75025c43f23a9b]::capture_handler<unknown>
  868. 2257.84 s > at <unknown source file>:<unknown line>
  869. 2257.84 s > 3: eyre[cd75025c43f23a9b]::private::format_err<unknown>
  870. 2257.84 s > at <unknown source file>:<unknown line>
  871. 2257.84 s > 4: <test_feyngen[10c70d8025b0d425]::cross_section_standalone_export_writes_archive_and_loader::{closure#0} as core[c0acaeba6ab4c2e0]::ops::function::FnOnce<()>>::call_once<unknown>
  872. 2257.84 s > at <unknown source file>:<unknown line>
  873. 2257.84 s > 5: test[69f9176bb4e5faed]::__rust_begin_short_backtrace::<core[c0acaeba6ab4c2e0]::result::Result<(), alloc[12e961f32105355]::string::String>, fn() -> core[c0acaeba6ab4c2e0]::result::Result<(), alloc[12e961f32105355]::string::String>><unknown>
  874. 2257.84 s > at <unknown source file>:<unknown line>
  875. 2257.84 s > 6: test[69f9176bb4e5faed]::run_test::{closure#0}<unknown>
  876. 2257.84 s > at <unknown source file>:<unknown line>
  877. 2257.84 s > 7: std[6c98fd8553dbae28]::sys::backtrace::__rust_begin_short_backtrace::<test[69f9176bb4e5faed]::run_test::{closure#1}, ()><unknown>
  878. 2257.84 s > at <unknown source file>:<unknown line>
  879. 2257.84 s > 8: <std[6c98fd8553dbae28]::thread::lifecycle::spawn_unchecked<test[69f9176bb4e5faed]::run_test::{closure#1}, ()>::{closure#1} as core[c0acaeba6ab4c2e0]::ops::function::FnOnce<()>>::call_once::{shim:vtable#0}<unknown>
  880. 2257.84 s > at <unknown source file>:<unknown line>
  881. 2257.84 s > 9: <std[6c98fd8553dbae28]::sys::thread::unix::Thread>::new::thread_start<unknown>
  882. 2257.84 s > at <unknown source file>:<unknown line>
  883. 2257.84 s > 10: start_thread<unknown>
  884. 2257.84 s > at <unknown source file>:<unknown line>
  885. 2257.84 s > 11: __clone3<unknown>
  886. 2257.84 s > at <unknown source file>:<unknown line>
  887. 2257.84 s >
  888. 2257.84 s > Run with COLORBT_SHOW_HIDDEN=1 environment variable to disable frame filtering.
  889. 2257.84 s > Run with RUST_BACKTRACE=full to include source snippets.
  890. 2257.84 s > =========================================
  891. 2257.84 s For full logs, run:
  892. 2257.84 s nix log /nix/store/x2iz5qc4w97m9cdhy2bcp2l2hw1pfpw5-gammaloop-nextest-integration.drv
  893. 2258.20 s [0 built (1 failed), 7 cRun failed.