test packages.x86_64-linux.nix-ci-check-gammaloop-nextest-integration

Reproduce this run
Original Run
  1. 0.00 s $ /nix/store/bhv6xyvqw6gjs3j488gi1z6wdv18bdpa-coreutils-9.11/bin/timeout --kill-after=15s 7200s /nix/store/5np0yidzrnyjbb243hvgqpgpss865p0n-nix-2.34.9/bin/nix --extra-experimental-features nix-command --extra-experimental-features flakes flake clone git+https://github.com/alphal00p/gammaloop --dest /tmp/nix-ci-worker/stable-pwd/repo/
  2. 0.08 s Cloning into '/tmp/nix-ci-worker/stable-pwd/repo'...
  3. 3.24 s remote: Enumerating objects: 157625 remote: Enumerating objects: 172461, done.
  4. 3.47 s remote: Counting objects: 0% (1/14836) remote: Counting objects: 1% (149/14836) remote: Counting objects: 2% (297/14836) remote: Counting objects: 3% (446/14836) remote: Counting objects: 4% (594/14836) remote: Counting objects: 5% (742/14836) remote: Counting objects: 6% (891/14836) remote: Counting objects: 7% (1039/14836) remote: Counting objects: 8% (1187/14836) remote: Counting objects: 9% (1336/14836) remote: Counting objects: 10% (1484/14836) remote: Counting objects: 11% (1632/14836) remote: Counting objects: 12% (1781/14836) remote: Counting objects: 13% (1929/14836) remote: Counting objects: 14% (2078/14836) remote: Counting objects: 15% (2226/14836) remote: Counting objects: 16% (2374/14836) remote: Counting objects: 17% (2523/14836) remote: Counting objects: 18% (2671/14836) remote: Counting objects: 19% (2819/14836) remote: Counting objects: 20% (2968/14836) remote: Counting objects: 21% (3116/14836) remote: Counting objects: 22% (3264/14836) remote: Counting objects: 23% (3413/14836) remote: Counting objects: 24% (3561/14836) remote: Counting objects: 25% (3709/14836) remote: Counting objects: 26% (3858/14836) remote: Counting objects: 27% (4006/14836) remote: Counting objects: 28% (4155/14836) remote: Counting objects: 29% (4303/14836) remote: Counting objects: 30% (4451/14836) remote: Counting objects: 31% (4600/14836) remote: Counting objects: 32% (4748/14836) remote: Counting objects: 33% (4896/14836) remote: Counting objects: 34% (5045/14836) remote: Counting objects: 35% (5193/14836) remote: Counting objects: 36% (5341/14836) remote: Counting objects: 37% (5490/14836) remote: Counting objects: 38% (5638/14836) remote: Counting objects: 39% (5787/14836) remote: Counting objects: 40% (5935/14836) remote: Counting objects: 41% (6083/14836) remote: Counting objects: 42% (6232/14836) remote: Counting objects: 43% (6380/14836) remote: Counting objects: 44% (6528/14836) remote: Counting objects: 45% (6677/14836) remote: Counting objects: 46% (6825/14836) remote: Counting objects: 47% (6973/14836) remote: Counting objects: 48% (7122/14836) remote: Counting objects: 49% (7270/14836) remote: Counting objects: 50% (7418/14836) remote: Counting objects: 51% (7567/14836) remote: Counting objects: 52% (7715/14836) remote: Counting objects: 53% (7864/14836) remote: Counting objects: 54% (8012/14836) remote: Counting objects: 55% (8160/14836) remote: Counting objects: 56% (8309/14836) remote: Counting objects: 57% (8457/14836) remote: Counting objects: 58% (8605/14836) remote: Counting objects: 59% (8754/14836) remote: Counting objects: 60% (8902/14836) remote: Counting objects: 61% (9050/14836) remote: Counting objects: 62% (9199/14836) remote: Counting objects: 63% (9347/14836) remote: Counting objects: 64% (9496/14836) remote: Counting objects: 65% (9644/14836) remote: Counting objects: 66% (9792/14836) remote: Counting objects: 67% (9941/14836) remote: Counting objects: 68% (10089/14836) remote: Counting objects: 69% (10237/14836) remote: Counting objects: 70% (10386/14836) remote: Counting objects: 71% (10534/14836) remote: Counting objects: 72% (10682/14836) remote: Counting objects: 73% (10831/14836) remote: Counting objects: 74% (10979/14836) remote: Counting objects: 75% (11127/14836) remote: Counting objects: 76% (11276/14836) remote: Counting objects: 77% (11424/14836) remote: Counting objects: 78% (11573/14836) remote: Counting objects: 79% (11721/14836) remote: Counting objects: 80% (11869/14836) remote: Counting objects: 81% (12018/14836) remote: Counting objects: 82% (12166/14836) remote: Counting objects: 83% (12314/14836) remote: Counting objects: 84% (12463/14836) remote: Counting objects: 85% (12611/14836) remote: Counting objects: 86% (12759/14836) remote: Counting objects: 87% (12908/14836) remote: Counting objects: 88% (13056/14836) remote: Counting objects: 89% (13205/14836) remote: Counting objects: 90% (13353/14836) remote: Counting objects: 91% (13501/14836) remote: Counting objects: 92% (13650/14836) remote: Counting objects: 93% (13798/14836) remote: Counting objects: 94% (13946/14836) remote: Counting objects: 95% (14095/14836) remote: Counting objects: 96% (14243/14836) remote: Counting objects: 97% (14391/14836) remote: Counting objects: 98% (14540/14836) remote: Counting objects: 99% (14688/14836) remote: Counting objects: 100% (14836/14836) remote: Counting objects: 100% (14836/14836), done.
  5. 4.81 s remote: Compressing objects: 0% (1/3077) remote: Compressing objects: 1% (31/3077) remote: Compressing objects: 2% (62/3077) remote: Compressing objects: 3% (93/3077) remote: Compressing objects: 4% (124/3077) remote: Compressing objects: 5% (154/3077) remote: Compressing objects: 5% (168/3077)
  6. 9.83 s remote: Compressing objects: 6% (185/3077) remote: Compressing objects: 6% (197/3077) remote: Compressing objects: 7% (216/3077) remote: Compressing objects: 8% (247/3077) remote: Compressing objects: 8% (252/3077) remote: Compressing objects: 9% (277/3077) remote: Compressing objects: 10% (308/3077) remote: Compressing objects: 11% (339/3077) remote: Compressing objects: 11% (342/3077) remote: Compressing objects: 12% (370/3077) remote: Compressing objects: 13% (401/3077) remote: Compressing objects: 14% (431/3077) remote: Compressing objects: 14% (461/3077) remote: Compressing objects: 15% (462/3077) remote: Compressing objects: 16% (493/3077) remote: Compressing objects: 17% (524/3077) remote: Compressing objects: 18% (554/3077) remote: Compressing objects: 19% (585/3077) remote: Compressing objects: 19% (613/3077) remote: Compressing objects: 20% (616/3077) remote: Compressing objects: 21% (647/3077) remote: Compressing objects: 22% (677/3077) remote: Compressing objects: 23% (708/3077) remote: Compressing objects: 24% (739/3077)
  7. 10.54 s remote: Compressing objects: 25% (770/3077) remote: Compressing objects: 26% (801/3077) remote: Compressing objects: 27% (831/3077) remote: Compressing objects: 28% (862/3077) remote: Compressing objects: 29% (893/3077) remote: Compressing objects: 30% (924/3077) remote: Compressing objects: 31% (954/3077) remote: Compressing objects: 32% (985/3077) remote: Compressing objects: 33% (1016/3077) remote: Compressing objects: 33% (1027/3077) remote: Compressing objects: 34% (1047/3077) remote: Compressing objects: 35% (1077/3077) remote: Compressing objects: 36% (1108/3077) remote: Compressing objects: 37% (1139/3077) remote: Compressing objects: 38% (1170/3077) remote: Compressing objects: 39% (1201/3077) remote: Compressing objects: 40% (1231/3077) remote: Compressing objects: 41% (1262/3077) remote: Compressing objects: 42% (1293/3077) remote: Compressing objects: 43% (1324/3077) remote: Compressing objects: 44% (1354/3077) remote: Compressing objects: 45% (1385/3077) remote: Compressing objects: 46% (1416/3077) remote: Compressing objects: 47% (1447/3077) remote: Compressing objects: 48% (1477/3077) remote: Compressing objects: 49% (1508/3077) remote: Compressing objects: 50% (1539/3077) remote: Compressing objects: 51% (1570/3077) remote: Compressing objects: 52% (1601/3077) remote: Compressing objects: 53% (1631/3077) remote: Compressing objects: 54% (1662/3077) remote: Compressing objects: 55% (1693/3077) remote: Compressing objects: 56% (1724/3077) remote: Compressing objects: 57% (1754/3077) remote: Compressing objects: 58% (1785/3077) remote: Compressing objects: 59% (1816/3077) remote: Compressing objects: 60% (1847/3077) remote: Compressing objects: 61% (1877/3077) remote: Compressing objects: 62% (1908/3077) remote: Compressing objects: 63% (1939/3077) remote: Compressing objects: 64% (1970/3077) remote: Compressing objects: 65% (2001/3077) remote: Compressing objects: 66% (2031/3077) remote: Compressing objects: 67% (2062/3077) remote: Compressing objects: 68% (2093/3077) remote: Compressing objects: 69% (2124/3077) remote: Compressing objects: 70% (2154/3077) remote: Compressing objects: 71% (2185/3077) remote: Compressing objects: 72% (2216/3077) remote: Compressing objects: 73% (2247/3077) remote: Compressing objects: 74% (2277/3077) remote: Compressing objects: 75% (2308/3077) remote: Compressing objects: 76% (2339/3077) remote: Compressing objects: 77% (2370/3077) remote: Compressing objects: 78% (2401/3077) remote: Compressing objects: 79% (2431/3077) remote: Compressing objects: 80% (2462/3077) remote: Compressing objects: 81% (2493/3077) remote: Compressing objects: 82% (2524/3077) remote: Compressing objects: 83% (2554/3077) remote: Compressing objects: 84% (2585/3077) remote: Compressing objects: 85% (2616/3077) remote: Compressing objects: 86% (2647/3077) remote: Compressing objects: 87% (2677/3077) remote: Compressing objects: 88% (2708/3077) remote: Compressing objects: 89% (2739/3077) remote: Compressing objects: 90% (2770/3077) remote: Compressing objects: 91% (2801/3077) remote: Compressing objects: 92% (2831/3077) remote: Compressing objects: 93% (2862/3077) remote: Compressing objects: 94% (2893/3077) remote: Compressing objects: 95% (2924/3077) remote: Compressing objects: 96% (2954/3077) remote: Compressing objects: 97% (2985/3077) remote: Compressing objects: 98% (3016/3077) remote: Compressing objects: 99% (3047/3077) remote: Compressing objects: 100% (3077/3077) remote: Compressing objects: 100% (3077/3077), done.
  8. 14.83 s Receiving objects: 0% (1/172461) Receiving objects: 1% (1725/172461) Receiving objects: 2% (3450/172461) Receiving objects: 3% (5174/172461), 16.68 MiB | 33.34 MiB/s Receiving objects: 4% (6899/172461), 16.68 MiB | 33.34 MiB/s Receiving objects: 4% (8413/172461), 33.49 MiB | 32.31 MiB/s Receiving objects: 5% (8624/172461), 33.49 MiB | 32.31 MiB/s Receiving objects: 6% (10348/172461), 33.49 MiB | 32.31 MiB/s Receiving objects: 7% (12073/172461), 50.40 MiB | 32.80 MiB/s Receiving objects: 7% (12548/172461), 67.57 MiB | 32.64 MiB/s Receiving objects: 8% (13797/172461), 67.57 MiB | 32.64 MiB/s Receiving objects: 9% (15522/172461), 67.57 MiB | 32.64 MiB/s Receiving objects: 10% (17247/172461), 67.57 MiB | 32.64 MiB/s Receiving objects: 11% (18971/172461), 67.57 MiB | 32.64 MiB/s Receiving objects: 12% (20696/172461), 83.32 MiB | 32.41 MiB/s Receiving objects: 13% (22420/172461), 83.32 MiB | 32.41 MiB/s Receiving objects: 14% (24145/172461), 83.32 MiB | 32.41 MiB/s Receiving objects: 15% (25870/172461), 83.32 MiB | 32.41 MiB/s Receiving objects: 16% (27594/172461), 83.32 MiB | 32.41 MiB/s Receiving objects: 17% (29319/172461), 83.32 MiB | 32.41 MiB/s Receiving objects: 18% (31043/172461), 83.32 MiB | 32.41 MiB/s Receiving objects: 19% (32768/172461), 83.32 MiB | 32.41 MiB/s Receiving objects: 20% (34493/172461), 83.32 MiB | 32.41 MiB/s Receiving objects: 21% (36217/172461), 83.32 MiB | 32.41 MiB/s Receiving objects: 22% (37942/172461), 83.32 MiB | 32.41 MiB/s Receiving objects: 23% (39667/172461), 83.32 MiB | 32.41 MiB/s Receiving objects: 24% (41391/172461), 83.32 MiB | 32.41 MiB/s Receiving objects: 25% (43116/172461), 83.32 MiB | 32.41 MiB/s Receiving objects: 26% (44840/172461), 83.32 MiB | 32.41 MiB/s Receiving objects: 26% (45588/172461), 83.32 MiB | 32.41 MiB/s Receiving objects: 27% (46565/172461), 83.32 MiB | 32.41 MiB/s Receiving objects: 28% (48290/172461), 83.32 MiB | 32.41 MiB/s Receiving objects: 29% (50014/172461), 102.82 MiB | 33.11 MiB/s Receiving objects: 30% (51739/172461), 102.82 MiB | 33.11 MiB/s Receiving objects: 31% (53463/172461), 102.82 MiB | 33.11 MiB/s Receiving objects: 32% (55188/172461), 102.82 MiB | 33.11 MiB/s Receiving objects: 33% (56913/172461), 102.82 MiB | 33.11 MiB/s Receiving objects: 34% (58637/172461), 121.99 MiB | 33.59 MiB/s Receiving objects: 35% (60362/172461), 121.99 MiB | 33.59 MiB/s Receiving objects: 35% (61601/172461), 121.99 MiB | 33.59 MiB/s Receiving objects: 36% (62086/172461), 121.99 MiB | 33.59 MiB/s Receiving objects: 37% (63811/172461), 138.26 MiB | 33.39 MiB/s Receiving objects: 38% (65536/172461), 138.26 MiB | 33.39 MiB/s Receiving objects: 39% (67260/172461), 138.26 MiB | 33.39 MiB/s
  9. 20.10 s Receiving objects: 40% (68985/172461), 156.60 MiB | 33.55 MiB/s Receiving objects: 41% (70710/172461), 156.60 MiB | 33.55 MiB/s Receiving objects: 41% (71123/172461), 156.60 MiB | 33.55 MiB/s Receiving objects: 42% (72434/172461), 156.60 MiB | 33.55 MiB/s Receiving objects: 43% (74159/172461), 173.60 MiB | 33.57 MiB/s Receiving objects: 44% (75883/172461), 173.60 MiB | 33.57 MiB/s Receiving objects: 45% (77608/172461), 173.60 MiB | 33.57 MiB/s Receiving objects: 46% (79333/172461), 173.60 MiB | 33.57 MiB/s Receiving objects: 47% (81057/172461), 173.60 MiB | 33.57 MiB/s Receiving objects: 48% (82782/172461), 173.60 MiB | 33.57 MiB/s Receiving objects: 49% (84506/172461), 191.65 MiB | 33.90 MiB/s Receiving objects: 49% (86199/172461), 191.65 MiB | 33.90 MiB/s Receiving objects: 50% (86231/172461), 191.65 MiB | 33.90 MiB/s Receiving objects: 51% (87956/172461), 191.65 MiB | 33.90 MiB/s Receiving objects: 52% (89680/172461), 191.65 MiB | 33.90 MiB/s Receiving objects: 52% (89800/172461), 224.58 MiB | 33.90 MiB/s Receiving objects: 53% (91405/172461), 255.70 MiB | 33.19 MiB/s Receiving objects: 53% (91556/172461), 255.70 MiB | 33.19 MiB/s Receiving objects: 54% (93129/172461), 272.14 MiB | 32.78 MiB/s Receiving objects: 55% (94854/172461), 272.14 MiB | 32.78 MiB/s Receiving objects: 56% (96579/172461), 272.14 MiB | 32.78 MiB/s Receiving objects: 57% (98303/172461), 288.75 MiB | 32.92 MiB/s Receiving objects: 58% (100028/172461), 288.75 MiB | 32.92 MiB/s Receiving objects: 59% (101752/172461), 288.75 MiB | 32.92 MiB/s Receiving objects: 60% (103477/172461), 288.75 MiB | 32.92 MiB/s Receiving objects: 61% (105202/172461), 288.75 MiB | 32.92 MiB/s Receiving objects: 62% (106926/172461), 288.75 MiB | 32.92 MiB/s Receiving objects: 63% (108651/172461), 288.75 MiB | 32.92 MiB/s Receiving objects: 63% (109561/172461), 288.75 MiB | 32.92 MiB/s Receiving objects: 64% (110376/172461), 288.75 MiB | 32.92 MiB/s Receiving objects: 65% (112100/172461), 305.42 MiB | 32.74 MiB/s Receiving objects: 66% (113825/172461), 305.42 MiB | 32.74 MiB/s
  10. 24.97 s Receiving objects: 67% (115549/172461), 305.42 MiB | 32.74 MiB/s Receiving objects: 68% (117274/172461), 321.76 MiB | 32.65 MiB/s Receiving objects: 68% (118097/172461), 321.76 MiB | 32.65 MiB/s Receiving objects: 69% (118999/172461), 321.76 MiB | 32.65 MiB/s Receiving objects: 70% (120723/172461), 321.76 MiB | 32.65 MiB/s Receiving objects: 71% (122448/172461), 339.33 MiB | 32.74 MiB/s Receiving objects: 72% (124172/172461), 356.62 MiB | 32.84 MiB/s Receiving objects: 72% (124317/172461), 356.62 MiB | 32.84 MiB/s Receiving objects: 73% (125897/172461), 373.23 MiB | 32.78 MiB/s Receiving objects: 74% (127622/172461), 373.23 MiB | 32.78 MiB/s Receiving objects: 75% (129346/172461), 390.06 MiB | 33.62 MiB/s Receiving objects: 75% (129941/172461), 390.06 MiB | 33.62 MiB/s Receiving objects: 76% (131071/172461), 390.06 MiB | 33.62 MiB/s Receiving objects: 77% (132795/172461), 424.68 MiB | 33.73 MiB/s Receiving objects: 77% (133299/172461), 424.68 MiB | 33.73 MiB/s Receiving objects: 78% (134520/172461), 424.68 MiB | 33.73 MiB/s Receiving objects: 79% (136245/172461), 424.68 MiB | 33.73 MiB/s Receiving objects: 80% (137969/172461), 441.99 MiB | 33.88 MiB/s Receiving objects: 81% (139694/172461), 458.99 MiB | 33.96 MiB/s Receiving objects: 81% (140347/172461), 458.99 MiB | 33.96 MiB/s Receiving objects: 82% (141419/172461), 476.07 MiB | 34.06 MiB/s
  11. 29.54 s Receiving objects: 82% (142734/172461), 493.06 MiB | 33.79 MiB/s Receiving objects: 83% (143143/172461), 493.06 MiB | 33.79 MiB/s Receiving objects: 84% (144868/172461), 511.03 MiB | 34.07 MiB/s Receiving objects: 85% (146592/172461), 528.00 MiB | 34.20 MiB/s Receiving objects: 85% (147491/172461), 544.64 MiB | 34.15 MiB/s Receiving objects: 85% (147550/172461), 579.65 MiB | 34.23 MiB/s Receiving objects: 85% (147551/172461), 612.74 MiB | 33.95 MiB/s Receiving objects: 85% (147553/172461), 630.83 MiB | 34.07 MiB/s
  12. 34.33 s Receiving objects: 85% (147557/172461), 682.24 MiB | 34.09 MiB/s Receiving objects: 85% (147565/172461), 716.54 MiB | 34.28 MiB/s Receiving objects: 85% (147911/172461), 733.08 MiB | 33.92 MiB/s Receiving objects: 86% (148317/172461), 733.08 MiB | 33.92 MiB/s Receiving objects: 87% (150042/172461), 733.08 MiB | 33.92 MiB/s Receiving objects: 88% (151766/172461), 733.08 MiB | 33.92 MiB/s Receiving objects: 89% (153491/172461), 750.69 MiB | 34.18 MiB/s Receiving objects: 90% (155215/172461), 768.13 MiB | 34.37 MiB/s Receiving objects: 90% (156790/172461), 768.13 MiB | 34.37 MiB/s Receiving objects: 91% (156940/172461), 768.13 MiB | 34.37 MiB/s Receiving objects: 92% (158665/172461), 768.13 MiB | 34.37 MiB/s Receiving objects: 93% (160389/172461), 768.13 MiB | 34.37 MiB/s Receiving objects: 94% (162114/172461), 768.13 MiB | 34.37 MiB/s Receiving objects: 95% (163838/172461), 768.13 MiB | 34.37 MiB/s Receiving objects: 96% (165563/172461), 768.13 MiB | 34.37 MiB/s Receiving objects: 97% (167288/172461), 768.13 MiB | 34.37 MiB/s Receiving objects: 98% (169012/172461), 768.13 MiB | 34.37 MiB/s Receiving objects: 99% (170737/172461), 784.61 MiB | 34.17 MiB/s remote: Total 172461 (delta 12808), reused 11913 (delta 11752), pack-reused 157625 (from 3)
  13. 34.33 s Receiving objects: 100% (172461/172461), 784.61 MiB | 34.17 MiB/s Receiving objects: 100% (172461/172461), 798.70 MiB | 33.58 MiB/s, done.
  14. 35.21 s Resolving deltas: 0% (0/106075) Resolving deltas: 1% (1061/106075) Resolving deltas: 2% (2122/106075) Resolving deltas: 3% (3183/106075) Resolving deltas: 4% (4243/106075) Resolving deltas: 5% (5304/106075) Resolving deltas: 6% (6365/106075) Resolving deltas: 7% (7426/106075) Resolving deltas: 8% (8486/106075) Resolving deltas: 9% (9548/106075) Resolving deltas: 10% (10608/106075) Resolving deltas: 11% (11669/106075) Resolving deltas: 12% (12729/106075) Resolving deltas: 13% (13790/106075) Resolving deltas: 14% (14851/106075) Resolving deltas: 15% (15912/106075) Resolving deltas: 16% (16972/106075) Resolving deltas: 17% (18033/106075) Resolving deltas: 18% (19094/106075) Resolving deltas: 19% (20155/106075) Resolving deltas: 20% (21215/106075) Resolving deltas: 21% (22276/106075) Resolving deltas: 22% (23337/106075)
  15. 37.50 s Resolving deltas: 23% (24398/106075) Resolving deltas: 24% (25458/106075) Resolving deltas: 25% (26519/106075) Resolving deltas: 25% (26979/106075) Resolving deltas: 26% (27580/106075) Resolving deltas: 27% (28641/106075) Resolving deltas: 28% (29702/106075) Resolving deltas: 29% (30762/106075) Resolving deltas: 30% (31823/106075) Resolving deltas: 31% (32885/106075) Resolving deltas: 32% (33945/106075) Resolving deltas: 33% (35005/106075) Resolving deltas: 34% (36067/106075) Resolving deltas: 35% (37127/106075) Resolving deltas: 36% (38187/106075) Resolving deltas: 37% (39248/106075) Resolving deltas: 38% (40309/106075) Resolving deltas: 39% (41370/106075) Resolving deltas: 40% (42430/106075) Resolving deltas: 41% (43491/106075) Resolving deltas: 42% (44552/106075) Resolving deltas: 43% (45613/106075) Resolving deltas: 44% (46673/106075) Resolving deltas: 45% (47734/106075) Resolving deltas: 46% (48795/106075) Resolving deltas: 47% (49856/106075) Resolving deltas: 48% (50916/106075) Resolving deltas: 49% (51977/106075) Resolving deltas: 50% (53038/106075) Resolving deltas: 51% (54099/106075) Resolving deltas: 52% (55159/106075) Resolving deltas: 53% (56220/106075) Resolving deltas: 54% (57281/106075) Resolving deltas: 55% (58342/106075) Resolving deltas: 56% (59402/106075) Resolving deltas: 57% (60463/106075) Resolving deltas: 57% (60744/106075) Resolving deltas: 58% (61525/106075) Resolving deltas: 59% (62585/106075) Resolving deltas: 60% (63645/106075) Resolving deltas: 61% (64706/106075) Resolving deltas: 62% (65767/106075) Resolving deltas: 63% (66828/106075) Resolving deltas: 64% (67892/106075) Resolving deltas: 65% (68952/106075) Resolving deltas: 66% (70013/106075) Resolving deltas: 67% (71071/106075) Resolving deltas: 68% (72131/106075) Resolving deltas: 69% (73192/106075) Resolving deltas: 70% (74253/106075) Resolving deltas: 71% (75314/106075) Resolving deltas: 72% (76374/106075) Resolving deltas: 73% (77435/106075) Resolving deltas: 74% (78496/106075) Resolving deltas: 75% (79557/106075) Resolving deltas: 76% (80617/106075) Resolving deltas: 77% (81678/106075) Resolving deltas: 78% (82739/106075) Resolving deltas: 79% (83802/106075) Resolving deltas: 80% (84860/106075) Resolving deltas: 81% (85921/106075) Resolving deltas: 82% (86982/106075) Resolving deltas: 83% (88046/106075) Resolving deltas: 84% (89104/106075) Resolving deltas: 85% (90164/106075) Resolving deltas: 86% (91225/106075) Resolving deltas: 87% (92287/106075) Resolving deltas: 88% (93346/106075) Resolving deltas: 89% (94407/106075) Resolving deltas: 90% (95468/106075) Resolving deltas: 91% (96529/106075) Resolving deltas: 92% (97589/106075) Resolving deltas: 93% (98650/106075) Resolving deltas: 94% (99711/106075) Resolving deltas: 95% (100775/106075) Resolving deltas: 95% (101322/106075) Resolving deltas: 96% (101832/106075) Resolving deltas: 97% (102893/106075) Resolving deltas: 98% (103954/106075) Resolving deltas: 99% (105015/106075) Resolving deltas: 100% (106075/106075) Resolving deltas: 100% (106075/106075), done.
  16. 38.78 s Fetching commit 3fab91cd4d2e773be97d81cf93421a58a94bdffa for ltd_support ...
  17. 38.78 s $ /nix/store/b1wn5clix1mz4vpfih7x9cnj9qfh7c6h-git-2.54.0/bin/git fetch origin 3fab91cd4d2e773be97d81cf93421a58a94bdffa
  18. 39.24 s From https://github.com/alphal00p/gammaloop
  19. 39.24 s * branch 3fab91cd4d2e773be97d81cf93421a58a94bdffa -> FETCH_HEAD
  20. 39.25 s $ /nix/store/bhv6xyvqw6gjs3j488gi1z6wdv18bdpa-coreutils-9.11/bin/timeout --kill-after=15s 7200s /nix/store/b1wn5clix1mz4vpfih7x9cnj9qfh7c6h-git-2.54.0/bin/git -c advice.detachedHead=false checkout 3fab91cd4d2e773be97d81cf93421a58a94bdffa
  21. 39.57 s HEAD is now at 3fab91cd4 finish standalone export cleanup and defer center test metadata
  22. 39.58 s $ /nix/store/bhv6xyvqw6gjs3j488gi1z6wdv18bdpa-coreutils-9.11/bin/timeout --kill-after=15s 7200s /nix/store/5np0yidzrnyjbb243hvgqpgpss865p0n-nix-2.34.9/bin/nix --extra-experimental-features nix-command --extra-experimental-features flakes --log-format internal-json run .#packages.x86_64-linux.nix-ci-check-gammaloop-nextest-integration --print-build-logs
  23. 39.76 s warning: ignoring untrusted flake configuration setting 'extra-substituters'.
  24. 39.76 s Pass '--accept-flake-config' to trust it
  25. 39.76 s warning: ignoring untrusted flake configuration setting 'extra-trusted-public-keys'.
  26. 39.76 s Pass '--accept-flake-config' to trust it
  27. 55.42 s
  28. 55.85 s evaluating derivation 'gdo you want to allow configuration setting 'extra-substituters' to be set to 'https://cache.nix-ci.com' (y/N)? do you want to permanently mark this value as untrusted (y/N)? warning: ignoring untrusted flake configuration setting 'extra-substituters'.
  29. 55.85 s Pass '--accept-flake-config' to trust it
  30. 55.85 s do you want to allow configuration setting 'extra-trusted-public-keys' to be set to 'nix-ci:g3xV5BDTLtIBZr/A00IU1x0EtKKlb7YLgBN2SgYgM6A=' (y/N)? do you want to permanently mark this value as untrusted (y/N)? warning: ignoring untrusted flake configuration setting 'extra-trusted-public-keys'.
  31. 55.85 s Pass '--accept-flake-config' to trust it
  32. 59.62 s copying '/nix/store/vxqg evaluating derivation 'g
  33. 65.83 s copying '/nix/store/vxqg evaluating derivation 'g copying '/nix/store/vxqg evaluating derivation 'g copying '/nix/store/vxqg evaluating derivation 'g copying '/nix/store/vxqg evaluating derivation 'g copying '/nix/store/vxqg evaluating derivation 'g copying '/nix/store/vxqg evaluating derivation 'g copying '/nix/store/vxqg evaluating derivation 'g copying '/nix/store/vxqg evaluating derivation 'g copying '/nix/store/vxqg evaluating derivation 'g copying '/nix/store/vxqg evaluating derivation 'g
  34. 70.87 s copying '/nix/store/vxqg evaluating derivation 'g copying '/nix/store/vxqg evaluating derivation 'g copying '/nix/store/vxqg evaluating derivation 'g copying '/nix/store/vxqg evaluating derivation 'g copying '/nix/store/vxqg evaluating derivation 'g copying '/nix/store/vxqg evaluating derivation 'g copying '/nix/store/vxqg evaluating derivation 'g copying '/nix/store/vxqg evaluating derivation 'g copying '/nix/store/vxqg evaluating derivation 'g copying '/nix/store/vxqg evaluating derivation 'g copying '/nix/store/vxqg evaluating derivation 'g copying '/nix/store/vxqg evaluating derivation 'g copying '/nix/store/vxqg evaluating derivation 'g copying '/nix/store/vxqg evaluating derivation 'g copying '/nix/store/vxqg evaluating derivation 'g copying '/nix/store/vxqg evaluating derivation 'g copying '/nix/store/vxqg evaluating derivation 'g copying '/nix/store/vxqg evaluating derivation 'g
  35. 72.85 s [0/1 built] [1/0/1 built] building ggammaloop-nextest-integration> Nextest worker budget: 16
  36. 72.87 s gammaloop-nextest-integration> Extracting 13 binaries (including 2 non-test binaries), 1 build script output directory, and 3 linked paths to /build/source
  37. 78.40 s gammaloop-nextest-integration> Extracted 32 files to /build/source in 5.54s
  38. 78.46 s gammaloop-nextest-integration> ------------
  39. 78.46 s gammaloop-nextest-integration> Nextest run ID b8a11aa2-05b4-4d49-b117-b76896cde12a with nextest profile: ci_gammaloop
  40. 78.46 s gammaloop-nextest-integration> Starting 380 tests across 11 binaries (65 tests skipped, including 61 tests via profile.default.default-filter)
  41. 97.49 s gammaloop-nextest-integration> FAIL [ 0.252s] ( 49/380) gammaloop-integration-tests::test_feyngen cross_section_standalone_export_writes_archive_and_loader
  42. 97.49 s gammaloop-nextest-integration> stdout ---
  43. 97.49 s gammaloop-nextest-integration>
  44. 97.49 s gammaloop-nextest-integration> running 1 test
  45. 97.49 s gammaloop-nextest-integration> test cross_section_standalone_export_writes_archive_and_loader ... FAILED
  46. 97.49 s gammaloop-nextest-integration>
  47. 97.49 s gammaloop-nextest-integration> failures:
  48. 97.49 s gammaloop-nextest-integration>
  49. 97.49 s gammaloop-nextest-integration> failures:
  50. 97.49 s gammaloop-nextest-integration> cross_section_standalone_export_writes_archive_and_loader
  51. 97.49 s gammaloop-nextest-integration>
  52. 97.49 s gammaloop-nextest-integration> test result: FAILED. 0 passed; 1 failed; 0 ignored; 0 measured; 37 filtered out; finished in 0.24s
  53. 97.49 s gammaloop-nextest-integration>
  54. 97.49 s gammaloop-nextest-integration> stderr ---
  55. 97.49 s gammaloop-nextest-integration> [2026-10-19 14:11:23.119] @gammaloop_api::se... INFO : Running command import model sm-default
  56. 97.49 s gammaloop-nextest-integration> [2026-10-19 14:11:23.119] @import::model INFO : Loading built-in JSON model sm-default
  57. 97.49 s gammaloop-nextest-integration> [2026-10-19 14:11:23.149] @gammalooprs::model INFO : The following 22 external parameters were forced to zero by the restriction card:
  58. 97.49 s gammaloop-nextest-integration> lamWS, AWS, rhoWS, etaWS, ymc, yme, ymm, MS, MC, Me, MM, WTau, muB, muQ, muLe, muLmu, muLtau, ymu, ymd, yms, MU, MD
  59. 97.49 s gammaloop-nextest-integration> [2026-10-19 14:11:23.150] @gammalooprs::model INFO : The following 44 vertex rules were removed by the restriction card:
  60. 97.49 s gammaloop-nextest-integration> V_82 -> (c~, d, G+) | V_83 -> (t~, d, G+) | V_84 -> (c~, s, G+) | V_85 -> (t~, s, G+) | V_86 -> (u~, b, G+) | V_87 -> (c~, b, G+) | V_90 -> (c~, d, W+) | V_91 -> (t~, d, W+) | V_92 -> (u~, s, W+) | V_94 -> (t~, s, W+) | V_95 -> (u~, b, W+) | V_96 -> (c~, b, W+) | V_101 -> (e+, e-, G0) | V_102 -> (mu+, mu-, G0) | V_104 -> (e+, e-, H) | V_105 -> (mu+, mu-, H) | V_110 -> (ve~, e-, G+) | V_111 -> (vm~, mu-, G+) | V_116 -> (b~, u, G-) | V_117 -> (d~, c, G-) | V_118 -> (s~, c, G-) | V_119 -> (b~, c, G-) | V_120 -> (d~, t, G-) | V_121 -> (s~, t, G-) | V_124 -> (s~, u, W-) | V_125 -> (b~, u, W-) | V_126 -> (d~, c, W-) | V_128 -> (b~, c, W-) | V_129 -> (d~, t, W-) | V_130 -> (s~, t, W-) | V_138 -> (c~, c, G0) | V_140 -> (c~, c, H) | V_145 -> (e+, ve, G-) | V_146 -> (mu+, vm, G-) | V_154 -> (u~, u, H) | V_155 -> (u~, u, G0) | V_156 -> (d~, d, H) | V_157 -> (d~, d, G0) | V_158 -> (s~, s, H) | V_159 -> (s~, s, G0) | V_160 -> (u~, d, G+) | V_161 -> (d~, u, G-) | V_162 -> (u~, s, G+) | V_163 -> (s~, u, G-)
  61. 97.49 s gammaloop-nextest-integration> [2026-10-19 14:11:23.150] @gammalooprs::model INFO : The following 60 couplings were removed by the restriction card:
  62. 97.49 s gammaloop-nextest-integration> GC_13, GC_14, GC_16, GC_17, GC_18, GC_19, GC_20, GC_22, GC_23, GC_24, GC_25, GC_26, GC_28, GC_29, GC_42, GC_43, GC_44, GC_46, GC_47, GC_48, GC_84, GC_85, GC_86, GC_87, GC_88, GC_89, GC_90, GC_91, GC_92, GC_93, GC_101, GC_102, GC_103, GC_105, GC_106, GC_107, GC_109, GC_110, GC_111, GC_112, GC_113, GC_114, GC_115, GC_116, GC_117, GC_118, GC_119, GC_120, GC_121, GC_122, GC_123, GC_124, GC_125, GC_126, GC_127, GC_128, GC_129, GC_130, GC_131, GC_132
  63. 97.49 s gammaloop-nextest-integration> [2026-10-19 14:11:23.158] @gammaloop_api::se... INFO : Running command set global kv global.n_cores.feyngen=1
  64. 97.49 s gammaloop-nextest-integration> [2026-10-19 14:11:23.203] @gammaloop_api::se... INFO : Running command set global kv global.generation.evaluator.store_atom=true
  65. 97.49 s gammaloop-nextest-integration> [2026-10-19 14:11:23.204] @gammaloop_api::se... INFO : Running command generate xs z > d d~
  66. 97.49 s gammaloop-nextest-integration> [2026-10-19 14:11:23.206] @feyngen::diagram_... INFO : 0s | Δ=0s | Starting Feynman graph generation with Symbolica...
  67. 97.49 s gammaloop-nextest-integration> [2026-10-19 14:11:23.206] @feyngen::diagram_... INFO : 0s | Δ=0s | Number of graphs resulting from Symbolica generation: 24
  68. 97.49 s gammaloop-nextest-integration> [2026-10-19 14:11:23.207] @feyngen::diagram_... INFO : 0s | Δ=0s | Number of graphs retained after enforcing supergraph particle content: 1
  69. 97.49 s gammaloop-nextest-integration> [2026-10-19 14:11:23.207] @feyngen::diagram_... INFO : 0s | Δ=0s | Number of graphs retained after removal of vetoed topologies: 1
  70. 97.49 s gammaloop-nextest-integration> [2026-10-19 14:11:23.207] @feyngen::diagram_... INFO : 0s | Δ=0s | Number of graphs after vertex info assignment: 1
  71. 97.49 s gammaloop-nextest-integration> [2026-10-19 14:11:23.207] @feyngen::diagram_... INFO : 0s | Δ=0s | Number of graphs after all complete graphs filters are applied: 1
  72. 97.49 s gammaloop-nextest-integration> [2026-10-19 14:11:23.207] @feyngen::diagram_... INFO : 0s | Δ=0s | Number of graphs after closed anticommutating chains analysis: 1
  73. 97.49 s gammaloop-nextest-integration> [2026-10-19 14:11:23.207] @feyngen::diagram_... INFO : 0s | Δ=0s | Number of graphs after fast Cutkosky cut filter is applied: 1
  74. 97.49 s gammaloop-nextest-integration> [2026-10-19 14:11:23.207] @feyngen::diagram_... INFO : 0s | Δ=0s | Number of graphs after symmetrization of external states: 1
  75. 97.49 s gammaloop-nextest-integration> [2026-10-19 14:11:23.207] @feyngen::diagram_... INFO : 0s | Δ=0s | Number of graphs after canonization of vertices, edges and flows (graph labels assigned here): 1
  76. 97.49 s gammaloop-nextest-integration> [2026-10-19 14:11:23.252] @feyngen::diagram_... INFO : 0s | Δ=0s | Number of graphs after numerator-aware grouping with strategy 'up to a scalar rescaling': 1 (1 isomorphically unique graph, 0 color zero, 0 lorentz zero, 0 grouped and 0 cancellation)
  77. 97.49 s gammaloop-nextest-integration> [2026-10-19 14:11:23.252] @feyngen::diagram_... INFO : ( Sum of the symmetry factors from each graph generated = -1 )
  78. 97.49 s gammaloop-nextest-integration> [2026-10-19 14:11:23.253] @commands::generate INFO : Generated cross-section 1 graphs.
  79. 97.49 s gammaloop-nextest-integration> [2026-10-19 14:11:23.270] @commands::generate INFO :
  80. 97.49 s gammaloop-nextest-integration> Integrand generation summary
  81. 97.49 s gammaloop-nextest-integration> peak RAM 97.84 MiB | cores 1
  82. 97.49 s gammaloop-nextest-integration> ╭───────────┬───────┬────────┬─────────┬─────────────┬────────────┬─────────────┬────────────────┬─────────────╮
  83. 97.49 s gammaloop-nextest-integration> │ integrand │ graph │ scope │ # evals │ total work │ expr build │ spenso │ symbolica eval │ compile │
  84. 97.49 s gammaloop-nextest-integration> ├───────────┼───────┼────────┼─────────┼─────────────┼────────────┼─────────────┼────────────────┼─────────────┤
  85. 97.49 s gammaloop-nextest-integration> │ default │ GL0 │ all │ 3 │ 16ms (100%) │ 7ms (48%) │ 4ms (27%) │ 4ms (25%) │ 0ms (0.00%) │
  86. 97.49 s gammaloop-nextest-integration> │ default │ GL0 │ shared │ 1 │ 4ms (30%) │ 4ms (26%) │ 0ms (0.00%) │ 0ms (4.2%) │ 0ms (0.00%) │
  87. 97.49 s gammaloop-nextest-integration> │ default │ GL0 │ cff │ 2 │ 11ms (70%) │ 3ms (23%) │ 4ms (27%) │ 3ms (21%) │ 0ms (0.00%) │
  88. 97.49 s gammaloop-nextest-integration> ├───────────┼───────┼────────┼─────────┼─────────────┼────────────┼─────────────┼────────────────┼─────────────┤
  89. 97.49 s gammaloop-nextest-integration> │ Total │ │ all │ 3 │ 16ms (100%) │ 7ms (48%) │ 4ms (27%) │ 4ms (25%) │ 0ms (0.00%) │
  90. 97.49 s gammaloop-nextest-integration> │ Total │ │ shared │ 1 │ 4ms (30%) │ 4ms (26%) │ 0ms (0.00%) │ 0ms (4.2%) │ 0ms (0.00%) │
  91. 97.49 s gammaloop-nextest-integration> │ Total │ │ cff │ 2 │ 11ms (70%) │ 3ms (23%) │ 4ms (27%) │ 3ms (21%) │ 0ms (0.00%) │
  92. 97.49 s gammaloop-nextest-integration> ╰───────────┴───────┴────────┴─────────┴─────────────┴────────────┴─────────────┴────────────────┴─────────────╯
  93. 97.49 s gammaloop-nextest-integration> Common graph/UV preparation and helpers are counted once. Representation rows partition the remaining work; percentages refer to the aggregate. Summed graph durations can overlap during parallel generation.
  94. 97.49 s gammaloop-nextest-integration> [2026-10-19 14:11:23.271] @gammaloop_api::se... INFO : Running command generate
  95. 97.49 s gammaloop-nextest-integration> [2026-10-19 14:11:23.289] @commands::generate INFO :
  96. 97.49 s gammaloop-nextest-integration> Integrand generation summary
  97. 97.49 s gammaloop-nextest-integration> peak RAM 104.09 MiB | cores 1
  98. 97.49 s gammaloop-nextest-integration> ╭───────────┬───────┬────────┬─────────┬─────────────┬────────────┬─────────────┬────────────────┬─────────────╮
  99. 97.49 s gammaloop-nextest-integration> │ integrand │ graph │ scope │ # evals │ total work │ expr build │ spenso │ symbolica eval │ compile │
  100. 97.49 s gammaloop-nextest-integration> ├───────────┼───────┼────────┼─────────┼─────────────┼────────────┼─────────────┼────────────────┼─────────────┤
  101. 97.49 s gammaloop-nextest-integration> │ default │ GL0 │ all │ 3 │ 17ms (100%) │ 8ms (49%) │ 4ms (23%) │ 4ms (27%) │ 0ms (0.00%) │
  102. 97.49 s gammaloop-nextest-integration> │ default │ GL0 │ shared │ 1 │ 5ms (31%) │ 4ms (27%) │ 0ms (0.00%) │ 0ms (3.7%) │ 0ms (0.00%) │
  103. 97.49 s gammaloop-nextest-integration> │ default │ GL0 │ cff │ 2 │ 11ms (69%) │ 3ms (22%) │ 4ms (23%) │ 4ms (24%) │ 0ms (0.00%) │
  104. 97.49 s gammaloop-nextest-integration> ├───────────┼───────┼────────┼─────────┼─────────────┼────────────┼─────────────┼────────────────┼─────────────┤
  105. 97.49 s gammaloop-nextest-integration> │ Total │ │ all │ 3 │ 17ms (100%) │ 8ms (49%) │ 4ms (23%) │ 4ms (27%) │ 0ms (0.00%) │
  106. 97.49 s gammaloop-nextest-integration> │ Total │ │ shared │ 1 │ 5ms (31%) │ 4ms (27%) │ 0ms (0.00%) │ 0ms (3.7%) │ 0ms (0.00%) │
  107. 97.49 s gammaloop-nextest-integration> │ Total │ │ cff │ 2 │ 11ms (69%) │ 3ms (22%) │ 4ms (23%) │ 4ms (24%) │ 0ms (0.00%) │
  108. 97.49 s gammaloop-nextest-integration> ╰───────────┴───────┴────────┴─────────┴─────────────┴────────────┴─────────────┴────────────────┴─────────────╯
  109. 97.49 s gammaloop-nextest-integration> Common graph/UV preparation and helpers are counted once. Representation rows partition the remaining work; percentages refer to the aggregate. Summed graph durations can overlap during parallel generation.
  110. 97.49 s gammaloop-nextest-integration> Error:
  111. 97.49 s gammaloop-nextest-integration> 0: standalone graph term has no cut-group integrands
  112. 97.49 s gammaloop-nextest-integration>
  113. 97.49 s gammaloop-nextest-integration> Location:
  114. 97.49 s gammaloop-nextest-integration> tests/tests/test_feyngen.rs:869
  115. 97.49 s gammaloop-nextest-integration>
  116. 97.49 s gammaloop-nextest-integration> ━━━━━━━━━━━━━━━━━━━━━━━━━━━━━━━━━━ BACKTRACE ━━━━━━━━━━━━━━━━━━━━━━━━━━━━━━━━━━━
  117. 97.49 s gammaloop-nextest-integration> 1: <color_eyre[dc2f931ed52a6dec]::config::EyreHook>::into_eyre_hook::{closure#0}<unknown>
  118. 97.49 s gammaloop-nextest-integration> at <unknown source file>:<unknown line>
  119. 97.49 s gammaloop-nextest-integration> 2: eyre[cd75025c43f23a9b]::capture_handler<unknown>
  120. 97.49 s gammaloop-nextest-integration> at <unknown source file>:<unknown line>
  121. 97.49 s gammaloop-nextest-integration> 3: eyre[cd75025c43f23a9b]::private::format_err<unknown>
  122. 97.49 s gammaloop-nextest-integration> at <unknown source file>:<unknown line>
  123. 97.49 s gammaloop-nextest-integration> 4: <test_feyngen[10c70d8025b0d425]::cross_section_standalone_export_writes_archive_and_loader::{closure#0} as core[c0acaeba6ab4c2e0]::ops::function::FnOnce<()>>::call_once<unknown>
  124. 97.49 s gammaloop-nextest-integration> at <unknown source file>:<unknown line>
  125. 97.49 s gammaloop-nextest-integration> 5: test[69f9176bb4e5faed]::__rust_begin_short_backtrace::<core[c0acaeba6ab4c2e0]::result::Result<(), alloc[12e961f32105355]::string::String>, fn() -> core[c0acaeba6ab4c2e0]::result::Result<(), alloc[12e961f32105355]::string::String>><unknown>
  126. 97.49 s gammaloop-nextest-integration> at <unknown source file>:<unknown line>
  127. 97.49 s gammaloop-nextest-integration> 6: test[69f9176bb4e5faed]::run_test::{closure#0}<unknown>
  128. 97.49 s gammaloop-nextest-integration> at <unknown source file>:<unknown line>
  129. 97.49 s gammaloop-nextest-integration> 7: std[6c98fd8553dbae28]::sys::backtrace::__rust_begin_short_backtrace::<test[69f9176bb4e5faed]::run_test::{closure#1}, ()><unknown>
  130. 97.49 s gammaloop-nextest-integration> at <unknown source file>:<unknown line>
  131. 97.49 s gammaloop-nextest-integration> 8: <std[6c98fd8553dbae28]::thread::lifecycle::spawn_unchecked<test[69f9176bb4e5faed]::run_test::{closure#1}, ()>::{closure#1} as core[c0acaeba6ab4c2e0]::ops::function::FnOnce<()>>::call_once::{shim:vtable#0}<unknown>
  132. 97.49 s gammaloop-nextest-integration> at <unknown source file>:<unknown line>
  133. 97.49 s gammaloop-nextest-integration> 9: <std[6c98fd8553dbae28]::sys::thread::unix::Thread>::new::thread_start<unknown>
  134. 97.49 s gammaloop-nextest-integration> at <unknown source file>:<unknown line>
  135. 97.49 s gammaloop-nextest-integration> 10: start_thread<unknown>
  136. 97.49 s gammaloop-nextest-integration> at <unknown source file>:<unknown line>
  137. 97.49 s gammaloop-nextest-integration> 11: __clone3<unknown>
  138. 97.49 s gammaloop-nextest-integration> at <unknown source file>:<unknown line>
  139. 97.49 s gammaloop-nextest-integration>
  140. 97.49 s gammaloop-nextest-integration> Run with COLORBT_SHOW_HIDDEN=1 environment variable to disable frame filtering.
  141. 97.49 s gammaloop-nextest-integration> Run with RUST_BACKTRACE=full to include source snippets.
  142. 97.49 s gammaloop-nextest-integration>
  143. 2716.45 s gammaloop-nextest-integration> ------------
  144. 2716.45 s gammaloop-nextest-integration> Summary [2637.994s] 380 tests run: 379 passed (5 slow), 1 failed, 65 skipped
  145. 2716.45 s gammaloop-nextest-integration> FAIL [ 0.252s] ( 49/380) gammaloop-integration-tests::test_feyngen cross_section_standalone_export_writes_archive_and_loader
  146. 2716.45 s gammaloop-nextest-integration> stdout ---
  147. 2716.45 s gammaloop-nextest-integration>
  148. 2716.45 s gammaloop-nextest-integration> running 1 test
  149. 2716.45 s gammaloop-nextest-integration> test cross_section_standalone_export_writes_archive_and_loader ... FAILED
  150. 2716.45 s gammaloop-nextest-integration>
  151. 2716.45 s gammaloop-nextest-integration> failures:
  152. 2716.45 s gammaloop-nextest-integration>
  153. 2716.45 s gammaloop-nextest-integration> failures:
  154. 2716.45 s gammaloop-nextest-integration> cross_section_standalone_export_writes_archive_and_loader
  155. 2716.45 s gammaloop-nextest-integration>
  156. 2716.45 s gammaloop-nextest-integration> test result: FAILED. 0 passed; 1 failed; 0 ignored; 0 measured; 37 filtered out; finished in 0.24s
  157. 2716.45 s gammaloop-nextest-integration>
  158. 2716.45 s gammaloop-nextest-integration> stderr ---
  159. 2716.45 s gammaloop-nextest-integration> [2026-10-19 14:11:23.119] @gammaloop_api::se... INFO : Running command import model sm-default
  160. 2716.45 s gammaloop-nextest-integration> [2026-10-19 14:11:23.119] @import::model INFO : Loading built-in JSON model sm-default
  161. 2716.45 s gammaloop-nextest-integration> [2026-10-19 14:11:23.149] @gammalooprs::model INFO : The following 22 external parameters were forced to zero by the restriction card:
  162. 2716.45 s gammaloop-nextest-integration> lamWS, AWS, rhoWS, etaWS, ymc, yme, ymm, MS, MC, Me, MM, WTau, muB, muQ, muLe, muLmu, muLtau, ymu, ymd, yms, MU, MD
  163. 2716.45 s gammaloop-nextest-integration> [2026-10-19 14:11:23.150] @gammalooprs::model INFO : The following 44 vertex rules were removed by the restriction card:
  164. 2716.45 s gammaloop-nextest-integration> V_82 -> (c~, d, G+) | V_83 -> (t~, d, G+) | V_84 -> (c~, s, G+) | V_85 -> (t~, s, G+) | V_86 -> (u~, b, G+) | V_87 -> (c~, b, G+) | V_90 -> (c~, d, W+) | V_91 -> (t~, d, W+) | V_92 -> (u~, s, W+) | V_94 -> (t~, s, W+) | V_95 -> (u~, b, W+) | V_96 -> (c~, b, W+) | V_101 -> (e+, e-, G0) | V_102 -> (mu+, mu-, G0) | V_104 -> (e+, e-, H) | V_105 -> (mu+, mu-, H) | V_110 -> (ve~, e-, G+) | V_111 -> (vm~, mu-, G+) | V_116 -> (b~, u, G-) | V_117 -> (d~, c, G-) | V_118 -> (s~, c, G-) | V_119 -> (b~, c, G-) | V_120 -> (d~, t, G-) | V_121 -> (s~, t, G-) | V_124 -> (s~, u, W-) | V_125 -> (b~, u, W-) | V_126 -> (d~, c, W-) | V_128 -> (b~, c, W-) | V_129 -> (d~, t, W-) | V_130 -> (s~, t, W-) | V_138 -> (c~, c, G0) | V_140 -> (c~, c, H) | V_145 -> (e+, ve, G-) | V_146 -> (mu+, vm, G-) | V_154 -> (u~, u, H) | V_155 -> (u~, u, G0) | V_156 -> (d~, d, H) | V_157 -> (d~, d, G0) | V_158 -> (s~, s, H) | V_159 -> (s~, s, G0) | V_160 -> (u~, d, G+) | V_161 -> (d~, u, G-) | V_162 -> (u~, s, G+) | V_163 -> (s~, u, G-)
  165. 2716.45 s gammaloop-nextest-integration> [2026-10-19 14:11:23.150] @gammalooprs::model INFO : The following 60 couplings were removed by the restriction card:
  166. 2716.45 s gammaloop-nextest-integration> GC_13, GC_14, GC_16, GC_17, GC_18, GC_19, GC_20, GC_22, GC_23, GC_24, GC_25, GC_26, GC_28, GC_29, GC_42, GC_43, GC_44, GC_46, GC_47, GC_48, GC_84, GC_85, GC_86, GC_87, GC_88, GC_89, GC_90, GC_91, GC_92, GC_93, GC_101, GC_102, GC_103, GC_105, GC_106, GC_107, GC_109, GC_110, GC_111, GC_112, GC_113, GC_114, GC_115, GC_116, GC_117, GC_118, GC_119, GC_120, GC_121, GC_122, GC_123, GC_124, GC_125, GC_126, GC_127, GC_128, GC_129, GC_130, GC_131, GC_132
  167. 2716.45 s gammaloop-nextest-integration> [2026-10-19 14:11:23.158] @gammaloop_api::se... INFO : Running command set global kv global.n_cores.feyngen=1
  168. 2716.45 s gammaloop-nextest-integration> [2026-10-19 14:11:23.203] @gammaloop_api::se... INFO : Running command set global kv global.generation.evaluator.store_atom=true
  169. 2716.45 s gammaloop-nextest-integration> [2026-10-19 14:11:23.204] @gammaloop_api::se... INFO : Running command generate xs z > d d~
  170. 2716.45 s gammaloop-nextest-integration> [2026-10-19 14:11:23.206] @feyngen::diagram_... INFO : 0s | Δ=0s | Starting Feynman graph generation with Symbolica...
  171. 2716.45 s gammaloop-nextest-integration> [2026-10-19 14:11:23.206] @feyngen::diagram_... INFO : 0s | Δ=0s | Number of graphs resulting from Symbolica generation: 24
  172. 2716.45 s gammaloop-nextest-integration> [2026-10-19 14:11:23.207] @feyngen::diagram_... INFO : 0s | Δ=0s | Number of graphs retained after enforcing supergraph particle content: 1
  173. 2716.45 s gammaloop-nextest-integration> [2026-10-19 14:11:23.207] @feyngen::diagram_... INFO : 0s | Δ=0s | Number of graphs retained after removal of vetoed topologies: 1
  174. 2716.45 s gammaloop-nextest-integration> [2026-10-19 14:11:23.207] @feyngen::diagram_... INFO : 0s | Δ=0s | Number of graphs after vertex info assignment: 1
  175. 2716.45 s gammaloop-nextest-integration> [2026-10-19 14:11:23.207] @feyngen::diagram_... INFO : 0s | Δ=0s | Number of graphs after all complete graphs filters are applied: 1
  176. 2716.45 s gammaloop-nextest-integration> [2026-10-19 14:11:23.207] @feyngen::diagram_... INFO : 0s | Δ=0s | Number of graphs after closed anticommutating chains analysis: 1
  177. 2716.45 s gammaloop-nextest-integration> [2026-10-19 14:11:23.207] @feyngen::diagram_... INFO : 0s | Δ=0s | Number of graphs after fast Cutkosky cut filter is applied: 1
  178. 2716.45 s gammaloop-nextest-integration> [2026-10-19 14:11:23.207] @feyngen::diagram_... INFO : 0s | Δ=0s | Number of graphs after symmetrization of external states: 1
  179. 2716.45 s gammaloop-nextest-integration> [2026-10-19 14:11:23.207] @feyngen::diagram_... INFO : 0s | Δ=0s | Number of graphs after canonization of vertices, edges and flows (graph labels assigned here): 1
  180. 2716.45 s gammaloop-nextest-integration> [2026-10-19 14:11:23.252] @feyngen::diagram_... INFO : 0s | Δ=0s | Number of graphs after numerator-aware grouping with strategy 'up to a scalar rescaling': 1 (1 isomorphically unique graph, 0 color zero, 0 lorentz zero, 0 grouped and 0 cancellation)
  181. 2716.45 s gammaloop-nextest-integration> [2026-10-19 14:11:23.252] @feyngen::diagram_... INFO : ( Sum of the symmetry factors from each graph generated = -1 )
  182. 2716.45 s gammaloop-nextest-integration> [2026-10-19 14:11:23.253] @commands::generate INFO : Generated cross-section 1 graphs.
  183. 2716.45 s gammaloop-nextest-integration> [2026-10-19 14:11:23.270] @commands::generate INFO :
  184. 2716.45 s gammaloop-nextest-integration> Integrand generation summary
  185. 2716.45 s gammaloop-nextest-integration> peak RAM 97.84 MiB | cores 1
  186. 2716.45 s gammaloop-nextest-integration> ╭───────────┬───────┬────────┬─────────┬─────────────┬────────────┬─────────────┬────────────────┬─────────────╮
  187. 2716.45 s gammaloop-nextest-integration> │ integrand │ graph │ scope │ # evals │ total work │ expr build │ spenso │ symbolica eval │ compile │
  188. 2716.45 s gammaloop-nextest-integration> ├───────────┼───────┼────────┼─────────┼─────────────┼────────────┼─────────────┼────────────────┼─────────────┤
  189. 2716.45 s gammaloop-nextest-integration> │ default │ GL0 │ all │ 3 │ 16ms (100%) │ 7ms (48%) │ 4ms (27%) │ 4ms (25%) │ 0ms (0.00%) │
  190. 2716.45 s gammaloop-nextest-integration> │ default │ GL0 │ shared │ 1 │ 4ms (30%) │ 4ms (26%) │ 0ms (0.00%) │ 0ms (4.2%) │ 0ms (0.00%) │
  191. 2716.45 s gammaloop-nextest-integration> │ default │ GL0 │ cff │ 2 │ 11ms (70%) │ 3ms (23%) │ 4ms (27%) │ 3ms (21%) │ 0ms (0.00%) │
  192. 2716.45 s gammaloop-nextest-integration> ├───────────┼───────┼────────┼─────────┼─────────────┼────────────┼─────────────┼────────────────┼─────────────┤
  193. 2716.45 s gammaloop-nextest-integration> │ Total │ │ all │ 3 │ 16ms (100%) │ 7ms (48%) │ 4ms (27%) │ 4ms (25%) │ 0ms (0.00%) │
  194. 2716.45 s gammaloop-nextest-integration> │ Total │ │ shared │ 1 │ 4ms (30%) │ 4ms (26%) │ 0ms (0.00%) │ 0ms (4.2%) │ 0ms (0.00%) │
  195. 2716.45 s gammaloop-nextest-integration> │ Total │ │ cff │ 2 │ 11ms (70%) │ 3ms (23%) │ 4ms (27%) │ 3ms (21%) │ 0ms (0.00%) │
  196. 2716.45 s gammaloop-nextest-integration> ╰───────────┴───────┴────────┴─────────┴─────────────┴────────────┴─────────────┴────────────────┴─────────────╯
  197. 2716.45 s gammaloop-nextest-integration> Common graph/UV preparation and helpers are counted once. Representation rows partition the remaining work; percentages refer to the aggregate. Summed graph durations can overlap during parallel generation.
  198. 2716.45 s gammaloop-nextest-integration> [2026-10-19 14:11:23.271] @gammaloop_api::se... INFO : Running command generate
  199. 2716.45 s gammaloop-nextest-integration> [2026-10-19 14:11:23.289] @commands::generate INFO :
  200. 2716.45 s gammaloop-nextest-integration> Integrand generation summary
  201. 2716.45 s gammaloop-nextest-integration> peak RAM 104.09 MiB | cores 1
  202. 2716.45 s gammaloop-nextest-integration> ╭───────────┬───────┬────────┬─────────┬─────────────┬────────────┬─────────────┬────────────────┬─────────────╮
  203. 2716.45 s gammaloop-nextest-integration> │ integrand │ graph │ scope │ # evals │ total work │ expr build │ spenso │ symbolica eval │ compile │
  204. 2716.45 s gammaloop-nextest-integration> ├───────────┼───────┼────────┼─────────┼─────────────┼────────────┼─────────────┼────────────────┼─────────────┤
  205. 2716.45 s gammaloop-nextest-integration> │ default │ GL0 │ all │ 3 │ 17ms (100%) │ 8ms (49%) │ 4ms (23%) │ 4ms (27%) │ 0ms (0.00%) │
  206. 2716.45 s gammaloop-nextest-integration> │ default │ GL0 │ shared │ 1 │ 5ms (31%) │ 4ms (27%) │ 0ms (0.00%) │ 0ms (3.7%) │ 0ms (0.00%) │
  207. 2716.45 s gammaloop-nextest-integration> │ default │ GL0 │ cff │ 2 │ 11ms (69%) │ 3ms (22%) │ 4ms (23%) │ 4ms (24%) │ 0ms (0.00%) │
  208. 2716.45 s gammaloop-nextest-integration> ├───────────┼───────┼────────┼─────────┼─────────────┼────────────┼─────────────┼────────────────┼─────────────┤
  209. 2716.45 s gammaloop-nextest-integration> │ Total │ │ all │ 3 │ 17ms (100%) │ 8ms (49%) │ 4ms (23%) │ 4ms (27%) │ 0ms (0.00%) │
  210. 2716.45 s gammaloop-nextest-integration> │ Total │ │ shared │ 1 │ 5ms (31%) │ 4ms (27%) │ 0ms (0.00%) │ 0ms (3.7%) │ 0ms (0.00%) │
  211. 2716.45 s gammaloop-nextest-integration> │ Total │ │ cff │ 2 │ 11ms (69%) │ 3ms (22%) │ 4ms (23%) │ 4ms (24%) │ 0ms (0.00%) │
  212. 2716.45 s gammaloop-nextest-integration> ╰───────────┴───────┴────────┴─────────┴─────────────┴────────────┴─────────────┴────────────────┴─────────────╯
  213. 2716.45 s gammaloop-nextest-integration> Common graph/UV preparation and helpers are counted once. Representation rows partition the remaining work; percentages refer to the aggregate. Summed graph durations can overlap during parallel generation.
  214. 2716.45 s gammaloop-nextest-integration> Error:
  215. 2716.45 s gammaloop-nextest-integration> 0: standalone graph term has no cut-group integrands
  216. 2716.45 s gammaloop-nextest-integration>
  217. 2716.45 s gammaloop-nextest-integration> Location:
  218. 2716.45 s gammaloop-nextest-integration> tests/tests/test_feyngen.rs:869
  219. 2716.45 s gammaloop-nextest-integration>
  220. 2716.45 s gammaloop-nextest-integration> ━━━━━━━━━━━━━━━━━━━━━━━━━━━━━━━━━━ BACKTRACE ━━━━━━━━━━━━━━━━━━━━━━━━━━━━━━━━━━━
  221. 2716.45 s gammaloop-nextest-integration> 1: <color_eyre[dc2f931ed52a6dec]::config::EyreHook>::into_eyre_hook::{closure#0}<unknown>
  222. 2716.45 s gammaloop-nextest-integration> at <unknown source file>:<unknown line>
  223. 2716.45 s gammaloop-nextest-integration> 2: eyre[cd75025c43f23a9b]::capture_handler<unknown>
  224. 2716.45 s gammaloop-nextest-integration> at <unknown source file>:<unknown line>
  225. 2716.45 s gammaloop-nextest-integration> 3: eyre[cd75025c43f23a9b]::private::format_err<unknown>
  226. 2716.45 s gammaloop-nextest-integration> at <unknown source file>:<unknown line>
  227. 2716.45 s gammaloop-nextest-integration> 4: <test_feyngen[10c70d8025b0d425]::cross_section_standalone_export_writes_archive_and_loader::{closure#0} as core[c0acaeba6ab4c2e0]::ops::function::FnOnce<()>>::call_once<unknown>
  228. 2716.45 s gammaloop-nextest-integration> at <unknown source file>:<unknown line>
  229. 2716.45 s gammaloop-nextest-integration> 5: test[69f9176bb4e5faed]::__rust_begin_short_backtrace::<core[c0acaeba6ab4c2e0]::result::Result<(), alloc[12e961f32105355]::string::String>, fn() -> core[c0acaeba6ab4c2e0]::result::Result<(), alloc[12e961f32105355]::string::String>><unknown>
  230. 2716.45 s gammaloop-nextest-integration> at <unknown source file>:<unknown line>
  231. 2716.45 s gammaloop-nextest-integration> 6: test[69f9176bb4e5faed]::run_test::{closure#0}<unknown>
  232. 2716.45 s gammaloop-nextest-integration> at <unknown source file>:<unknown line>
  233. 2716.45 s gammaloop-nextest-integration> 7: std[6c98fd8553dbae28]::sys::backtrace::__rust_begin_short_backtrace::<test[69f9176bb4e5faed]::run_test::{closure#1}, ()><unknown>
  234. 2716.45 s gammaloop-nextest-integration> at <unknown source file>:<unknown line>
  235. 2716.45 s gammaloop-nextest-integration> 8: <std[6c98fd8553dbae28]::thread::lifecycle::spawn_unchecked<test[69f9176bb4e5faed]::run_test::{closure#1}, ()>::{closure#1} as core[c0acaeba6ab4c2e0]::ops::function::FnOnce<()>>::call_once::{shim:vtable#0}<unknown>
  236. 2716.45 s gammaloop-nextest-integration> at <unknown source file>:<unknown line>
  237. 2716.45 s gammaloop-nextest-integration> 9: <std[6c98fd8553dbae28]::sys::thread::unix::Thread>::new::thread_start<unknown>
  238. 2716.45 s gammaloop-nextest-integration> at <unknown source file>:<unknown line>
  239. 2716.45 s gammaloop-nextest-integration> 10: start_thread<unknown>
  240. 2716.45 s gammaloop-nextest-integration> at <unknown source file>:<unknown line>
  241. 2716.45 s gammaloop-nextest-integration> 11: __clone3<unknown>
  242. 2716.45 s gammaloop-nextest-integration> at <unknown source file>:<unknown line>
  243. 2716.45 s gammaloop-nextest-integration>
  244. 2716.45 s gammaloop-nextest-integration> Run with COLORBT_SHOW_HIDDEN=1 environment variable to disable frame filtering.
  245. 2716.45 s gammaloop-nextest-integration> Run with RUST_BACKTRACE=full to include source snippets.
  246. 2716.45 s gammaloop-nextest-integration>
  247. 2716.46 s gammaloop-nextest-integration> error: test run failed
  248. 2716.50 s gammaloop-nextest-integration>
  249. 2716.50 s gammaloop-nextest-integration> ========== nextest test summary ==========
  250. 2716.50 s gammaloop-nextest-integration> report: target/nextest/ci_gammaloop/junit.xml
  251. 2716.50 s gammaloop-nextest-integration> tests: 380, failures: 1, errors: 0
  252. 2716.50 s gammaloop-nextest-integration>
  253. 2716.50 s gammaloop-nextest-integration> 1. gammaloop-integration-tests::test_feyngen::cross_section_standalone_export_writes_archive_and_loader
  254. 2716.50 s gammaloop-nextest-integration> failure: test failure with exit code 101
  255. 2716.50 s gammaloop-nextest-integration> Error:
  256. 2716.50 s gammaloop-nextest-integration> 0: standalone graph term has no cut-group integrands
  257. 2716.50 s gammaloop-nextest-integration>
  258. 2716.50 s gammaloop-nextest-integration> Location:
  259. 2716.50 s gammaloop-nextest-integration> tests/tests/test_feyngen.rs:869
  260. 2716.50 s gammaloop-nextest-integration>
  261. 2716.50 s gammaloop-nextest-integration> ━━━━━━━━━━━━━━━━━━━━━━━━━━━━━━━━━━ BACKTRACE ━━━━━━━━━━━━━━━━━━━━━━━━━━━━━━━━━━━
  262. 2716.50 s gammaloop-nextest-integration> 1: <color_eyre[dc2f931ed52a6dec]::config::EyreHook>::into_eyre_hook::{closure#0}<unknown>
  263. 2716.50 s gammaloop-nextest-integration> at <unknown source file>:<unknown line>
  264. 2716.50 s gammaloop-nextest-integration> 2: eyre[cd75025c43f23a9b]::capture_handler<unknown>
  265. 2716.50 s gammaloop-nextest-integration> at <unknown source file>:<unknown line>
  266. 2716.50 s gammaloop-nextest-integration> 3: eyre[cd75025c43f23a9b]::private::format_err<unknown>
  267. 2716.50 s gammaloop-nextest-integration> at <unknown source file>:<unknown line>
  268. 2716.50 s gammaloop-nextest-integration> 4: <test_feyngen[10c70d8025b0d425]::cross_section_standalone_export_writes_archive_and_loader::{closure#0} as core[c0acaeba6ab4c2e0]::ops::function::FnOnce<()>>::call_once<unknown>
  269. 2716.50 s gammaloop-nextest-integration> at <unknown source file>:<unknown line>
  270. 2716.50 s gammaloop-nextest-integration> 5: test[69f9176bb4e5faed]::__rust_begin_short_backtrace::<core[c0acaeba6ab4c2e0]::result::Result<(), alloc[12e961f32105355]::string::String>, fn() -> core[c0acaeba6ab4c2e0]::result::Result<(), alloc[12e961f32105355]::string::String>><unknown>
  271. 2716.50 s gammaloop-nextest-integration> at <unknown source file>:<unknown line>
  272. 2716.50 s gammaloop-nextest-integration> 6: test[69f9176bb4e5faed]::run_test::{closure#0}<unknown>
  273. 2716.50 s gammaloop-nextest-integration> at <unknown source file>:<unknown line>
  274. 2716.50 s gammaloop-nextest-integration> 7: std[6c98fd8553dbae28]::sys::backtrace::__rust_begin_short_backtrace::<test[69f9176bb4e5faed]::run_test::{closure#1}, ()><unknown>
  275. 2716.50 s gammaloop-nextest-integration> at <unknown source file>:<unknown line>
  276. 2716.50 s gammaloop-nextest-integration> 8: <std[6c98fd8553dbae28]::thread::lifecycle::spawn_unchecked<test[69f9176bb4e5faed]::run_test::{closure#1}, ()>::{closure#1} as core[c0acaeba6ab4c2e0]::ops::function::FnOnce<()>>::call_once::{shim:vtable#0}<unknown>
  277. 2716.50 s gammaloop-nextest-integration> at <unknown source file>:<unknown line>
  278. 2716.50 s gammaloop-nextest-integration> 9: <std[6c98fd8553dbae28]::sys::thread::unix::Thread>::new::thread_start<unknown>
  279. 2716.50 s gammaloop-nextest-integration> at <unknown source file>:<unknown line>
  280. 2716.50 s gammaloop-nextest-integration> 10: start_thread<unknown>
  281. 2716.50 s gammaloop-nextest-integration> at <unknown source file>:<unknown line>
  282. 2716.50 s gammaloop-nextest-integration> 11: __clone3<unknown>
  283. 2716.50 s gammaloop-nextest-integration> at <unknown source file>:<unknown line>
  284. 2716.50 s gammaloop-nextest-integration>
  285. 2716.50 s gammaloop-nextest-integration> Run with COLORBT_SHOW_HIDDEN=1 environment variable to disable frame filtering.
  286. 2716.50 s gammaloop-nextest-integration> Run with RUST_BACKTRACE=full to include source snippets.
  287. 2716.50 s gammaloop-nextest-integration> system-out
  288. 2716.50 s gammaloop-nextest-integration> running 1 test
  289. 2716.50 s gammaloop-nextest-integration> test cross_section_standalone_export_writes_archive_and_loader ... FAILED
  290. 2716.50 s gammaloop-nextest-integration>
  291. 2716.50 s gammaloop-nextest-integration> failures:
  292. 2716.50 s gammaloop-nextest-integration>
  293. 2716.50 s gammaloop-nextest-integration> failures:
  294. 2716.50 s gammaloop-nextest-integration> cross_section_standalone_export_writes_archive_and_loader
  295. 2716.50 s gammaloop-nextest-integration>
  296. 2716.50 s gammaloop-nextest-integration> test result: FAILED. 0 passed; 1 failed; 0 ignored; 0 measured; 37 filtered out; finished in 0.24s
  297. 2716.50 s gammaloop-nextest-integration> system-err
  298. 2716.50 s gammaloop-nextest-integration> [2026-10-19 14:11:23.119] @gammaloop_api::se... INFO : Running command import model sm-default
  299. 2716.50 s gammaloop-nextest-integration> [2026-10-19 14:11:23.119] @import::model INFO : Loading built-in JSON model sm-default
  300. 2716.50 s gammaloop-nextest-integration> [2026-10-19 14:11:23.149] @gammalooprs::model INFO : The following 22 external parameters were forced to zero by the restriction card:
  301. 2716.50 s gammaloop-nextest-integration> lamWS, AWS, rhoWS, etaWS, ymc, yme, ymm, MS, MC, Me, MM, WTau, muB, muQ, muLe, muLmu, muLtau, ymu, ymd, yms, MU, MD
  302. 2716.50 s gammaloop-nextest-integration> [2026-10-19 14:11:23.150] @gammalooprs::model INFO : The following 44 vertex rules were removed by the restriction card:
  303. 2716.50 s gammaloop-nextest-integration> V_82 -> (c~, d, G+) | V_83 -> (t~, d, G+) | V_84 -> (c~, s, G+) | V_85 -> (t~, s, G+) | V_86 -> (u~, b, G+) | V_87 -> (c~, b, G+) | V_90 -> (c~, d, W+) | V_91 -> (t~, d, W+) | V_92 -> (u~, s, W+) | V_94 -> (t~, s, W+) | V_95 -> (u~, b, W+) | V_96 -> (c~, b, W+) | V_101 -> (e+, e-, G0) | V_102 -> (mu+, mu-, G0) | V_104 -> (e+, e-, H) | V_105 -> (mu+, mu-, H) | V_110 -> (ve~, e-, G+) | V_111 -> (vm~, mu-, G+) | V_116 -> (b~, u, G-) | V_117 -> (d~, c, G-) | V_118 -> (s~, c, G-) | V_119 -> (b~, c, G-) | V_120 -> (d~, t, G-) | V_121 -> (s~, t, G-) | V_124 -> (s~, u, W-) | V_125 -> (b~, u, W-) | V_126 -> (d~, c, W-) | V_128 -> (b~, c, W-) | V_129 -> (d~, t, W-) | V_130 -> (s~, t, W-) | V_138 -> (c~, c, G0) | V_140 -> (c~, c, H) | V_145 -> (e+, ve, G-) | V_146 -> (mu+, vm, G-) | V_154 -> (u~, u, H) | V_155 -> (u~, u, G0) | V_156 -> (d~, d, H) | V_157 -> (d~, d, G0) | V_158 -> (s~, s, H) | V_159 -> (s~, s, G0) | V_160 -> (u~, d, G+) | V_161 -> (d~, u, G-) | V_162 -> (u~, s, G+) | V_163 -> (s~, u, G-)
  304. 2716.50 s gammaloop-nextest-integration> [2026-10-19 14:11:23.150] @gammalooprs::model INFO : The following 60 couplings were removed by the restriction card:
  305. 2716.50 s gammaloop-nextest-integration> GC_13, GC_14, GC_16, GC_17, GC_18, GC_19, GC_20, GC_22, GC_23, GC_24, GC_25, GC_26, GC_28, GC_29, GC_42, GC_43, GC_44, GC_46, GC_47, GC_48, GC_84, GC_85, GC_86, GC_87, GC_88, GC_89, GC_90, GC_91, GC_92, GC_93, GC_101, GC_102, GC_103, GC_105, GC_106, GC_107, GC_109, GC_110, GC_111, GC_112, GC_113, GC_114, GC_115, GC_116, GC_117, GC_118, GC_119, GC_120, GC_121, GC_122, GC_123, GC_124, GC_125, GC_126, GC_127, GC_128, GC_129, GC_130, GC_131, GC_132
  306. 2716.50 s gammaloop-nextest-integration> [2026-10-19 14:11:23.158] @gammaloop_api::se... INFO : Running command set global kv global.n_cores.feyngen=1
  307. 2716.50 s gammaloop-nextest-integration> [2026-10-19 14:11:23.203] @gammaloop_api::se... INFO : Running command set global kv global.generation.evaluator.store_atom=true
  308. 2716.50 s gammaloop-nextest-integration> [2026-10-19 14:11:23.204] @gammaloop_api::se... INFO : Running command generate xs z > d d~
  309. 2716.50 s gammaloop-nextest-integration> [2026-10-19 14:11:23.206] @feyngen::diagram_... INFO : 0s | Δ=0s | Starting Feynman graph generation with Symbolica...
  310. 2716.50 s gammaloop-nextest-integration> [2026-10-19 14:11:23.206] @feyngen::diagram_... INFO : 0s | Δ=0s | Number of graphs resulting from Symbolica generation: 24
  311. 2716.50 s gammaloop-nextest-integration> [2026-10-19 14:11:23.207] @feyngen::diagram_... INFO : 0s | Δ=0s | Number of graphs retained after enforcing supergraph particle content: 1
  312. 2716.50 s gammaloop-nextest-integration> [2026-10-19 14:11:23.207] @feyngen::diagram_... INFO : 0s | Δ=0s | Number of graphs retained after removal of vetoed topologies: 1
  313. 2716.50 s gammaloop-nextest-integration> [2026-10-19 14:11:23.207] @feyngen::diagram_... INFO : 0s | Δ=0s | Number of graphs after vertex info assignment: 1
  314. 2716.50 s gammaloop-nextest-integration> [2026-10-19 14:11:23.207] @feyngen::diagram_... INFO : 0s | Δ=0s | Number of graphs after all complete graphs filters are applied: 1
  315. 2716.50 s gammaloop-nextest-integration> [2026-10-19 14:11:23.207] @feyngen::diagram_... INFO : 0s | Δ=0s | Number of graphs after closed anticommutating chains analysis: 1
  316. 2716.50 s gammaloop-nextest-integration> [2026-10-19 14:11:23.207] @feyngen::diagram_... INFO : 0s | Δ=0s | Number of graphs after fast Cutkosky cut filter is applied: 1
  317. 2716.50 s gammaloop-nextest-integration> [2026-10-19 14:11:23.207] @feyngen::diagram_... INFO : 0s | Δ=0s | Number of graphs after symmetrization of external states: 1
  318. 2716.50 s gammaloop-nextest-integration> [2026-10-19 14:11:23.207] @feyngen::diagram_... INFO : 0s | Δ=0s | Number of graphs after canonization of vertices, edges and flows (graph labels assigned here): 1
  319. 2716.50 s gammaloop-nextest-integration> [2026-10-19 14:11:23.252] @feyngen::diagram_... INFO : 0s | Δ=0s | Number of graphs after numerator-aware grouping with strategy 'up to a scalar rescaling': 1 (1 isomorphically unique graph, 0 color zero, 0 lorentz zero, 0 grouped and 0 cancellation)
  320. 2716.50 s gammaloop-nextest-integration> [2026-10-19 14:11:23.252] @feyngen::diagram_... INFO : ( Sum of the symmetry factors from each graph generated = -1 )
  321. 2716.50 s gammaloop-nextest-integration> [2026-10-19 14:11:23.253] @commands::generate INFO : Generated cross-section 1 graphs.
  322. 2716.50 s gammaloop-nextest-integration> [2026-10-19 14:11:23.270] @commands::generate INFO :
  323. 2716.50 s gammaloop-nextest-integration> Integrand generation summary
  324. 2716.50 s gammaloop-nextest-integration> peak RAM 97.84 MiB | cores 1
  325. 2716.50 s gammaloop-nextest-integration> ╭───────────┬───────┬────────┬─────────┬─────────────┬────────────┬─────────────┬────────────────┬─────────────╮
  326. 2716.50 s gammaloop-nextest-integration> │ integrand │ graph │ scope │ # evals │ total work │ expr build │ spenso │ symbolica eval │ compile │
  327. 2716.50 s gammaloop-nextest-integration> ├───────────┼───────┼────────┼─────────┼─────────────┼────────────┼─────────────┼────────────────┼─────────────┤
  328. 2716.50 s gammaloop-nextest-integration> │ default │ GL0 │ all │ 3 │ 16ms (100%) │ 7ms (48%) │ 4ms (27%) │ 4ms (25%) │ 0ms (0.00%) │
  329. 2716.50 s gammaloop-nextest-integration> │ default │ GL0 │ shared │ 1 │ 4ms (30%) │ 4ms (26%) │ 0ms (0.00%) │ 0ms (4.2%) │ 0ms (0.00%) │
  330. 2716.50 s gammaloop-nextest-integration> │ default │ GL0 │ cff │ 2 │ 11ms (70%) │ 3ms (23%) │ 4ms (27%) │ 3ms (21%) │ 0ms (0.00%) │
  331. 2716.50 s gammaloop-nextest-integration> ├───────────┼───────┼────────┼─────────┼─────────────┼────────────┼─────────────┼────────────────┼─────────────┤
  332. 2716.50 s gammaloop-nextest-integration> │ Total │ │ all │ 3 │ 16ms (100%) │ 7ms (48%) │ 4ms (27%) │ 4ms (25%) │ 0ms (0.00%) │
  333. 2716.50 s gammaloop-nextest-integration> │ Total │ │ shared │ 1 │ 4ms (30%) │ 4ms (26%) │ 0ms (0.00%) │ 0ms (4.2%) │ 0ms (0.00%) │
  334. 2716.50 s gammaloop-nextest-integration> │ Total │ │ cff │ 2 │ 11ms (70%) │ 3ms (23%) │ 4ms (27%) │ 3ms (21%) │ 0ms (0.00%) │
  335. 2716.50 s gammaloop-nextest-integration> ╰───────────┴───────┴────────┴─────────┴─────────────┴────────────┴─────────────┴────────────────┴─────────────╯
  336. 2716.50 s gammaloop-nextest-integration> Common graph/UV preparation and helpers are counted once. Representation rows partition the remaining work; percentages refer to the aggregate. Summed graph durations can overlap during parallel generation.
  337. 2716.50 s gammaloop-nextest-integration> [2026-10-19 14:11:23.271] @gammaloop_api::se... INFO : Running command generate
  338. 2716.50 s gammaloop-nextest-integration> [2026-10-19 14:11:23.289] @commands::generate INFO :
  339. 2716.50 s gammaloop-nextest-integration> Integrand generation summary
  340. 2716.50 s gammaloop-nextest-integration> peak RAM 104.09 MiB | cores 1
  341. 2716.50 s gammaloop-nextest-integration> ╭───────────┬───────┬────────┬─────────┬─────────────┬────────────┬─────────────┬────────────────┬─────────────╮
  342. 2716.50 s gammaloop-nextest-integration> │ integrand │ graph │ scope │ # evals │ total work │ expr build │ spenso │ symbolica eval │ compile │
  343. 2716.50 s gammaloop-nextest-integration> ├───────────┼───────┼────────┼─────────┼─────────────┼────────────┼─────────────┼────────────────┼─────────────┤
  344. 2716.50 s gammaloop-nextest-integration> │ default │ GL0 │ all │ 3 │ 17ms (100%) │ 8ms (49%) │ 4ms (23%) │ 4ms (27%) │ 0ms (0.00%) │
  345. 2716.50 s gammaloop-nextest-integration> │ default │ GL0 │ shared │ 1 │ 5ms (31%) │ 4ms (27%) │ 0ms (0.00%) │ 0ms (3.7%) │ 0ms (0.00%) │
  346. 2716.50 s gammaloop-nextest-integration> │ default │ GL0 │ cff │ 2 │ 11ms (69%) │ 3ms (22%) │ 4ms (23%) │ 4ms (24%) │ 0ms (0.00%) │
  347. 2716.50 s gammaloop-nextest-integration> ├───────────┼───────┼────────┼─────────┼─────────────┼────────────┼─────────────┼────────────────┼─────────────┤
  348. 2716.50 s gammaloop-nextest-integration> │ Total │ │ all │ 3 │ 17ms (100%) │ 8ms (49%) │ 4ms (23%) │ 4ms (27%) │ 0ms (0.00%) │
  349. 2716.50 s gammaloop-nextest-integration> │ Total │ │ shared │ 1 │ 5ms (31%) │ 4ms (27%) │ 0ms (0.00%) │ 0ms (3.7%) │ 0ms (0.00%) │
  350. 2716.50 s gammaloop-nextest-integration> │ Total │ │ cff │ 2 │ 11ms (69%) │ 3ms (22%) │ 4ms (23%) │ 4ms (24%) │ 0ms (0.00%) │
  351. 2716.50 s gammaloop-nextest-integration> ╰───────────┴───────┴────────┴─────────┴─────────────┴────────────┴─────────────┴────────────────┴─────────────╯
  352. 2716.50 s gammaloop-nextest-integration> Common graph/UV preparation and helpers are counted once. Representation rows partition the remaining work; percentages refer to the aggregate. Summed graph durations can overlap during parallel generation.
  353. 2716.50 s gammaloop-nextest-integration> Error:
  354. 2716.50 s gammaloop-nextest-integration> 0: standalone graph term has no cut-group integrands
  355. 2716.50 s gammaloop-nextest-integration>
  356. 2716.50 s gammaloop-nextest-integration> Location:
  357. 2716.50 s gammaloop-nextest-integration> tests/tests/test_feyngen.rs:869
  358. 2716.50 s gammaloop-nextest-integration>
  359. 2716.50 s gammaloop-nextest-integration> ━━━━━━━━━━━━━━━━━━━━━━━━━━━━━━━━━━ BACKTRACE ━━━━━━━━━━━━━━━━━━━━━━━━━━━━━━━━━━━
  360. 2716.50 s gammaloop-nextest-integration> 1: <color_eyre[dc2f931ed52a6dec]::config::EyreHook>::into_eyre_hook::{closure#0}<unknown>
  361. 2716.50 s gammaloop-nextest-integration> at <unknown source file>:<unknown line>
  362. 2716.50 s gammaloop-nextest-integration> 2: eyre[cd75025c43f23a9b]::capture_handler<unknown>
  363. 2716.50 s gammaloop-nextest-integration> at <unknown source file>:<unknown line>
  364. 2716.50 s gammaloop-nextest-integration> 3: eyre[cd75025c43f23a9b]::private::format_err<unknown>
  365. 2716.50 s gammaloop-nextest-integration> at <unknown source file>:<unknown line>
  366. 2716.50 s gammaloop-nextest-integration> 4: <test_feyngen[10c70d8025b0d425]::cross_section_standalone_export_writes_archive_and_loader::{closure#0} as core[c0acaeba6ab4c2e0]::ops::function::FnOnce<()>>::call_once<unknown>
  367. 2716.50 s gammaloop-nextest-integration> at <unknown source file>:<unknown line>
  368. 2716.50 s gammaloop-nextest-integration> 5: test[69f9176bb4e5faed]::__rust_begin_short_backtrace::<core[c0acaeba6ab4c2e0]::result::Result<(), alloc[12e961f32105355]::string::String>, fn() -> core[c0acaeba6ab4c2e0]::result::Result<(), alloc[12e961f32105355]::string::String>><unknown>
  369. 2716.50 s gammaloop-nextest-integration> at <unknown source file>:<unknown line>
  370. 2716.50 s gammaloop-nextest-integration> 6: test[69f9176bb4e5faed]::run_test::{closure#0}<unknown>
  371. 2716.50 s gammaloop-nextest-integration> at <unknown source file>:<unknown line>
  372. 2716.50 s gammaloop-nextest-integration> 7: std[6c98fd8553dbae28]::sys::backtrace::__rust_begin_short_backtrace::<test[69f9176bb4e5faed]::run_test::{closure#1}, ()><unknown>
  373. 2716.50 s gammaloop-nextest-integration> at <unknown source file>:<unknown line>
  374. 2716.50 s gammaloop-nextest-integration> 8: <std[6c98fd8553dbae28]::thread::lifecycle::spawn_unchecked<test[69f9176bb4e5faed]::run_test::{closure#1}, ()>::{closure#1} as core[c0acaeba6ab4c2e0]::ops::function::FnOnce<()>>::call_once::{shim:vtable#0}<unknown>
  375. 2716.50 s gammaloop-nextest-integration> at <unknown source file>:<unknown line>
  376. 2716.50 s gammaloop-nextest-integration> 9: <std[6c98fd8553dbae28]::sys::thread::unix::Thread>::new::thread_start<unknown>
  377. 2716.50 s gammaloop-nextest-integration> at <unknown source file>:<unknown line>
  378. 2716.50 s gammaloop-nextest-integration> 10: start_thread<unknown>
  379. 2716.50 s gammaloop-nextest-integration> at <unknown source file>:<unknown line>
  380. 2716.50 s gammaloop-nextest-integration> 11: __clone3<unknown>
  381. 2716.50 s gammaloop-nextest-integration> at <unknown source file>:<unknown line>
  382. 2716.50 s gammaloop-nextest-integration>
  383. 2716.50 s gammaloop-nextest-integration> Run with COLORBT_SHOW_HIDDEN=1 environment variable to disable frame filtering.
  384. 2716.50 s gammaloop-nextest-integration> Run with RUST_BACKTRACE=full to include source snippets.
  385. 2716.50 s gammaloop-nextest-integration> =========================================
  386. 2717.11 s [0 built (1 failed)]error: Cannot build '/nix/store/x2iz5qc4w97m9cdhy2bcp2l2hw1pfpw5-gammaloop-nextest-integration.drv'.
  387. 2717.11 s Reason: builder failed with exit code 100.
  388. 2717.11 s Output paths:
  389. 2717.11 s /nix/store/12yf3xmzm8whr0nhwchcvdfvzdxll6yk-gammaloop-nextest-integration
  390. 2717.11 s Last 351 log lines:
  391. 2717.11 s > Nextest worker budget: 16
  392. 2717.11 s > Extracting 13 binaries (including 2 non-test binaries), 1 build script output directory, and 3 linked paths to /build/source
  393. 2717.11 s > Extracted 32 files to /build/source in 5.54s
  394. 2717.11 s > ------------
  395. 2717.11 s > Nextest run ID b8a11aa2-05b4-4d49-b117-b76896cde12a with nextest profile: ci_gammaloop
  396. 2717.11 s > Starting 380 tests across 11 binaries (65 tests skipped, including 61 tests via profile.default.default-filter)
  397. 2717.11 s > FAIL [ 0.252s] ( 49/380) gammaloop-integration-tests::test_feyngen cross_section_standalone_export_writes_archive_and_loader
  398. 2717.11 s > stdout ---
  399. 2717.11 s >
  400. 2717.11 s > running 1 test
  401. 2717.11 s > test cross_section_standalone_export_writes_archive_and_loader ... FAILED
  402. 2717.11 s >
  403. 2717.11 s > failures:
  404. 2717.11 s >
  405. 2717.11 s > failures:
  406. 2717.11 s > cross_section_standalone_export_writes_archive_and_loader
  407. 2717.11 s >
  408. 2717.11 s > test result: FAILED. 0 passed; 1 failed; 0 ignored; 0 measured; 37 filtered out; finished in 0.24s
  409. 2717.11 s >
  410. 2717.11 s > stderr ---
  411. 2717.11 s > [2026-10-19 14:11:23.119] @gammaloop_api::se... INFO : Running command import model sm-default
  412. 2717.11 s > [2026-10-19 14:11:23.119] @import::model INFO : Loading built-in JSON model sm-default
  413. 2717.11 s > [2026-10-19 14:11:23.149] @gammalooprs::model INFO : The following 22 external parameters were forced to zero by the restriction card:
  414. 2717.11 s > lamWS, AWS, rhoWS, etaWS, ymc, yme, ymm, MS, MC, Me, MM, WTau, muB, muQ, muLe, muLmu, muLtau, ymu, ymd, yms, MU, MD
  415. 2717.11 s > [2026-10-19 14:11:23.150] @gammalooprs::model INFO : The following 44 vertex rules were removed by the restriction card:
  416. 2717.11 s > V_82 -> (c~, d, G+) | V_83 -> (t~, d, G+) | V_84 -> (c~, s, G+) | V_85 -> (t~, s, G+) | V_86 -> (u~, b, G+) | V_87 -> (c~, b, G+) | V_90 -> (c~, d, W+) | V_91 -> (t~, d, W+) | V_92 -> (u~, s, W+) | V_94 -> (t~, s, W+) | V_95 -> (u~, b, W+) | V_96 -> (c~, b, W+) | V_101 -> (e+, e-, G0) | V_102 -> (mu+, mu-, G0) | V_104 -> (e+, e-, H) | V_105 -> (mu+, mu-, H) | V_110 -> (ve~, e-, G+) | V_111 -> (vm~, mu-, G+) | V_116 -> (b~, u, G-) | V_117 -> (d~, c, G-) | V_118 -> (s~, c, G-) | V_119 -> (b~, c, G-) | V_120 -> (d~, t, G-) | V_121 -> (s~, t, G-) | V_124 -> (s~, u, W-) | V_125 -> (b~, u, W-) | V_126 -> (d~, c, W-) | V_128 -> (b~, c, W-) | V_129 -> (d~, t, W-) | V_130 -> (s~, t, W-) | V_138 -> (c~, c, G0) | V_140 -> (c~, c, H) | V_145 -> (e+, ve, G-) | V_146 -> (mu+, vm, G-) | V_154 -> (u~, u, H) | V_155 -> (u~, u, G0) | V_156 -> (d~, d, H) | V_157 -> (d~, d, G0) | V_158 -> (s~, s, H) | V_159 -> (s~, s, G0) | V_160 -> (u~, d, G+) | V_161 -> (d~, u, G-) | V_162 -> (u~, s, G+) | V_163 -> (s~, u, G-)
  417. 2717.11 s > [2026-10-19 14:11:23.150] @gammalooprs::model INFO : The following 60 couplings were removed by the restriction card:
  418. 2717.11 s > GC_13, GC_14, GC_16, GC_17, GC_18, GC_19, GC_20, GC_22, GC_23, GC_24, GC_25, GC_26, GC_28, GC_29, GC_42, GC_43, GC_44, GC_46, GC_47, GC_48, GC_84, GC_85, GC_86, GC_87, GC_88, GC_89, GC_90, GC_91, GC_92, GC_93, GC_101, GC_102, GC_103, GC_105, GC_106, GC_107, GC_109, GC_110, GC_111, GC_112, GC_113, GC_114, GC_115, GC_116, GC_117, GC_118, GC_119, GC_120, GC_121, GC_122, GC_123, GC_124, GC_125, GC_126, GC_127, GC_128, GC_129, GC_130, GC_131, GC_132
  419. 2717.11 s > [2026-10-19 14:11:23.158] @gammaloop_api::se... INFO : Running command set global kv global.n_cores.feyngen=1
  420. 2717.11 s > [2026-10-19 14:11:23.203] @gammaloop_api::se... INFO : Running command set global kv global.generation.evaluator.store_atom=true
  421. 2717.11 s > [2026-10-19 14:11:23.204] @gammaloop_api::se... INFO : Running command generate xs z > d d~
  422. 2717.11 s > [2026-10-19 14:11:23.206] @feyngen::diagram_... INFO : 0s | Δ=0s | Starting Feynman graph generation with Symbolica...
  423. 2717.11 s > [2026-10-19 14:11:23.206] @feyngen::diagram_... INFO : 0s | Δ=0s | Number of graphs resulting from Symbolica generation: 24
  424. 2717.11 s > [2026-10-19 14:11:23.207] @feyngen::diagram_... INFO : 0s | Δ=0s | Number of graphs retained after enforcing supergraph particle content: 1
  425. 2717.11 s > [2026-10-19 14:11:23.207] @feyngen::diagram_... INFO : 0s | Δ=0s | Number of graphs retained after removal of vetoed topologies: 1
  426. 2717.11 s > [2026-10-19 14:11:23.207] @feyngen::diagram_... INFO : 0s | Δ=0s | Number of graphs after vertex info assignment: 1
  427. 2717.11 s > [2026-10-19 14:11:23.207] @feyngen::diagram_... INFO : 0s | Δ=0s | Number of graphs after all complete graphs filters are applied: 1
  428. 2717.11 s > [2026-10-19 14:11:23.207] @feyngen::diagram_... INFO : 0s | Δ=0s | Number of graphs after closed anticommutating chains analysis: 1
  429. 2717.11 s > [2026-10-19 14:11:23.207] @feyngen::diagram_... INFO : 0s | Δ=0s | Number of graphs after fast Cutkosky cut filter is applied: 1
  430. 2717.11 s > [2026-10-19 14:11:23.207] @feyngen::diagram_... INFO : 0s | Δ=0s | Number of graphs after symmetrization of external states: 1
  431. 2717.11 s > [2026-10-19 14:11:23.207] @feyngen::diagram_... INFO : 0s | Δ=0s | Number of graphs after canonization of vertices, edges and flows (graph labels assigned here): 1
  432. 2717.11 s > [2026-10-19 14:11:23.252] @feyngen::diagram_... INFO : 0s | Δ=0s | Number of graphs after numerator-aware grouping with strategy 'up to a scalar rescaling': 1 (1 isomorphically unique graph, 0 color zero, 0 lorentz zero, 0 grouped and 0 cancellation)
  433. 2717.11 s > [2026-10-19 14:11:23.252] @feyngen::diagram_... INFO : ( Sum of the symmetry factors from each graph generated = -1 )
  434. 2717.11 s > [2026-10-19 14:11:23.253] @commands::generate INFO : Generated cross-section 1 graphs.
  435. 2717.11 s > [2026-10-19 14:11:23.270] @commands::generate INFO :
  436. 2717.11 s > Integrand generation summary
  437. 2717.11 s > peak RAM 97.84 MiB | cores 1
  438. 2717.11 s > ╭───────────┬───────┬────────┬─────────┬─────────────┬────────────┬─────────────┬────────────────┬─────────────╮
  439. 2717.11 s > │ integrand │ graph │ scope │ # evals │ total work │ expr build │ spenso │ symbolica eval │ compile │
  440. 2717.11 s > ├───────────┼───────┼────────┼─────────┼─────────────┼────────────┼─────────────┼────────────────┼─────────────┤
  441. 2717.11 s > │ default │ GL0 │ all │ 3 │ 16ms (100%) │ 7ms (48%) │ 4ms (27%) │ 4ms (25%) │ 0ms (0.00%) │
  442. 2717.11 s > │ default │ GL0 │ shared │ 1 │ 4ms (30%) │ 4ms (26%) │ 0ms (0.00%) │ 0ms (4.2%) │ 0ms (0.00%) │
  443. 2717.11 s > │ default │ GL0 │ cff │ 2 │ 11ms (70%) │ 3ms (23%) │ 4ms (27%) │ 3ms (21%) │ 0ms (0.00%) │
  444. 2717.11 s > ├───────────┼───────┼────────┼─────────┼─────────────┼────────────┼─────────────┼────────────────┼─────────────┤
  445. 2717.11 s > │ Total │ │ all │ 3 │ 16ms (100%) │ 7ms (48%) │ 4ms (27%) │ 4ms (25%) │ 0ms (0.00%) │
  446. 2717.11 s > │ Total │ │ shared │ 1 │ 4ms (30%) │ 4ms (26%) │ 0ms (0.00%) │ 0ms (4.2%) │ 0ms (0.00%) │
  447. 2717.11 s > │ Total │ │ cff │ 2 │ 11ms (70%) │ 3ms (23%) │ 4ms (27%) │ 3ms (21%) │ 0ms (0.00%) │
  448. 2717.11 s > ╰───────────┴───────┴────────┴─────────┴─────────────┴────────────┴─────────────┴────────────────┴─────────────╯
  449. 2717.11 s > Common graph/UV preparation and helpers are counted once. Representation rows partition the remaining work; percentages refer to the aggregate. Summed graph durations can overlap during parallel generation.
  450. 2717.11 s > [2026-10-19 14:11:23.271] @gammaloop_api::se... INFO : Running command generate
  451. 2717.11 s > [2026-10-19 14:11:23.289] @commands::generate INFO :
  452. 2717.11 s > Integrand generation summary
  453. 2717.11 s > peak RAM 104.09 MiB | cores 1
  454. 2717.11 s > ╭───────────┬───────┬────────┬─────────┬─────────────┬────────────┬─────────────┬────────────────┬─────────────╮
  455. 2717.11 s > │ integrand │ graph │ scope │ # evals │ total work │ expr build │ spenso │ symbolica eval │ compile │
  456. 2717.11 s > ├───────────┼───────┼────────┼─────────┼─────────────┼────────────┼─────────────┼────────────────┼─────────────┤
  457. 2717.11 s > │ default │ GL0 │ all │ 3 │ 17ms (100%) │ 8ms (49%) │ 4ms (23%) │ 4ms (27%) │ 0ms (0.00%) │
  458. 2717.11 s > │ default │ GL0 │ shared │ 1 │ 5ms (31%) │ 4ms (27%) │ 0ms (0.00%) │ 0ms (3.7%) │ 0ms (0.00%) │
  459. 2717.11 s > │ default │ GL0 │ cff │ 2 │ 11ms (69%) │ 3ms (22%) │ 4ms (23%) │ 4ms (24%) │ 0ms (0.00%) │
  460. 2717.11 s > ├───────────┼───────┼────────┼─────────┼─────────────┼────────────┼─────────────┼────────────────┼─────────────┤
  461. 2717.11 s > │ Total │ │ all │ 3 │ 17ms (100%) │ 8ms (49%) │ 4ms (23%) │ 4ms (27%) │ 0ms (0.00%) │
  462. 2717.11 s > │ Total │ │ shared │ 1 │ 5ms (31%) │ 4ms (27%) │ 0ms (0.00%) │ 0ms (3.7%) │ 0ms (0.00%) │
  463. 2717.11 s > │ Total │ │ cff │ 2 │ 11ms (69%) │ 3ms (22%) │ 4ms (23%) │ 4ms (24%) │ 0ms (0.00%) │
  464. 2717.11 s > ╰───────────┴───────┴────────┴─────────┴─────────────┴────────────┴─────────────┴────────────────┴─────────────╯
  465. 2717.11 s > Common graph/UV preparation and helpers are counted once. Representation rows partition the remaining work; percentages refer to the aggregate. Summed graph durations can overlap during parallel generation.
  466. 2717.11 s > Error:
  467. 2717.11 s > 0: standalone graph term has no cut-group integrands
  468. 2717.11 s >
  469. 2717.11 s > Location:
  470. 2717.11 s > tests/tests/test_feyngen.rs:869
  471. 2717.11 s >
  472. 2717.11 s > ━━━━━━━━━━━━━━━━━━━━━━━━━━━━━━━━━━ BACKTRACE ━━━━━━━━━━━━━━━━━━━━━━━━━━━━━━━━━━━
  473. 2717.11 s > 1: <color_eyre[dc2f931ed52a6dec]::config::EyreHook>::into_eyre_hook::{closure#0}<unknown>
  474. 2717.11 s > at <unknown source file>:<unknown line>
  475. 2717.11 s > 2: eyre[cd75025c43f23a9b]::capture_handler<unknown>
  476. 2717.11 s > at <unknown source file>:<unknown line>
  477. 2717.11 s > 3: eyre[cd75025c43f23a9b]::private::format_err<unknown>
  478. 2717.11 s > at <unknown source file>:<unknown line>
  479. 2717.11 s > 4: <test_feyngen[10c70d8025b0d425]::cross_section_standalone_export_writes_archive_and_loader::{closure#0} as core[c0acaeba6ab4c2e0]::ops::function::FnOnce<()>>::call_once<unknown>
  480. 2717.11 s > at <unknown source file>:<unknown line>
  481. 2717.11 s > 5: test[69f9176bb4e5faed]::__rust_begin_short_backtrace::<core[c0acaeba6ab4c2e0]::result::Result<(), alloc[12e961f32105355]::string::String>, fn() -> core[c0acaeba6ab4c2e0]::result::Result<(), alloc[12e961f32105355]::string::String>><unknown>
  482. 2717.11 s > at <unknown source file>:<unknown line>
  483. 2717.11 s > 6: test[69f9176bb4e5faed]::run_test::{closure#0}<unknown>
  484. 2717.11 s > at <unknown source file>:<unknown line>
  485. 2717.11 s > 7: std[6c98fd8553dbae28]::sys::backtrace::__rust_begin_short_backtrace::<test[69f9176bb4e5faed]::run_test::{closure#1}, ()><unknown>
  486. 2717.11 s > at <unknown source file>:<unknown line>
  487. 2717.11 s > 8: <std[6c98fd8553dbae28]::thread::lifecycle::spawn_unchecked<test[69f9176bb4e5faed]::run_test::{closure#1}, ()>::{closure#1} as core[c0acaeba6ab4c2e0]::ops::function::FnOnce<()>>::call_once::{shim:vtable#0}<unknown>
  488. 2717.11 s > at <unknown source file>:<unknown line>
  489. 2717.11 s > 9: <std[6c98fd8553dbae28]::sys::thread::unix::Thread>::new::thread_start<unknown>
  490. 2717.11 s > at <unknown source file>:<unknown line>
  491. 2717.11 s > 10: start_thread<unknown>
  492. 2717.11 s > at <unknown source file>:<unknown line>
  493. 2717.11 s > 11: __clone3<unknown>
  494. 2717.11 s > at <unknown source file>:<unknown line>
  495. 2717.11 s >
  496. 2717.11 s > Run with COLORBT_SHOW_HIDDEN=1 environment variable to disable frame filtering.
  497. 2717.11 s > Run with RUST_BACKTRACE=full to include source snippets.
  498. 2717.11 s >
  499. 2717.11 s > ------------
  500. 2717.11 s > Summary [2637.994s] 380 tests run: 379 passed (5 slow), 1 failed, 65 skipped
  501. 2717.11 s > FAIL [ 0.252s] ( 49/380) gammaloop-integration-tests::test_feyngen cross_section_standalone_export_writes_archive_and_loader
  502. 2717.11 s > stdout ---
  503. 2717.11 s >
  504. 2717.11 s > running 1 test
  505. 2717.11 s > test cross_section_standalone_export_writes_archive_and_loader ... FAILED
  506. 2717.11 s >
  507. 2717.11 s > failures:
  508. 2717.11 s >
  509. 2717.11 s > failures:
  510. 2717.11 s > cross_section_standalone_export_writes_archive_and_loader
  511. 2717.11 s >
  512. 2717.11 s > test result: FAILED. 0 passed; 1 failed; 0 ignored; 0 measured; 37 filtered out; finished in 0.24s
  513. 2717.11 s >
  514. 2717.11 s > stderr ---
  515. 2717.11 s > [2026-10-19 14:11:23.119] @gammaloop_api::se... INFO : Running command import model sm-default
  516. 2717.11 s > [2026-10-19 14:11:23.119] @import::model INFO : Loading built-in JSON model sm-default
  517. 2717.11 s > [2026-10-19 14:11:23.149] @gammalooprs::model INFO : The following 22 external parameters were forced to zero by the restriction card:
  518. 2717.11 s > lamWS, AWS, rhoWS, etaWS, ymc, yme, ymm, MS, MC, Me, MM, WTau, muB, muQ, muLe, muLmu, muLtau, ymu, ymd, yms, MU, MD
  519. 2717.11 s > [2026-10-19 14:11:23.150] @gammalooprs::model INFO : The following 44 vertex rules were removed by the restriction card:
  520. 2717.11 s > V_82 -> (c~, d, G+) | V_83 -> (t~, d, G+) | V_84 -> (c~, s, G+) | V_85 -> (t~, s, G+) | V_86 -> (u~, b, G+) | V_87 -> (c~, b, G+) | V_90 -> (c~, d, W+) | V_91 -> (t~, d, W+) | V_92 -> (u~, s, W+) | V_94 -> (t~, s, W+) | V_95 -> (u~, b, W+) | V_96 -> (c~, b, W+) | V_101 -> (e+, e-, G0) | V_102 -> (mu+, mu-, G0) | V_104 -> (e+, e-, H) | V_105 -> (mu+, mu-, H) | V_110 -> (ve~, e-, G+) | V_111 -> (vm~, mu-, G+) | V_116 -> (b~, u, G-) | V_117 -> (d~, c, G-) | V_118 -> (s~, c, G-) | V_119 -> (b~, c, G-) | V_120 -> (d~, t, G-) | V_121 -> (s~, t, G-) | V_124 -> (s~, u, W-) | V_125 -> (b~, u, W-) | V_126 -> (d~, c, W-) | V_128 -> (b~, c, W-) | V_129 -> (d~, t, W-) | V_130 -> (s~, t, W-) | V_138 -> (c~, c, G0) | V_140 -> (c~, c, H) | V_145 -> (e+, ve, G-) | V_146 -> (mu+, vm, G-) | V_154 -> (u~, u, H) | V_155 -> (u~, u, G0) | V_156 -> (d~, d, H) | V_157 -> (d~, d, G0) | V_158 -> (s~, s, H) | V_159 -> (s~, s, G0) | V_160 -> (u~, d, G+) | V_161 -> (d~, u, G-) | V_162 -> (u~, s, G+) | V_163 -> (s~, u, G-)
  521. 2717.11 s > [2026-10-19 14:11:23.150] @gammalooprs::model INFO : The following 60 couplings were removed by the restriction card:
  522. 2717.11 s > GC_13, GC_14, GC_16, GC_17, GC_18, GC_19, GC_20, GC_22, GC_23, GC_24, GC_25, GC_26, GC_28, GC_29, GC_42, GC_43, GC_44, GC_46, GC_47, GC_48, GC_84, GC_85, GC_86, GC_87, GC_88, GC_89, GC_90, GC_91, GC_92, GC_93, GC_101, GC_102, GC_103, GC_105, GC_106, GC_107, GC_109, GC_110, GC_111, GC_112, GC_113, GC_114, GC_115, GC_116, GC_117, GC_118, GC_119, GC_120, GC_121, GC_122, GC_123, GC_124, GC_125, GC_126, GC_127, GC_128, GC_129, GC_130, GC_131, GC_132
  523. 2717.11 s > [2026-10-19 14:11:23.158] @gammaloop_api::se... INFO : Running command set global kv global.n_cores.feyngen=1
  524. 2717.11 s > [2026-10-19 14:11:23.203] @gammaloop_api::se... INFO : Running command set global kv global.generation.evaluator.store_atom=true
  525. 2717.11 s > [2026-10-19 14:11:23.204] @gammaloop_api::se... INFO : Running command generate xs z > d d~
  526. 2717.11 s > [2026-10-19 14:11:23.206] @feyngen::diagram_... INFO : 0s | Δ=0s | Starting Feynman graph generation with Symbolica...
  527. 2717.11 s > [2026-10-19 14:11:23.206] @feyngen::diagram_... INFO : 0s | Δ=0s | Number of graphs resulting from Symbolica generation: 24
  528. 2717.11 s > [2026-10-19 14:11:23.207] @feyngen::diagram_... INFO : 0s | Δ=0s | Number of graphs retained after enforcing supergraph particle content: 1
  529. 2717.11 s > [2026-10-19 14:11:23.207] @feyngen::diagram_... INFO : 0s | Δ=0s | Number of graphs retained after removal of vetoed topologies: 1
  530. 2717.11 s > [2026-10-19 14:11:23.207] @feyngen::diagram_... INFO : 0s | Δ=0s | Number of graphs after vertex info assignment: 1
  531. 2717.11 s > [2026-10-19 14:11:23.207] @feyngen::diagram_... INFO : 0s | Δ=0s | Number of graphs after all complete graphs filters are applied: 1
  532. 2717.11 s > [2026-10-19 14:11:23.207] @feyngen::diagram_... INFO : 0s | Δ=0s | Number of graphs after closed anticommutating chains analysis: 1
  533. 2717.11 s > [2026-10-19 14:11:23.207] @feyngen::diagram_... INFO : 0s | Δ=0s | Number of graphs after fast Cutkosky cut filter is applied: 1
  534. 2717.11 s > [2026-10-19 14:11:23.207] @feyngen::diagram_... INFO : 0s | Δ=0s | Number of graphs after symmetrization of external states: 1
  535. 2717.11 s > [2026-10-19 14:11:23.207] @feyngen::diagram_... INFO : 0s | Δ=0s | Number of graphs after canonization of vertices, edges and flows (graph labels assigned here): 1
  536. 2717.11 s > [2026-10-19 14:11:23.252] @feyngen::diagram_... INFO : 0s | Δ=0s | Number of graphs after numerator-aware grouping with strategy 'up to a scalar rescaling': 1 (1 isomorphically unique graph, 0 color zero, 0 lorentz zero, 0 grouped and 0 cancellation)
  537. 2717.11 s > [2026-10-19 14:11:23.252] @feyngen::diagram_... INFO : ( Sum of the symmetry factors from each graph generated = -1 )
  538. 2717.11 s > [2026-10-19 14:11:23.253] @commands::generate INFO : Generated cross-section 1 graphs.
  539. 2717.11 s > [2026-10-19 14:11:23.270] @commands::generate INFO :
  540. 2717.11 s > Integrand generation summary
  541. 2717.11 s > peak RAM 97.84 MiB | cores 1
  542. 2717.11 s > ╭───────────┬───────┬────────┬─────────┬─────────────┬────────────┬─────────────┬────────────────┬─────────────╮
  543. 2717.11 s > │ integrand │ graph │ scope │ # evals │ total work │ expr build │ spenso │ symbolica eval │ compile │
  544. 2717.11 s > ├───────────┼───────┼────────┼─────────┼─────────────┼────────────┼─────────────┼────────────────┼─────────────┤
  545. 2717.11 s > │ default │ GL0 │ all │ 3 │ 16ms (100%) │ 7ms (48%) │ 4ms (27%) │ 4ms (25%) │ 0ms (0.00%) │
  546. 2717.11 s > │ default │ GL0 │ shared │ 1 │ 4ms (30%) │ 4ms (26%) │ 0ms (0.00%) │ 0ms (4.2%) │ 0ms (0.00%) │
  547. 2717.11 s > │ default │ GL0 │ cff │ 2 │ 11ms (70%) │ 3ms (23%) │ 4ms (27%) │ 3ms (21%) │ 0ms (0.00%) │
  548. 2717.11 s > ├───────────┼───────┼────────┼─────────┼─────────────┼────────────┼─────────────┼────────────────┼─────────────┤
  549. 2717.11 s > │ Total │ │ all │ 3 │ 16ms (100%) │ 7ms (48%) │ 4ms (27%) │ 4ms (25%) │ 0ms (0.00%) │
  550. 2717.11 s > │ Total │ │ shared │ 1 │ 4ms (30%) │ 4ms (26%) │ 0ms (0.00%) │ 0ms (4.2%) │ 0ms (0.00%) │
  551. 2717.11 s > │ Total │ │ cff │ 2 │ 11ms (70%) │ 3ms (23%) │ 4ms (27%) │ 3ms (21%) │ 0ms (0.00%) │
  552. 2717.11 s > ╰───────────┴───────┴────────┴─────────┴─────────────┴────────────┴─────────────┴────────────────┴─────────────╯
  553. 2717.11 s > Common graph/UV preparation and helpers are counted once. Representation rows partition the remaining work; percentages refer to the aggregate. Summed graph durations can overlap during parallel generation.
  554. 2717.11 s > [2026-10-19 14:11:23.271] @gammaloop_api::se... INFO : Running command generate
  555. 2717.11 s > [2026-10-19 14:11:23.289] @commands::generate INFO :
  556. 2717.11 s > Integrand generation summary
  557. 2717.11 s > peak RAM 104.09 MiB | cores 1
  558. 2717.11 s > ╭───────────┬───────┬────────┬─────────┬─────────────┬────────────┬─────────────┬────────────────┬─────────────╮
  559. 2717.11 s > │ integrand │ graph │ scope │ # evals │ total work │ expr build │ spenso │ symbolica eval │ compile │
  560. 2717.11 s > ├───────────┼───────┼────────┼─────────┼─────────────┼────────────┼─────────────┼────────────────┼─────────────┤
  561. 2717.11 s > │ default │ GL0 │ all │ 3 │ 17ms (100%) │ 8ms (49%) │ 4ms (23%) │ 4ms (27%) │ 0ms (0.00%) │
  562. 2717.11 s > │ default │ GL0 │ shared │ 1 │ 5ms (31%) │ 4ms (27%) │ 0ms (0.00%) │ 0ms (3.7%) │ 0ms (0.00%) │
  563. 2717.11 s > │ default │ GL0 │ cff │ 2 │ 11ms (69%) │ 3ms (22%) │ 4ms (23%) │ 4ms (24%) │ 0ms (0.00%) │
  564. 2717.11 s > ├───────────┼───────┼────────┼─────────┼─────────────┼────────────┼─────────────┼────────────────┼─────────────┤
  565. 2717.11 s > │ Total │ │ all │ 3 │ 17ms (100%) │ 8ms (49%) │ 4ms (23%) │ 4ms (27%) │ 0ms (0.00%) │
  566. 2717.11 s > │ Total │ │ shared │ 1 │ 5ms (31%) │ 4ms (27%) │ 0ms (0.00%) │ 0ms (3.7%) │ 0ms (0.00%) │
  567. 2717.11 s > │ Total │ │ cff │ 2 │ 11ms (69%) │ 3ms (22%) │ 4ms (23%) │ 4ms (24%) │ 0ms (0.00%) │
  568. 2717.11 s > ╰───────────┴───────┴────────┴─────────┴─────────────┴────────────┴─────────────┴────────────────┴─────────────╯
  569. 2717.11 s > Common graph/UV preparation and helpers are counted once. Representation rows partition the remaining work; percentages refer to the aggregate. Summed graph durations can overlap during parallel generation.
  570. 2717.11 s > Error:
  571. 2717.11 s > 0: standalone graph term has no cut-group integrands
  572. 2717.11 s >
  573. 2717.11 s > Location:
  574. 2717.11 s > tests/tests/test_feyngen.rs:869
  575. 2717.11 s >
  576. 2717.11 s > ━━━━━━━━━━━━━━━━━━━━━━━━━━━━━━━━━━ BACKTRACE ━━━━━━━━━━━━━━━━━━━━━━━━━━━━━━━━━━━
  577. 2717.11 s > 1: <color_eyre[dc2f931ed52a6dec]::config::EyreHook>::into_eyre_hook::{closure#0}<unknown>
  578. 2717.11 s > at <unknown source file>:<unknown line>
  579. 2717.11 s > 2: eyre[cd75025c43f23a9b]::capture_handler<unknown>
  580. 2717.11 s > at <unknown source file>:<unknown line>
  581. 2717.11 s > 3: eyre[cd75025c43f23a9b]::private::format_err<unknown>
  582. 2717.11 s > at <unknown source file>:<unknown line>
  583. 2717.11 s > 4: <test_feyngen[10c70d8025b0d425]::cross_section_standalone_export_writes_archive_and_loader::{closure#0} as core[c0acaeba6ab4c2e0]::ops::function::FnOnce<()>>::call_once<unknown>
  584. 2717.11 s > at <unknown source file>:<unknown line>
  585. 2717.11 s > 5: test[69f9176bb4e5faed]::__rust_begin_short_backtrace::<core[c0acaeba6ab4c2e0]::result::Result<(), alloc[12e961f32105355]::string::String>, fn() -> core[c0acaeba6ab4c2e0]::result::Result<(), alloc[12e961f32105355]::string::String>><unknown>
  586. 2717.11 s > at <unknown source file>:<unknown line>
  587. 2717.11 s > 6: test[69f9176bb4e5faed]::run_test::{closure#0}<unknown>
  588. 2717.11 s > at <unknown source file>:<unknown line>
  589. 2717.11 s > 7: std[6c98fd8553dbae28]::sys::backtrace::__rust_begin_short_backtrace::<test[69f9176bb4e5faed]::run_test::{closure#1}, ()><unknown>
  590. 2717.11 s > at <unknown source file>:<unknown line>
  591. 2717.11 s > 8: <std[6c98fd8553dbae28]::thread::lifecycle::spawn_unchecked<test[69f9176bb4e5faed]::run_test::{closure#1}, ()>::{closure#1} as core[c0acaeba6ab4c2e0]::ops::function::FnOnce<()>>::call_once::{shim:vtable#0}<unknown>
  592. 2717.11 s > at <unknown source file>:<unknown line>
  593. 2717.11 s > 9: <std[6c98fd8553dbae28]::sys::thread::unix::Thread>::new::thread_start<unknown>
  594. 2717.11 s > at <unknown source file>:<unknown line>
  595. 2717.11 s > 10: start_thread<unknown>
  596. 2717.11 s > at <unknown source file>:<unknown line>
  597. 2717.11 s > 11: __clone3<unknown>
  598. 2717.11 s > at <unknown source file>:<unknown line>
  599. 2717.11 s >
  600. 2717.11 s > Run with COLORBT_SHOW_HIDDEN=1 environment variable to disable frame filtering.
  601. 2717.11 s > Run with RUST_BACKTRACE=full to include source snippets.
  602. 2717.11 s >
  603. 2717.11 s > error: test run failed
  604. 2717.11 s >
  605. 2717.11 s > ========== nextest test summary ==========
  606. 2717.11 s > report: target/nextest/ci_gammaloop/junit.xml
  607. 2717.11 s > tests: 380, failures: 1, errors: 0
  608. 2717.11 s >
  609. 2717.11 s > 1. gammaloop-integration-tests::test_feyngen::cross_section_standalone_export_writes_archive_and_loader
  610. 2717.11 s > failure: test failure with exit code 101
  611. 2717.11 s > Error:
  612. 2717.11 s > 0: standalone graph term has no cut-group integrands
  613. 2717.11 s >
  614. 2717.11 s > Location:
  615. 2717.11 s > tests/tests/test_feyngen.rs:869
  616. 2717.11 s >
  617. 2717.11 s > ━━━━━━━━━━━━━━━━━━━━━━━━━━━━━━━━━━ BACKTRACE ━━━━━━━━━━━━━━━━━━━━━━━━━━━━━━━━━━━
  618. 2717.11 s > 1: <color_eyre[dc2f931ed52a6dec]::config::EyreHook>::into_eyre_hook::{closure#0}<unknown>
  619. 2717.11 s > at <unknown source file>:<unknown line>
  620. 2717.11 s > 2: eyre[cd75025c43f23a9b]::capture_handler<unknown>
  621. 2717.11 s > at <unknown source file>:<unknown line>
  622. 2717.11 s > 3: eyre[cd75025c43f23a9b]::private::format_err<unknown>
  623. 2717.11 s > at <unknown source file>:<unknown line>
  624. 2717.11 s > 4: <test_feyngen[10c70d8025b0d425]::cross_section_standalone_export_writes_archive_and_loader::{closure#0} as core[c0acaeba6ab4c2e0]::ops::function::FnOnce<()>>::call_once<unknown>
  625. 2717.11 s > at <unknown source file>:<unknown line>
  626. 2717.11 s > 5: test[69f9176bb4e5faed]::__rust_begin_short_backtrace::<core[c0acaeba6ab4c2e0]::result::Result<(), alloc[12e961f32105355]::string::String>, fn() -> core[c0acaeba6ab4c2e0]::result::Result<(), alloc[12e961f32105355]::string::String>><unknown>
  627. 2717.11 s > at <unknown source file>:<unknown line>
  628. 2717.11 s > 6: test[69f9176bb4e5faed]::run_test::{closure#0}<unknown>
  629. 2717.11 s > at <unknown source file>:<unknown line>
  630. 2717.11 s > 7: std[6c98fd8553dbae28]::sys::backtrace::__rust_begin_short_backtrace::<test[69f9176bb4e5faed]::run_test::{closure#1}, ()><unknown>
  631. 2717.11 s > at <unknown source file>:<unknown line>
  632. 2717.11 s > 8: <std[6c98fd8553dbae28]::thread::lifecycle::spawn_unchecked<test[69f9176bb4e5faed]::run_test::{closure#1}, ()>::{closure#1} as core[c0acaeba6ab4c2e0]::ops::function::FnOnce<()>>::call_once::{shim:vtable#0}<unknown>
  633. 2717.11 s > at <unknown source file>:<unknown line>
  634. 2717.11 s > 9: <std[6c98fd8553dbae28]::sys::thread::unix::Thread>::new::thread_start<unknown>
  635. 2717.11 s > at <unknown source file>:<unknown line>
  636. 2717.11 s > 10: start_thread<unknown>
  637. 2717.11 s > at <unknown source file>:<unknown line>
  638. 2717.11 s > 11: __clone3<unknown>
  639. 2717.11 s > at <unknown source file>:<unknown line>
  640. 2717.11 s >
  641. 2717.11 s > Run with COLORBT_SHOW_HIDDEN=1 environment variable to disable frame filtering.
  642. 2717.11 s > Run with RUST_BACKTRACE=full to include source snippets.
  643. 2717.11 s > system-out
  644. 2717.11 s > running 1 test
  645. 2717.11 s > test cross_section_standalone_export_writes_archive_and_loader ... FAILED
  646. 2717.11 s >
  647. 2717.11 s > failures:
  648. 2717.11 s >
  649. 2717.11 s > failures:
  650. 2717.11 s > cross_section_standalone_export_writes_archive_and_loader
  651. 2717.11 s >
  652. 2717.11 s > test result: FAILED. 0 passed; 1 failed; 0 ignored; 0 measured; 37 filtered out; finished in 0.24s
  653. 2717.11 s > system-err
  654. 2717.11 s > [2026-10-19 14:11:23.119] @gammaloop_api::se... INFO : Running command import model sm-default
  655. 2717.11 s > [2026-10-19 14:11:23.119] @import::model INFO : Loading built-in JSON model sm-default
  656. 2717.11 s > [2026-10-19 14:11:23.149] @gammalooprs::model INFO : The following 22 external parameters were forced to zero by the restriction card:
  657. 2717.11 s > lamWS, AWS, rhoWS, etaWS, ymc, yme, ymm, MS, MC, Me, MM, WTau, muB, muQ, muLe, muLmu, muLtau, ymu, ymd, yms, MU, MD
  658. 2717.11 s > [2026-10-19 14:11:23.150] @gammalooprs::model INFO : The following 44 vertex rules were removed by the restriction card:
  659. 2717.11 s > V_82 -> (c~, d, G+) | V_83 -> (t~, d, G+) | V_84 -> (c~, s, G+) | V_85 -> (t~, s, G+) | V_86 -> (u~, b, G+) | V_87 -> (c~, b, G+) | V_90 -> (c~, d, W+) | V_91 -> (t~, d, W+) | V_92 -> (u~, s, W+) | V_94 -> (t~, s, W+) | V_95 -> (u~, b, W+) | V_96 -> (c~, b, W+) | V_101 -> (e+, e-, G0) | V_102 -> (mu+, mu-, G0) | V_104 -> (e+, e-, H) | V_105 -> (mu+, mu-, H) | V_110 -> (ve~, e-, G+) | V_111 -> (vm~, mu-, G+) | V_116 -> (b~, u, G-) | V_117 -> (d~, c, G-) | V_118 -> (s~, c, G-) | V_119 -> (b~, c, G-) | V_120 -> (d~, t, G-) | V_121 -> (s~, t, G-) | V_124 -> (s~, u, W-) | V_125 -> (b~, u, W-) | V_126 -> (d~, c, W-) | V_128 -> (b~, c, W-) | V_129 -> (d~, t, W-) | V_130 -> (s~, t, W-) | V_138 -> (c~, c, G0) | V_140 -> (c~, c, H) | V_145 -> (e+, ve, G-) | V_146 -> (mu+, vm, G-) | V_154 -> (u~, u, H) | V_155 -> (u~, u, G0) | V_156 -> (d~, d, H) | V_157 -> (d~, d, G0) | V_158 -> (s~, s, H) | V_159 -> (s~, s, G0) | V_160 -> (u~, d, G+) | V_161 -> (d~, u, G-) | V_162 -> (u~, s, G+) | V_163 -> (s~, u, G-)
  660. 2717.11 s > [2026-10-19 14:11:23.150] @gammalooprs::model INFO : The following 60 couplings were removed by the restriction card:
  661. 2717.11 s > GC_13, GC_14, GC_16, GC_17, GC_18, GC_19, GC_20, GC_22, GC_23, GC_24, GC_25, GC_26, GC_28, GC_29, GC_42, GC_43, GC_44, GC_46, GC_47, GC_48, GC_84, GC_85, GC_86, GC_87, GC_88, GC_89, GC_90, GC_91, GC_92, GC_93, GC_101, GC_102, GC_103, GC_105, GC_106, GC_107, GC_109, GC_110, GC_111, GC_112, GC_113, GC_114, GC_115, GC_116, GC_117, GC_118, GC_119, GC_120, GC_121, GC_122, GC_123, GC_124, GC_125, GC_126, GC_127, GC_128, GC_129, GC_130, GC_131, GC_132
  662. 2717.11 s > [2026-10-19 14:11:23.158] @gammaloop_api::se... INFO : Running command set global kv global.n_cores.feyngen=1
  663. 2717.11 s > [2026-10-19 14:11:23.203] @gammaloop_api::se... INFO : Running command set global kv global.generation.evaluator.store_atom=true
  664. 2717.11 s > [2026-10-19 14:11:23.204] @gammaloop_api::se... INFO : Running command generate xs z > d d~
  665. 2717.11 s > [2026-10-19 14:11:23.206] @feyngen::diagram_... INFO : 0s | Δ=0s | Starting Feynman graph generation with Symbolica...
  666. 2717.11 s > [2026-10-19 14:11:23.206] @feyngen::diagram_... INFO : 0s | Δ=0s | Number of graphs resulting from Symbolica generation: 24
  667. 2717.11 s > [2026-10-19 14:11:23.207] @feyngen::diagram_... INFO : 0s | Δ=0s | Number of graphs retained after enforcing supergraph particle content: 1
  668. 2717.11 s > [2026-10-19 14:11:23.207] @feyngen::diagram_... INFO : 0s | Δ=0s | Number of graphs retained after removal of vetoed topologies: 1
  669. 2717.11 s > [2026-10-19 14:11:23.207] @feyngen::diagram_... INFO : 0s | Δ=0s | Number of graphs after vertex info assignment: 1
  670. 2717.11 s > [2026-10-19 14:11:23.207] @feyngen::diagram_... INFO : 0s | Δ=0s | Number of graphs after all complete graphs filters are applied: 1
  671. 2717.11 s > [2026-10-19 14:11:23.207] @feyngen::diagram_... INFO : 0s | Δ=0s | Number of graphs after closed anticommutating chains analysis: 1
  672. 2717.11 s > [2026-10-19 14:11:23.207] @feyngen::diagram_... INFO : 0s | Δ=0s | Number of graphs after fast Cutkosky cut filter is applied: 1
  673. 2717.11 s > [2026-10-19 14:11:23.207] @feyngen::diagram_... INFO : 0s | Δ=0s | Number of graphs after symmetrization of external states: 1
  674. 2717.11 s > [2026-10-19 14:11:23.207] @feyngen::diagram_... INFO : 0s | Δ=0s | Number of graphs after canonization of vertices, edges and flows (graph labels assigned here): 1
  675. 2717.11 s > [2026-10-19 14:11:23.252] @feyngen::diagram_... INFO : 0s | Δ=0s | Number of graphs after numerator-aware grouping with strategy 'up to a scalar rescaling': 1 (1 isomorphically unique graph, 0 color zero, 0 lorentz zero, 0 grouped and 0 cancellation)
  676. 2717.11 s > [2026-10-19 14:11:23.252] @feyngen::diagram_... INFO : ( Sum of the symmetry factors from each graph generated = -1 )
  677. 2717.11 s > [2026-10-19 14:11:23.253] @commands::generate INFO : Generated cross-section 1 graphs.
  678. 2717.11 s > [2026-10-19 14:11:23.270] @commands::generate INFO :
  679. 2717.11 s > Integrand generation summary
  680. 2717.11 s > peak RAM 97.84 MiB | cores 1
  681. 2717.11 s > ╭───────────┬───────┬────────┬─────────┬─────────────┬────────────┬─────────────┬────────────────┬─────────────╮
  682. 2717.11 s > │ integrand │ graph │ scope │ # evals │ total work │ expr build │ spenso │ symbolica eval │ compile │
  683. 2717.11 s > ├───────────┼───────┼────────┼─────────┼─────────────┼────────────┼─────────────┼────────────────┼─────────────┤
  684. 2717.11 s > │ default │ GL0 │ all │ 3 │ 16ms (100%) │ 7ms (48%) │ 4ms (27%) │ 4ms (25%) │ 0ms (0.00%) │
  685. 2717.11 s > │ default │ GL0 │ shared │ 1 │ 4ms (30%) │ 4ms (26%) │ 0ms (0.00%) │ 0ms (4.2%) │ 0ms (0.00%) │
  686. 2717.11 s > │ default │ GL0 │ cff │ 2 │ 11ms (70%) │ 3ms (23%) │ 4ms (27%) │ 3ms (21%) │ 0ms (0.00%) │
  687. 2717.11 s > ├───────────┼───────┼────────┼─────────┼─────────────┼────────────┼─────────────┼────────────────┼─────────────┤
  688. 2717.11 s > │ Total │ │ all │ 3 │ 16ms (100%) │ 7ms (48%) │ 4ms (27%) │ 4ms (25%) │ 0ms (0.00%) │
  689. 2717.11 s > │ Total │ │ shared │ 1 │ 4ms (30%) │ 4ms (26%) │ 0ms (0.00%) │ 0ms (4.2%) │ 0ms (0.00%) │
  690. 2717.11 s > │ Total │ │ cff │ 2 │ 11ms (70%) │ 3ms (23%) │ 4ms (27%) │ 3ms (21%) │ 0ms (0.00%) │
  691. 2717.11 s > ╰───────────┴───────┴────────┴─────────┴─────────────┴────────────┴─────────────┴────────────────┴─────────────╯
  692. 2717.11 s > Common graph/UV preparation and helpers are counted once. Representation rows partition the remaining work; percentages refer to the aggregate. Summed graph durations can overlap during parallel generation.
  693. 2717.11 s > [2026-10-19 14:11:23.271] @gammaloop_api::se... INFO : Running command generate
  694. 2717.11 s > [2026-10-19 14:11:23.289] @commands::generate INFO :
  695. 2717.11 s > Integrand generation summary
  696. 2717.11 s > peak RAM 104.09 MiB | cores 1
  697. 2717.11 s > ╭───────────┬───────┬────────┬─────────┬─────────────┬────────────┬─────────────┬────────────────┬─────────────╮
  698. 2717.11 s > │ integrand │ graph │ scope │ # evals │ total work │ expr build │ spenso │ symbolica eval │ compile │
  699. 2717.11 s > ├───────────┼───────┼────────┼─────────┼─────────────┼────────────┼─────────────┼────────────────┼─────────────┤
  700. 2717.11 s > │ default │ GL0 │ all │ 3 │ 17ms (100%) │ 8ms (49%) │ 4ms (23%) │ 4ms (27%) │ 0ms (0.00%) │
  701. 2717.11 s > │ default │ GL0 │ shared │ 1 │ 5ms (31%) │ 4ms (27%) │ 0ms (0.00%) │ 0ms (3.7%) │ 0ms (0.00%) │
  702. 2717.11 s > │ default │ GL0 │ cff │ 2 │ 11ms (69%) │ 3ms (22%) │ 4ms (23%) │ 4ms (24%) │ 0ms (0.00%) │
  703. 2717.11 s > ├───────────┼───────┼────────┼─────────┼─────────────┼────────────┼─────────────┼────────────────┼─────────────┤
  704. 2717.11 s > │ Total │ │ all │ 3 │ 17ms (100%) │ 8ms (49%) │ 4ms (23%) │ 4ms (27%) │ 0ms (0.00%) │
  705. 2717.11 s > │ Total │ │ shared │ 1 │ 5ms (31%) │ 4ms (27%) │ 0ms (0.00%) │ 0ms (3.7%) │ 0ms (0.00%) │
  706. 2717.11 s > │ Total │ │ cff │ 2 │ 11ms (69%) │ 3ms (22%) │ 4ms (23%) │ 4ms (24%) │ 0ms (0.00%) │
  707. 2717.11 s > ╰───────────┴───────┴────────┴─────────┴─────────────┴────────────┴─────────────┴────────────────┴─────────────╯
  708. 2717.11 s > Common graph/UV preparation and helpers are counted once. Representation rows partition the remaining work; percentages refer to the aggregate. Summed graph durations can overlap during parallel generation.
  709. 2717.11 s > Error:
  710. 2717.11 s > 0: standalone graph term has no cut-group integrands
  711. 2717.11 s >
  712. 2717.11 s > Location:
  713. 2717.11 s > tests/tests/test_feyngen.rs:869
  714. 2717.11 s >
  715. 2717.11 s > ━━━━━━━━━━━━━━━━━━━━━━━━━━━━━━━━━━ BACKTRACE ━━━━━━━━━━━━━━━━━━━━━━━━━━━━━━━━━━━
  716. 2717.11 s > 1: <color_eyre[dc2f931ed52a6dec]::config::EyreHook>::into_eyre_hook::{closure#0}<unknown>
  717. 2717.11 s > at <unknown source file>:<unknown line>
  718. 2717.11 s > 2: eyre[cd75025c43f23a9b]::capture_handler<unknown>
  719. 2717.11 s > at <unknown source file>:<unknown line>
  720. 2717.11 s > 3: eyre[cd75025c43f23a9b]::private::format_err<unknown>
  721. 2717.11 s > at <unknown source file>:<unknown line>
  722. 2717.11 s > 4: <test_feyngen[10c70d8025b0d425]::cross_section_standalone_export_writes_archive_and_loader::{closure#0} as core[c0acaeba6ab4c2e0]::ops::function::FnOnce<()>>::call_once<unknown>
  723. 2717.11 s > at <unknown source file>:<unknown line>
  724. 2717.11 s > 5: test[69f9176bb4e5faed]::__rust_begin_short_backtrace::<core[c0acaeba6ab4c2e0]::result::Result<(), alloc[12e961f32105355]::string::String>, fn() -> core[c0acaeba6ab4c2e0]::result::Result<(), alloc[12e961f32105355]::string::String>><unknown>
  725. 2717.11 s > at <unknown source file>:<unknown line>
  726. 2717.11 s > 6: test[69f9176bb4e5faed]::run_test::{closure#0}<unknown>
  727. 2717.11 s > at <unknown source file>:<unknown line>
  728. 2717.11 s > 7: std[6c98fd8553dbae28]::sys::backtrace::__rust_begin_short_backtrace::<test[69f9176bb4e5faed]::run_test::{closure#1}, ()><unknown>
  729. 2717.11 s > at <unknown source file>:<unknown line>
  730. 2717.11 s > 8: <std[6c98fd8553dbae28]::thread::lifecycle::spawn_unchecked<test[69f9176bb4e5faed]::run_test::{closure#1}, ()>::{closure#1} as core[c0acaeba6ab4c2e0]::ops::function::FnOnce<()>>::call_once::{shim:vtable#0}<unknown>
  731. 2717.11 s > at <unknown source file>:<unknown line>
  732. 2717.11 s > 9: <std[6c98fd8553dbae28]::sys::thread::unix::Thread>::new::thread_start<unknown>
  733. 2717.11 s > at <unknown source file>:<unknown line>
  734. 2717.11 s > 10: start_thread<unknown>
  735. 2717.11 s > at <unknown source file>:<unknown line>
  736. 2717.11 s > 11: __clone3<unknown>
  737. 2717.11 s > at <unknown source file>:<unknown line>
  738. 2717.11 s >
  739. 2717.11 s > Run with COLORBT_SHOW_HIDDEN=1 environment variable to disable frame filtering.
  740. 2717.11 s > Run with RUST_BACKTRACE=full to include source snippets.
  741. 2717.11 s > =========================================
  742. 2717.11 s For full logs, run:
  743. 2717.11 s nix log /nix/store/x2iz5qc4w97m9cdhy2bcp2l2hw1pfpw5-gammaloop-nextest-integration.drv
  744. 2717.33 s Run failed.