test packages.x86_64-linux.nix-ci-check-gammaloop-nextest-clinnet

Reproduce this run
Original Run
  1. 0.01 s $ /nix/store/bhv6xyvqw6gjs3j488gi1z6wdv18bdpa-coreutils-9.11/bin/timeout --kill-after=15s 7200s /nix/store/5np0yidzrnyjbb243hvgqpgpss865p0n-nix-2.34.9/bin/nix --extra-experimental-features nix-command --extra-experimental-features flakes flake clone git+https://github.com/alphal00p/gammaloop --dest /tmp/nix-ci-worker/stable-pwd/repo/
  2. 0.19 s Cloning into '/tmp/nix-ci-worker/stable-pwd/repo'...
  3. 2.45 s remote: Enumerating objects: 157628 remote: Enumerating objects: 172467, done.
  4. 2.57 s remote: Counting objects: 0% (1/14839) remote: Counting objects: 1% (149/14839) remote: Counting objects: 2% (297/14839) remote: Counting objects: 3% (446/14839) remote: Counting objects: 4% (594/14839) remote: Counting objects: 5% (742/14839) remote: Counting objects: 6% (891/14839) remote: Counting objects: 7% (1039/14839) remote: Counting objects: 8% (1188/14839) remote: Counting objects: 9% (1336/14839) remote: Counting objects: 10% (1484/14839) remote: Counting objects: 11% (1633/14839) remote: Counting objects: 12% (1781/14839) remote: Counting objects: 13% (1930/14839) remote: Counting objects: 14% (2078/14839) remote: Counting objects: 15% (2226/14839) remote: Counting objects: 16% (2375/14839) remote: Counting objects: 17% (2523/14839) remote: Counting objects: 18% (2672/14839) remote: Counting objects: 19% (2820/14839) remote: Counting objects: 20% (2968/14839) remote: Counting objects: 21% (3117/14839) remote: Counting objects: 22% (3265/14839) remote: Counting objects: 23% (3413/14839) remote: Counting objects: 24% (3562/14839) remote: Counting objects: 25% (3710/14839) remote: Counting objects: 26% (3859/14839) remote: Counting objects: 27% (4007/14839) remote: Counting objects: 28% (4155/14839) remote: Counting objects: 29% (4304/14839) remote: Counting objects: 30% (4452/14839) remote: Counting objects: 31% (4601/14839) remote: Counting objects: 32% (4749/14839) remote: Counting objects: 33% (4897/14839) remote: Counting objects: 34% (5046/14839) remote: Counting objects: 35% (5194/14839) remote: Counting objects: 36% (5343/14839) remote: Counting objects: 37% (5491/14839) remote: Counting objects: 38% (5639/14839) remote: Counting objects: 39% (5788/14839) remote: Counting objects: 40% (5936/14839) remote: Counting objects: 41% (6084/14839) remote: Counting objects: 42% (6233/14839) remote: Counting objects: 43% (6381/14839) remote: Counting objects: 44% (6530/14839) remote: Counting objects: 45% (6678/14839) remote: Counting objects: 46% (6826/14839) remote: Counting objects: 47% (6975/14839) remote: Counting objects: 48% (7123/14839) remote: Counting objects: 49% (7272/14839) remote: Counting objects: 50% (7420/14839) remote: Counting objects: 51% (7568/14839) remote: Counting objects: 52% (7717/14839) remote: Counting objects: 53% (7865/14839) remote: Counting objects: 54% (8014/14839) remote: Counting objects: 55% (8162/14839) remote: Counting objects: 56% (8310/14839) remote: Counting objects: 57% (8459/14839) remote: Counting objects: 58% (8607/14839) remote: Counting objects: 59% (8756/14839) remote: Counting objects: 60% (8904/14839) remote: Counting objects: 61% (9052/14839) remote: Counting objects: 62% (9201/14839) remote: Counting objects: 63% (9349/14839) remote: Counting objects: 64% (9497/14839) remote: Counting objects: 65% (9646/14839) remote: Counting objects: 66% (9794/14839) remote: Counting objects: 67% (9943/14839) remote: Counting objects: 68% (10091/14839) remote: Counting objects: 69% (10239/14839) remote: Counting objects: 70% (10388/14839) remote: Counting objects: 71% (10536/14839) remote: Counting objects: 72% (10685/14839) remote: Counting objects: 73% (10833/14839) remote: Counting objects: 74% (10981/14839) remote: Counting objects: 75% (11130/14839) remote: Counting objects: 76% (11278/14839) remote: Counting objects: 77% (11427/14839) remote: Counting objects: 78% (11575/14839) remote: Counting objects: 79% (11723/14839) remote: Counting objects: 80% (11872/14839) remote: Counting objects: 81% (12020/14839) remote: Counting objects: 82% (12168/14839) remote: Counting objects: 83% (12317/14839) remote: Counting objects: 84% (12465/14839) remote: Counting objects: 85% (12614/14839) remote: Counting objects: 86% (12762/14839) remote: Counting objects: 87% (12910/14839) remote: Counting objects: 88% (13059/14839) remote: Counting objects: 89% (13207/14839) remote: Counting objects: 90% (13356/14839) remote: Counting objects: 91% (13504/14839) remote: Counting objects: 92% (13652/14839) remote: Counting objects: 93% (13801/14839) remote: Counting objects: 94% (13949/14839) remote: Counting objects: 95% (14098/14839) remote: Counting objects: 96% (14246/14839) remote: Counting objects: 97% (14394/14839) remote: Counting objects: 98% (14543/14839) remote: Counting objects: 99% (14691/14839) remote: Counting objects: 100% (14839/14839) remote: Counting objects: 100% (14839/14839), done.
  5. 4.81 s remote: Compressing objects: 0% (1/3073) remote: Compressing objects: 1% (31/3073) remote: Compressing objects: 2% (62/3073) remote: Compressing objects: 3% (93/3073) remote: Compressing objects: 4% (123/3073) remote: Compressing objects: 5% (154/3073) remote: Compressing objects: 5% (166/3073) remote: Compressing objects: 6% (185/3073) remote: Compressing objects: 6% (209/3073) remote: Compressing objects: 7% (216/3073)
  6. 8.79 s remote: Compressing objects: 8% (246/3073) remote: Compressing objects: 9% (277/3073) remote: Compressing objects: 9% (281/3073) remote: Compressing objects: 10% (308/3073) remote: Compressing objects: 11% (339/3073) remote: Compressing objects: 12% (369/3073) remote: Compressing objects: 13% (400/3073) remote: Compressing objects: 13% (404/3073) remote: Compressing objects: 14% (431/3073) remote: Compressing objects: 15% (461/3073) remote: Compressing objects: 16% (492/3073) remote: Compressing objects: 17% (523/3073) remote: Compressing objects: 18% (554/3073) remote: Compressing objects: 18% (564/3073) remote: Compressing objects: 19% (584/3073) remote: Compressing objects: 20% (615/3073) remote: Compressing objects: 21% (646/3073) remote: Compressing objects: 22% (677/3073) remote: Compressing objects: 23% (707/3073) remote: Compressing objects: 24% (738/3073) remote: Compressing objects: 25% (769/3073) remote: Compressing objects: 26% (799/3073) remote: Compressing objects: 27% (830/3073) remote: Compressing objects: 28% (861/3073) remote: Compressing objects: 29% (892/3073) remote: Compressing objects: 30% (922/3073) remote: Compressing objects: 30% (941/3073) remote: Compressing objects: 31% (953/3073) remote: Compressing objects: 32% (984/3073) remote: Compressing objects: 33% (1015/3073) remote: Compressing objects: 34% (1045/3073) remote: Compressing objects: 35% (1076/3073) remote: Compressing objects: 36% (1107/3073) remote: Compressing objects: 37% (1138/3073) remote: Compressing objects: 38% (1168/3073) remote: Compressing objects: 39% (1199/3073) remote: Compressing objects: 40% (1230/3073) remote: Compressing objects: 41% (1260/3073) remote: Compressing objects: 42% (1291/3073) remote: Compressing objects: 43% (1322/3073) remote: Compressing objects: 44% (1353/3073) remote: Compressing objects: 45% (1383/3073) remote: Compressing objects: 46% (1414/3073) remote: Compressing objects: 47% (1445/3073) remote: Compressing objects: 48% (1476/3073) remote: Compressing objects: 49% (1506/3073) remote: Compressing objects: 50% (1537/3073) remote: Compressing objects: 51% (1568/3073) remote: Compressing objects: 52% (1598/3073) remote: Compressing objects: 53% (1629/3073) remote: Compressing objects: 54% (1660/3073) remote: Compressing objects: 55% (1691/3073) remote: Compressing objects: 56% (1721/3073) remote: Compressing objects: 57% (1752/3073) remote: Compressing objects: 58% (1783/3073) remote: Compressing objects: 59% (1814/3073) remote: Compressing objects: 60% (1844/3073) remote: Compressing objects: 61% (1875/3073) remote: Compressing objects: 62% (1906/3073) remote: Compressing objects: 63% (1936/3073) remote: Compressing objects: 64% (1967/3073) remote: Compressing objects: 65% (1998/3073) remote: Compressing objects: 66% (2029/3073) remote: Compressing objects: 67% (2059/3073) remote: Compressing objects: 68% (2090/3073) remote: Compressing objects: 69% (2121/3073) remote: Compressing objects: 70% (2152/3073) remote: Compressing objects: 71% (2182/3073) remote: Compressing objects: 72% (2213/3073) remote: Compressing objects: 73% (2244/3073) remote: Compressing objects: 74% (2275/3073) remote: Compressing objects: 75% (2305/3073) remote: Compressing objects: 76% (2336/3073) remote: Compressing objects: 77% (2367/3073) remote: Compressing objects: 78% (2397/3073) remote: Compressing objects: 79% (2428/3073) remote: Compressing objects: 80% (2459/3073) remote: Compressing objects: 81% (2490/3073) remote: Compressing objects: 82% (2520/3073) remote: Compressing objects: 83% (2551/3073) remote: Compressing objects: 84% (2582/3073) remote: Compressing objects: 85% (2613/3073) remote: Compressing objects: 86% (2643/3073) remote: Compressing objects: 87% (2674/3073) remote: Compressing objects: 88% (2705/3073) remote: Compressing objects: 89% (2735/3073) remote: Compressing objects: 90% (2766/3073) remote: Compressing objects: 91% (2797/3073) remote: Compressing objects: 92% (2828/3073) remote: Compressing objects: 93% (2858/3073) remote: Compressing objects: 94% (2889/3073) remote: Compressing objects: 95% (2920/3073) remote: Compressing objects: 96% (2951/3073) remote: Compressing objects: 97% (2981/3073) remote: Compressing objects: 98% (3012/3073) remote: Compressing objects: 99% (3043/3073) remote: Compressing objects: 100% (3073/3073) remote: Compressing objects: 100% (3073/3073), done.
  7. 10.16 s Receiving objects: 0% (1/172467) Receiving objects: 1% (1725/172467) Receiving objects: 2% (3450/172467), 14.24 MiB | 28.46 MiB/s Receiving objects: 3% (5175/172467), 14.24 MiB | 28.46 MiB/s Receiving objects: 4% (6899/172467), 14.24 MiB | 28.46 MiB/s Receiving objects: 4% (7500/172467), 32.21 MiB | 32.20 MiB/s Receiving objects: 5% (8624/172467), 32.21 MiB | 32.20 MiB/s Receiving objects: 6% (10349/172467), 32.21 MiB | 32.20 MiB/s
  8. 15.01 s Receiving objects: 6% (11755/172467), 48.96 MiB | 31.93 MiB/s Receiving objects: 7% (12073/172467), 48.96 MiB | 31.93 MiB/s Receiving objects: 8% (13798/172467), 65.86 MiB | 32.39 MiB/s Receiving objects: 9% (15523/172467), 65.86 MiB | 32.39 MiB/s Receiving objects: 10% (17247/172467), 65.86 MiB | 32.39 MiB/s Receiving objects: 11% (18972/172467), 65.86 MiB | 32.39 MiB/s Receiving objects: 12% (20697/172467), 79.64 MiB | 31.44 MiB/s Receiving objects: 13% (22421/172467), 79.64 MiB | 31.44 MiB/s Receiving objects: 14% (24146/172467), 79.64 MiB | 31.44 MiB/s Receiving objects: 15% (25871/172467), 79.64 MiB | 31.44 MiB/s Receiving objects: 16% (27595/172467), 79.64 MiB | 31.44 MiB/s Receiving objects: 17% (29320/172467), 79.64 MiB | 31.44 MiB/s Receiving objects: 18% (31045/172467), 79.64 MiB | 31.44 MiB/s Receiving objects: 19% (32769/172467), 79.64 MiB | 31.44 MiB/s Receiving objects: 20% (34494/172467), 79.64 MiB | 31.44 MiB/s Receiving objects: 21% (36219/172467), 79.64 MiB | 31.44 MiB/s Receiving objects: 22% (37943/172467), 79.64 MiB | 31.44 MiB/s Receiving objects: 23% (39668/172467), 79.64 MiB | 31.44 MiB/s Receiving objects: 24% (41393/172467), 79.64 MiB | 31.44 MiB/s Receiving objects: 25% (43117/172467), 79.64 MiB | 31.44 MiB/s Receiving objects: 26% (44842/172467), 79.64 MiB | 31.44 MiB/s Receiving objects: 26% (44898/172467), 79.64 MiB | 31.44 MiB/s Receiving objects: 27% (46567/172467), 97.75 MiB | 32.22 MiB/s Receiving objects: 28% (48291/172467), 97.75 MiB | 32.22 MiB/s Receiving objects: 29% (50016/172467), 97.75 MiB | 32.22 MiB/s Receiving objects: 30% (51741/172467), 97.75 MiB | 32.22 MiB/s Receiving objects: 31% (53465/172467), 97.75 MiB | 32.22 MiB/s Receiving objects: 32% (55190/172467), 97.75 MiB | 32.22 MiB/s Receiving objects: 33% (56915/172467), 115.98 MiB | 32.64 MiB/s Receiving objects: 34% (58639/172467), 115.98 MiB | 32.64 MiB/s Receiving objects: 35% (60364/172467), 115.98 MiB | 32.64 MiB/s Receiving objects: 35% (60791/172467), 115.98 MiB | 32.64 MiB/s Receiving objects: 36% (62089/172467), 132.82 MiB | 32.76 MiB/s Receiving objects: 37% (63813/172467), 132.82 MiB | 32.76 MiB/s Receiving objects: 38% (65538/172467), 132.82 MiB | 32.76 MiB/s Receiving objects: 39% (67263/172467), 132.82 MiB | 32.76 MiB/s Receiving objects: 39% (68220/172467), 149.76 MiB | 32.88 MiB/s Receiving objects: 40% (68987/172467), 165.73 MiB | 33.27 MiB/s Receiving objects: 41% (70712/172467), 165.73 MiB | 33.27 MiB/s Receiving objects: 42% (72437/172467), 165.73 MiB | 33.27 MiB/s Receiving objects: 43% (74161/172467), 165.73 MiB | 33.27 MiB/s Receiving objects: 44% (75886/172467), 183.02 MiB | 33.00 MiB/s Receiving objects: 45% (77611/172467), 183.02 MiB | 33.00 MiB/s Receiving objects: 46% (79335/172467), 183.02 MiB | 33.00 MiB/s Receiving objects: 47% (81060/172467), 183.02 MiB | 33.00 MiB/s Receiving objects: 48% (82785/172467), 183.02 MiB | 33.00 MiB/s Receiving objects: 49% (84509/172467), 183.02 MiB | 33.00 MiB/s Receiving objects: 49% (86181/172467), 183.02 MiB | 33.00 MiB/s Receiving objects: 50% (86234/172467), 199.90 MiB | 33.28 MiB/s Receiving objects: 51% (87959/172467), 199.90 MiB | 33.28 MiB/s Receiving objects: 52% (89683/172467), 199.90 MiB | 33.28 MiB/s
  9. 19.84 s Receiving objects: 52% (89797/172467), 216.32 MiB | 33.17 MiB/s Receiving objects: 53% (91408/172467), 249.89 MiB | 33.54 MiB/s Receiving objects: 53% (91464/172467), 249.89 MiB | 33.54 MiB/s Receiving objects: 54% (93133/172467), 265.79 MiB | 33.17 MiB/s Receiving objects: 55% (94857/172467), 265.79 MiB | 33.17 MiB/s Receiving objects: 56% (96582/172467), 282.55 MiB | 33.17 MiB/s Receiving objects: 57% (98307/172467), 282.55 MiB | 33.17 MiB/s Receiving objects: 58% (100031/172467), 282.55 MiB | 33.17 MiB/s Receiving objects: 59% (101756/172467), 282.55 MiB | 33.17 MiB/s Receiving objects: 60% (103481/172467), 282.55 MiB | 33.17 MiB/s Receiving objects: 61% (105205/172467), 282.55 MiB | 33.17 MiB/s Receiving objects: 62% (106930/172467), 282.55 MiB | 33.17 MiB/s Receiving objects: 63% (108655/172467), 282.55 MiB | 33.17 MiB/s Receiving objects: 63% (109392/172467), 282.55 MiB | 33.17 MiB/s Receiving objects: 64% (110379/172467), 299.23 MiB | 33.10 MiB/s Receiving objects: 65% (112104/172467), 299.23 MiB | 33.10 MiB/s Receiving objects: 66% (113829/172467), 316.27 MiB | 33.34 MiB/s Receiving objects: 67% (115553/172467), 316.27 MiB | 33.34 MiB/s Receiving objects: 68% (117278/172467), 316.27 MiB | 33.34 MiB/s Receiving objects: 68% (118094/172467), 316.27 MiB | 33.34 MiB/s Receiving objects: 69% (119003/172467), 332.57 MiB | 33.15 MiB/s Receiving objects: 70% (120727/172467), 332.57 MiB | 33.15 MiB/s Receiving objects: 71% (122452/172467), 332.57 MiB | 33.15 MiB/s Receiving objects: 71% (124091/172467), 349.27 MiB | 33.11 MiB/s Receiving objects: 72% (124177/172467), 349.27 MiB | 33.11 MiB/s
  10. 24.81 s Receiving objects: 73% (125901/172467), 366.07 MiB | 33.20 MiB/s Receiving objects: 74% (127626/172467), 382.82 MiB | 33.18 MiB/s Receiving objects: 74% (127949/172467), 382.82 MiB | 33.18 MiB/s Receiving objects: 75% (129351/172467), 382.82 MiB | 33.18 MiB/s Receiving objects: 76% (131075/172467), 399.31 MiB | 32.98 MiB/s Receiving objects: 77% (132800/172467), 416.25 MiB | 33.21 MiB/s Receiving objects: 77% (133238/172467), 416.25 MiB | 33.21 MiB/s Receiving objects: 78% (134525/172467), 432.98 MiB | 33.21 MiB/s Receiving objects: 79% (136249/172467), 432.98 MiB | 33.21 MiB/s Receiving objects: 80% (137974/172467), 449.89 MiB | 33.26 MiB/s Receiving objects: 81% (139699/172467), 449.89 MiB | 33.26 MiB/s Receiving objects: 81% (139846/172467), 449.89 MiB | 33.26 MiB/s Receiving objects: 82% (141423/172467), 466.79 MiB | 33.22 MiB/s Receiving objects: 82% (142387/172467), 482.91 MiB | 33.26 MiB/s Receiving objects: 83% (143148/172467), 499.31 MiB | 33.18 MiB/s Receiving objects: 84% (144873/172467), 516.19 MiB | 33.20 MiB/s Receiving objects: 84% (146301/172467), 516.19 MiB | 33.20 MiB/s Receiving objects: 85% (146597/172467), 516.19 MiB | 33.20 MiB/s
  11. 29.92 s Receiving objects: 85% (147547/172467), 549.89 MiB | 33.38 MiB/s Receiving objects: 85% (147551/172467), 599.78 MiB | 33.21 MiB/s Receiving objects: 85% (147552/172467), 633.25 MiB | 33.32 MiB/s Receiving objects: 85% (147554/172467), 649.57 MiB | 33.31 MiB/s Receiving objects: 85% (147565/172467), 699.47 MiB | 33.23 MiB/s
  12. 33.23 s Receiving objects: 85% (147565/172467), 732.72 MiB | 33.25 MiB/s Receiving objects: 86% (148322/172467), 732.72 MiB | 33.25 MiB/s Receiving objects: 87% (150047/172467), 732.72 MiB | 33.25 MiB/s Receiving objects: 88% (151771/172467), 749.59 MiB | 33.29 MiB/s Receiving objects: 88% (152751/172467), 749.59 MiB | 33.29 MiB/s Receiving objects: 89% (153496/172467), 749.59 MiB | 33.29 MiB/s Receiving objects: 90% (155221/172467), 766.03 MiB | 33.24 MiB/s Receiving objects: 91% (156945/172467), 766.03 MiB | 33.24 MiB/s Receiving objects: 92% (158670/172467), 766.03 MiB | 33.24 MiB/s Receiving objects: 93% (160395/172467), 766.03 MiB | 33.24 MiB/s Receiving objects: 94% (162119/172467), 766.03 MiB | 33.24 MiB/s Receiving objects: 95% (163844/172467), 766.03 MiB | 33.24 MiB/s Receiving objects: 96% (165569/172467), 766.03 MiB | 33.24 MiB/s Receiving objects: 97% (167293/172467), 766.03 MiB | 33.24 MiB/s Receiving objects: 98% (169018/172467), 782.70 MiB | 33.21 MiB/s Receiving objects: 99% (170743/172467), 782.70 MiB | 33.21 MiB/s Receiving objects: 99% (172295/172467), 782.70 MiB | 33.21 MiB/s remote: Total 172467 (delta 12813), reused 11932 (delta 11758), pack-reused 157628 (from 3)
  13. 33.23 s Receiving objects: 100% (172467/172467), 793.55 MiB | 30.82 MiB/s Receiving objects: 100% (172467/172467), 798.59 MiB | 32.68 MiB/s, done.
  14. 35.28 s Resolving deltas: 0% (0/106083) Resolving deltas: 1% (1061/106083) Resolving deltas: 2% (2122/106083) Resolving deltas: 3% (3184/106083) Resolving deltas: 4% (4244/106083) Resolving deltas: 5% (5305/106083) Resolving deltas: 6% (6365/106083) Resolving deltas: 7% (7426/106083) Resolving deltas: 8% (8487/106083) Resolving deltas: 9% (9548/106083) Resolving deltas: 10% (10609/106083) Resolving deltas: 11% (11670/106083) Resolving deltas: 12% (12730/106083) Resolving deltas: 13% (13791/106083) Resolving deltas: 14% (14854/106083) Resolving deltas: 15% (15913/106083) Resolving deltas: 16% (16974/106083) Resolving deltas: 17% (18035/106083) Resolving deltas: 18% (19095/106083) Resolving deltas: 19% (20156/106083) Resolving deltas: 20% (21217/106083) Resolving deltas: 21% (22278/106083) Resolving deltas: 22% (23339/106083) Resolving deltas: 23% (24400/106083) Resolving deltas: 24% (25460/106083) Resolving deltas: 25% (26521/106083) Resolving deltas: 26% (27582/106083) Resolving deltas: 27% (28643/106083) Resolving deltas: 28% (29704/106083) Resolving deltas: 29% (30765/106083) Resolving deltas: 30% (31825/106083) Resolving deltas: 31% (32886/106083) Resolving deltas: 32% (33947/106083) Resolving deltas: 33% (35009/106083) Resolving deltas: 34% (36070/106083) Resolving deltas: 35% (37130/106083) Resolving deltas: 36% (38192/106083) Resolving deltas: 37% (39251/106083) Resolving deltas: 38% (40312/106083) Resolving deltas: 39% (41374/106083) Resolving deltas: 40% (42434/106083) Resolving deltas: 41% (43496/106083) Resolving deltas: 42% (44555/106083) Resolving deltas: 43% (45616/106083) Resolving deltas: 44% (46678/106083) Resolving deltas: 45% (47738/106083) Resolving deltas: 46% (48801/106083) Resolving deltas: 47% (49860/106083) Resolving deltas: 48% (50920/106083) Resolving deltas: 49% (51981/106083) Resolving deltas: 50% (53042/106083) Resolving deltas: 51% (54106/106083) Resolving deltas: 52% (55164/106083) Resolving deltas: 52% (55567/106083) Resolving deltas: 53% (56224/106083) Resolving deltas: 54% (57287/106083) Resolving deltas: 55% (58346/106083) Resolving deltas: 56% (59407/106083) Resolving deltas: 57% (60468/106083) Resolving deltas: 58% (61529/106083) Resolving deltas: 59% (62589/106083) Resolving deltas: 60% (63652/106083) Resolving deltas: 61% (64711/106083) Resolving deltas: 62% (65772/106083) Resolving deltas: 63% (66833/106083) Resolving deltas: 64% (67894/106083) Resolving deltas: 65% (68954/106083) Resolving deltas: 66% (70015/106083) Resolving deltas: 67% (71077/106083) Resolving deltas: 68% (72137/106083) Resolving deltas: 69% (73198/106083) Resolving deltas: 70% (74259/106083) Resolving deltas: 71% (75319/106083) Resolving deltas: 72% (76380/106083) Resolving deltas: 73% (77443/106083) Resolving deltas: 74% (78502/106083) Resolving deltas: 75% (79563/106083) Resolving deltas: 76% (80624/106083) Resolving deltas: 77% (81684/106083) Resolving deltas: 78% (82745/106083) Resolving deltas: 79% (83806/106083) Resolving deltas: 80% (84867/106083) Resolving deltas: 81% (85928/106083) Resolving deltas: 82% (86989/106083) Resolving deltas: 83% (88049/106083) Resolving deltas: 84% (89112/106083) Resolving deltas: 85% (90171/106083) Resolving deltas: 86% (91232/106083) Resolving deltas: 87% (92293/106083) Resolving deltas: 87% (93348/106083) Resolving deltas: 88% (93354/106083) Resolving deltas: 89% (94414/106083) Resolving deltas: 90% (95476/106083) Resolving deltas: 91% (96537/106083) Resolving deltas: 92% (97597/106083) Resolving deltas: 93% (98658/106083) Resolving deltas: 94% (99719/106083)
  15. 35.44 s Resolving deltas: 95% (100779/106083) Resolving deltas: 96% (101840/106083) Resolving deltas: 97% (102901/106083) Resolving deltas: 98% (103962/106083) Resolving deltas: 99% (105023/106083) Resolving deltas: 100% (106083/106083) Resolving deltas: 100% (106083/106083), done.
  16. 36.40 s Fetching commit 1e8063a763d3aa515749c33616ee59aa827705be for ninjars-combined ...
  17. 36.40 s $ /nix/store/b1wn5clix1mz4vpfih7x9cnj9qfh7c6h-git-2.54.0/bin/git fetch origin 1e8063a763d3aa515749c33616ee59aa827705be
  18. 36.84 s From https://github.com/alphal00p/gammaloop
  19. 36.84 s * branch 1e8063a763d3aa515749c33616ee59aa827705be -> FETCH_HEAD
  20. 37.08 s $ /nix/store/bhv6xyvqw6gjs3j488gi1z6wdv18bdpa-coreutils-9.11/bin/timeout --kill-after=15s 7200s /nix/store/b1wn5clix1mz4vpfih7x9cnj9qfh7c6h-git-2.54.0/bin/git -c advice.detachedHead=false checkout 1e8063a763d3aa515749c33616ee59aa827705be
  21. 40.72 s HEAD is now at 1e8063a76 Merge commit '30fb0f28c' into ninjars-combined
  22. 40.74 s $ /nix/store/bhv6xyvqw6gjs3j488gi1z6wdv18bdpa-coreutils-9.11/bin/timeout --kill-after=15s 7200s /nix/store/5np0yidzrnyjbb243hvgqpgpss865p0n-nix-2.34.9/bin/nix --extra-experimental-features nix-command --extra-experimental-features flakes --log-format internal-json run .#packages.x86_64-linux.nix-ci-check-gammaloop-nextest-clinnet --print-build-logs
  23. 40.92 s warning: ignoring untrusted flake configuration setting 'extra-substituters'.
  24. 40.92 s Pass '--accept-flake-config' to trust it
  25. 40.92 s warning: ignoring untrusted flake configuration setting 'extra-trusted-public-keys'.
  26. 40.92 s Pass '--accept-flake-config' to trust it
  27. 46.21 s
  28. 46.83 s evaluating derivation 'gdo you want to allow configuration setting 'extra-substituters' to be set to 'https://cache.nix-ci.com' (y/N)? do you want to permanently mark this value as untrusted (y/N)? warning: ignoring untrusted flake configuration setting 'extra-substituters'.
  29. 46.83 s Pass '--accept-flake-config' to trust it
  30. 46.83 s do you want to allow configuration setting 'extra-trusted-public-keys' to be set to 'nix-ci:g3xV5BDTLtIBZr/A00IU1x0EtKKlb7YLgBN2SgYgM6A=' (y/N)? do you want to permanently mark this value as untrusted (y/N)? warning: ignoring untrusted flake configuration setting 'extra-trusted-public-keys'.
  31. 46.83 s Pass '--accept-flake-config' to trust it
  32. 51.43 s copying '/nix/store/l3sx evaluating derivation 'g copying '/nix/store/l3sx evaluating derivation 'g copying '/nix/store/l3sx evaluating derivation 'g copying '/nix/store/l3sx evaluating derivation 'g copying '/nix/store/l3sx evaluating derivation 'g copying '/nix/store/l3sx evaluating derivation 'g copying '/nix/store/l3sx evaluating derivation 'g
  33. 54.67 s [0/1 built] [1/0/1 built] building ggammaloop-nextest-clinnet> Nextest worker budget: 16
  34. 54.69 s gammaloop-nextest-clinnet> Extracting 4 binaries (including 1 non-test binary), 1 build script output directory, and 1 linked path to /build/source
  35. 54.77 s gammaloop-nextest-clinnet> Extracted 16 files to /build/source in 0.09s
  36. 54.79 s gammaloop-nextest-clinnet> ------------
  37. 54.79 s gammaloop-nextest-clinnet> Nextest run ID 6244babb-ea3c-4cec-a105-b786d8602a20 with nextest profile: ci_gammaloop
  38. 54.79 s gammaloop-nextest-clinnet> Starting 38 tests across 3 binaries
  39. 122.97 s gammaloop-nextest-clinnet> FAIL [ 68.163s] (32/38) clinnet::public_typst_behavior public_linnest_arrow_shafts_and_crossing_gaps
  40. 122.97 s gammaloop-nextest-clinnet> stdout ---
  41. 122.97 s gammaloop-nextest-clinnet>
  42. 122.97 s gammaloop-nextest-clinnet> running 1 test
  43. 122.97 s gammaloop-nextest-clinnet> test public_linnest_arrow_shafts_and_crossing_gaps has been running for over 60 seconds
  44. 122.97 s gammaloop-nextest-clinnet> test public_linnest_arrow_shafts_and_crossing_gaps ... FAILED
  45. 122.97 s gammaloop-nextest-clinnet>
  46. 122.97 s gammaloop-nextest-clinnet> failures:
  47. 122.97 s gammaloop-nextest-clinnet>
  48. 122.97 s gammaloop-nextest-clinnet> failures:
  49. 122.97 s gammaloop-nextest-clinnet> public_linnest_arrow_shafts_and_crossing_gaps
  50. 122.97 s gammaloop-nextest-clinnet>
  51. 122.97 s gammaloop-nextest-clinnet> test result: FAILED. 0 passed; 1 failed; 0 ignored; 0 measured; 17 filtered out; finished in 68.15s
  52. 122.97 s gammaloop-nextest-clinnet>
  53. 122.97 s gammaloop-nextest-clinnet> stderr ---
  54. 122.97 s gammaloop-nextest-clinnet>
  55. 122.97 s gammaloop-nextest-clinnet> thread 'public_linnest_arrow_shafts_and_crossing_gaps' (258) panicked at crates/clinnet/tests/public_typst_behavior.rs:81:55:
  56. 122.97 s gammaloop-nextest-clinnet> called `Result::unwrap()` on an `Err` value: typst failed while compiling template /build/.tmpc2nhYk/.clinnet/templates/linnest-public-behavior.svg
  57. 122.97 s gammaloop-nextest-clinnet>
  58. 122.97 s gammaloop-nextest-clinnet> Command executed:
  59. 122.97 s gammaloop-nextest-clinnet> "typst" "c" "/build/.tmpc2nhYk/.clinnet/templates/linnest-public-behavior.typ" "/build/.tmpc2nhYk/.clinnet/templates/linnest-public-behavior.svg" "--root" "/build/.tmpc2nhYk/.clinnet/templates"
  60. 122.97 s gammaloop-nextest-clinnet>
  61. 122.97 s gammaloop-nextest-clinnet> Typst stdout:
  62. 122.97 s gammaloop-nextest-clinnet>
  63. 122.97 s gammaloop-nextest-clinnet>
  64. 122.97 s gammaloop-nextest-clinnet> Typst stderr:
  65. 122.97 s gammaloop-nextest-clinnet>
  66. 122.97 s gammaloop-nextest-clinnet>
  67. 122.97 s gammaloop-nextest-clinnet> Location:
  68. 122.97 s gammaloop-nextest-clinnet> crates/clinnet/src/lib.rs:741:13
  69. 122.97 s gammaloop-nextest-clinnet> stack backtrace:
  70. 122.97 s gammaloop-nextest-clinnet> 0: __rustc::rust_begin_unwind
  71. 122.97 s gammaloop-nextest-clinnet> 1: core::panicking::panic_fmt
  72. 122.97 s gammaloop-nextest-clinnet> 2: core::result::unwrap_failed
  73. 122.97 s gammaloop-nextest-clinnet> 3: public_typst_behavior::render
  74. 122.97 s gammaloop-nextest-clinnet> 4: <std::sync::once::Once>::call_once_force::<<std::sync::once_lock::OnceLock<alloc::string::String>>::initialize<<std::sync::once_lock::OnceLock<alloc::string::String>>::get_or_init<public_typst_behavior::linnest_public_svg::{closure#0}>::{closure#0}, !>::{closure#0}>::{closure#0}
  75. 122.97 s gammaloop-nextest-clinnet> 5: <std::sys::sync::once::futex::Once>::call
  76. 122.97 s gammaloop-nextest-clinnet> 6: <std::sync::once_lock::OnceLock<alloc::string::String>>::initialize::<<std::sync::once_lock::OnceLock<alloc::string::String>>::get_or_init<public_typst_behavior::linnest_public_svg::{closure#0}>::{closure#0}, !>
  77. 122.97 s gammaloop-nextest-clinnet> 7: <public_typst_behavior::public_linnest_arrow_shafts_and_crossing_gaps::{closure#0} as core::ops::function::FnOnce<()>>::call_once
  78. 122.97 s gammaloop-nextest-clinnet> note: Some details are omitted, run with `RUST_BACKTRACE=full` for a verbose backtrace.
  79. 122.97 s gammaloop-nextest-clinnet>
  80. 125.79 s gammaloop-nextest-clinnet> FAIL [ 70.989s] (33/38) clinnet::public_typst_behavior public_linnest_edge_styles_skip_fallbacks
  81. 125.79 s gammaloop-nextest-clinnet> stdout ---
  82. 125.79 s gammaloop-nextest-clinnet>
  83. 125.79 s gammaloop-nextest-clinnet> running 1 test
  84. 125.79 s gammaloop-nextest-clinnet> test public_linnest_edge_styles_skip_fallbacks has been running for over 60 seconds
  85. 125.79 s gammaloop-nextest-clinnet> test public_linnest_edge_styles_skip_fallbacks ... FAILED
  86. 125.79 s gammaloop-nextest-clinnet>
  87. 125.79 s gammaloop-nextest-clinnet> failures:
  88. 125.79 s gammaloop-nextest-clinnet>
  89. 125.79 s gammaloop-nextest-clinnet> failures:
  90. 125.79 s gammaloop-nextest-clinnet> public_linnest_edge_styles_skip_fallbacks
  91. 125.79 s gammaloop-nextest-clinnet>
  92. 125.79 s gammaloop-nextest-clinnet> test result: FAILED. 0 passed; 1 failed; 0 ignored; 0 measured; 17 filtered out; finished in 70.98s
  93. 125.79 s gammaloop-nextest-clinnet>
  94. 125.79 s gammaloop-nextest-clinnet> stderr ---
  95. 125.79 s gammaloop-nextest-clinnet>
  96. 125.79 s gammaloop-nextest-clinnet> thread 'public_linnest_edge_styles_skip_fallbacks' (277) panicked at crates/clinnet/tests/public_typst_behavior.rs:81:55:
  97. 125.79 s gammaloop-nextest-clinnet> called `Result::unwrap()` on an `Err` value: typst failed while compiling template /build/.tmpDBd4KZ/.clinnet/templates/linnest-public-behavior.svg
  98. 125.79 s gammaloop-nextest-clinnet>
  99. 125.79 s gammaloop-nextest-clinnet> Command executed:
  100. 125.79 s gammaloop-nextest-clinnet> "typst" "c" "/build/.tmpDBd4KZ/.clinnet/templates/linnest-public-behavior.typ" "/build/.tmpDBd4KZ/.clinnet/templates/linnest-public-behavior.svg" "--root" "/build/.tmpDBd4KZ/.clinnet/templates"
  101. 125.79 s gammaloop-nextest-clinnet>
  102. 125.79 s gammaloop-nextest-clinnet> Typst stdout:
  103. 125.79 s gammaloop-nextest-clinnet>
  104. 125.79 s gammaloop-nextest-clinnet>
  105. 125.79 s gammaloop-nextest-clinnet> Typst stderr:
  106. 125.79 s gammaloop-nextest-clinnet>
  107. 125.79 s gammaloop-nextest-clinnet>
  108. 125.79 s gammaloop-nextest-clinnet> Location:
  109. 125.79 s gammaloop-nextest-clinnet> crates/clinnet/src/lib.rs:741:13
  110. 125.79 s gammaloop-nextest-clinnet> stack backtrace:
  111. 125.79 s gammaloop-nextest-clinnet> 0: __rustc::rust_begin_unwind
  112. 125.79 s gammaloop-nextest-clinnet> 1: core::panicking::panic_fmt
  113. 125.79 s gammaloop-nextest-clinnet> 2: core::result::unwrap_failed
  114. 125.79 s gammaloop-nextest-clinnet> 3: public_typst_behavior::render
  115. 125.79 s gammaloop-nextest-clinnet> 4: <std::sync::once::Once>::call_once_force::<<std::sync::once_lock::OnceLock<alloc::string::String>>::initialize<<std::sync::once_lock::OnceLock<alloc::string::String>>::get_or_init<public_typst_behavior::linnest_public_svg::{closure#0}>::{closure#0}, !>::{closure#0}>::{closure#0}
  116. 125.79 s gammaloop-nextest-clinnet> 5: <std::sys::sync::once::futex::Once>::call
  117. 125.79 s gammaloop-nextest-clinnet> 6: <std::sync::once_lock::OnceLock<alloc::string::String>>::initialize::<<std::sync::once_lock::OnceLock<alloc::string::String>>::get_or_init<public_typst_behavior::linnest_public_svg::{closure#0}>::{closure#0}, !>
  118. 125.79 s gammaloop-nextest-clinnet> 7: <public_typst_behavior::public_linnest_edge_styles_skip_fallbacks::{closure#0} as core::ops::function::FnOnce<()>>::call_once
  119. 125.79 s gammaloop-nextest-clinnet> note: Some details are omitted, run with `RUST_BACKTRACE=full` for a verbose backtrace.
  120. 125.79 s gammaloop-nextest-clinnet>
  121. 177.54 s gammaloop-nextest-clinnet> FAIL [ 122.723s] (34/38) clinnet::public_typst_behavior public_linnest_momentum_layers_place_shafts_and_labels
  122. 177.54 s gammaloop-nextest-clinnet> stdout ---
  123. 177.54 s gammaloop-nextest-clinnet>
  124. 177.54 s gammaloop-nextest-clinnet> running 1 test
  125. 177.54 s gammaloop-nextest-clinnet> test public_linnest_momentum_layers_place_shafts_and_labels has been running for over 60 seconds
  126. 177.54 s gammaloop-nextest-clinnet> test public_linnest_momentum_layers_place_shafts_and_labels ... FAILED
  127. 177.54 s gammaloop-nextest-clinnet>
  128. 177.54 s gammaloop-nextest-clinnet> failures:
  129. 177.54 s gammaloop-nextest-clinnet>
  130. 177.54 s gammaloop-nextest-clinnet> failures:
  131. 177.54 s gammaloop-nextest-clinnet> public_linnest_momentum_layers_place_shafts_and_labels
  132. 177.54 s gammaloop-nextest-clinnet>
  133. 177.54 s gammaloop-nextest-clinnet> test result: FAILED. 0 passed; 1 failed; 0 ignored; 0 measured; 17 filtered out; finished in 122.71s
  134. 177.54 s gammaloop-nextest-clinnet>
  135. 177.54 s gammaloop-nextest-clinnet> stderr ---
  136. 177.54 s gammaloop-nextest-clinnet>
  137. 177.54 s gammaloop-nextest-clinnet> thread 'public_linnest_momentum_layers_place_shafts_and_labels' (283) panicked at crates/clinnet/tests/public_typst_behavior.rs:81:55:
  138. 177.54 s gammaloop-nextest-clinnet> called `Result::unwrap()` on an `Err` value: typst failed while compiling template /build/.tmpv1f5m6/.clinnet/templates/linnest-public-behavior.svg
  139. 177.54 s gammaloop-nextest-clinnet>
  140. 177.54 s gammaloop-nextest-clinnet> Command executed:
  141. 177.54 s gammaloop-nextest-clinnet> "typst" "c" "/build/.tmpv1f5m6/.clinnet/templates/linnest-public-behavior.typ" "/build/.tmpv1f5m6/.clinnet/templates/linnest-public-behavior.svg" "--root" "/build/.tmpv1f5m6/.clinnet/templates"
  142. 177.54 s gammaloop-nextest-clinnet>
  143. 177.54 s gammaloop-nextest-clinnet> Typst stdout:
  144. 177.54 s gammaloop-nextest-clinnet>
  145. 177.54 s gammaloop-nextest-clinnet>
  146. 177.54 s gammaloop-nextest-clinnet> Typst stderr:
  147. 177.54 s gammaloop-nextest-clinnet>
  148. 177.54 s gammaloop-nextest-clinnet>
  149. 177.54 s gammaloop-nextest-clinnet> Location:
  150. 177.54 s gammaloop-nextest-clinnet> crates/clinnet/src/lib.rs:741:13
  151. 177.54 s gammaloop-nextest-clinnet> stack backtrace:
  152. 177.54 s gammaloop-nextest-clinnet> 0: __rustc::rust_begin_unwind
  153. 177.54 s gammaloop-nextest-clinnet> 1: core::panicking::panic_fmt
  154. 177.54 s gammaloop-nextest-clinnet> 2: core::result::unwrap_failed
  155. 177.54 s gammaloop-nextest-clinnet> 3: public_typst_behavior::render
  156. 177.54 s gammaloop-nextest-clinnet> 4: <std::sync::once::Once>::call_once_force::<<std::sync::once_lock::OnceLock<alloc::string::String>>::initialize<<std::sync::once_lock::OnceLock<alloc::string::String>>::get_or_init<public_typst_behavior::linnest_public_svg::{closure#0}>::{closure#0}, !>::{closure#0}>::{closure#0}
  157. 177.54 s gammaloop-nextest-clinnet> 5: <std::sys::sync::once::futex::Once>::call
  158. 177.54 s gammaloop-nextest-clinnet> 6: <std::sync::once_lock::OnceLock<alloc::string::String>>::initialize::<<std::sync::once_lock::OnceLock<alloc::string::String>>::get_or_init<public_typst_behavior::linnest_public_svg::{closure#0}>::{closure#0}, !>
  159. 177.54 s gammaloop-nextest-clinnet> 7: <public_typst_behavior::public_linnest_momentum_layers_place_shafts_and_labels::{closure#0} as core::ops::function::FnOnce<()>>::call_once
  160. 177.54 s gammaloop-nextest-clinnet> note: Some details are omitted, run with `RUST_BACKTRACE=full` for a verbose backtrace.
  161. 177.54 s gammaloop-nextest-clinnet>
  162. 185.83 s gammaloop-nextest-clinnet> ------------
  163. 185.83 s gammaloop-nextest-clinnet> Summary [ 131.047s] 38 tests run: 35 passed (4 slow), 3 failed, 0 skipped
  164. 185.83 s gammaloop-nextest-clinnet> FAIL [ 68.163s] (32/38) clinnet::public_typst_behavior public_linnest_arrow_shafts_and_crossing_gaps
  165. 185.83 s gammaloop-nextest-clinnet> stdout ---
  166. 185.83 s gammaloop-nextest-clinnet>
  167. 185.83 s gammaloop-nextest-clinnet> running 1 test
  168. 185.83 s gammaloop-nextest-clinnet> test public_linnest_arrow_shafts_and_crossing_gaps has been running for over 60 seconds
  169. 185.83 s gammaloop-nextest-clinnet> test public_linnest_arrow_shafts_and_crossing_gaps ... FAILED
  170. 185.83 s gammaloop-nextest-clinnet>
  171. 185.83 s gammaloop-nextest-clinnet> failures:
  172. 185.83 s gammaloop-nextest-clinnet>
  173. 185.83 s gammaloop-nextest-clinnet> failures:
  174. 185.83 s gammaloop-nextest-clinnet> public_linnest_arrow_shafts_and_crossing_gaps
  175. 185.83 s gammaloop-nextest-clinnet>
  176. 185.83 s gammaloop-nextest-clinnet> test result: FAILED. 0 passed; 1 failed; 0 ignored; 0 measured; 17 filtered out; finished in 68.15s
  177. 185.83 s gammaloop-nextest-clinnet>
  178. 185.83 s gammaloop-nextest-clinnet> stderr ---
  179. 185.83 s gammaloop-nextest-clinnet>
  180. 185.83 s gammaloop-nextest-clinnet> thread 'public_linnest_arrow_shafts_and_crossing_gaps' (258) panicked at crates/clinnet/tests/public_typst_behavior.rs:81:55:
  181. 185.83 s gammaloop-nextest-clinnet> called `Result::unwrap()` on an `Err` value: typst failed while compiling template /build/.tmpc2nhYk/.clinnet/templates/linnest-public-behavior.svg
  182. 185.83 s gammaloop-nextest-clinnet>
  183. 185.83 s gammaloop-nextest-clinnet> Command executed:
  184. 185.83 s gammaloop-nextest-clinnet> "typst" "c" "/build/.tmpc2nhYk/.clinnet/templates/linnest-public-behavior.typ" "/build/.tmpc2nhYk/.clinnet/templates/linnest-public-behavior.svg" "--root" "/build/.tmpc2nhYk/.clinnet/templates"
  185. 185.83 s gammaloop-nextest-clinnet>
  186. 185.83 s gammaloop-nextest-clinnet> Typst stdout:
  187. 185.83 s gammaloop-nextest-clinnet>
  188. 185.83 s gammaloop-nextest-clinnet>
  189. 185.83 s gammaloop-nextest-clinnet> Typst stderr:
  190. 185.83 s gammaloop-nextest-clinnet>
  191. 185.83 s gammaloop-nextest-clinnet>
  192. 185.83 s gammaloop-nextest-clinnet> Location:
  193. 185.83 s gammaloop-nextest-clinnet> crates/clinnet/src/lib.rs:741:13
  194. 185.83 s gammaloop-nextest-clinnet> stack backtrace:
  195. 185.83 s gammaloop-nextest-clinnet> 0: __rustc::rust_begin_unwind
  196. 185.83 s gammaloop-nextest-clinnet> 1: core::panicking::panic_fmt
  197. 185.83 s gammaloop-nextest-clinnet> 2: core::result::unwrap_failed
  198. 185.83 s gammaloop-nextest-clinnet> 3: public_typst_behavior::render
  199. 185.83 s gammaloop-nextest-clinnet> 4: <std::sync::once::Once>::call_once_force::<<std::sync::once_lock::OnceLock<alloc::string::String>>::initialize<<std::sync::once_lock::OnceLock<alloc::string::String>>::get_or_init<public_typst_behavior::linnest_public_svg::{closure#0}>::{closure#0}, !>::{closure#0}>::{closure#0}
  200. 185.83 s gammaloop-nextest-clinnet> 5: <std::sys::sync::once::futex::Once>::call
  201. 185.83 s gammaloop-nextest-clinnet> 6: <std::sync::once_lock::OnceLock<alloc::string::String>>::initialize::<<std::sync::once_lock::OnceLock<alloc::string::String>>::get_or_init<public_typst_behavior::linnest_public_svg::{closure#0}>::{closure#0}, !>
  202. 185.83 s gammaloop-nextest-clinnet> 7: <public_typst_behavior::public_linnest_arrow_shafts_and_crossing_gaps::{closure#0} as core::ops::function::FnOnce<()>>::call_once
  203. 185.83 s gammaloop-nextest-clinnet> note: Some details are omitted, run with `RUST_BACKTRACE=full` for a verbose backtrace.
  204. 185.83 s gammaloop-nextest-clinnet>
  205. 185.83 s gammaloop-nextest-clinnet> FAIL [ 70.989s] (33/38) clinnet::public_typst_behavior public_linnest_edge_styles_skip_fallbacks
  206. 185.83 s gammaloop-nextest-clinnet> stdout ---
  207. 185.83 s gammaloop-nextest-clinnet>
  208. 185.83 s gammaloop-nextest-clinnet> running 1 test
  209. 185.83 s gammaloop-nextest-clinnet> test public_linnest_edge_styles_skip_fallbacks has been running for over 60 seconds
  210. 185.83 s gammaloop-nextest-clinnet> test public_linnest_edge_styles_skip_fallbacks ... FAILED
  211. 185.83 s gammaloop-nextest-clinnet>
  212. 185.83 s gammaloop-nextest-clinnet> failures:
  213. 185.83 s gammaloop-nextest-clinnet>
  214. 185.83 s gammaloop-nextest-clinnet> failures:
  215. 185.83 s gammaloop-nextest-clinnet> public_linnest_edge_styles_skip_fallbacks
  216. 185.83 s gammaloop-nextest-clinnet>
  217. 185.83 s gammaloop-nextest-clinnet> test result: FAILED. 0 passed; 1 failed; 0 ignored; 0 measured; 17 filtered out; finished in 70.98s
  218. 185.83 s gammaloop-nextest-clinnet>
  219. 185.83 s gammaloop-nextest-clinnet> stderr ---
  220. 185.83 s gammaloop-nextest-clinnet>
  221. 185.83 s gammaloop-nextest-clinnet> thread 'public_linnest_edge_styles_skip_fallbacks' (277) panicked at crates/clinnet/tests/public_typst_behavior.rs:81:55:
  222. 185.83 s gammaloop-nextest-clinnet> called `Result::unwrap()` on an `Err` value: typst failed while compiling template /build/.tmpDBd4KZ/.clinnet/templates/linnest-public-behavior.svg
  223. 185.83 s gammaloop-nextest-clinnet>
  224. 185.83 s gammaloop-nextest-clinnet> Command executed:
  225. 185.83 s gammaloop-nextest-clinnet> "typst" "c" "/build/.tmpDBd4KZ/.clinnet/templates/linnest-public-behavior.typ" "/build/.tmpDBd4KZ/.clinnet/templates/linnest-public-behavior.svg" "--root" "/build/.tmpDBd4KZ/.clinnet/templates"
  226. 185.83 s gammaloop-nextest-clinnet>
  227. 185.83 s gammaloop-nextest-clinnet> Typst stdout:
  228. 185.83 s gammaloop-nextest-clinnet>
  229. 185.83 s gammaloop-nextest-clinnet>
  230. 185.83 s gammaloop-nextest-clinnet> Typst stderr:
  231. 185.83 s gammaloop-nextest-clinnet>
  232. 185.83 s gammaloop-nextest-clinnet>
  233. 185.83 s gammaloop-nextest-clinnet> Location:
  234. 185.83 s gammaloop-nextest-clinnet> crates/clinnet/src/lib.rs:741:13
  235. 185.83 s gammaloop-nextest-clinnet> stack backtrace:
  236. 185.83 s gammaloop-nextest-clinnet> 0: __rustc::rust_begin_unwind
  237. 185.83 s gammaloop-nextest-clinnet> 1: core::panicking::panic_fmt
  238. 185.83 s gammaloop-nextest-clinnet> 2: core::result::unwrap_failed
  239. 185.83 s gammaloop-nextest-clinnet> 3: public_typst_behavior::render
  240. 185.83 s gammaloop-nextest-clinnet> 4: <std::sync::once::Once>::call_once_force::<<std::sync::once_lock::OnceLock<alloc::string::String>>::initialize<<std::sync::once_lock::OnceLock<alloc::string::String>>::get_or_init<public_typst_behavior::linnest_public_svg::{closure#0}>::{closure#0}, !>::{closure#0}>::{closure#0}
  241. 185.83 s gammaloop-nextest-clinnet> 5: <std::sys::sync::once::futex::Once>::call
  242. 185.83 s gammaloop-nextest-clinnet> 6: <std::sync::once_lock::OnceLock<alloc::string::String>>::initialize::<<std::sync::once_lock::OnceLock<alloc::string::String>>::get_or_init<public_typst_behavior::linnest_public_svg::{closure#0}>::{closure#0}, !>
  243. 185.83 s gammaloop-nextest-clinnet> 7: <public_typst_behavior::public_linnest_edge_styles_skip_fallbacks::{closure#0} as core::ops::function::FnOnce<()>>::call_once
  244. 185.83 s gammaloop-nextest-clinnet> note: Some details are omitted, run with `RUST_BACKTRACE=full` for a verbose backtrace.
  245. 185.83 s gammaloop-nextest-clinnet>
  246. 185.83 s gammaloop-nextest-clinnet> FAIL [ 122.723s] (34/38) clinnet::public_typst_behavior public_linnest_momentum_layers_place_shafts_and_labels
  247. 185.83 s gammaloop-nextest-clinnet> stdout ---
  248. 185.83 s gammaloop-nextest-clinnet>
  249. 185.83 s gammaloop-nextest-clinnet> running 1 test
  250. 185.83 s gammaloop-nextest-clinnet> test public_linnest_momentum_layers_place_shafts_and_labels has been running for over 60 seconds
  251. 185.83 s gammaloop-nextest-clinnet> test public_linnest_momentum_layers_place_shafts_and_labels ... FAILED
  252. 185.83 s gammaloop-nextest-clinnet>
  253. 185.83 s gammaloop-nextest-clinnet> failures:
  254. 185.83 s gammaloop-nextest-clinnet>
  255. 185.83 s gammaloop-nextest-clinnet> failures:
  256. 185.83 s gammaloop-nextest-clinnet> public_linnest_momentum_layers_place_shafts_and_labels
  257. 185.83 s gammaloop-nextest-clinnet>
  258. 185.83 s gammaloop-nextest-clinnet> test result: FAILED. 0 passed; 1 failed; 0 ignored; 0 measured; 17 filtered out; finished in 122.71s
  259. 185.83 s gammaloop-nextest-clinnet>
  260. 185.83 s gammaloop-nextest-clinnet> stderr ---
  261. 185.83 s gammaloop-nextest-clinnet>
  262. 185.83 s gammaloop-nextest-clinnet> thread 'public_linnest_momentum_layers_place_shafts_and_labels' (283) panicked at crates/clinnet/tests/public_typst_behavior.rs:81:55:
  263. 185.83 s gammaloop-nextest-clinnet> called `Result::unwrap()` on an `Err` value: typst failed while compiling template /build/.tmpv1f5m6/.clinnet/templates/linnest-public-behavior.svg
  264. 185.83 s gammaloop-nextest-clinnet>
  265. 185.83 s gammaloop-nextest-clinnet> Command executed:
  266. 185.83 s gammaloop-nextest-clinnet> "typst" "c" "/build/.tmpv1f5m6/.clinnet/templates/linnest-public-behavior.typ" "/build/.tmpv1f5m6/.clinnet/templates/linnest-public-behavior.svg" "--root" "/build/.tmpv1f5m6/.clinnet/templates"
  267. 185.83 s gammaloop-nextest-clinnet>
  268. 185.83 s gammaloop-nextest-clinnet> Typst stdout:
  269. 185.83 s gammaloop-nextest-clinnet>
  270. 185.83 s gammaloop-nextest-clinnet>
  271. 185.83 s gammaloop-nextest-clinnet> Typst stderr:
  272. 185.83 s gammaloop-nextest-clinnet>
  273. 185.83 s gammaloop-nextest-clinnet>
  274. 185.83 s gammaloop-nextest-clinnet> Location:
  275. 185.83 s gammaloop-nextest-clinnet> crates/clinnet/src/lib.rs:741:13
  276. 185.83 s gammaloop-nextest-clinnet> stack backtrace:
  277. 185.83 s gammaloop-nextest-clinnet> 0: __rustc::rust_begin_unwind
  278. 185.83 s gammaloop-nextest-clinnet> 1: core::panicking::panic_fmt
  279. 185.83 s gammaloop-nextest-clinnet> 2: core::result::unwrap_failed
  280. 185.83 s gammaloop-nextest-clinnet> 3: public_typst_behavior::render
  281. 185.83 s gammaloop-nextest-clinnet> 4: <std::sync::once::Once>::call_once_force::<<std::sync::once_lock::OnceLock<alloc::string::String>>::initialize<<std::sync::once_lock::OnceLock<alloc::string::String>>::get_or_init<public_typst_behavior::linnest_public_svg::{closure#0}>::{closure#0}, !>::{closure#0}>::{closure#0}
  282. 185.83 s gammaloop-nextest-clinnet> 5: <std::sys::sync::once::futex::Once>::call
  283. 185.83 s gammaloop-nextest-clinnet> 6: <std::sync::once_lock::OnceLock<alloc::string::String>>::initialize::<<std::sync::once_lock::OnceLock<alloc::string::String>>::get_or_init<public_typst_behavior::linnest_public_svg::{closure#0}>::{closure#0}, !>
  284. 185.83 s gammaloop-nextest-clinnet> 7: <public_typst_behavior::public_linnest_momentum_layers_place_shafts_and_labels::{closure#0} as core::ops::function::FnOnce<()>>::call_once
  285. 185.83 s gammaloop-nextest-clinnet> note: Some details are omitted, run with `RUST_BACKTRACE=full` for a verbose backtrace.
  286. 185.83 s gammaloop-nextest-clinnet>
  287. 185.84 s gammaloop-nextest-clinnet> error: test run failed
  288. 185.91 s gammaloop-nextest-clinnet>
  289. 185.91 s gammaloop-nextest-clinnet> ========== nextest test summary ==========
  290. 185.91 s gammaloop-nextest-clinnet> report: target/nextest/ci_gammaloop/junit.xml
  291. 185.91 s gammaloop-nextest-clinnet> tests: 38, failures: 3, errors: 0
  292. 185.91 s gammaloop-nextest-clinnet>
  293. 185.91 s gammaloop-nextest-clinnet> 1. clinnet::public_typst_behavior::public_linnest_arrow_shafts_and_crossing_gaps
  294. 185.91 s gammaloop-nextest-clinnet> failure: test failure with exit code 101
  295. 185.91 s gammaloop-nextest-clinnet> thread 'public_linnest_arrow_shafts_and_crossing_gaps' (258) panicked at crates/clinnet/tests/public_typst_behavior.rs:81:55:
  296. 185.91 s gammaloop-nextest-clinnet> called `Result::unwrap()` on an `Err` value: typst failed while compiling template /build/.tmpc2nhYk/.clinnet/templates/linnest-public-behavior.svg
  297. 185.91 s gammaloop-nextest-clinnet>
  298. 185.91 s gammaloop-nextest-clinnet> Command executed:
  299. 185.91 s gammaloop-nextest-clinnet> "typst" "c" "/build/.tmpc2nhYk/.clinnet/templates/linnest-public-behavior.typ" "/build/.tmpc2nhYk/.clinnet/templates/linnest-public-behavior.svg" "--root" "/build/.tmpc2nhYk/.clinnet/templates"
  300. 185.91 s gammaloop-nextest-clinnet>
  301. 185.91 s gammaloop-nextest-clinnet> Typst stdout:
  302. 185.91 s gammaloop-nextest-clinnet>
  303. 185.91 s gammaloop-nextest-clinnet>
  304. 185.91 s gammaloop-nextest-clinnet> Typst stderr:
  305. 185.91 s gammaloop-nextest-clinnet>
  306. 185.91 s gammaloop-nextest-clinnet>
  307. 185.91 s gammaloop-nextest-clinnet> Location:
  308. 185.91 s gammaloop-nextest-clinnet> crates/clinnet/src/lib.rs:741:13
  309. 185.91 s gammaloop-nextest-clinnet> stack backtrace:
  310. 185.91 s gammaloop-nextest-clinnet> 0: __rustc::rust_begin_unwind
  311. 185.91 s gammaloop-nextest-clinnet> 1: core::panicking::panic_fmt
  312. 185.91 s gammaloop-nextest-clinnet> 2: core::result::unwrap_failed
  313. 185.91 s gammaloop-nextest-clinnet> 3: public_typst_behavior::render
  314. 185.91 s gammaloop-nextest-clinnet> 4: <std::sync::once::Once>::call_once_force::<<std::sync::once_lock::OnceLock<alloc::string::String>>::initialize<<std::sync::once_lock::OnceLock<alloc::string::String>>::get_or_init<public_typst_behavior::linnest_public_svg::{closure#0}>::{closure#0}, !>::{closure#0}>::{closure#0}
  315. 185.91 s gammaloop-nextest-clinnet> 5: <std::sys::sync::once::futex::Once>::call
  316. 185.91 s gammaloop-nextest-clinnet> 6: <std::sync::once_lock::OnceLock<alloc::string::String>>::initialize::<<std::sync::once_lock::OnceLock<alloc::string::String>>::get_or_init<public_typst_behavior::linnest_public_svg::{closure#0}>::{closure#0}, !>
  317. 185.91 s gammaloop-nextest-clinnet> 7: <public_typst_behavior::public_linnest_arrow_shafts_and_crossing_gaps::{closure#0} as core::ops::function::FnOnce<()>>::call_once
  318. 185.91 s gammaloop-nextest-clinnet> note: Some details are omitted, run with `RUST_BACKTRACE=full` for a verbose backtrace.
  319. 185.91 s gammaloop-nextest-clinnet> system-out
  320. 185.91 s gammaloop-nextest-clinnet> running 1 test
  321. 185.91 s gammaloop-nextest-clinnet> test public_linnest_arrow_shafts_and_crossing_gaps has been running for over 60 seconds
  322. 185.91 s gammaloop-nextest-clinnet> test public_linnest_arrow_shafts_and_crossing_gaps ... FAILED
  323. 185.91 s gammaloop-nextest-clinnet>
  324. 185.91 s gammaloop-nextest-clinnet> failures:
  325. 185.91 s gammaloop-nextest-clinnet>
  326. 185.91 s gammaloop-nextest-clinnet> failures:
  327. 185.91 s gammaloop-nextest-clinnet> public_linnest_arrow_shafts_and_crossing_gaps
  328. 185.91 s gammaloop-nextest-clinnet>
  329. 185.91 s gammaloop-nextest-clinnet> test result: FAILED. 0 passed; 1 failed; 0 ignored; 0 measured; 17 filtered out; finished in 68.15s
  330. 185.91 s gammaloop-nextest-clinnet> system-err
  331. 185.91 s gammaloop-nextest-clinnet> thread 'public_linnest_arrow_shafts_and_crossing_gaps' (258) panicked at crates/clinnet/tests/public_typst_behavior.rs:81:55:
  332. 185.91 s gammaloop-nextest-clinnet> called `Result::unwrap()` on an `Err` value: typst failed while compiling template /build/.tmpc2nhYk/.clinnet/templates/linnest-public-behavior.svg
  333. 185.91 s gammaloop-nextest-clinnet>
  334. 185.91 s gammaloop-nextest-clinnet> Command executed:
  335. 185.91 s gammaloop-nextest-clinnet> "typst" "c" "/build/.tmpc2nhYk/.clinnet/templates/linnest-public-behavior.typ" "/build/.tmpc2nhYk/.clinnet/templates/linnest-public-behavior.svg" "--root" "/build/.tmpc2nhYk/.clinnet/templates"
  336. 185.91 s gammaloop-nextest-clinnet>
  337. 185.91 s gammaloop-nextest-clinnet> Typst stdout:
  338. 185.91 s gammaloop-nextest-clinnet>
  339. 185.91 s gammaloop-nextest-clinnet>
  340. 185.91 s gammaloop-nextest-clinnet> Typst stderr:
  341. 185.91 s gammaloop-nextest-clinnet>
  342. 185.91 s gammaloop-nextest-clinnet>
  343. 185.91 s gammaloop-nextest-clinnet> Location:
  344. 185.91 s gammaloop-nextest-clinnet> crates/clinnet/src/lib.rs:741:13
  345. 185.91 s gammaloop-nextest-clinnet> stack backtrace:
  346. 185.91 s gammaloop-nextest-clinnet> 0: __rustc::rust_begin_unwind
  347. 185.91 s gammaloop-nextest-clinnet> 1: core::panicking::panic_fmt
  348. 185.91 s gammaloop-nextest-clinnet> 2: core::result::unwrap_failed
  349. 185.91 s gammaloop-nextest-clinnet> 3: public_typst_behavior::render
  350. 185.91 s gammaloop-nextest-clinnet> 4: <std::sync::once::Once>::call_once_force::<<std::sync::once_lock::OnceLock<alloc::string::String>>::initialize<<std::sync::once_lock::OnceLock<alloc::string::String>>::get_or_init<public_typst_behavior::linnest_public_svg::{closure#0}>::{closure#0}, !>::{closure#0}>::{closure#0}
  351. 185.91 s gammaloop-nextest-clinnet> 5: <std::sys::sync::once::futex::Once>::call
  352. 185.91 s gammaloop-nextest-clinnet> 6: <std::sync::once_lock::OnceLock<alloc::string::String>>::initialize::<<std::sync::once_lock::OnceLock<alloc::string::String>>::get_or_init<public_typst_behavior::linnest_public_svg::{closure#0}>::{closure#0}, !>
  353. 185.91 s gammaloop-nextest-clinnet> 7: <public_typst_behavior::public_linnest_arrow_shafts_and_crossing_gaps::{closure#0} as core::ops::function::FnOnce<()>>::call_once
  354. 185.91 s gammaloop-nextest-clinnet> note: Some details are omitted, run with `RUST_BACKTRACE=full` for a verbose backtrace.
  355. 185.91 s gammaloop-nextest-clinnet>
  356. 185.91 s gammaloop-nextest-clinnet> 2. clinnet::public_typst_behavior::public_linnest_edge_styles_skip_fallbacks
  357. 185.91 s gammaloop-nextest-clinnet> failure: test failure with exit code 101
  358. 185.91 s gammaloop-nextest-clinnet> thread 'public_linnest_edge_styles_skip_fallbacks' (277) panicked at crates/clinnet/tests/public_typst_behavior.rs:81:55:
  359. 185.91 s gammaloop-nextest-clinnet> called `Result::unwrap()` on an `Err` value: typst failed while compiling template /build/.tmpDBd4KZ/.clinnet/templates/linnest-public-behavior.svg
  360. 185.91 s gammaloop-nextest-clinnet>
  361. 185.91 s gammaloop-nextest-clinnet> Command executed:
  362. 185.91 s gammaloop-nextest-clinnet> "typst" "c" "/build/.tmpDBd4KZ/.clinnet/templates/linnest-public-behavior.typ" "/build/.tmpDBd4KZ/.clinnet/templates/linnest-public-behavior.svg" "--root" "/build/.tmpDBd4KZ/.clinnet/templates"
  363. 185.91 s gammaloop-nextest-clinnet>
  364. 185.91 s gammaloop-nextest-clinnet> Typst stdout:
  365. 185.91 s gammaloop-nextest-clinnet>
  366. 185.91 s gammaloop-nextest-clinnet>
  367. 185.91 s gammaloop-nextest-clinnet> Typst stderr:
  368. 185.91 s gammaloop-nextest-clinnet>
  369. 185.91 s gammaloop-nextest-clinnet>
  370. 185.91 s gammaloop-nextest-clinnet> Location:
  371. 185.91 s gammaloop-nextest-clinnet> crates/clinnet/src/lib.rs:741:13
  372. 185.91 s gammaloop-nextest-clinnet> stack backtrace:
  373. 185.91 s gammaloop-nextest-clinnet> 0: __rustc::rust_begin_unwind
  374. 185.91 s gammaloop-nextest-clinnet> 1: core::panicking::panic_fmt
  375. 185.91 s gammaloop-nextest-clinnet> 2: core::result::unwrap_failed
  376. 185.91 s gammaloop-nextest-clinnet> 3: public_typst_behavior::render
  377. 185.91 s gammaloop-nextest-clinnet> 4: <std::sync::once::Once>::call_once_force::<<std::sync::once_lock::OnceLock<alloc::string::String>>::initialize<<std::sync::once_lock::OnceLock<alloc::string::String>>::get_or_init<public_typst_behavior::linnest_public_svg::{closure#0}>::{closure#0}, !>::{closure#0}>::{closure#0}
  378. 185.91 s gammaloop-nextest-clinnet> 5: <std::sys::sync::once::futex::Once>::call
  379. 185.91 s gammaloop-nextest-clinnet> 6: <std::sync::once_lock::OnceLock<alloc::string::String>>::initialize::<<std::sync::once_lock::OnceLock<alloc::string::String>>::get_or_init<public_typst_behavior::linnest_public_svg::{closure#0}>::{closure#0}, !>
  380. 185.91 s gammaloop-nextest-clinnet> 7: <public_typst_behavior::public_linnest_edge_styles_skip_fallbacks::{closure#0} as core::ops::function::FnOnce<()>>::call_once
  381. 185.91 s gammaloop-nextest-clinnet> note: Some details are omitted, run with `RUST_BACKTRACE=full` for a verbose backtrace.
  382. 185.91 s gammaloop-nextest-clinnet> system-out
  383. 185.91 s gammaloop-nextest-clinnet> running 1 test
  384. 185.91 s gammaloop-nextest-clinnet> test public_linnest_edge_styles_skip_fallbacks has been running for over 60 seconds
  385. 185.91 s gammaloop-nextest-clinnet> test public_linnest_edge_styles_skip_fallbacks ... FAILED
  386. 185.91 s gammaloop-nextest-clinnet>
  387. 185.91 s gammaloop-nextest-clinnet> failures:
  388. 185.91 s gammaloop-nextest-clinnet>
  389. 185.91 s gammaloop-nextest-clinnet> failures:
  390. 185.91 s gammaloop-nextest-clinnet> public_linnest_edge_styles_skip_fallbacks
  391. 185.91 s gammaloop-nextest-clinnet>
  392. 185.91 s gammaloop-nextest-clinnet> test result: FAILED. 0 passed; 1 failed; 0 ignored; 0 measured; 17 filtered out; finished in 70.98s
  393. 185.91 s gammaloop-nextest-clinnet> system-err
  394. 185.91 s gammaloop-nextest-clinnet> thread 'public_linnest_edge_styles_skip_fallbacks' (277) panicked at crates/clinnet/tests/public_typst_behavior.rs:81:55:
  395. 185.91 s gammaloop-nextest-clinnet> called `Result::unwrap()` on an `Err` value: typst failed while compiling template /build/.tmpDBd4KZ/.clinnet/templates/linnest-public-behavior.svg
  396. 185.91 s gammaloop-nextest-clinnet>
  397. 185.91 s gammaloop-nextest-clinnet> Command executed:
  398. 185.91 s gammaloop-nextest-clinnet> "typst" "c" "/build/.tmpDBd4KZ/.clinnet/templates/linnest-public-behavior.typ" "/build/.tmpDBd4KZ/.clinnet/templates/linnest-public-behavior.svg" "--root" "/build/.tmpDBd4KZ/.clinnet/templates"
  399. 185.91 s gammaloop-nextest-clinnet>
  400. 185.91 s gammaloop-nextest-clinnet> Typst stdout:
  401. 185.91 s gammaloop-nextest-clinnet>
  402. 185.91 s gammaloop-nextest-clinnet>
  403. 185.91 s gammaloop-nextest-clinnet> Typst stderr:
  404. 185.91 s gammaloop-nextest-clinnet>
  405. 185.91 s gammaloop-nextest-clinnet>
  406. 185.91 s gammaloop-nextest-clinnet> Location:
  407. 185.91 s gammaloop-nextest-clinnet> crates/clinnet/src/lib.rs:741:13
  408. 185.91 s gammaloop-nextest-clinnet> stack backtrace:
  409. 185.91 s gammaloop-nextest-clinnet> 0: __rustc::rust_begin_unwind
  410. 185.91 s gammaloop-nextest-clinnet> 1: core::panicking::panic_fmt
  411. 185.91 s gammaloop-nextest-clinnet> 2: core::result::unwrap_failed
  412. 185.91 s gammaloop-nextest-clinnet> 3: public_typst_behavior::render
  413. 185.91 s gammaloop-nextest-clinnet> 4: <std::sync::once::Once>::call_once_force::<<std::sync::once_lock::OnceLock<alloc::string::String>>::initialize<<std::sync::once_lock::OnceLock<alloc::string::String>>::get_or_init<public_typst_behavior::linnest_public_svg::{closure#0}>::{closure#0}, !>::{closure#0}>::{closure#0}
  414. 185.91 s gammaloop-nextest-clinnet> 5: <std::sys::sync::once::futex::Once>::call
  415. 185.91 s gammaloop-nextest-clinnet> 6: <std::sync::once_lock::OnceLock<alloc::string::String>>::initialize::<<std::sync::once_lock::OnceLock<alloc::string::String>>::get_or_init<public_typst_behavior::linnest_public_svg::{closure#0}>::{closure#0}, !>
  416. 185.91 s gammaloop-nextest-clinnet> 7: <public_typst_behavior::public_linnest_edge_styles_skip_fallbacks::{closure#0} as core::ops::function::FnOnce<()>>::call_once
  417. 185.91 s gammaloop-nextest-clinnet> note: Some details are omitted, run with `RUST_BACKTRACE=full` for a verbose backtrace.
  418. 185.91 s gammaloop-nextest-clinnet>
  419. 185.91 s gammaloop-nextest-clinnet> 3. clinnet::public_typst_behavior::public_linnest_momentum_layers_place_shafts_and_labels
  420. 185.91 s gammaloop-nextest-clinnet> failure: test failure with exit code 101
  421. 185.91 s gammaloop-nextest-clinnet> thread 'public_linnest_momentum_layers_place_shafts_and_labels' (283) panicked at crates/clinnet/tests/public_typst_behavior.rs:81:55:
  422. 185.91 s gammaloop-nextest-clinnet> called `Result::unwrap()` on an `Err` value: typst failed while compiling template /build/.tmpv1f5m6/.clinnet/templates/linnest-public-behavior.svg
  423. 185.91 s gammaloop-nextest-clinnet>
  424. 185.91 s gammaloop-nextest-clinnet> Command executed:
  425. 185.91 s gammaloop-nextest-clinnet> "typst" "c" "/build/.tmpv1f5m6/.clinnet/templates/linnest-public-behavior.typ" "/build/.tmpv1f5m6/.clinnet/templates/linnest-public-behavior.svg" "--root" "/build/.tmpv1f5m6/.clinnet/templates"
  426. 185.91 s gammaloop-nextest-clinnet>
  427. 185.91 s gammaloop-nextest-clinnet> Typst stdout:
  428. 185.91 s gammaloop-nextest-clinnet>
  429. 185.91 s gammaloop-nextest-clinnet>
  430. 185.91 s gammaloop-nextest-clinnet> Typst stderr:
  431. 185.91 s gammaloop-nextest-clinnet>
  432. 185.91 s gammaloop-nextest-clinnet>
  433. 185.91 s gammaloop-nextest-clinnet> Location:
  434. 185.91 s gammaloop-nextest-clinnet> crates/clinnet/src/lib.rs:741:13
  435. 185.91 s gammaloop-nextest-clinnet> stack backtrace:
  436. 185.91 s gammaloop-nextest-clinnet> 0: __rustc::rust_begin_unwind
  437. 185.91 s gammaloop-nextest-clinnet> 1: core::panicking::panic_fmt
  438. 185.91 s gammaloop-nextest-clinnet> 2: core::result::unwrap_failed
  439. 185.91 s gammaloop-nextest-clinnet> 3: public_typst_behavior::render
  440. 185.91 s gammaloop-nextest-clinnet> 4: <std::sync::once::Once>::call_once_force::<<std::sync::once_lock::OnceLock<alloc::string::String>>::initialize<<std::sync::once_lock::OnceLock<alloc::string::String>>::get_or_init<public_typst_behavior::linnest_public_svg::{closure#0}>::{closure#0}, !>::{closure#0}>::{closure#0}
  441. 185.91 s gammaloop-nextest-clinnet> 5: <std::sys::sync::once::futex::Once>::call
  442. 185.91 s gammaloop-nextest-clinnet> 6: <std::sync::once_lock::OnceLock<alloc::string::String>>::initialize::<<std::sync::once_lock::OnceLock<alloc::string::String>>::get_or_init<public_typst_behavior::linnest_public_svg::{closure#0}>::{closure#0}, !>
  443. 185.91 s gammaloop-nextest-clinnet> 7: <public_typst_behavior::public_linnest_momentum_layers_place_shafts_and_labels::{closure#0} as core::ops::function::FnOnce<()>>::call_once
  444. 185.91 s gammaloop-nextest-clinnet> note: Some details are omitted, run with `RUST_BACKTRACE=full` for a verbose backtrace.
  445. 185.91 s gammaloop-nextest-clinnet> system-out
  446. 185.91 s gammaloop-nextest-clinnet> running 1 test
  447. 185.91 s gammaloop-nextest-clinnet> test public_linnest_momentum_layers_place_shafts_and_labels has been running for over 60 seconds
  448. 185.91 s gammaloop-nextest-clinnet> test public_linnest_momentum_layers_place_shafts_and_labels ... FAILED
  449. 185.91 s gammaloop-nextest-clinnet>
  450. 185.91 s gammaloop-nextest-clinnet> failures:
  451. 185.91 s gammaloop-nextest-clinnet>
  452. 185.91 s gammaloop-nextest-clinnet> failures:
  453. 185.91 s gammaloop-nextest-clinnet> public_linnest_momentum_layers_place_shafts_and_labels
  454. 185.91 s gammaloop-nextest-clinnet>
  455. 185.91 s gammaloop-nextest-clinnet> test result: FAILED. 0 passed; 1 failed; 0 ignored; 0 measured; 17 filtered out; finished in 122.71s
  456. 185.91 s gammaloop-nextest-clinnet> system-err
  457. 185.91 s gammaloop-nextest-clinnet> thread 'public_linnest_momentum_layers_place_shafts_and_labels' (283) panicked at crates/clinnet/tests/public_typst_behavior.rs:81:55:
  458. 185.91 s gammaloop-nextest-clinnet> called `Result::unwrap()` on an `Err` value: typst failed while compiling template /build/.tmpv1f5m6/.clinnet/templates/linnest-public-behavior.svg
  459. 185.91 s gammaloop-nextest-clinnet>
  460. 185.91 s gammaloop-nextest-clinnet> Command executed:
  461. 185.91 s gammaloop-nextest-clinnet> "typst" "c" "/build/.tmpv1f5m6/.clinnet/templates/linnest-public-behavior.typ" "/build/.tmpv1f5m6/.clinnet/templates/linnest-public-behavior.svg" "--root" "/build/.tmpv1f5m6/.clinnet/templates"
  462. 185.91 s gammaloop-nextest-clinnet>
  463. 185.91 s gammaloop-nextest-clinnet> Typst stdout:
  464. 185.91 s gammaloop-nextest-clinnet>
  465. 185.91 s gammaloop-nextest-clinnet>
  466. 185.91 s gammaloop-nextest-clinnet> Typst stderr:
  467. 185.91 s gammaloop-nextest-clinnet>
  468. 185.91 s gammaloop-nextest-clinnet>
  469. 185.91 s gammaloop-nextest-clinnet> Location:
  470. 185.91 s gammaloop-nextest-clinnet> crates/clinnet/src/lib.rs:741:13
  471. 185.91 s gammaloop-nextest-clinnet> stack backtrace:
  472. 185.91 s gammaloop-nextest-clinnet> 0: __rustc::rust_begin_unwind
  473. 185.91 s gammaloop-nextest-clinnet> 1: core::panicking::panic_fmt
  474. 185.91 s gammaloop-nextest-clinnet> 2: core::result::unwrap_failed
  475. 185.91 s gammaloop-nextest-clinnet> 3: public_typst_behavior::render
  476. 185.91 s gammaloop-nextest-clinnet> 4: <std::sync::once::Once>::call_once_force::<<std::sync::once_lock::OnceLock<alloc::string::String>>::initialize<<std::sync::once_lock::OnceLock<alloc::string::String>>::get_or_init<public_typst_behavior::linnest_public_svg::{closure#0}>::{closure#0}, !>::{closure#0}>::{closure#0}
  477. 185.91 s gammaloop-nextest-clinnet> 5: <std::sys::sync::once::futex::Once>::call
  478. 185.91 s gammaloop-nextest-clinnet> 6: <std::sync::once_lock::OnceLock<alloc::string::String>>::initialize::<<std::sync::once_lock::OnceLock<alloc::string::String>>::get_or_init<public_typst_behavior::linnest_public_svg::{closure#0}>::{closure#0}, !>
  479. 185.91 s gammaloop-nextest-clinnet> 7: <public_typst_behavior::public_linnest_momentum_layers_place_shafts_and_labels::{closure#0} as core::ops::function::FnOnce<()>>::call_once
  480. 185.91 s gammaloop-nextest-clinnet> note: Some details are omitted, run with `RUST_BACKTRACE=full` for a verbose backtrace.
  481. 185.91 s gammaloop-nextest-clinnet> =========================================
  482. 186.03 s [0 built (1 failed)]error: Cannot build '/nix/store/4pqspwvh8pi9s2vg9g6mfsggpl9ynwzx-gammaloop-nextest-clinnet.drv'.
  483. 186.03 s Reason: builder failed with exit code 100.
  484. 186.03 s Output paths:
  485. 186.03 s /nix/store/v9zka7gxdrym1pq03r0i4w2q43fgdwcq-gammaloop-nextest-clinnet
  486. 186.03 s Last 449 log lines:
  487. 186.03 s > Nextest worker budget: 16
  488. 186.03 s > Extracting 4 binaries (including 1 non-test binary), 1 build script output directory, and 1 linked path to /build/source
  489. 186.03 s > Extracted 16 files to /build/source in 0.09s
  490. 186.03 s > ------------
  491. 186.03 s > Nextest run ID 6244babb-ea3c-4cec-a105-b786d8602a20 with nextest profile: ci_gammaloop
  492. 186.03 s > Starting 38 tests across 3 binaries
  493. 186.03 s > FAIL [ 68.163s] (32/38) clinnet::public_typst_behavior public_linnest_arrow_shafts_and_crossing_gaps
  494. 186.03 s > stdout ---
  495. 186.03 s >
  496. 186.03 s > running 1 test
  497. 186.03 s > test public_linnest_arrow_shafts_and_crossing_gaps has been running for over 60 seconds
  498. 186.03 s > test public_linnest_arrow_shafts_and_crossing_gaps ... FAILED
  499. 186.03 s >
  500. 186.03 s > failures:
  501. 186.03 s >
  502. 186.03 s > failures:
  503. 186.03 s > public_linnest_arrow_shafts_and_crossing_gaps
  504. 186.03 s >
  505. 186.03 s > test result: FAILED. 0 passed; 1 failed; 0 ignored; 0 measured; 17 filtered out; finished in 68.15s
  506. 186.03 s >
  507. 186.03 s > stderr ---
  508. 186.03 s >
  509. 186.03 s > thread 'public_linnest_arrow_shafts_and_crossing_gaps' (258) panicked at crates/clinnet/tests/public_typst_behavior.rs:81:55:
  510. 186.03 s > called `Result::unwrap()` on an `Err` value: typst failed while compiling template /build/.tmpc2nhYk/.clinnet/templates/linnest-public-behavior.svg
  511. 186.03 s >
  512. 186.03 s > Command executed:
  513. 186.03 s > "typst" "c" "/build/.tmpc2nhYk/.clinnet/templates/linnest-public-behavior.typ" "/build/.tmpc2nhYk/.clinnet/templates/linnest-public-behavior.svg" "--root" "/build/.tmpc2nhYk/.clinnet/templates"
  514. 186.03 s >
  515. 186.03 s > Typst stdout:
  516. 186.03 s >
  517. 186.03 s >
  518. 186.03 s > Typst stderr:
  519. 186.03 s >
  520. 186.03 s >
  521. 186.03 s > Location:
  522. 186.03 s > crates/clinnet/src/lib.rs:741:13
  523. 186.03 s > stack backtrace:
  524. 186.03 s > 0: __rustc::rust_begin_unwind
  525. 186.03 s > 1: core::panicking::panic_fmt
  526. 186.03 s > 2: core::result::unwrap_failed
  527. 186.03 s > 3: public_typst_behavior::render
  528. 186.03 s > 4: <std::sync::once::Once>::call_once_force::<<std::sync::once_lock::OnceLock<alloc::string::String>>::initialize<<std::sync::once_lock::OnceLock<alloc::string::String>>::get_or_init<public_typst_behavior::linnest_public_svg::{closure#0}>::{closure#0}, !>::{closure#0}>::{closure#0}
  529. 186.03 s > 5: <std::sys::sync::once::futex::Once>::call
  530. 186.03 s > 6: <std::sync::once_lock::OnceLock<alloc::string::String>>::initialize::<<std::sync::once_lock::OnceLock<alloc::string::String>>::get_or_init<public_typst_behavior::linnest_public_svg::{closure#0}>::{closure#0}, !>
  531. 186.03 s > 7: <public_typst_behavior::public_linnest_arrow_shafts_and_crossing_gaps::{closure#0} as core::ops::function::FnOnce<()>>::call_once
  532. 186.03 s > note: Some details are omitted, run with `RUST_BACKTRACE=full` for a verbose backtrace.
  533. 186.03 s >
  534. 186.03 s > FAIL [ 70.989s] (33/38) clinnet::public_typst_behavior public_linnest_edge_styles_skip_fallbacks
  535. 186.03 s > stdout ---
  536. 186.03 s >
  537. 186.03 s > running 1 test
  538. 186.03 s > test public_linnest_edge_styles_skip_fallbacks has been running for over 60 seconds
  539. 186.03 s > test public_linnest_edge_styles_skip_fallbacks ... FAILED
  540. 186.03 s >
  541. 186.03 s > failures:
  542. 186.03 s >
  543. 186.03 s > failures:
  544. 186.03 s > public_linnest_edge_styles_skip_fallbacks
  545. 186.03 s >
  546. 186.03 s > test result: FAILED. 0 passed; 1 failed; 0 ignored; 0 measured; 17 filtered out; finished in 70.98s
  547. 186.03 s >
  548. 186.03 s > stderr ---
  549. 186.03 s >
  550. 186.03 s > thread 'public_linnest_edge_styles_skip_fallbacks' (277) panicked at crates/clinnet/tests/public_typst_behavior.rs:81:55:
  551. 186.03 s > called `Result::unwrap()` on an `Err` value: typst failed while compiling template /build/.tmpDBd4KZ/.clinnet/templates/linnest-public-behavior.svg
  552. 186.03 s >
  553. 186.03 s > Command executed:
  554. 186.03 s > "typst" "c" "/build/.tmpDBd4KZ/.clinnet/templates/linnest-public-behavior.typ" "/build/.tmpDBd4KZ/.clinnet/templates/linnest-public-behavior.svg" "--root" "/build/.tmpDBd4KZ/.clinnet/templates"
  555. 186.03 s >
  556. 186.03 s > Typst stdout:
  557. 186.03 s >
  558. 186.03 s >
  559. 186.03 s > Typst stderr:
  560. 186.03 s >
  561. 186.03 s >
  562. 186.03 s > Location:
  563. 186.03 s > crates/clinnet/src/lib.rs:741:13
  564. 186.03 s > stack backtrace:
  565. 186.03 s > 0: __rustc::rust_begin_unwind
  566. 186.03 s > 1: core::panicking::panic_fmt
  567. 186.03 s > 2: core::result::unwrap_failed
  568. 186.03 s > 3: public_typst_behavior::render
  569. 186.03 s > 4: <std::sync::once::Once>::call_once_force::<<std::sync::once_lock::OnceLock<alloc::string::String>>::initialize<<std::sync::once_lock::OnceLock<alloc::string::String>>::get_or_init<public_typst_behavior::linnest_public_svg::{closure#0}>::{closure#0}, !>::{closure#0}>::{closure#0}
  570. 186.03 s > 5: <std::sys::sync::once::futex::Once>::call
  571. 186.03 s > 6: <std::sync::once_lock::OnceLock<alloc::string::String>>::initialize::<<std::sync::once_lock::OnceLock<alloc::string::String>>::get_or_init<public_typst_behavior::linnest_public_svg::{closure#0}>::{closure#0}, !>
  572. 186.03 s > 7: <public_typst_behavior::public_linnest_edge_styles_skip_fallbacks::{closure#0} as core::ops::function::FnOnce<()>>::call_once
  573. 186.03 s > note: Some details are omitted, run with `RUST_BACKTRACE=full` for a verbose backtrace.
  574. 186.03 s >
  575. 186.03 s > FAIL [ 122.723s] (34/38) clinnet::public_typst_behavior public_linnest_momentum_layers_place_shafts_and_labels
  576. 186.03 s > stdout ---
  577. 186.03 s >
  578. 186.03 s > running 1 test
  579. 186.03 s > test public_linnest_momentum_layers_place_shafts_and_labels has been running for over 60 seconds
  580. 186.03 s > test public_linnest_momentum_layers_place_shafts_and_labels ... FAILED
  581. 186.03 s >
  582. 186.03 s > failures:
  583. 186.03 s >
  584. 186.03 s > failures:
  585. 186.03 s > public_linnest_momentum_layers_place_shafts_and_labels
  586. 186.03 s >
  587. 186.03 s > test result: FAILED. 0 passed; 1 failed; 0 ignored; 0 measured; 17 filtered out; finished in 122.71s
  588. 186.03 s >
  589. 186.03 s > stderr ---
  590. 186.03 s >
  591. 186.03 s > thread 'public_linnest_momentum_layers_place_shafts_and_labels' (283) panicked at crates/clinnet/tests/public_typst_behavior.rs:81:55:
  592. 186.03 s > called `Result::unwrap()` on an `Err` value: typst failed while compiling template /build/.tmpv1f5m6/.clinnet/templates/linnest-public-behavior.svg
  593. 186.03 s >
  594. 186.03 s > Command executed:
  595. 186.03 s > "typst" "c" "/build/.tmpv1f5m6/.clinnet/templates/linnest-public-behavior.typ" "/build/.tmpv1f5m6/.clinnet/templates/linnest-public-behavior.svg" "--root" "/build/.tmpv1f5m6/.clinnet/templates"
  596. 186.03 s >
  597. 186.03 s > Typst stdout:
  598. 186.03 s >
  599. 186.03 s >
  600. 186.03 s > Typst stderr:
  601. 186.03 s >
  602. 186.03 s >
  603. 186.03 s > Location:
  604. 186.03 s > crates/clinnet/src/lib.rs:741:13
  605. 186.03 s > stack backtrace:
  606. 186.03 s > 0: __rustc::rust_begin_unwind
  607. 186.03 s > 1: core::panicking::panic_fmt
  608. 186.03 s > 2: core::result::unwrap_failed
  609. 186.03 s > 3: public_typst_behavior::render
  610. 186.03 s > 4: <std::sync::once::Once>::call_once_force::<<std::sync::once_lock::OnceLock<alloc::string::String>>::initialize<<std::sync::once_lock::OnceLock<alloc::string::String>>::get_or_init<public_typst_behavior::linnest_public_svg::{closure#0}>::{closure#0}, !>::{closure#0}>::{closure#0}
  611. 186.03 s > 5: <std::sys::sync::once::futex::Once>::call
  612. 186.03 s > 6: <std::sync::once_lock::OnceLock<alloc::string::String>>::initialize::<<std::sync::once_lock::OnceLock<alloc::string::String>>::get_or_init<public_typst_behavior::linnest_public_svg::{closure#0}>::{closure#0}, !>
  613. 186.03 s > 7: <public_typst_behavior::public_linnest_momentum_layers_place_shafts_and_labels::{closure#0} as core::ops::function::FnOnce<()>>::call_once
  614. 186.03 s > note: Some details are omitted, run with `RUST_BACKTRACE=full` for a verbose backtrace.
  615. 186.03 s >
  616. 186.03 s > ------------
  617. 186.03 s > Summary [ 131.047s] 38 tests run: 35 passed (4 slow), 3 failed, 0 skipped
  618. 186.03 s > FAIL [ 68.163s] (32/38) clinnet::public_typst_behavior public_linnest_arrow_shafts_and_crossing_gaps
  619. 186.03 s > stdout ---
  620. 186.03 s >
  621. 186.03 s > running 1 test
  622. 186.03 s > test public_linnest_arrow_shafts_and_crossing_gaps has been running for over 60 seconds
  623. 186.03 s > test public_linnest_arrow_shafts_and_crossing_gaps ... FAILED
  624. 186.03 s >
  625. 186.03 s > failures:
  626. 186.03 s >
  627. 186.03 s > failures:
  628. 186.03 s > public_linnest_arrow_shafts_and_crossing_gaps
  629. 186.03 s >
  630. 186.03 s > test result: FAILED. 0 passed; 1 failed; 0 ignored; 0 measured; 17 filtered out; finished in 68.15s
  631. 186.03 s >
  632. 186.03 s > stderr ---
  633. 186.03 s >
  634. 186.03 s > thread 'public_linnest_arrow_shafts_and_crossing_gaps' (258) panicked at crates/clinnet/tests/public_typst_behavior.rs:81:55:
  635. 186.03 s > called `Result::unwrap()` on an `Err` value: typst failed while compiling template /build/.tmpc2nhYk/.clinnet/templates/linnest-public-behavior.svg
  636. 186.03 s >
  637. 186.03 s > Command executed:
  638. 186.03 s > "typst" "c" "/build/.tmpc2nhYk/.clinnet/templates/linnest-public-behavior.typ" "/build/.tmpc2nhYk/.clinnet/templates/linnest-public-behavior.svg" "--root" "/build/.tmpc2nhYk/.clinnet/templates"
  639. 186.03 s >
  640. 186.03 s > Typst stdout:
  641. 186.03 s >
  642. 186.03 s >
  643. 186.03 s > Typst stderr:
  644. 186.03 s >
  645. 186.03 s >
  646. 186.03 s > Location:
  647. 186.03 s > crates/clinnet/src/lib.rs:741:13
  648. 186.03 s > stack backtrace:
  649. 186.03 s > 0: __rustc::rust_begin_unwind
  650. 186.03 s > 1: core::panicking::panic_fmt
  651. 186.03 s > 2: core::result::unwrap_failed
  652. 186.03 s > 3: public_typst_behavior::render
  653. 186.03 s > 4: <std::sync::once::Once>::call_once_force::<<std::sync::once_lock::OnceLock<alloc::string::String>>::initialize<<std::sync::once_lock::OnceLock<alloc::string::String>>::get_or_init<public_typst_behavior::linnest_public_svg::{closure#0}>::{closure#0}, !>::{closure#0}>::{closure#0}
  654. 186.03 s > 5: <std::sys::sync::once::futex::Once>::call
  655. 186.03 s > 6: <std::sync::once_lock::OnceLock<alloc::string::String>>::initialize::<<std::sync::once_lock::OnceLock<alloc::string::String>>::get_or_init<public_typst_behavior::linnest_public_svg::{closure#0}>::{closure#0}, !>
  656. 186.03 s > 7: <public_typst_behavior::public_linnest_arrow_shafts_and_crossing_gaps::{closure#0} as core::ops::function::FnOnce<()>>::call_once
  657. 186.03 s > note: Some details are omitted, run with `RUST_BACKTRACE=full` for a verbose backtrace.
  658. 186.03 s >
  659. 186.03 s > FAIL [ 70.989s] (33/38) clinnet::public_typst_behavior public_linnest_edge_styles_skip_fallbacks
  660. 186.03 s > stdout ---
  661. 186.03 s >
  662. 186.03 s > running 1 test
  663. 186.03 s > test public_linnest_edge_styles_skip_fallbacks has been running for over 60 seconds
  664. 186.03 s > test public_linnest_edge_styles_skip_fallbacks ... FAILED
  665. 186.03 s >
  666. 186.03 s > failures:
  667. 186.03 s >
  668. 186.03 s > failures:
  669. 186.03 s > public_linnest_edge_styles_skip_fallbacks
  670. 186.03 s >
  671. 186.03 s > test result: FAILED. 0 passed; 1 failed; 0 ignored; 0 measured; 17 filtered out; finished in 70.98s
  672. 186.03 s >
  673. 186.03 s > stderr ---
  674. 186.03 s >
  675. 186.03 s > thread 'public_linnest_edge_styles_skip_fallbacks' (277) panicked at crates/clinnet/tests/public_typst_behavior.rs:81:55:
  676. 186.03 s > called `Result::unwrap()` on an `Err` value: typst failed while compiling template /build/.tmpDBd4KZ/.clinnet/templates/linnest-public-behavior.svg
  677. 186.03 s >
  678. 186.03 s > Command executed:
  679. 186.03 s > "typst" "c" "/build/.tmpDBd4KZ/.clinnet/templates/linnest-public-behavior.typ" "/build/.tmpDBd4KZ/.clinnet/templates/linnest-public-behavior.svg" "--root" "/build/.tmpDBd4KZ/.clinnet/templates"
  680. 186.03 s >
  681. 186.03 s > Typst stdout:
  682. 186.03 s >
  683. 186.03 s >
  684. 186.03 s > Typst stderr:
  685. 186.03 s >
  686. 186.03 s >
  687. 186.03 s > Location:
  688. 186.03 s > crates/clinnet/src/lib.rs:741:13
  689. 186.03 s > stack backtrace:
  690. 186.03 s > 0: __rustc::rust_begin_unwind
  691. 186.03 s > 1: core::panicking::panic_fmt
  692. 186.03 s > 2: core::result::unwrap_failed
  693. 186.03 s > 3: public_typst_behavior::render
  694. 186.03 s > 4: <std::sync::once::Once>::call_once_force::<<std::sync::once_lock::OnceLock<alloc::string::String>>::initialize<<std::sync::once_lock::OnceLock<alloc::string::String>>::get_or_init<public_typst_behavior::linnest_public_svg::{closure#0}>::{closure#0}, !>::{closure#0}>::{closure#0}
  695. 186.03 s > 5: <std::sys::sync::once::futex::Once>::call
  696. 186.03 s > 6: <std::sync::once_lock::OnceLock<alloc::string::String>>::initialize::<<std::sync::once_lock::OnceLock<alloc::string::String>>::get_or_init<public_typst_behavior::linnest_public_svg::{closure#0}>::{closure#0}, !>
  697. 186.03 s > 7: <public_typst_behavior::public_linnest_edge_styles_skip_fallbacks::{closure#0} as core::ops::function::FnOnce<()>>::call_once
  698. 186.03 s > note: Some details are omitted, run with `RUST_BACKTRACE=full` for a verbose backtrace.
  699. 186.03 s >
  700. 186.03 s > FAIL [ 122.723s] (34/38) clinnet::public_typst_behavior public_linnest_momentum_layers_place_shafts_and_labels
  701. 186.03 s > stdout ---
  702. 186.03 s >
  703. 186.03 s > running 1 test
  704. 186.03 s > test public_linnest_momentum_layers_place_shafts_and_labels has been running for over 60 seconds
  705. 186.03 s > test public_linnest_momentum_layers_place_shafts_and_labels ... FAILED
  706. 186.03 s >
  707. 186.03 s > failures:
  708. 186.03 s >
  709. 186.03 s > failures:
  710. 186.03 s > public_linnest_momentum_layers_place_shafts_and_labels
  711. 186.03 s >
  712. 186.03 s > test result: FAILED. 0 passed; 1 failed; 0 ignored; 0 measured; 17 filtered out; finished in 122.71s
  713. 186.03 s >
  714. 186.03 s > stderr ---
  715. 186.03 s >
  716. 186.03 s > thread 'public_linnest_momentum_layers_place_shafts_and_labels' (283) panicked at crates/clinnet/tests/public_typst_behavior.rs:81:55:
  717. 186.03 s > called `Result::unwrap()` on an `Err` value: typst failed while compiling template /build/.tmpv1f5m6/.clinnet/templates/linnest-public-behavior.svg
  718. 186.03 s >
  719. 186.03 s > Command executed:
  720. 186.03 s > "typst" "c" "/build/.tmpv1f5m6/.clinnet/templates/linnest-public-behavior.typ" "/build/.tmpv1f5m6/.clinnet/templates/linnest-public-behavior.svg" "--root" "/build/.tmpv1f5m6/.clinnet/templates"
  721. 186.03 s >
  722. 186.03 s > Typst stdout:
  723. 186.03 s >
  724. 186.03 s >
  725. 186.03 s > Typst stderr:
  726. 186.03 s >
  727. 186.03 s >
  728. 186.03 s > Location:
  729. 186.03 s > crates/clinnet/src/lib.rs:741:13
  730. 186.03 s > stack backtrace:
  731. 186.03 s > 0: __rustc::rust_begin_unwind
  732. 186.03 s > 1: core::panicking::panic_fmt
  733. 186.03 s > 2: core::result::unwrap_failed
  734. 186.03 s > 3: public_typst_behavior::render
  735. 186.03 s > 4: <std::sync::once::Once>::call_once_force::<<std::sync::once_lock::OnceLock<alloc::string::String>>::initialize<<std::sync::once_lock::OnceLock<alloc::string::String>>::get_or_init<public_typst_behavior::linnest_public_svg::{closure#0}>::{closure#0}, !>::{closure#0}>::{closure#0}
  736. 186.03 s > 5: <std::sys::sync::once::futex::Once>::call
  737. 186.03 s > 6: <std::sync::once_lock::OnceLock<alloc::string::String>>::initialize::<<std::sync::once_lock::OnceLock<alloc::string::String>>::get_or_init<public_typst_behavior::linnest_public_svg::{closure#0}>::{closure#0}, !>
  738. 186.03 s > 7: <public_typst_behavior::public_linnest_momentum_layers_place_shafts_and_labels::{closure#0} as core::ops::function::FnOnce<()>>::call_once
  739. 186.03 s > note: Some details are omitted, run with `RUST_BACKTRACE=full` for a verbose backtrace.
  740. 186.03 s >
  741. 186.03 s > error: test run failed
  742. 186.03 s >
  743. 186.03 s > ========== nextest test summary ==========
  744. 186.03 s > report: target/nextest/ci_gammaloop/junit.xml
  745. 186.03 s > tests: 38, failures: 3, errors: 0
  746. 186.03 s >
  747. 186.03 s > 1. clinnet::public_typst_behavior::public_linnest_arrow_shafts_and_crossing_gaps
  748. 186.03 s > failure: test failure with exit code 101
  749. 186.03 s > thread 'public_linnest_arrow_shafts_and_crossing_gaps' (258) panicked at crates/clinnet/tests/public_typst_behavior.rs:81:55:
  750. 186.03 s > called `Result::unwrap()` on an `Err` value: typst failed while compiling template /build/.tmpc2nhYk/.clinnet/templates/linnest-public-behavior.svg
  751. 186.03 s >
  752. 186.03 s > Command executed:
  753. 186.03 s > "typst" "c" "/build/.tmpc2nhYk/.clinnet/templates/linnest-public-behavior.typ" "/build/.tmpc2nhYk/.clinnet/templates/linnest-public-behavior.svg" "--root" "/build/.tmpc2nhYk/.clinnet/templates"
  754. 186.03 s >
  755. 186.03 s > Typst stdout:
  756. 186.03 s >
  757. 186.03 s >
  758. 186.03 s > Typst stderr:
  759. 186.03 s >
  760. 186.03 s >
  761. 186.03 s > Location:
  762. 186.03 s > crates/clinnet/src/lib.rs:741:13
  763. 186.03 s > stack backtrace:
  764. 186.03 s > 0: __rustc::rust_begin_unwind
  765. 186.03 s > 1: core::panicking::panic_fmt
  766. 186.03 s > 2: core::result::unwrap_failed
  767. 186.03 s > 3: public_typst_behavior::render
  768. 186.03 s > 4: <std::sync::once::Once>::call_once_force::<<std::sync::once_lock::OnceLock<alloc::string::String>>::initialize<<std::sync::once_lock::OnceLock<alloc::string::String>>::get_or_init<public_typst_behavior::linnest_public_svg::{closure#0}>::{closure#0}, !>::{closure#0}>::{closure#0}
  769. 186.03 s > 5: <std::sys::sync::once::futex::Once>::call
  770. 186.03 s > 6: <std::sync::once_lock::OnceLock<alloc::string::String>>::initialize::<<std::sync::once_lock::OnceLock<alloc::string::String>>::get_or_init<public_typst_behavior::linnest_public_svg::{closure#0}>::{closure#0}, !>
  771. 186.03 s > 7: <public_typst_behavior::public_linnest_arrow_shafts_and_crossing_gaps::{closure#0} as core::ops::function::FnOnce<()>>::call_once
  772. 186.03 s > note: Some details are omitted, run with `RUST_BACKTRACE=full` for a verbose backtrace.
  773. 186.03 s > system-out
  774. 186.03 s > running 1 test
  775. 186.03 s > test public_linnest_arrow_shafts_and_crossing_gaps has been running for over 60 seconds
  776. 186.03 s > test public_linnest_arrow_shafts_and_crossing_gaps ... FAILED
  777. 186.03 s >
  778. 186.03 s > failures:
  779. 186.03 s >
  780. 186.03 s > failures:
  781. 186.03 s > public_linnest_arrow_shafts_and_crossing_gaps
  782. 186.03 s >
  783. 186.03 s > test result: FAILED. 0 passed; 1 failed; 0 ignored; 0 measured; 17 filtered out; finished in 68.15s
  784. 186.03 s > system-err
  785. 186.03 s > thread 'public_linnest_arrow_shafts_and_crossing_gaps' (258) panicked at crates/clinnet/tests/public_typst_behavior.rs:81:55:
  786. 186.03 s > called `Result::unwrap()` on an `Err` value: typst failed while compiling template /build/.tmpc2nhYk/.clinnet/templates/linnest-public-behavior.svg
  787. 186.03 s >
  788. 186.03 s > Command executed:
  789. 186.03 s > "typst" "c" "/build/.tmpc2nhYk/.clinnet/templates/linnest-public-behavior.typ" "/build/.tmpc2nhYk/.clinnet/templates/linnest-public-behavior.svg" "--root" "/build/.tmpc2nhYk/.clinnet/templates"
  790. 186.03 s >
  791. 186.03 s > Typst stdout:
  792. 186.03 s >
  793. 186.03 s >
  794. 186.03 s > Typst stderr:
  795. 186.03 s >
  796. 186.03 s >
  797. 186.03 s > Location:
  798. 186.03 s > crates/clinnet/src/lib.rs:741:13
  799. 186.03 s > stack backtrace:
  800. 186.03 s > 0: __rustc::rust_begin_unwind
  801. 186.03 s > 1: core::panicking::panic_fmt
  802. 186.03 s > 2: core::result::unwrap_failed
  803. 186.03 s > 3: public_typst_behavior::render
  804. 186.03 s > 4: <std::sync::once::Once>::call_once_force::<<std::sync::once_lock::OnceLock<alloc::string::String>>::initialize<<std::sync::once_lock::OnceLock<alloc::string::String>>::get_or_init<public_typst_behavior::linnest_public_svg::{closure#0}>::{closure#0}, !>::{closure#0}>::{closure#0}
  805. 186.03 s > 5: <std::sys::sync::once::futex::Once>::call
  806. 186.03 s > 6: <std::sync::once_lock::OnceLock<alloc::string::String>>::initialize::<<std::sync::once_lock::OnceLock<alloc::string::String>>::get_or_init<public_typst_behavior::linnest_public_svg::{closure#0}>::{closure#0}, !>
  807. 186.03 s > 7: <public_typst_behavior::public_linnest_arrow_shafts_and_crossing_gaps::{closure#0} as core::ops::function::FnOnce<()>>::call_once
  808. 186.03 s > note: Some details are omitted, run with `RUST_BACKTRACE=full` for a verbose backtrace.
  809. 186.03 s >
  810. 186.03 s > 2. clinnet::public_typst_behavior::public_linnest_edge_styles_skip_fallbacks
  811. 186.03 s > failure: test failure with exit code 101
  812. 186.03 s > thread 'public_linnest_edge_styles_skip_fallbacks' (277) panicked at crates/clinnet/tests/public_typst_behavior.rs:81:55:
  813. 186.03 s > called `Result::unwrap()` on an `Err` value: typst failed while compiling template /build/.tmpDBd4KZ/.clinnet/templates/linnest-public-behavior.svg
  814. 186.03 s >
  815. 186.03 s > Command executed:
  816. 186.03 s > "typst" "c" "/build/.tmpDBd4KZ/.clinnet/templates/linnest-public-behavior.typ" "/build/.tmpDBd4KZ/.clinnet/templates/linnest-public-behavior.svg" "--root" "/build/.tmpDBd4KZ/.clinnet/templates"
  817. 186.03 s >
  818. 186.03 s > Typst stdout:
  819. 186.03 s >
  820. 186.03 s >
  821. 186.03 s > Typst stderr:
  822. 186.03 s >
  823. 186.03 s >
  824. 186.03 s > Location:
  825. 186.03 s > crates/clinnet/src/lib.rs:741:13
  826. 186.03 s > stack backtrace:
  827. 186.03 s > 0: __rustc::rust_begin_unwind
  828. 186.03 s > 1: core::panicking::panic_fmt
  829. 186.03 s > 2: core::result::unwrap_failed
  830. 186.03 s > 3: public_typst_behavior::render
  831. 186.03 s > 4: <std::sync::once::Once>::call_once_force::<<std::sync::once_lock::OnceLock<alloc::string::String>>::initialize<<std::sync::once_lock::OnceLock<alloc::string::String>>::get_or_init<public_typst_behavior::linnest_public_svg::{closure#0}>::{closure#0}, !>::{closure#0}>::{closure#0}
  832. 186.03 s > 5: <std::sys::sync::once::futex::Once>::call
  833. 186.03 s > 6: <std::sync::once_lock::OnceLock<alloc::string::String>>::initialize::<<std::sync::once_lock::OnceLock<alloc::string::String>>::get_or_init<public_typst_behavior::linnest_public_svg::{closure#0}>::{closure#0}, !>
  834. 186.03 s > 7: <public_typst_behavior::public_linnest_edge_styles_skip_fallbacks::{closure#0} as core::ops::function::FnOnce<()>>::call_once
  835. 186.03 s > note: Some details are omitted, run with `RUST_BACKTRACE=full` for a verbose backtrace.
  836. 186.03 s > system-out
  837. 186.03 s > running 1 test
  838. 186.03 s > test public_linnest_edge_styles_skip_fallbacks has been running for over 60 seconds
  839. 186.03 s > test public_linnest_edge_styles_skip_fallbacks ... FAILED
  840. 186.03 s >
  841. 186.03 s > failures:
  842. 186.03 s >
  843. 186.03 s > failures:
  844. 186.03 s > public_linnest_edge_styles_skip_fallbacks
  845. 186.03 s >
  846. 186.03 s > test result: FAILED. 0 passed; 1 failed; 0 ignored; 0 measured; 17 filtered out; finished in 70.98s
  847. 186.03 s > system-err
  848. 186.03 s > thread 'public_linnest_edge_styles_skip_fallbacks' (277) panicked at crates/clinnet/tests/public_typst_behavior.rs:81:55:
  849. 186.03 s > called `Result::unwrap()` on an `Err` value: typst failed while compiling template /build/.tmpDBd4KZ/.clinnet/templates/linnest-public-behavior.svg
  850. 186.03 s >
  851. 186.03 s > Command executed:
  852. 186.03 s > "typst" "c" "/build/.tmpDBd4KZ/.clinnet/templates/linnest-public-behavior.typ" "/build/.tmpDBd4KZ/.clinnet/templates/linnest-public-behavior.svg" "--root" "/build/.tmpDBd4KZ/.clinnet/templates"
  853. 186.03 s >
  854. 186.03 s > Typst stdout:
  855. 186.03 s >
  856. 186.03 s >
  857. 186.03 s > Typst stderr:
  858. 186.03 s >
  859. 186.03 s >
  860. 186.03 s > Location:
  861. 186.03 s > crates/clinnet/src/lib.rs:741:13
  862. 186.03 s > stack backtrace:
  863. 186.03 s > 0: __rustc::rust_begin_unwind
  864. 186.03 s > 1: core::panicking::panic_fmt
  865. 186.03 s > 2: core::result::unwrap_failed
  866. 186.03 s > 3: public_typst_behavior::render
  867. 186.03 s > 4: <std::sync::once::Once>::call_once_force::<<std::sync::once_lock::OnceLock<alloc::string::String>>::initialize<<std::sync::once_lock::OnceLock<alloc::string::String>>::get_or_init<public_typst_behavior::linnest_public_svg::{closure#0}>::{closure#0}, !>::{closure#0}>::{closure#0}
  868. 186.03 s > 5: <std::sys::sync::once::futex::Once>::call
  869. 186.03 s > 6: <std::sync::once_lock::OnceLock<alloc::string::String>>::initialize::<<std::sync::once_lock::OnceLock<alloc::string::String>>::get_or_init<public_typst_behavior::linnest_public_svg::{closure#0}>::{closure#0}, !>
  870. 186.03 s > 7: <public_typst_behavior::public_linnest_edge_styles_skip_fallbacks::{closure#0} as core::ops::function::FnOnce<()>>::call_once
  871. 186.03 s > note: Some details are omitted, run with `RUST_BACKTRACE=full` for a verbose backtrace.
  872. 186.03 s >
  873. 186.03 s > 3. clinnet::public_typst_behavior::public_linnest_momentum_layers_place_shafts_and_labels
  874. 186.03 s > failure: test failure with exit code 101
  875. 186.03 s > thread 'public_linnest_momentum_layers_place_shafts_and_labels' (283) panicked at crates/clinnet/tests/public_typst_behavior.rs:81:55:
  876. 186.03 s > called `Result::unwrap()` on an `Err` value: typst failed while compiling template /build/.tmpv1f5m6/.clinnet/templates/linnest-public-behavior.svg
  877. 186.03 s >
  878. 186.03 s > Command executed:
  879. 186.03 s > "typst" "c" "/build/.tmpv1f5m6/.clinnet/templates/linnest-public-behavior.typ" "/build/.tmpv1f5m6/.clinnet/templates/linnest-public-behavior.svg" "--root" "/build/.tmpv1f5m6/.clinnet/templates"
  880. 186.03 s >
  881. 186.03 s > Typst stdout:
  882. 186.03 s >
  883. 186.03 s >
  884. 186.03 s > Typst stderr:
  885. 186.03 s >
  886. 186.03 s >
  887. 186.03 s > Location:
  888. 186.03 s > crates/clinnet/src/lib.rs:741:13
  889. 186.03 s > stack backtrace:
  890. 186.03 s > 0: __rustc::rust_begin_unwind
  891. 186.03 s > 1: core::panicking::panic_fmt
  892. 186.03 s > 2: core::result::unwrap_failed
  893. 186.03 s > 3: public_typst_behavior::render
  894. 186.03 s > 4: <std::sync::once::Once>::call_once_force::<<std::sync::once_lock::OnceLock<alloc::string::String>>::initialize<<std::sync::once_lock::OnceLock<alloc::string::String>>::get_or_init<public_typst_behavior::linnest_public_svg::{closure#0}>::{closure#0}, !>::{closure#0}>::{closure#0}
  895. 186.03 s > 5: <std::sys::sync::once::futex::Once>::call
  896. 186.03 s > 6: <std::sync::once_lock::OnceLock<alloc::string::String>>::initialize::<<std::sync::once_lock::OnceLock<alloc::string::String>>::get_or_init<public_typst_behavior::linnest_public_svg::{closure#0}>::{closure#0}, !>
  897. 186.03 s > 7: <public_typst_behavior::public_linnest_momentum_layers_place_shafts_and_labels::{closure#0} as core::ops::function::FnOnce<()>>::call_once
  898. 186.03 s > note: Some details are omitted, run with `RUST_BACKTRACE=full` for a verbose backtrace.
  899. 186.03 s > system-out
  900. 186.03 s > running 1 test
  901. 186.03 s > test public_linnest_momentum_layers_place_shafts_and_labels has been running for over 60 seconds
  902. 186.03 s > test public_linnest_momentum_layers_place_shafts_and_labels ... FAILED
  903. 186.03 s >
  904. 186.03 s > failures:
  905. 186.03 s >
  906. 186.03 s > failures:
  907. 186.03 s > public_linnest_momentum_layers_place_shafts_and_labels
  908. 186.03 s >
  909. 186.03 s > test result: FAILED. 0 passed; 1 failed; 0 ignored; 0 measured; 17 filtered out; finished in 122.71s
  910. 186.03 s > system-err
  911. 186.03 s > thread 'public_linnest_momentum_layers_place_shafts_and_labels' (283) panicked at crates/clinnet/tests/public_typst_behavior.rs:81:55:
  912. 186.03 s > called `Result::unwrap()` on an `Err` value: typst failed while compiling template /build/.tmpv1f5m6/.clinnet/templates/linnest-public-behavior.svg
  913. 186.03 s >
  914. 186.03 s > Command executed:
  915. 186.03 s > "typst" "c" "/build/.tmpv1f5m6/.clinnet/templates/linnest-public-behavior.typ" "/build/.tmpv1f5m6/.clinnet/templates/linnest-public-behavior.svg" "--root" "/build/.tmpv1f5m6/.clinnet/templates"
  916. 186.03 s >
  917. 186.03 s > Typst stdout:
  918. 186.03 s >
  919. 186.03 s >
  920. 186.03 s > Typst stderr:
  921. 186.03 s >
  922. 186.03 s >
  923. 186.03 s > Location:
  924. 186.03 s > crates/clinnet/src/lib.rs:741:13
  925. 186.03 s > stack backtrace:
  926. 186.03 s > 0: __rustc::rust_begin_unwind
  927. 186.03 s > 1: core::panicking::panic_fmt
  928. 186.03 s > 2: core::result::unwrap_failed
  929. 186.03 s > 3: public_typst_behavior::render
  930. 186.03 s > 4: <std::sync::once::Once>::call_once_force::<<std::sync::once_lock::OnceLock<alloc::string::String>>::initialize<<std::sync::once_lock::OnceLock<alloc::string::String>>::get_or_init<public_typst_behavior::linnest_public_svg::{closure#0}>::{closure#0}, !>::{closure#0}>::{closure#0}
  931. 186.03 s > 5: <std::sys::sync::once::futex::Once>::call
  932. 186.03 s > 6: <std::sync::once_lock::OnceLock<alloc::string::String>>::initialize::<<std::sync::once_lock::OnceLock<alloc::string::String>>::get_or_init<public_typst_behavior::linnest_public_svg::{closure#0}>::{closure#0}, !>
  933. 186.03 s > 7: <public_typst_behavior::public_linnest_momentum_layers_place_shafts_and_labels::{closure#0} as core::ops::function::FnOnce<()>>::call_once
  934. 186.03 s > note: Some details are omitted, run with `RUST_BACKTRACE=full` for a verbose backtrace.
  935. 186.03 s > =========================================
  936. 186.03 s For full logs, run:
  937. 186.03 s nix log /nix/store/4pqspwvh8pi9s2vg9g6mfsggpl9ynwzx-gammaloop-nextest-clinnet.drv
  938. 186.30 s Run failed.