0.01 s
$ /nix/store/bhv6xyvqw6gjs3j488gi1z6wdv18bdpa-coreutils-9.11/bin/timeout --kill-after=15s 7200s /nix/store/5np0yidzrnyjbb243hvgqpgpss865p0n-nix-2.34.9/bin/nix --extra-experimental-features nix-command --extra-experimental-features flakes flake clone git+https://github.com/alphal00p/gammaloop --dest /tmp/nix-ci-worker/stable-pwd/repo/
0.19 s
Cloning into '/tmp/nix-ci-worker/stable-pwd/repo'...
2.45 s
remote: Enumerating objects: 157628
remote: Enumerating objects: 172467, done.
2.57 s
remote: Counting objects: 0% (1/14839)
remote: Counting objects: 1% (149/14839)
remote: Counting objects: 2% (297/14839)
remote: Counting objects: 3% (446/14839)
remote: Counting objects: 4% (594/14839)
remote: Counting objects: 5% (742/14839)
remote: Counting objects: 6% (891/14839)
remote: Counting objects: 7% (1039/14839)
remote: Counting objects: 8% (1188/14839)
remote: Counting objects: 9% (1336/14839)
remote: Counting objects: 10% (1484/14839)
remote: Counting objects: 11% (1633/14839)
remote: Counting objects: 12% (1781/14839)
remote: Counting objects: 13% (1930/14839)
remote: Counting objects: 14% (2078/14839)
remote: Counting objects: 15% (2226/14839)
remote: Counting objects: 16% (2375/14839)
remote: Counting objects: 17% (2523/14839)
remote: Counting objects: 18% (2672/14839)
remote: Counting objects: 19% (2820/14839)
remote: Counting objects: 20% (2968/14839)
remote: Counting objects: 21% (3117/14839)
remote: Counting objects: 22% (3265/14839)
remote: Counting objects: 23% (3413/14839)
remote: Counting objects: 24% (3562/14839)
remote: Counting objects: 25% (3710/14839)
remote: Counting objects: 26% (3859/14839)
remote: Counting objects: 27% (4007/14839)
remote: Counting objects: 28% (4155/14839)
remote: Counting objects: 29% (4304/14839)
remote: Counting objects: 30% (4452/14839)
remote: Counting objects: 31% (4601/14839)
remote: Counting objects: 32% (4749/14839)
remote: Counting objects: 33% (4897/14839)
remote: Counting objects: 34% (5046/14839)
remote: Counting objects: 35% (5194/14839)
remote: Counting objects: 36% (5343/14839)
remote: Counting objects: 37% (5491/14839)
remote: Counting objects: 38% (5639/14839)
remote: Counting objects: 39% (5788/14839)
remote: Counting objects: 40% (5936/14839)
remote: Counting objects: 41% (6084/14839)
remote: Counting objects: 42% (6233/14839)
remote: Counting objects: 43% (6381/14839)
remote: Counting objects: 44% (6530/14839)
remote: Counting objects: 45% (6678/14839)
remote: Counting objects: 46% (6826/14839)
remote: Counting objects: 47% (6975/14839)
remote: Counting objects: 48% (7123/14839)
remote: Counting objects: 49% (7272/14839)
remote: Counting objects: 50% (7420/14839)
remote: Counting objects: 51% (7568/14839)
remote: Counting objects: 52% (7717/14839)
remote: Counting objects: 53% (7865/14839)
remote: Counting objects: 54% (8014/14839)
remote: Counting objects: 55% (8162/14839)
remote: Counting objects: 56% (8310/14839)
remote: Counting objects: 57% (8459/14839)
remote: Counting objects: 58% (8607/14839)
remote: Counting objects: 59% (8756/14839)
remote: Counting objects: 60% (8904/14839)
remote: Counting objects: 61% (9052/14839)
remote: Counting objects: 62% (9201/14839)
remote: Counting objects: 63% (9349/14839)
remote: Counting objects: 64% (9497/14839)
remote: Counting objects: 65% (9646/14839)
remote: Counting objects: 66% (9794/14839)
remote: Counting objects: 67% (9943/14839)
remote: Counting objects: 68% (10091/14839)
remote: Counting objects: 69% (10239/14839)
remote: Counting objects: 70% (10388/14839)
remote: Counting objects: 71% (10536/14839)
remote: Counting objects: 72% (10685/14839)
remote: Counting objects: 73% (10833/14839)
remote: Counting objects: 74% (10981/14839)
remote: Counting objects: 75% (11130/14839)
remote: Counting objects: 76% (11278/14839)
remote: Counting objects: 77% (11427/14839)
remote: Counting objects: 78% (11575/14839)
remote: Counting objects: 79% (11723/14839)
remote: Counting objects: 80% (11872/14839)
remote: Counting objects: 81% (12020/14839)
remote: Counting objects: 82% (12168/14839)
remote: Counting objects: 83% (12317/14839)
remote: Counting objects: 84% (12465/14839)
remote: Counting objects: 85% (12614/14839)
remote: Counting objects: 86% (12762/14839)
remote: Counting objects: 87% (12910/14839)
remote: Counting objects: 88% (13059/14839)
remote: Counting objects: 89% (13207/14839)
remote: Counting objects: 90% (13356/14839)
remote: Counting objects: 91% (13504/14839)
remote: Counting objects: 92% (13652/14839)
remote: Counting objects: 93% (13801/14839)
remote: Counting objects: 94% (13949/14839)
remote: Counting objects: 95% (14098/14839)
remote: Counting objects: 96% (14246/14839)
remote: Counting objects: 97% (14394/14839)
remote: Counting objects: 98% (14543/14839)
remote: Counting objects: 99% (14691/14839)
remote: Counting objects: 100% (14839/14839)
remote: Counting objects: 100% (14839/14839), done.
4.81 s
remote: Compressing objects: 0% (1/3073)
remote: Compressing objects: 1% (31/3073)
remote: Compressing objects: 2% (62/3073)
remote: Compressing objects: 3% (93/3073)
remote: Compressing objects: 4% (123/3073)
remote: Compressing objects: 5% (154/3073)
remote: Compressing objects: 5% (166/3073)
remote: Compressing objects: 6% (185/3073)
remote: Compressing objects: 6% (209/3073)
remote: Compressing objects: 7% (216/3073)
8.79 s
remote: Compressing objects: 8% (246/3073)
remote: Compressing objects: 9% (277/3073)
remote: Compressing objects: 9% (281/3073)
remote: Compressing objects: 10% (308/3073)
remote: Compressing objects: 11% (339/3073)
remote: Compressing objects: 12% (369/3073)
remote: Compressing objects: 13% (400/3073)
remote: Compressing objects: 13% (404/3073)
remote: Compressing objects: 14% (431/3073)
remote: Compressing objects: 15% (461/3073)
remote: Compressing objects: 16% (492/3073)
remote: Compressing objects: 17% (523/3073)
remote: Compressing objects: 18% (554/3073)
remote: Compressing objects: 18% (564/3073)
remote: Compressing objects: 19% (584/3073)
remote: Compressing objects: 20% (615/3073)
remote: Compressing objects: 21% (646/3073)
remote: Compressing objects: 22% (677/3073)
remote: Compressing objects: 23% (707/3073)
remote: Compressing objects: 24% (738/3073)
remote: Compressing objects: 25% (769/3073)
remote: Compressing objects: 26% (799/3073)
remote: Compressing objects: 27% (830/3073)
remote: Compressing objects: 28% (861/3073)
remote: Compressing objects: 29% (892/3073)
remote: Compressing objects: 30% (922/3073)
remote: Compressing objects: 30% (941/3073)
remote: Compressing objects: 31% (953/3073)
remote: Compressing objects: 32% (984/3073)
remote: Compressing objects: 33% (1015/3073)
remote: Compressing objects: 34% (1045/3073)
remote: Compressing objects: 35% (1076/3073)
remote: Compressing objects: 36% (1107/3073)
remote: Compressing objects: 37% (1138/3073)
remote: Compressing objects: 38% (1168/3073)
remote: Compressing objects: 39% (1199/3073)
remote: Compressing objects: 40% (1230/3073)
remote: Compressing objects: 41% (1260/3073)
remote: Compressing objects: 42% (1291/3073)
remote: Compressing objects: 43% (1322/3073)
remote: Compressing objects: 44% (1353/3073)
remote: Compressing objects: 45% (1383/3073)
remote: Compressing objects: 46% (1414/3073)
remote: Compressing objects: 47% (1445/3073)
remote: Compressing objects: 48% (1476/3073)
remote: Compressing objects: 49% (1506/3073)
remote: Compressing objects: 50% (1537/3073)
remote: Compressing objects: 51% (1568/3073)
remote: Compressing objects: 52% (1598/3073)
remote: Compressing objects: 53% (1629/3073)
remote: Compressing objects: 54% (1660/3073)
remote: Compressing objects: 55% (1691/3073)
remote: Compressing objects: 56% (1721/3073)
remote: Compressing objects: 57% (1752/3073)
remote: Compressing objects: 58% (1783/3073)
remote: Compressing objects: 59% (1814/3073)
remote: Compressing objects: 60% (1844/3073)
remote: Compressing objects: 61% (1875/3073)
remote: Compressing objects: 62% (1906/3073)
remote: Compressing objects: 63% (1936/3073)
remote: Compressing objects: 64% (1967/3073)
remote: Compressing objects: 65% (1998/3073)
remote: Compressing objects: 66% (2029/3073)
remote: Compressing objects: 67% (2059/3073)
remote: Compressing objects: 68% (2090/3073)
remote: Compressing objects: 69% (2121/3073)
remote: Compressing objects: 70% (2152/3073)
remote: Compressing objects: 71% (2182/3073)
remote: Compressing objects: 72% (2213/3073)
remote: Compressing objects: 73% (2244/3073)
remote: Compressing objects: 74% (2275/3073)
remote: Compressing objects: 75% (2305/3073)
remote: Compressing objects: 76% (2336/3073)
remote: Compressing objects: 77% (2367/3073)
remote: Compressing objects: 78% (2397/3073)
remote: Compressing objects: 79% (2428/3073)
remote: Compressing objects: 80% (2459/3073)
remote: Compressing objects: 81% (2490/3073)
remote: Compressing objects: 82% (2520/3073)
remote: Compressing objects: 83% (2551/3073)
remote: Compressing objects: 84% (2582/3073)
remote: Compressing objects: 85% (2613/3073)
remote: Compressing objects: 86% (2643/3073)
remote: Compressing objects: 87% (2674/3073)
remote: Compressing objects: 88% (2705/3073)
remote: Compressing objects: 89% (2735/3073)
remote: Compressing objects: 90% (2766/3073)
remote: Compressing objects: 91% (2797/3073)
remote: Compressing objects: 92% (2828/3073)
remote: Compressing objects: 93% (2858/3073)
remote: Compressing objects: 94% (2889/3073)
remote: Compressing objects: 95% (2920/3073)
remote: Compressing objects: 96% (2951/3073)
remote: Compressing objects: 97% (2981/3073)
remote: Compressing objects: 98% (3012/3073)
remote: Compressing objects: 99% (3043/3073)
remote: Compressing objects: 100% (3073/3073)
remote: Compressing objects: 100% (3073/3073), done.
10.16 s
Receiving objects: 0% (1/172467)
Receiving objects: 1% (1725/172467)
Receiving objects: 2% (3450/172467), 14.24 MiB | 28.46 MiB/s
Receiving objects: 3% (5175/172467), 14.24 MiB | 28.46 MiB/s
Receiving objects: 4% (6899/172467), 14.24 MiB | 28.46 MiB/s
Receiving objects: 4% (7500/172467), 32.21 MiB | 32.20 MiB/s
Receiving objects: 5% (8624/172467), 32.21 MiB | 32.20 MiB/s
Receiving objects: 6% (10349/172467), 32.21 MiB | 32.20 MiB/s
15.01 s
Receiving objects: 6% (11755/172467), 48.96 MiB | 31.93 MiB/s
Receiving objects: 7% (12073/172467), 48.96 MiB | 31.93 MiB/s
Receiving objects: 8% (13798/172467), 65.86 MiB | 32.39 MiB/s
Receiving objects: 9% (15523/172467), 65.86 MiB | 32.39 MiB/s
Receiving objects: 10% (17247/172467), 65.86 MiB | 32.39 MiB/s
Receiving objects: 11% (18972/172467), 65.86 MiB | 32.39 MiB/s
Receiving objects: 12% (20697/172467), 79.64 MiB | 31.44 MiB/s
Receiving objects: 13% (22421/172467), 79.64 MiB | 31.44 MiB/s
Receiving objects: 14% (24146/172467), 79.64 MiB | 31.44 MiB/s
Receiving objects: 15% (25871/172467), 79.64 MiB | 31.44 MiB/s
Receiving objects: 16% (27595/172467), 79.64 MiB | 31.44 MiB/s
Receiving objects: 17% (29320/172467), 79.64 MiB | 31.44 MiB/s
Receiving objects: 18% (31045/172467), 79.64 MiB | 31.44 MiB/s
Receiving objects: 19% (32769/172467), 79.64 MiB | 31.44 MiB/s
Receiving objects: 20% (34494/172467), 79.64 MiB | 31.44 MiB/s
Receiving objects: 21% (36219/172467), 79.64 MiB | 31.44 MiB/s
Receiving objects: 22% (37943/172467), 79.64 MiB | 31.44 MiB/s
Receiving objects: 23% (39668/172467), 79.64 MiB | 31.44 MiB/s
Receiving objects: 24% (41393/172467), 79.64 MiB | 31.44 MiB/s
Receiving objects: 25% (43117/172467), 79.64 MiB | 31.44 MiB/s
Receiving objects: 26% (44842/172467), 79.64 MiB | 31.44 MiB/s
Receiving objects: 26% (44898/172467), 79.64 MiB | 31.44 MiB/s
Receiving objects: 27% (46567/172467), 97.75 MiB | 32.22 MiB/s
Receiving objects: 28% (48291/172467), 97.75 MiB | 32.22 MiB/s
Receiving objects: 29% (50016/172467), 97.75 MiB | 32.22 MiB/s
Receiving objects: 30% (51741/172467), 97.75 MiB | 32.22 MiB/s
Receiving objects: 31% (53465/172467), 97.75 MiB | 32.22 MiB/s
Receiving objects: 32% (55190/172467), 97.75 MiB | 32.22 MiB/s
Receiving objects: 33% (56915/172467), 115.98 MiB | 32.64 MiB/s
Receiving objects: 34% (58639/172467), 115.98 MiB | 32.64 MiB/s
Receiving objects: 35% (60364/172467), 115.98 MiB | 32.64 MiB/s
Receiving objects: 35% (60791/172467), 115.98 MiB | 32.64 MiB/s
Receiving objects: 36% (62089/172467), 132.82 MiB | 32.76 MiB/s
Receiving objects: 37% (63813/172467), 132.82 MiB | 32.76 MiB/s
Receiving objects: 38% (65538/172467), 132.82 MiB | 32.76 MiB/s
Receiving objects: 39% (67263/172467), 132.82 MiB | 32.76 MiB/s
Receiving objects: 39% (68220/172467), 149.76 MiB | 32.88 MiB/s
Receiving objects: 40% (68987/172467), 165.73 MiB | 33.27 MiB/s
Receiving objects: 41% (70712/172467), 165.73 MiB | 33.27 MiB/s
Receiving objects: 42% (72437/172467), 165.73 MiB | 33.27 MiB/s
Receiving objects: 43% (74161/172467), 165.73 MiB | 33.27 MiB/s
Receiving objects: 44% (75886/172467), 183.02 MiB | 33.00 MiB/s
Receiving objects: 45% (77611/172467), 183.02 MiB | 33.00 MiB/s
Receiving objects: 46% (79335/172467), 183.02 MiB | 33.00 MiB/s
Receiving objects: 47% (81060/172467), 183.02 MiB | 33.00 MiB/s
Receiving objects: 48% (82785/172467), 183.02 MiB | 33.00 MiB/s
Receiving objects: 49% (84509/172467), 183.02 MiB | 33.00 MiB/s
Receiving objects: 49% (86181/172467), 183.02 MiB | 33.00 MiB/s
Receiving objects: 50% (86234/172467), 199.90 MiB | 33.28 MiB/s
Receiving objects: 51% (87959/172467), 199.90 MiB | 33.28 MiB/s
Receiving objects: 52% (89683/172467), 199.90 MiB | 33.28 MiB/s
19.84 s
Receiving objects: 52% (89797/172467), 216.32 MiB | 33.17 MiB/s
Receiving objects: 53% (91408/172467), 249.89 MiB | 33.54 MiB/s
Receiving objects: 53% (91464/172467), 249.89 MiB | 33.54 MiB/s
Receiving objects: 54% (93133/172467), 265.79 MiB | 33.17 MiB/s
Receiving objects: 55% (94857/172467), 265.79 MiB | 33.17 MiB/s
Receiving objects: 56% (96582/172467), 282.55 MiB | 33.17 MiB/s
Receiving objects: 57% (98307/172467), 282.55 MiB | 33.17 MiB/s
Receiving objects: 58% (100031/172467), 282.55 MiB | 33.17 MiB/s
Receiving objects: 59% (101756/172467), 282.55 MiB | 33.17 MiB/s
Receiving objects: 60% (103481/172467), 282.55 MiB | 33.17 MiB/s
Receiving objects: 61% (105205/172467), 282.55 MiB | 33.17 MiB/s
Receiving objects: 62% (106930/172467), 282.55 MiB | 33.17 MiB/s
Receiving objects: 63% (108655/172467), 282.55 MiB | 33.17 MiB/s
Receiving objects: 63% (109392/172467), 282.55 MiB | 33.17 MiB/s
Receiving objects: 64% (110379/172467), 299.23 MiB | 33.10 MiB/s
Receiving objects: 65% (112104/172467), 299.23 MiB | 33.10 MiB/s
Receiving objects: 66% (113829/172467), 316.27 MiB | 33.34 MiB/s
Receiving objects: 67% (115553/172467), 316.27 MiB | 33.34 MiB/s
Receiving objects: 68% (117278/172467), 316.27 MiB | 33.34 MiB/s
Receiving objects: 68% (118094/172467), 316.27 MiB | 33.34 MiB/s
Receiving objects: 69% (119003/172467), 332.57 MiB | 33.15 MiB/s
Receiving objects: 70% (120727/172467), 332.57 MiB | 33.15 MiB/s
Receiving objects: 71% (122452/172467), 332.57 MiB | 33.15 MiB/s
Receiving objects: 71% (124091/172467), 349.27 MiB | 33.11 MiB/s
Receiving objects: 72% (124177/172467), 349.27 MiB | 33.11 MiB/s
24.81 s
Receiving objects: 73% (125901/172467), 366.07 MiB | 33.20 MiB/s
Receiving objects: 74% (127626/172467), 382.82 MiB | 33.18 MiB/s
Receiving objects: 74% (127949/172467), 382.82 MiB | 33.18 MiB/s
Receiving objects: 75% (129351/172467), 382.82 MiB | 33.18 MiB/s
Receiving objects: 76% (131075/172467), 399.31 MiB | 32.98 MiB/s
Receiving objects: 77% (132800/172467), 416.25 MiB | 33.21 MiB/s
Receiving objects: 77% (133238/172467), 416.25 MiB | 33.21 MiB/s
Receiving objects: 78% (134525/172467), 432.98 MiB | 33.21 MiB/s
Receiving objects: 79% (136249/172467), 432.98 MiB | 33.21 MiB/s
Receiving objects: 80% (137974/172467), 449.89 MiB | 33.26 MiB/s
Receiving objects: 81% (139699/172467), 449.89 MiB | 33.26 MiB/s
Receiving objects: 81% (139846/172467), 449.89 MiB | 33.26 MiB/s
Receiving objects: 82% (141423/172467), 466.79 MiB | 33.22 MiB/s
Receiving objects: 82% (142387/172467), 482.91 MiB | 33.26 MiB/s
Receiving objects: 83% (143148/172467), 499.31 MiB | 33.18 MiB/s
Receiving objects: 84% (144873/172467), 516.19 MiB | 33.20 MiB/s
Receiving objects: 84% (146301/172467), 516.19 MiB | 33.20 MiB/s
Receiving objects: 85% (146597/172467), 516.19 MiB | 33.20 MiB/s
29.92 s
Receiving objects: 85% (147547/172467), 549.89 MiB | 33.38 MiB/s
Receiving objects: 85% (147551/172467), 599.78 MiB | 33.21 MiB/s
Receiving objects: 85% (147552/172467), 633.25 MiB | 33.32 MiB/s
Receiving objects: 85% (147554/172467), 649.57 MiB | 33.31 MiB/s
Receiving objects: 85% (147565/172467), 699.47 MiB | 33.23 MiB/s
33.23 s
Receiving objects: 85% (147565/172467), 732.72 MiB | 33.25 MiB/s
Receiving objects: 86% (148322/172467), 732.72 MiB | 33.25 MiB/s
Receiving objects: 87% (150047/172467), 732.72 MiB | 33.25 MiB/s
Receiving objects: 88% (151771/172467), 749.59 MiB | 33.29 MiB/s
Receiving objects: 88% (152751/172467), 749.59 MiB | 33.29 MiB/s
Receiving objects: 89% (153496/172467), 749.59 MiB | 33.29 MiB/s
Receiving objects: 90% (155221/172467), 766.03 MiB | 33.24 MiB/s
Receiving objects: 91% (156945/172467), 766.03 MiB | 33.24 MiB/s
Receiving objects: 92% (158670/172467), 766.03 MiB | 33.24 MiB/s
Receiving objects: 93% (160395/172467), 766.03 MiB | 33.24 MiB/s
Receiving objects: 94% (162119/172467), 766.03 MiB | 33.24 MiB/s
Receiving objects: 95% (163844/172467), 766.03 MiB | 33.24 MiB/s
Receiving objects: 96% (165569/172467), 766.03 MiB | 33.24 MiB/s
Receiving objects: 97% (167293/172467), 766.03 MiB | 33.24 MiB/s
Receiving objects: 98% (169018/172467), 782.70 MiB | 33.21 MiB/s
Receiving objects: 99% (170743/172467), 782.70 MiB | 33.21 MiB/s
Receiving objects: 99% (172295/172467), 782.70 MiB | 33.21 MiB/s
remote: Total 172467 (delta 12813), reused 11932 (delta 11758), pack-reused 157628 (from 3)
33.23 s
Receiving objects: 100% (172467/172467), 793.55 MiB | 30.82 MiB/s
Receiving objects: 100% (172467/172467), 798.59 MiB | 32.68 MiB/s, done.
35.28 s
Resolving deltas: 0% (0/106083)
Resolving deltas: 1% (1061/106083)
Resolving deltas: 2% (2122/106083)
Resolving deltas: 3% (3184/106083)
Resolving deltas: 4% (4244/106083)
Resolving deltas: 5% (5305/106083)
Resolving deltas: 6% (6365/106083)
Resolving deltas: 7% (7426/106083)
Resolving deltas: 8% (8487/106083)
Resolving deltas: 9% (9548/106083)
Resolving deltas: 10% (10609/106083)
Resolving deltas: 11% (11670/106083)
Resolving deltas: 12% (12730/106083)
Resolving deltas: 13% (13791/106083)
Resolving deltas: 14% (14854/106083)
Resolving deltas: 15% (15913/106083)
Resolving deltas: 16% (16974/106083)
Resolving deltas: 17% (18035/106083)
Resolving deltas: 18% (19095/106083)
Resolving deltas: 19% (20156/106083)
Resolving deltas: 20% (21217/106083)
Resolving deltas: 21% (22278/106083)
Resolving deltas: 22% (23339/106083)
Resolving deltas: 23% (24400/106083)
Resolving deltas: 24% (25460/106083)
Resolving deltas: 25% (26521/106083)
Resolving deltas: 26% (27582/106083)
Resolving deltas: 27% (28643/106083)
Resolving deltas: 28% (29704/106083)
Resolving deltas: 29% (30765/106083)
Resolving deltas: 30% (31825/106083)
Resolving deltas: 31% (32886/106083)
Resolving deltas: 32% (33947/106083)
Resolving deltas: 33% (35009/106083)
Resolving deltas: 34% (36070/106083)
Resolving deltas: 35% (37130/106083)
Resolving deltas: 36% (38192/106083)
Resolving deltas: 37% (39251/106083)
Resolving deltas: 38% (40312/106083)
Resolving deltas: 39% (41374/106083)
Resolving deltas: 40% (42434/106083)
Resolving deltas: 41% (43496/106083)
Resolving deltas: 42% (44555/106083)
Resolving deltas: 43% (45616/106083)
Resolving deltas: 44% (46678/106083)
Resolving deltas: 45% (47738/106083)
Resolving deltas: 46% (48801/106083)
Resolving deltas: 47% (49860/106083)
Resolving deltas: 48% (50920/106083)
Resolving deltas: 49% (51981/106083)
Resolving deltas: 50% (53042/106083)
Resolving deltas: 51% (54106/106083)
Resolving deltas: 52% (55164/106083)
Resolving deltas: 52% (55567/106083)
Resolving deltas: 53% (56224/106083)
Resolving deltas: 54% (57287/106083)
Resolving deltas: 55% (58346/106083)
Resolving deltas: 56% (59407/106083)
Resolving deltas: 57% (60468/106083)
Resolving deltas: 58% (61529/106083)
Resolving deltas: 59% (62589/106083)
Resolving deltas: 60% (63652/106083)
Resolving deltas: 61% (64711/106083)
Resolving deltas: 62% (65772/106083)
Resolving deltas: 63% (66833/106083)
Resolving deltas: 64% (67894/106083)
Resolving deltas: 65% (68954/106083)
Resolving deltas: 66% (70015/106083)
Resolving deltas: 67% (71077/106083)
Resolving deltas: 68% (72137/106083)
Resolving deltas: 69% (73198/106083)
Resolving deltas: 70% (74259/106083)
Resolving deltas: 71% (75319/106083)
Resolving deltas: 72% (76380/106083)
Resolving deltas: 73% (77443/106083)
Resolving deltas: 74% (78502/106083)
Resolving deltas: 75% (79563/106083)
Resolving deltas: 76% (80624/106083)
Resolving deltas: 77% (81684/106083)
Resolving deltas: 78% (82745/106083)
Resolving deltas: 79% (83806/106083)
Resolving deltas: 80% (84867/106083)
Resolving deltas: 81% (85928/106083)
Resolving deltas: 82% (86989/106083)
Resolving deltas: 83% (88049/106083)
Resolving deltas: 84% (89112/106083)
Resolving deltas: 85% (90171/106083)
Resolving deltas: 86% (91232/106083)
Resolving deltas: 87% (92293/106083)
Resolving deltas: 87% (93348/106083)
Resolving deltas: 88% (93354/106083)
Resolving deltas: 89% (94414/106083)
Resolving deltas: 90% (95476/106083)
Resolving deltas: 91% (96537/106083)
Resolving deltas: 92% (97597/106083)
Resolving deltas: 93% (98658/106083)
Resolving deltas: 94% (99719/106083)
35.44 s
Resolving deltas: 95% (100779/106083)
Resolving deltas: 96% (101840/106083)
Resolving deltas: 97% (102901/106083)
Resolving deltas: 98% (103962/106083)
Resolving deltas: 99% (105023/106083)
Resolving deltas: 100% (106083/106083)
Resolving deltas: 100% (106083/106083), done.
36.40 s
Fetching commit 1e8063a763d3aa515749c33616ee59aa827705be for ninjars-combined ...
36.40 s
$ /nix/store/b1wn5clix1mz4vpfih7x9cnj9qfh7c6h-git-2.54.0/bin/git fetch origin 1e8063a763d3aa515749c33616ee59aa827705be
36.84 s
From https://github.com/alphal00p/gammaloop
36.84 s
* branch 1e8063a763d3aa515749c33616ee59aa827705be -> FETCH_HEAD
37.08 s
$ /nix/store/bhv6xyvqw6gjs3j488gi1z6wdv18bdpa-coreutils-9.11/bin/timeout --kill-after=15s 7200s /nix/store/b1wn5clix1mz4vpfih7x9cnj9qfh7c6h-git-2.54.0/bin/git -c advice.detachedHead=false checkout 1e8063a763d3aa515749c33616ee59aa827705be
40.72 s
HEAD is now at 1e8063a76 Merge commit '30fb0f28c' into ninjars-combined
40.74 s
$ /nix/store/bhv6xyvqw6gjs3j488gi1z6wdv18bdpa-coreutils-9.11/bin/timeout --kill-after=15s 7200s /nix/store/5np0yidzrnyjbb243hvgqpgpss865p0n-nix-2.34.9/bin/nix --extra-experimental-features nix-command --extra-experimental-features flakes --log-format internal-json run .#packages.x86_64-linux.nix-ci-check-gammaloop-nextest-clinnet --print-build-logs
40.92 s
warning: ignoring untrusted flake configuration setting 'extra-substituters'.
40.92 s
Pass '--accept-flake-config' to trust it
40.92 s
warning: ignoring untrusted flake configuration setting 'extra-trusted-public-keys'.
40.92 s
Pass '--accept-flake-config' to trust it
46.21 s
46.83 s
evaluating derivation 'gdo you want to allow configuration setting 'extra-substituters' to be set to 'https://cache.nix-ci.com ' (y/N)? do you want to permanently mark this value as untrusted (y/N)? warning: ignoring untrusted flake configuration setting 'extra-substituters'.
46.83 s
Pass '--accept-flake-config' to trust it
46.83 s
do you want to allow configuration setting 'extra-trusted-public-keys' to be set to 'nix-ci:g3xV5BDTLtIBZr/A00IU1x0EtKKlb7YLgBN2SgYgM6A= ' (y/N)? do you want to permanently mark this value as untrusted (y/N)? warning: ignoring untrusted flake configuration setting 'extra-trusted-public-keys'.
46.83 s
Pass '--accept-flake-config' to trust it
51.43 s
copying '/nix/store/l3sx
evaluating derivation 'g
copying '/nix/store/l3sx
evaluating derivation 'g
copying '/nix/store/l3sx
evaluating derivation 'g
copying '/nix/store/l3sx
evaluating derivation 'g
copying '/nix/store/l3sx
evaluating derivation 'g
copying '/nix/store/l3sx
evaluating derivation 'g
copying '/nix/store/l3sx
evaluating derivation 'g
54.67 s
[0 /1 built]
[1 /0 /1 built] building g gammaloop-nextest-clinnet> Nextest worker budget: 16
54.69 s
gammaloop-nextest-clinnet> Extracting 4 binaries (including 1 non-test binary), 1 build script output directory, and 1 linked path to /build/source
54.77 s
gammaloop-nextest-clinnet> Extracted 16 files to /build/source in 0.09s
54.79 s
gammaloop-nextest-clinnet> ------------
54.79 s
gammaloop-nextest-clinnet> Nextest run ID 6244babb-ea3c-4cec-a105-b786d8602a20 with nextest profile: ci_gammaloop
54.79 s
gammaloop-nextest-clinnet> Starting 38 tests across 3 binaries
122.97 s
gammaloop-nextest-clinnet> FAIL [ 68.163s] (32/38) clinnet::public_typst_behavior public_linnest_arrow_shafts_and_crossing_gaps
122.97 s
gammaloop-nextest-clinnet> stdout ---
122.97 s
gammaloop-nextest-clinnet>
122.97 s
gammaloop-nextest-clinnet> running 1 test
122.97 s
gammaloop-nextest-clinnet> test public_linnest_arrow_shafts_and_crossing_gaps has been running for over 60 seconds
122.97 s
gammaloop-nextest-clinnet> test public_linnest_arrow_shafts_and_crossing_gaps ... FAILED
122.97 s
gammaloop-nextest-clinnet>
122.97 s
gammaloop-nextest-clinnet> failures:
122.97 s
gammaloop-nextest-clinnet>
122.97 s
gammaloop-nextest-clinnet> failures:
122.97 s
gammaloop-nextest-clinnet> public_linnest_arrow_shafts_and_crossing_gaps
122.97 s
gammaloop-nextest-clinnet>
122.97 s
gammaloop-nextest-clinnet> test result: FAILED. 0 passed; 1 failed; 0 ignored; 0 measured; 17 filtered out; finished in 68.15s
122.97 s
gammaloop-nextest-clinnet>
122.97 s
gammaloop-nextest-clinnet> stderr ---
122.97 s
gammaloop-nextest-clinnet>
122.97 s
gammaloop-nextest-clinnet> thread 'public_linnest_arrow_shafts_and_crossing_gaps' (258) panicked at crates/clinnet/tests/public_typst_behavior.rs:81:55:
122.97 s
gammaloop-nextest-clinnet> called `Result::unwrap()` on an `Err` value: typst failed while compiling template /build/.tmpc2nhYk/.clinnet/templates/linnest-public-behavior.svg
122.97 s
gammaloop-nextest-clinnet>
122.97 s
gammaloop-nextest-clinnet> Command executed:
122.97 s
gammaloop-nextest-clinnet> "typst" "c" "/build/.tmpc2nhYk/.clinnet/templates/linnest-public-behavior.typ" "/build/.tmpc2nhYk/.clinnet/templates/linnest-public-behavior.svg" "--root" "/build/.tmpc2nhYk/.clinnet/templates"
122.97 s
gammaloop-nextest-clinnet>
122.97 s
gammaloop-nextest-clinnet> Typst stdout:
122.97 s
gammaloop-nextest-clinnet>
122.97 s
gammaloop-nextest-clinnet>
122.97 s
gammaloop-nextest-clinnet> Typst stderr:
122.97 s
gammaloop-nextest-clinnet>
122.97 s
gammaloop-nextest-clinnet>
122.97 s
gammaloop-nextest-clinnet> Location:
122.97 s
gammaloop-nextest-clinnet> crates/clinnet/src/lib.rs:741:13
122.97 s
gammaloop-nextest-clinnet> stack backtrace:
122.97 s
gammaloop-nextest-clinnet> 0: __rustc::rust_begin_unwind
122.97 s
gammaloop-nextest-clinnet> 1: core::panicking::panic_fmt
122.97 s
gammaloop-nextest-clinnet> 2: core::result::unwrap_failed
122.97 s
gammaloop-nextest-clinnet> 3: public_typst_behavior::render
122.97 s
gammaloop-nextest-clinnet> 4: <std::sync::once::Once>::call_once_force::<<std::sync::once_lock::OnceLock<alloc::string::String>>::initialize<<std::sync::once_lock::OnceLock<alloc::string::String>>::get_or_init<public_typst_behavior::linnest_public_svg::{closure#0}>::{closure#0}, !>::{closure#0}>::{closure#0}
122.97 s
gammaloop-nextest-clinnet> 5: <std::sys::sync::once::futex::Once>::call
122.97 s
gammaloop-nextest-clinnet> 6: <std::sync::once_lock::OnceLock<alloc::string::String>>::initialize::<<std::sync::once_lock::OnceLock<alloc::string::String>>::get_or_init<public_typst_behavior::linnest_public_svg::{closure#0}>::{closure#0}, !>
122.97 s
gammaloop-nextest-clinnet> 7: <public_typst_behavior::public_linnest_arrow_shafts_and_crossing_gaps::{closure#0} as core::ops::function::FnOnce<()>>::call_once
122.97 s
gammaloop-nextest-clinnet> note: Some details are omitted, run with `RUST_BACKTRACE=full` for a verbose backtrace.
122.97 s
gammaloop-nextest-clinnet>
125.79 s
gammaloop-nextest-clinnet> FAIL [ 70.989s] (33/38) clinnet::public_typst_behavior public_linnest_edge_styles_skip_fallbacks
125.79 s
gammaloop-nextest-clinnet> stdout ---
125.79 s
gammaloop-nextest-clinnet>
125.79 s
gammaloop-nextest-clinnet> running 1 test
125.79 s
gammaloop-nextest-clinnet> test public_linnest_edge_styles_skip_fallbacks has been running for over 60 seconds
125.79 s
gammaloop-nextest-clinnet> test public_linnest_edge_styles_skip_fallbacks ... FAILED
125.79 s
gammaloop-nextest-clinnet>
125.79 s
gammaloop-nextest-clinnet> failures:
125.79 s
gammaloop-nextest-clinnet>
125.79 s
gammaloop-nextest-clinnet> failures:
125.79 s
gammaloop-nextest-clinnet> public_linnest_edge_styles_skip_fallbacks
125.79 s
gammaloop-nextest-clinnet>
125.79 s
gammaloop-nextest-clinnet> test result: FAILED. 0 passed; 1 failed; 0 ignored; 0 measured; 17 filtered out; finished in 70.98s
125.79 s
gammaloop-nextest-clinnet>
125.79 s
gammaloop-nextest-clinnet> stderr ---
125.79 s
gammaloop-nextest-clinnet>
125.79 s
gammaloop-nextest-clinnet> thread 'public_linnest_edge_styles_skip_fallbacks' (277) panicked at crates/clinnet/tests/public_typst_behavior.rs:81:55:
125.79 s
gammaloop-nextest-clinnet> called `Result::unwrap()` on an `Err` value: typst failed while compiling template /build/.tmpDBd4KZ/.clinnet/templates/linnest-public-behavior.svg
125.79 s
gammaloop-nextest-clinnet>
125.79 s
gammaloop-nextest-clinnet> Command executed:
125.79 s
gammaloop-nextest-clinnet> "typst" "c" "/build/.tmpDBd4KZ/.clinnet/templates/linnest-public-behavior.typ" "/build/.tmpDBd4KZ/.clinnet/templates/linnest-public-behavior.svg" "--root" "/build/.tmpDBd4KZ/.clinnet/templates"
125.79 s
gammaloop-nextest-clinnet>
125.79 s
gammaloop-nextest-clinnet> Typst stdout:
125.79 s
gammaloop-nextest-clinnet>
125.79 s
gammaloop-nextest-clinnet>
125.79 s
gammaloop-nextest-clinnet> Typst stderr:
125.79 s
gammaloop-nextest-clinnet>
125.79 s
gammaloop-nextest-clinnet>
125.79 s
gammaloop-nextest-clinnet> Location:
125.79 s
gammaloop-nextest-clinnet> crates/clinnet/src/lib.rs:741:13
125.79 s
gammaloop-nextest-clinnet> stack backtrace:
125.79 s
gammaloop-nextest-clinnet> 0: __rustc::rust_begin_unwind
125.79 s
gammaloop-nextest-clinnet> 1: core::panicking::panic_fmt
125.79 s
gammaloop-nextest-clinnet> 2: core::result::unwrap_failed
125.79 s
gammaloop-nextest-clinnet> 3: public_typst_behavior::render
125.79 s
gammaloop-nextest-clinnet> 4: <std::sync::once::Once>::call_once_force::<<std::sync::once_lock::OnceLock<alloc::string::String>>::initialize<<std::sync::once_lock::OnceLock<alloc::string::String>>::get_or_init<public_typst_behavior::linnest_public_svg::{closure#0}>::{closure#0}, !>::{closure#0}>::{closure#0}
125.79 s
gammaloop-nextest-clinnet> 5: <std::sys::sync::once::futex::Once>::call
125.79 s
gammaloop-nextest-clinnet> 6: <std::sync::once_lock::OnceLock<alloc::string::String>>::initialize::<<std::sync::once_lock::OnceLock<alloc::string::String>>::get_or_init<public_typst_behavior::linnest_public_svg::{closure#0}>::{closure#0}, !>
125.79 s
gammaloop-nextest-clinnet> 7: <public_typst_behavior::public_linnest_edge_styles_skip_fallbacks::{closure#0} as core::ops::function::FnOnce<()>>::call_once
125.79 s
gammaloop-nextest-clinnet> note: Some details are omitted, run with `RUST_BACKTRACE=full` for a verbose backtrace.
125.79 s
gammaloop-nextest-clinnet>
177.54 s
gammaloop-nextest-clinnet> FAIL [ 122.723s] (34/38) clinnet::public_typst_behavior public_linnest_momentum_layers_place_shafts_and_labels
177.54 s
gammaloop-nextest-clinnet> stdout ---
177.54 s
gammaloop-nextest-clinnet>
177.54 s
gammaloop-nextest-clinnet> running 1 test
177.54 s
gammaloop-nextest-clinnet> test public_linnest_momentum_layers_place_shafts_and_labels has been running for over 60 seconds
177.54 s
gammaloop-nextest-clinnet> test public_linnest_momentum_layers_place_shafts_and_labels ... FAILED
177.54 s
gammaloop-nextest-clinnet>
177.54 s
gammaloop-nextest-clinnet> failures:
177.54 s
gammaloop-nextest-clinnet>
177.54 s
gammaloop-nextest-clinnet> failures:
177.54 s
gammaloop-nextest-clinnet> public_linnest_momentum_layers_place_shafts_and_labels
177.54 s
gammaloop-nextest-clinnet>
177.54 s
gammaloop-nextest-clinnet> test result: FAILED. 0 passed; 1 failed; 0 ignored; 0 measured; 17 filtered out; finished in 122.71s
177.54 s
gammaloop-nextest-clinnet>
177.54 s
gammaloop-nextest-clinnet> stderr ---
177.54 s
gammaloop-nextest-clinnet>
177.54 s
gammaloop-nextest-clinnet> thread 'public_linnest_momentum_layers_place_shafts_and_labels' (283) panicked at crates/clinnet/tests/public_typst_behavior.rs:81:55:
177.54 s
gammaloop-nextest-clinnet> called `Result::unwrap()` on an `Err` value: typst failed while compiling template /build/.tmpv1f5m6/.clinnet/templates/linnest-public-behavior.svg
177.54 s
gammaloop-nextest-clinnet>
177.54 s
gammaloop-nextest-clinnet> Command executed:
177.54 s
gammaloop-nextest-clinnet> "typst" "c" "/build/.tmpv1f5m6/.clinnet/templates/linnest-public-behavior.typ" "/build/.tmpv1f5m6/.clinnet/templates/linnest-public-behavior.svg" "--root" "/build/.tmpv1f5m6/.clinnet/templates"
177.54 s
gammaloop-nextest-clinnet>
177.54 s
gammaloop-nextest-clinnet> Typst stdout:
177.54 s
gammaloop-nextest-clinnet>
177.54 s
gammaloop-nextest-clinnet>
177.54 s
gammaloop-nextest-clinnet> Typst stderr:
177.54 s
gammaloop-nextest-clinnet>
177.54 s
gammaloop-nextest-clinnet>
177.54 s
gammaloop-nextest-clinnet> Location:
177.54 s
gammaloop-nextest-clinnet> crates/clinnet/src/lib.rs:741:13
177.54 s
gammaloop-nextest-clinnet> stack backtrace:
177.54 s
gammaloop-nextest-clinnet> 0: __rustc::rust_begin_unwind
177.54 s
gammaloop-nextest-clinnet> 1: core::panicking::panic_fmt
177.54 s
gammaloop-nextest-clinnet> 2: core::result::unwrap_failed
177.54 s
gammaloop-nextest-clinnet> 3: public_typst_behavior::render
177.54 s
gammaloop-nextest-clinnet> 4: <std::sync::once::Once>::call_once_force::<<std::sync::once_lock::OnceLock<alloc::string::String>>::initialize<<std::sync::once_lock::OnceLock<alloc::string::String>>::get_or_init<public_typst_behavior::linnest_public_svg::{closure#0}>::{closure#0}, !>::{closure#0}>::{closure#0}
177.54 s
gammaloop-nextest-clinnet> 5: <std::sys::sync::once::futex::Once>::call
177.54 s
gammaloop-nextest-clinnet> 6: <std::sync::once_lock::OnceLock<alloc::string::String>>::initialize::<<std::sync::once_lock::OnceLock<alloc::string::String>>::get_or_init<public_typst_behavior::linnest_public_svg::{closure#0}>::{closure#0}, !>
177.54 s
gammaloop-nextest-clinnet> 7: <public_typst_behavior::public_linnest_momentum_layers_place_shafts_and_labels::{closure#0} as core::ops::function::FnOnce<()>>::call_once
177.54 s
gammaloop-nextest-clinnet> note: Some details are omitted, run with `RUST_BACKTRACE=full` for a verbose backtrace.
177.54 s
gammaloop-nextest-clinnet>
185.83 s
gammaloop-nextest-clinnet> ------------
185.83 s
gammaloop-nextest-clinnet> Summary [ 131.047s] 38 tests run: 35 passed (4 slow ), 3 failed , 0 skipped
185.83 s
gammaloop-nextest-clinnet> FAIL [ 68.163s] (32/38) clinnet::public_typst_behavior public_linnest_arrow_shafts_and_crossing_gaps
185.83 s
gammaloop-nextest-clinnet> stdout ---
185.83 s
gammaloop-nextest-clinnet>
185.83 s
gammaloop-nextest-clinnet> running 1 test
185.83 s
gammaloop-nextest-clinnet> test public_linnest_arrow_shafts_and_crossing_gaps has been running for over 60 seconds
185.83 s
gammaloop-nextest-clinnet> test public_linnest_arrow_shafts_and_crossing_gaps ... FAILED
185.83 s
gammaloop-nextest-clinnet>
185.83 s
gammaloop-nextest-clinnet> failures:
185.83 s
gammaloop-nextest-clinnet>
185.83 s
gammaloop-nextest-clinnet> failures:
185.83 s
gammaloop-nextest-clinnet> public_linnest_arrow_shafts_and_crossing_gaps
185.83 s
gammaloop-nextest-clinnet>
185.83 s
gammaloop-nextest-clinnet> test result: FAILED. 0 passed; 1 failed; 0 ignored; 0 measured; 17 filtered out; finished in 68.15s
185.83 s
gammaloop-nextest-clinnet>
185.83 s
gammaloop-nextest-clinnet> stderr ---
185.83 s
gammaloop-nextest-clinnet>
185.83 s
gammaloop-nextest-clinnet> thread 'public_linnest_arrow_shafts_and_crossing_gaps' (258) panicked at crates/clinnet/tests/public_typst_behavior.rs:81:55:
185.83 s
gammaloop-nextest-clinnet> called `Result::unwrap()` on an `Err` value: typst failed while compiling template /build/.tmpc2nhYk/.clinnet/templates/linnest-public-behavior.svg
185.83 s
gammaloop-nextest-clinnet>
185.83 s
gammaloop-nextest-clinnet> Command executed:
185.83 s
gammaloop-nextest-clinnet> "typst" "c" "/build/.tmpc2nhYk/.clinnet/templates/linnest-public-behavior.typ" "/build/.tmpc2nhYk/.clinnet/templates/linnest-public-behavior.svg" "--root" "/build/.tmpc2nhYk/.clinnet/templates"
185.83 s
gammaloop-nextest-clinnet>
185.83 s
gammaloop-nextest-clinnet> Typst stdout:
185.83 s
gammaloop-nextest-clinnet>
185.83 s
gammaloop-nextest-clinnet>
185.83 s
gammaloop-nextest-clinnet> Typst stderr:
185.83 s
gammaloop-nextest-clinnet>
185.83 s
gammaloop-nextest-clinnet>
185.83 s
gammaloop-nextest-clinnet> Location:
185.83 s
gammaloop-nextest-clinnet> crates/clinnet/src/lib.rs:741:13
185.83 s
gammaloop-nextest-clinnet> stack backtrace:
185.83 s
gammaloop-nextest-clinnet> 0: __rustc::rust_begin_unwind
185.83 s
gammaloop-nextest-clinnet> 1: core::panicking::panic_fmt
185.83 s
gammaloop-nextest-clinnet> 2: core::result::unwrap_failed
185.83 s
gammaloop-nextest-clinnet> 3: public_typst_behavior::render
185.83 s
gammaloop-nextest-clinnet> 4: <std::sync::once::Once>::call_once_force::<<std::sync::once_lock::OnceLock<alloc::string::String>>::initialize<<std::sync::once_lock::OnceLock<alloc::string::String>>::get_or_init<public_typst_behavior::linnest_public_svg::{closure#0}>::{closure#0}, !>::{closure#0}>::{closure#0}
185.83 s
gammaloop-nextest-clinnet> 5: <std::sys::sync::once::futex::Once>::call
185.83 s
gammaloop-nextest-clinnet> 6: <std::sync::once_lock::OnceLock<alloc::string::String>>::initialize::<<std::sync::once_lock::OnceLock<alloc::string::String>>::get_or_init<public_typst_behavior::linnest_public_svg::{closure#0}>::{closure#0}, !>
185.83 s
gammaloop-nextest-clinnet> 7: <public_typst_behavior::public_linnest_arrow_shafts_and_crossing_gaps::{closure#0} as core::ops::function::FnOnce<()>>::call_once
185.83 s
gammaloop-nextest-clinnet> note: Some details are omitted, run with `RUST_BACKTRACE=full` for a verbose backtrace.
185.83 s
gammaloop-nextest-clinnet>
185.83 s
gammaloop-nextest-clinnet> FAIL [ 70.989s] (33/38) clinnet::public_typst_behavior public_linnest_edge_styles_skip_fallbacks
185.83 s
gammaloop-nextest-clinnet> stdout ---
185.83 s
gammaloop-nextest-clinnet>
185.83 s
gammaloop-nextest-clinnet> running 1 test
185.83 s
gammaloop-nextest-clinnet> test public_linnest_edge_styles_skip_fallbacks has been running for over 60 seconds
185.83 s
gammaloop-nextest-clinnet> test public_linnest_edge_styles_skip_fallbacks ... FAILED
185.83 s
gammaloop-nextest-clinnet>
185.83 s
gammaloop-nextest-clinnet> failures:
185.83 s
gammaloop-nextest-clinnet>
185.83 s
gammaloop-nextest-clinnet> failures:
185.83 s
gammaloop-nextest-clinnet> public_linnest_edge_styles_skip_fallbacks
185.83 s
gammaloop-nextest-clinnet>
185.83 s
gammaloop-nextest-clinnet> test result: FAILED. 0 passed; 1 failed; 0 ignored; 0 measured; 17 filtered out; finished in 70.98s
185.83 s
gammaloop-nextest-clinnet>
185.83 s
gammaloop-nextest-clinnet> stderr ---
185.83 s
gammaloop-nextest-clinnet>
185.83 s
gammaloop-nextest-clinnet> thread 'public_linnest_edge_styles_skip_fallbacks' (277) panicked at crates/clinnet/tests/public_typst_behavior.rs:81:55:
185.83 s
gammaloop-nextest-clinnet> called `Result::unwrap()` on an `Err` value: typst failed while compiling template /build/.tmpDBd4KZ/.clinnet/templates/linnest-public-behavior.svg
185.83 s
gammaloop-nextest-clinnet>
185.83 s
gammaloop-nextest-clinnet> Command executed:
185.83 s
gammaloop-nextest-clinnet> "typst" "c" "/build/.tmpDBd4KZ/.clinnet/templates/linnest-public-behavior.typ" "/build/.tmpDBd4KZ/.clinnet/templates/linnest-public-behavior.svg" "--root" "/build/.tmpDBd4KZ/.clinnet/templates"
185.83 s
gammaloop-nextest-clinnet>
185.83 s
gammaloop-nextest-clinnet> Typst stdout:
185.83 s
gammaloop-nextest-clinnet>
185.83 s
gammaloop-nextest-clinnet>
185.83 s
gammaloop-nextest-clinnet> Typst stderr:
185.83 s
gammaloop-nextest-clinnet>
185.83 s
gammaloop-nextest-clinnet>
185.83 s
gammaloop-nextest-clinnet> Location:
185.83 s
gammaloop-nextest-clinnet> crates/clinnet/src/lib.rs:741:13
185.83 s
gammaloop-nextest-clinnet> stack backtrace:
185.83 s
gammaloop-nextest-clinnet> 0: __rustc::rust_begin_unwind
185.83 s
gammaloop-nextest-clinnet> 1: core::panicking::panic_fmt
185.83 s
gammaloop-nextest-clinnet> 2: core::result::unwrap_failed
185.83 s
gammaloop-nextest-clinnet> 3: public_typst_behavior::render
185.83 s
gammaloop-nextest-clinnet> 4: <std::sync::once::Once>::call_once_force::<<std::sync::once_lock::OnceLock<alloc::string::String>>::initialize<<std::sync::once_lock::OnceLock<alloc::string::String>>::get_or_init<public_typst_behavior::linnest_public_svg::{closure#0}>::{closure#0}, !>::{closure#0}>::{closure#0}
185.83 s
gammaloop-nextest-clinnet> 5: <std::sys::sync::once::futex::Once>::call
185.83 s
gammaloop-nextest-clinnet> 6: <std::sync::once_lock::OnceLock<alloc::string::String>>::initialize::<<std::sync::once_lock::OnceLock<alloc::string::String>>::get_or_init<public_typst_behavior::linnest_public_svg::{closure#0}>::{closure#0}, !>
185.83 s
gammaloop-nextest-clinnet> 7: <public_typst_behavior::public_linnest_edge_styles_skip_fallbacks::{closure#0} as core::ops::function::FnOnce<()>>::call_once
185.83 s
gammaloop-nextest-clinnet> note: Some details are omitted, run with `RUST_BACKTRACE=full` for a verbose backtrace.
185.83 s
gammaloop-nextest-clinnet>
185.83 s
gammaloop-nextest-clinnet> FAIL [ 122.723s] (34/38) clinnet::public_typst_behavior public_linnest_momentum_layers_place_shafts_and_labels
185.83 s
gammaloop-nextest-clinnet> stdout ---
185.83 s
gammaloop-nextest-clinnet>
185.83 s
gammaloop-nextest-clinnet> running 1 test
185.83 s
gammaloop-nextest-clinnet> test public_linnest_momentum_layers_place_shafts_and_labels has been running for over 60 seconds
185.83 s
gammaloop-nextest-clinnet> test public_linnest_momentum_layers_place_shafts_and_labels ... FAILED
185.83 s
gammaloop-nextest-clinnet>
185.83 s
gammaloop-nextest-clinnet> failures:
185.83 s
gammaloop-nextest-clinnet>
185.83 s
gammaloop-nextest-clinnet> failures:
185.83 s
gammaloop-nextest-clinnet> public_linnest_momentum_layers_place_shafts_and_labels
185.83 s
gammaloop-nextest-clinnet>
185.83 s
gammaloop-nextest-clinnet> test result: FAILED. 0 passed; 1 failed; 0 ignored; 0 measured; 17 filtered out; finished in 122.71s
185.83 s
gammaloop-nextest-clinnet>
185.83 s
gammaloop-nextest-clinnet> stderr ---
185.83 s
gammaloop-nextest-clinnet>
185.83 s
gammaloop-nextest-clinnet> thread 'public_linnest_momentum_layers_place_shafts_and_labels' (283) panicked at crates/clinnet/tests/public_typst_behavior.rs:81:55:
185.83 s
gammaloop-nextest-clinnet> called `Result::unwrap()` on an `Err` value: typst failed while compiling template /build/.tmpv1f5m6/.clinnet/templates/linnest-public-behavior.svg
185.83 s
gammaloop-nextest-clinnet>
185.83 s
gammaloop-nextest-clinnet> Command executed:
185.83 s
gammaloop-nextest-clinnet> "typst" "c" "/build/.tmpv1f5m6/.clinnet/templates/linnest-public-behavior.typ" "/build/.tmpv1f5m6/.clinnet/templates/linnest-public-behavior.svg" "--root" "/build/.tmpv1f5m6/.clinnet/templates"
185.83 s
gammaloop-nextest-clinnet>
185.83 s
gammaloop-nextest-clinnet> Typst stdout:
185.83 s
gammaloop-nextest-clinnet>
185.83 s
gammaloop-nextest-clinnet>
185.83 s
gammaloop-nextest-clinnet> Typst stderr:
185.83 s
gammaloop-nextest-clinnet>
185.83 s
gammaloop-nextest-clinnet>
185.83 s
gammaloop-nextest-clinnet> Location:
185.83 s
gammaloop-nextest-clinnet> crates/clinnet/src/lib.rs:741:13
185.83 s
gammaloop-nextest-clinnet> stack backtrace:
185.83 s
gammaloop-nextest-clinnet> 0: __rustc::rust_begin_unwind
185.83 s
gammaloop-nextest-clinnet> 1: core::panicking::panic_fmt
185.83 s
gammaloop-nextest-clinnet> 2: core::result::unwrap_failed
185.83 s
gammaloop-nextest-clinnet> 3: public_typst_behavior::render
185.83 s
gammaloop-nextest-clinnet> 4: <std::sync::once::Once>::call_once_force::<<std::sync::once_lock::OnceLock<alloc::string::String>>::initialize<<std::sync::once_lock::OnceLock<alloc::string::String>>::get_or_init<public_typst_behavior::linnest_public_svg::{closure#0}>::{closure#0}, !>::{closure#0}>::{closure#0}
185.83 s
gammaloop-nextest-clinnet> 5: <std::sys::sync::once::futex::Once>::call
185.83 s
gammaloop-nextest-clinnet> 6: <std::sync::once_lock::OnceLock<alloc::string::String>>::initialize::<<std::sync::once_lock::OnceLock<alloc::string::String>>::get_or_init<public_typst_behavior::linnest_public_svg::{closure#0}>::{closure#0}, !>
185.83 s
gammaloop-nextest-clinnet> 7: <public_typst_behavior::public_linnest_momentum_layers_place_shafts_and_labels::{closure#0} as core::ops::function::FnOnce<()>>::call_once
185.83 s
gammaloop-nextest-clinnet> note: Some details are omitted, run with `RUST_BACKTRACE=full` for a verbose backtrace.
185.83 s
gammaloop-nextest-clinnet>
185.84 s
gammaloop-nextest-clinnet> error : test run failed
185.91 s
gammaloop-nextest-clinnet>
185.91 s
gammaloop-nextest-clinnet> ========== nextest test summary ==========
185.91 s
gammaloop-nextest-clinnet> report: target/nextest/ci_gammaloop/junit.xml
185.91 s
gammaloop-nextest-clinnet> tests: 38, failures: 3, errors: 0
185.91 s
gammaloop-nextest-clinnet>
185.91 s
gammaloop-nextest-clinnet> 1. clinnet::public_typst_behavior::public_linnest_arrow_shafts_and_crossing_gaps
185.91 s
gammaloop-nextest-clinnet> failure: test failure with exit code 101
185.91 s
gammaloop-nextest-clinnet> thread 'public_linnest_arrow_shafts_and_crossing_gaps' (258) panicked at crates/clinnet/tests/public_typst_behavior.rs:81:55:
185.91 s
gammaloop-nextest-clinnet> called `Result::unwrap()` on an `Err` value: typst failed while compiling template /build/.tmpc2nhYk/.clinnet/templates/linnest-public-behavior.svg
185.91 s
gammaloop-nextest-clinnet>
185.91 s
gammaloop-nextest-clinnet> Command executed:
185.91 s
gammaloop-nextest-clinnet> "typst" "c" "/build/.tmpc2nhYk/.clinnet/templates/linnest-public-behavior.typ" "/build/.tmpc2nhYk/.clinnet/templates/linnest-public-behavior.svg" "--root" "/build/.tmpc2nhYk/.clinnet/templates"
185.91 s
gammaloop-nextest-clinnet>
185.91 s
gammaloop-nextest-clinnet> Typst stdout:
185.91 s
gammaloop-nextest-clinnet>
185.91 s
gammaloop-nextest-clinnet>
185.91 s
gammaloop-nextest-clinnet> Typst stderr:
185.91 s
gammaloop-nextest-clinnet>
185.91 s
gammaloop-nextest-clinnet>
185.91 s
gammaloop-nextest-clinnet> Location:
185.91 s
gammaloop-nextest-clinnet> crates/clinnet/src/lib.rs:741:13
185.91 s
gammaloop-nextest-clinnet> stack backtrace:
185.91 s
gammaloop-nextest-clinnet> 0: __rustc::rust_begin_unwind
185.91 s
gammaloop-nextest-clinnet> 1: core::panicking::panic_fmt
185.91 s
gammaloop-nextest-clinnet> 2: core::result::unwrap_failed
185.91 s
gammaloop-nextest-clinnet> 3: public_typst_behavior::render
185.91 s
gammaloop-nextest-clinnet> 4: <std::sync::once::Once>::call_once_force::<<std::sync::once_lock::OnceLock<alloc::string::String>>::initialize<<std::sync::once_lock::OnceLock<alloc::string::String>>::get_or_init<public_typst_behavior::linnest_public_svg::{closure#0}>::{closure#0}, !>::{closure#0}>::{closure#0}
185.91 s
gammaloop-nextest-clinnet> 5: <std::sys::sync::once::futex::Once>::call
185.91 s
gammaloop-nextest-clinnet> 6: <std::sync::once_lock::OnceLock<alloc::string::String>>::initialize::<<std::sync::once_lock::OnceLock<alloc::string::String>>::get_or_init<public_typst_behavior::linnest_public_svg::{closure#0}>::{closure#0}, !>
185.91 s
gammaloop-nextest-clinnet> 7: <public_typst_behavior::public_linnest_arrow_shafts_and_crossing_gaps::{closure#0} as core::ops::function::FnOnce<()>>::call_once
185.91 s
gammaloop-nextest-clinnet> note: Some details are omitted, run with `RUST_BACKTRACE=full` for a verbose backtrace.
185.91 s
gammaloop-nextest-clinnet> system-out
185.91 s
gammaloop-nextest-clinnet> running 1 test
185.91 s
gammaloop-nextest-clinnet> test public_linnest_arrow_shafts_and_crossing_gaps has been running for over 60 seconds
185.91 s
gammaloop-nextest-clinnet> test public_linnest_arrow_shafts_and_crossing_gaps ... FAILED
185.91 s
gammaloop-nextest-clinnet>
185.91 s
gammaloop-nextest-clinnet> failures:
185.91 s
gammaloop-nextest-clinnet>
185.91 s
gammaloop-nextest-clinnet> failures:
185.91 s
gammaloop-nextest-clinnet> public_linnest_arrow_shafts_and_crossing_gaps
185.91 s
gammaloop-nextest-clinnet>
185.91 s
gammaloop-nextest-clinnet> test result: FAILED. 0 passed; 1 failed; 0 ignored; 0 measured; 17 filtered out; finished in 68.15s
185.91 s
gammaloop-nextest-clinnet> system-err
185.91 s
gammaloop-nextest-clinnet> thread 'public_linnest_arrow_shafts_and_crossing_gaps' (258) panicked at crates/clinnet/tests/public_typst_behavior.rs:81:55:
185.91 s
gammaloop-nextest-clinnet> called `Result::unwrap()` on an `Err` value: typst failed while compiling template /build/.tmpc2nhYk/.clinnet/templates/linnest-public-behavior.svg
185.91 s
gammaloop-nextest-clinnet>
185.91 s
gammaloop-nextest-clinnet> Command executed:
185.91 s
gammaloop-nextest-clinnet> "typst" "c" "/build/.tmpc2nhYk/.clinnet/templates/linnest-public-behavior.typ" "/build/.tmpc2nhYk/.clinnet/templates/linnest-public-behavior.svg" "--root" "/build/.tmpc2nhYk/.clinnet/templates"
185.91 s
gammaloop-nextest-clinnet>
185.91 s
gammaloop-nextest-clinnet> Typst stdout:
185.91 s
gammaloop-nextest-clinnet>
185.91 s
gammaloop-nextest-clinnet>
185.91 s
gammaloop-nextest-clinnet> Typst stderr:
185.91 s
gammaloop-nextest-clinnet>
185.91 s
gammaloop-nextest-clinnet>
185.91 s
gammaloop-nextest-clinnet> Location:
185.91 s
gammaloop-nextest-clinnet> crates/clinnet/src/lib.rs:741:13
185.91 s
gammaloop-nextest-clinnet> stack backtrace:
185.91 s
gammaloop-nextest-clinnet> 0: __rustc::rust_begin_unwind
185.91 s
gammaloop-nextest-clinnet> 1: core::panicking::panic_fmt
185.91 s
gammaloop-nextest-clinnet> 2: core::result::unwrap_failed
185.91 s
gammaloop-nextest-clinnet> 3: public_typst_behavior::render
185.91 s
gammaloop-nextest-clinnet> 4: <std::sync::once::Once>::call_once_force::<<std::sync::once_lock::OnceLock<alloc::string::String>>::initialize<<std::sync::once_lock::OnceLock<alloc::string::String>>::get_or_init<public_typst_behavior::linnest_public_svg::{closure#0}>::{closure#0}, !>::{closure#0}>::{closure#0}
185.91 s
gammaloop-nextest-clinnet> 5: <std::sys::sync::once::futex::Once>::call
185.91 s
gammaloop-nextest-clinnet> 6: <std::sync::once_lock::OnceLock<alloc::string::String>>::initialize::<<std::sync::once_lock::OnceLock<alloc::string::String>>::get_or_init<public_typst_behavior::linnest_public_svg::{closure#0}>::{closure#0}, !>
185.91 s
gammaloop-nextest-clinnet> 7: <public_typst_behavior::public_linnest_arrow_shafts_and_crossing_gaps::{closure#0} as core::ops::function::FnOnce<()>>::call_once
185.91 s
gammaloop-nextest-clinnet> note: Some details are omitted, run with `RUST_BACKTRACE=full` for a verbose backtrace.
185.91 s
gammaloop-nextest-clinnet>
185.91 s
gammaloop-nextest-clinnet> 2. clinnet::public_typst_behavior::public_linnest_edge_styles_skip_fallbacks
185.91 s
gammaloop-nextest-clinnet> failure: test failure with exit code 101
185.91 s
gammaloop-nextest-clinnet> thread 'public_linnest_edge_styles_skip_fallbacks' (277) panicked at crates/clinnet/tests/public_typst_behavior.rs:81:55:
185.91 s
gammaloop-nextest-clinnet> called `Result::unwrap()` on an `Err` value: typst failed while compiling template /build/.tmpDBd4KZ/.clinnet/templates/linnest-public-behavior.svg
185.91 s
gammaloop-nextest-clinnet>
185.91 s
gammaloop-nextest-clinnet> Command executed:
185.91 s
gammaloop-nextest-clinnet> "typst" "c" "/build/.tmpDBd4KZ/.clinnet/templates/linnest-public-behavior.typ" "/build/.tmpDBd4KZ/.clinnet/templates/linnest-public-behavior.svg" "--root" "/build/.tmpDBd4KZ/.clinnet/templates"
185.91 s
gammaloop-nextest-clinnet>
185.91 s
gammaloop-nextest-clinnet> Typst stdout:
185.91 s
gammaloop-nextest-clinnet>
185.91 s
gammaloop-nextest-clinnet>
185.91 s
gammaloop-nextest-clinnet> Typst stderr:
185.91 s
gammaloop-nextest-clinnet>
185.91 s
gammaloop-nextest-clinnet>
185.91 s
gammaloop-nextest-clinnet> Location:
185.91 s
gammaloop-nextest-clinnet> crates/clinnet/src/lib.rs:741:13
185.91 s
gammaloop-nextest-clinnet> stack backtrace:
185.91 s
gammaloop-nextest-clinnet> 0: __rustc::rust_begin_unwind
185.91 s
gammaloop-nextest-clinnet> 1: core::panicking::panic_fmt
185.91 s
gammaloop-nextest-clinnet> 2: core::result::unwrap_failed
185.91 s
gammaloop-nextest-clinnet> 3: public_typst_behavior::render
185.91 s
gammaloop-nextest-clinnet> 4: <std::sync::once::Once>::call_once_force::<<std::sync::once_lock::OnceLock<alloc::string::String>>::initialize<<std::sync::once_lock::OnceLock<alloc::string::String>>::get_or_init<public_typst_behavior::linnest_public_svg::{closure#0}>::{closure#0}, !>::{closure#0}>::{closure#0}
185.91 s
gammaloop-nextest-clinnet> 5: <std::sys::sync::once::futex::Once>::call
185.91 s
gammaloop-nextest-clinnet> 6: <std::sync::once_lock::OnceLock<alloc::string::String>>::initialize::<<std::sync::once_lock::OnceLock<alloc::string::String>>::get_or_init<public_typst_behavior::linnest_public_svg::{closure#0}>::{closure#0}, !>
185.91 s
gammaloop-nextest-clinnet> 7: <public_typst_behavior::public_linnest_edge_styles_skip_fallbacks::{closure#0} as core::ops::function::FnOnce<()>>::call_once
185.91 s
gammaloop-nextest-clinnet> note: Some details are omitted, run with `RUST_BACKTRACE=full` for a verbose backtrace.
185.91 s
gammaloop-nextest-clinnet> system-out
185.91 s
gammaloop-nextest-clinnet> running 1 test
185.91 s
gammaloop-nextest-clinnet> test public_linnest_edge_styles_skip_fallbacks has been running for over 60 seconds
185.91 s
gammaloop-nextest-clinnet> test public_linnest_edge_styles_skip_fallbacks ... FAILED
185.91 s
gammaloop-nextest-clinnet>
185.91 s
gammaloop-nextest-clinnet> failures:
185.91 s
gammaloop-nextest-clinnet>
185.91 s
gammaloop-nextest-clinnet> failures:
185.91 s
gammaloop-nextest-clinnet> public_linnest_edge_styles_skip_fallbacks
185.91 s
gammaloop-nextest-clinnet>
185.91 s
gammaloop-nextest-clinnet> test result: FAILED. 0 passed; 1 failed; 0 ignored; 0 measured; 17 filtered out; finished in 70.98s
185.91 s
gammaloop-nextest-clinnet> system-err
185.91 s
gammaloop-nextest-clinnet> thread 'public_linnest_edge_styles_skip_fallbacks' (277) panicked at crates/clinnet/tests/public_typst_behavior.rs:81:55:
185.91 s
gammaloop-nextest-clinnet> called `Result::unwrap()` on an `Err` value: typst failed while compiling template /build/.tmpDBd4KZ/.clinnet/templates/linnest-public-behavior.svg
185.91 s
gammaloop-nextest-clinnet>
185.91 s
gammaloop-nextest-clinnet> Command executed:
185.91 s
gammaloop-nextest-clinnet> "typst" "c" "/build/.tmpDBd4KZ/.clinnet/templates/linnest-public-behavior.typ" "/build/.tmpDBd4KZ/.clinnet/templates/linnest-public-behavior.svg" "--root" "/build/.tmpDBd4KZ/.clinnet/templates"
185.91 s
gammaloop-nextest-clinnet>
185.91 s
gammaloop-nextest-clinnet> Typst stdout:
185.91 s
gammaloop-nextest-clinnet>
185.91 s
gammaloop-nextest-clinnet>
185.91 s
gammaloop-nextest-clinnet> Typst stderr:
185.91 s
gammaloop-nextest-clinnet>
185.91 s
gammaloop-nextest-clinnet>
185.91 s
gammaloop-nextest-clinnet> Location:
185.91 s
gammaloop-nextest-clinnet> crates/clinnet/src/lib.rs:741:13
185.91 s
gammaloop-nextest-clinnet> stack backtrace:
185.91 s
gammaloop-nextest-clinnet> 0: __rustc::rust_begin_unwind
185.91 s
gammaloop-nextest-clinnet> 1: core::panicking::panic_fmt
185.91 s
gammaloop-nextest-clinnet> 2: core::result::unwrap_failed
185.91 s
gammaloop-nextest-clinnet> 3: public_typst_behavior::render
185.91 s
gammaloop-nextest-clinnet> 4: <std::sync::once::Once>::call_once_force::<<std::sync::once_lock::OnceLock<alloc::string::String>>::initialize<<std::sync::once_lock::OnceLock<alloc::string::String>>::get_or_init<public_typst_behavior::linnest_public_svg::{closure#0}>::{closure#0}, !>::{closure#0}>::{closure#0}
185.91 s
gammaloop-nextest-clinnet> 5: <std::sys::sync::once::futex::Once>::call
185.91 s
gammaloop-nextest-clinnet> 6: <std::sync::once_lock::OnceLock<alloc::string::String>>::initialize::<<std::sync::once_lock::OnceLock<alloc::string::String>>::get_or_init<public_typst_behavior::linnest_public_svg::{closure#0}>::{closure#0}, !>
185.91 s
gammaloop-nextest-clinnet> 7: <public_typst_behavior::public_linnest_edge_styles_skip_fallbacks::{closure#0} as core::ops::function::FnOnce<()>>::call_once
185.91 s
gammaloop-nextest-clinnet> note: Some details are omitted, run with `RUST_BACKTRACE=full` for a verbose backtrace.
185.91 s
gammaloop-nextest-clinnet>
185.91 s
gammaloop-nextest-clinnet> 3. clinnet::public_typst_behavior::public_linnest_momentum_layers_place_shafts_and_labels
185.91 s
gammaloop-nextest-clinnet> failure: test failure with exit code 101
185.91 s
gammaloop-nextest-clinnet> thread 'public_linnest_momentum_layers_place_shafts_and_labels' (283) panicked at crates/clinnet/tests/public_typst_behavior.rs:81:55:
185.91 s
gammaloop-nextest-clinnet> called `Result::unwrap()` on an `Err` value: typst failed while compiling template /build/.tmpv1f5m6/.clinnet/templates/linnest-public-behavior.svg
185.91 s
gammaloop-nextest-clinnet>
185.91 s
gammaloop-nextest-clinnet> Command executed:
185.91 s
gammaloop-nextest-clinnet> "typst" "c" "/build/.tmpv1f5m6/.clinnet/templates/linnest-public-behavior.typ" "/build/.tmpv1f5m6/.clinnet/templates/linnest-public-behavior.svg" "--root" "/build/.tmpv1f5m6/.clinnet/templates"
185.91 s
gammaloop-nextest-clinnet>
185.91 s
gammaloop-nextest-clinnet> Typst stdout:
185.91 s
gammaloop-nextest-clinnet>
185.91 s
gammaloop-nextest-clinnet>
185.91 s
gammaloop-nextest-clinnet> Typst stderr:
185.91 s
gammaloop-nextest-clinnet>
185.91 s
gammaloop-nextest-clinnet>
185.91 s
gammaloop-nextest-clinnet> Location:
185.91 s
gammaloop-nextest-clinnet> crates/clinnet/src/lib.rs:741:13
185.91 s
gammaloop-nextest-clinnet> stack backtrace:
185.91 s
gammaloop-nextest-clinnet> 0: __rustc::rust_begin_unwind
185.91 s
gammaloop-nextest-clinnet> 1: core::panicking::panic_fmt
185.91 s
gammaloop-nextest-clinnet> 2: core::result::unwrap_failed
185.91 s
gammaloop-nextest-clinnet> 3: public_typst_behavior::render
185.91 s
gammaloop-nextest-clinnet> 4: <std::sync::once::Once>::call_once_force::<<std::sync::once_lock::OnceLock<alloc::string::String>>::initialize<<std::sync::once_lock::OnceLock<alloc::string::String>>::get_or_init<public_typst_behavior::linnest_public_svg::{closure#0}>::{closure#0}, !>::{closure#0}>::{closure#0}
185.91 s
gammaloop-nextest-clinnet> 5: <std::sys::sync::once::futex::Once>::call
185.91 s
gammaloop-nextest-clinnet> 6: <std::sync::once_lock::OnceLock<alloc::string::String>>::initialize::<<std::sync::once_lock::OnceLock<alloc::string::String>>::get_or_init<public_typst_behavior::linnest_public_svg::{closure#0}>::{closure#0}, !>
185.91 s
gammaloop-nextest-clinnet> 7: <public_typst_behavior::public_linnest_momentum_layers_place_shafts_and_labels::{closure#0} as core::ops::function::FnOnce<()>>::call_once
185.91 s
gammaloop-nextest-clinnet> note: Some details are omitted, run with `RUST_BACKTRACE=full` for a verbose backtrace.
185.91 s
gammaloop-nextest-clinnet> system-out
185.91 s
gammaloop-nextest-clinnet> running 1 test
185.91 s
gammaloop-nextest-clinnet> test public_linnest_momentum_layers_place_shafts_and_labels has been running for over 60 seconds
185.91 s
gammaloop-nextest-clinnet> test public_linnest_momentum_layers_place_shafts_and_labels ... FAILED
185.91 s
gammaloop-nextest-clinnet>
185.91 s
gammaloop-nextest-clinnet> failures:
185.91 s
gammaloop-nextest-clinnet>
185.91 s
gammaloop-nextest-clinnet> failures:
185.91 s
gammaloop-nextest-clinnet> public_linnest_momentum_layers_place_shafts_and_labels
185.91 s
gammaloop-nextest-clinnet>
185.91 s
gammaloop-nextest-clinnet> test result: FAILED. 0 passed; 1 failed; 0 ignored; 0 measured; 17 filtered out; finished in 122.71s
185.91 s
gammaloop-nextest-clinnet> system-err
185.91 s
gammaloop-nextest-clinnet> thread 'public_linnest_momentum_layers_place_shafts_and_labels' (283) panicked at crates/clinnet/tests/public_typst_behavior.rs:81:55:
185.91 s
gammaloop-nextest-clinnet> called `Result::unwrap()` on an `Err` value: typst failed while compiling template /build/.tmpv1f5m6/.clinnet/templates/linnest-public-behavior.svg
185.91 s
gammaloop-nextest-clinnet>
185.91 s
gammaloop-nextest-clinnet> Command executed:
185.91 s
gammaloop-nextest-clinnet> "typst" "c" "/build/.tmpv1f5m6/.clinnet/templates/linnest-public-behavior.typ" "/build/.tmpv1f5m6/.clinnet/templates/linnest-public-behavior.svg" "--root" "/build/.tmpv1f5m6/.clinnet/templates"
185.91 s
gammaloop-nextest-clinnet>
185.91 s
gammaloop-nextest-clinnet> Typst stdout:
185.91 s
gammaloop-nextest-clinnet>
185.91 s
gammaloop-nextest-clinnet>
185.91 s
gammaloop-nextest-clinnet> Typst stderr:
185.91 s
gammaloop-nextest-clinnet>
185.91 s
gammaloop-nextest-clinnet>
185.91 s
gammaloop-nextest-clinnet> Location:
185.91 s
gammaloop-nextest-clinnet> crates/clinnet/src/lib.rs:741:13
185.91 s
gammaloop-nextest-clinnet> stack backtrace:
185.91 s
gammaloop-nextest-clinnet> 0: __rustc::rust_begin_unwind
185.91 s
gammaloop-nextest-clinnet> 1: core::panicking::panic_fmt
185.91 s
gammaloop-nextest-clinnet> 2: core::result::unwrap_failed
185.91 s
gammaloop-nextest-clinnet> 3: public_typst_behavior::render
185.91 s
gammaloop-nextest-clinnet> 4: <std::sync::once::Once>::call_once_force::<<std::sync::once_lock::OnceLock<alloc::string::String>>::initialize<<std::sync::once_lock::OnceLock<alloc::string::String>>::get_or_init<public_typst_behavior::linnest_public_svg::{closure#0}>::{closure#0}, !>::{closure#0}>::{closure#0}
185.91 s
gammaloop-nextest-clinnet> 5: <std::sys::sync::once::futex::Once>::call
185.91 s
gammaloop-nextest-clinnet> 6: <std::sync::once_lock::OnceLock<alloc::string::String>>::initialize::<<std::sync::once_lock::OnceLock<alloc::string::String>>::get_or_init<public_typst_behavior::linnest_public_svg::{closure#0}>::{closure#0}, !>
185.91 s
gammaloop-nextest-clinnet> 7: <public_typst_behavior::public_linnest_momentum_layers_place_shafts_and_labels::{closure#0} as core::ops::function::FnOnce<()>>::call_once
185.91 s
gammaloop-nextest-clinnet> note: Some details are omitted, run with `RUST_BACKTRACE=full` for a verbose backtrace.
185.91 s
gammaloop-nextest-clinnet> =========================================
186.03 s
[0 built (1 failed )]error: Cannot build '/nix/store/4pqspwvh8pi9s2vg9g6mfsggpl9ynwzx-gammaloop-nextest-clinnet.drv '.
186.03 s
Reason: builder failed with exit code 100 .
186.03 s
Output paths:
186.03 s
/nix/store/v9zka7gxdrym1pq03r0i4w2q43fgdwcq-gammaloop-nextest-clinnet
186.03 s
Last 449 log lines:
186.03 s
> Nextest worker budget: 16
186.03 s
> Extracting 4 binaries (including 1 non-test binary), 1 build script output directory, and 1 linked path to /build/source
186.03 s
> Extracted 16 files to /build/source in 0.09s
186.03 s
> ------------
186.03 s
> Nextest run ID 6244babb-ea3c-4cec-a105-b786d8602a20 with nextest profile: ci_gammaloop
186.03 s
> Starting 38 tests across 3 binaries
186.03 s
> FAIL [ 68.163s] (32/38) clinnet::public_typst_behavior public_linnest_arrow_shafts_and_crossing_gaps
186.03 s
> stdout ---
186.03 s
>
186.03 s
> running 1 test
186.03 s
> test public_linnest_arrow_shafts_and_crossing_gaps has been running for over 60 seconds
186.03 s
> test public_linnest_arrow_shafts_and_crossing_gaps ... FAILED
186.03 s
>
186.03 s
> failures:
186.03 s
>
186.03 s
> failures:
186.03 s
> public_linnest_arrow_shafts_and_crossing_gaps
186.03 s
>
186.03 s
> test result: FAILED. 0 passed; 1 failed; 0 ignored; 0 measured; 17 filtered out; finished in 68.15s
186.03 s
>
186.03 s
> stderr ---
186.03 s
>
186.03 s
> thread 'public_linnest_arrow_shafts_and_crossing_gaps' (258) panicked at crates/clinnet/tests/public_typst_behavior.rs:81:55:
186.03 s
> called `Result::unwrap()` on an `Err` value: typst failed while compiling template /build/.tmpc2nhYk/.clinnet/templates/linnest-public-behavior.svg
186.03 s
>
186.03 s
> Command executed:
186.03 s
> "typst" "c" "/build/.tmpc2nhYk/.clinnet/templates/linnest-public-behavior.typ" "/build/.tmpc2nhYk/.clinnet/templates/linnest-public-behavior.svg" "--root" "/build/.tmpc2nhYk/.clinnet/templates"
186.03 s
>
186.03 s
> Typst stdout:
186.03 s
>
186.03 s
>
186.03 s
> Typst stderr:
186.03 s
>
186.03 s
>
186.03 s
> Location:
186.03 s
> crates/clinnet/src/lib.rs:741:13
186.03 s
> stack backtrace:
186.03 s
> 0: __rustc::rust_begin_unwind
186.03 s
> 1: core::panicking::panic_fmt
186.03 s
> 2: core::result::unwrap_failed
186.03 s
> 3: public_typst_behavior::render
186.03 s
> 4: <std::sync::once::Once>::call_once_force::<<std::sync::once_lock::OnceLock<alloc::string::String>>::initialize<<std::sync::once_lock::OnceLock<alloc::string::String>>::get_or_init<public_typst_behavior::linnest_public_svg::{closure#0}>::{closure#0}, !>::{closure#0}>::{closure#0}
186.03 s
> 5: <std::sys::sync::once::futex::Once>::call
186.03 s
> 6: <std::sync::once_lock::OnceLock<alloc::string::String>>::initialize::<<std::sync::once_lock::OnceLock<alloc::string::String>>::get_or_init<public_typst_behavior::linnest_public_svg::{closure#0}>::{closure#0}, !>
186.03 s
> 7: <public_typst_behavior::public_linnest_arrow_shafts_and_crossing_gaps::{closure#0} as core::ops::function::FnOnce<()>>::call_once
186.03 s
> note: Some details are omitted, run with `RUST_BACKTRACE=full` for a verbose backtrace.
186.03 s
>
186.03 s
> FAIL [ 70.989s] (33/38) clinnet::public_typst_behavior public_linnest_edge_styles_skip_fallbacks
186.03 s
> stdout ---
186.03 s
>
186.03 s
> running 1 test
186.03 s
> test public_linnest_edge_styles_skip_fallbacks has been running for over 60 seconds
186.03 s
> test public_linnest_edge_styles_skip_fallbacks ... FAILED
186.03 s
>
186.03 s
> failures:
186.03 s
>
186.03 s
> failures:
186.03 s
> public_linnest_edge_styles_skip_fallbacks
186.03 s
>
186.03 s
> test result: FAILED. 0 passed; 1 failed; 0 ignored; 0 measured; 17 filtered out; finished in 70.98s
186.03 s
>
186.03 s
> stderr ---
186.03 s
>
186.03 s
> thread 'public_linnest_edge_styles_skip_fallbacks' (277) panicked at crates/clinnet/tests/public_typst_behavior.rs:81:55:
186.03 s
> called `Result::unwrap()` on an `Err` value: typst failed while compiling template /build/.tmpDBd4KZ/.clinnet/templates/linnest-public-behavior.svg
186.03 s
>
186.03 s
> Command executed:
186.03 s
> "typst" "c" "/build/.tmpDBd4KZ/.clinnet/templates/linnest-public-behavior.typ" "/build/.tmpDBd4KZ/.clinnet/templates/linnest-public-behavior.svg" "--root" "/build/.tmpDBd4KZ/.clinnet/templates"
186.03 s
>
186.03 s
> Typst stdout:
186.03 s
>
186.03 s
>
186.03 s
> Typst stderr:
186.03 s
>
186.03 s
>
186.03 s
> Location:
186.03 s
> crates/clinnet/src/lib.rs:741:13
186.03 s
> stack backtrace:
186.03 s
> 0: __rustc::rust_begin_unwind
186.03 s
> 1: core::panicking::panic_fmt
186.03 s
> 2: core::result::unwrap_failed
186.03 s
> 3: public_typst_behavior::render
186.03 s
> 4: <std::sync::once::Once>::call_once_force::<<std::sync::once_lock::OnceLock<alloc::string::String>>::initialize<<std::sync::once_lock::OnceLock<alloc::string::String>>::get_or_init<public_typst_behavior::linnest_public_svg::{closure#0}>::{closure#0}, !>::{closure#0}>::{closure#0}
186.03 s
> 5: <std::sys::sync::once::futex::Once>::call
186.03 s
> 6: <std::sync::once_lock::OnceLock<alloc::string::String>>::initialize::<<std::sync::once_lock::OnceLock<alloc::string::String>>::get_or_init<public_typst_behavior::linnest_public_svg::{closure#0}>::{closure#0}, !>
186.03 s
> 7: <public_typst_behavior::public_linnest_edge_styles_skip_fallbacks::{closure#0} as core::ops::function::FnOnce<()>>::call_once
186.03 s
> note: Some details are omitted, run with `RUST_BACKTRACE=full` for a verbose backtrace.
186.03 s
>
186.03 s
> FAIL [ 122.723s] (34/38) clinnet::public_typst_behavior public_linnest_momentum_layers_place_shafts_and_labels
186.03 s
> stdout ---
186.03 s
>
186.03 s
> running 1 test
186.03 s
> test public_linnest_momentum_layers_place_shafts_and_labels has been running for over 60 seconds
186.03 s
> test public_linnest_momentum_layers_place_shafts_and_labels ... FAILED
186.03 s
>
186.03 s
> failures:
186.03 s
>
186.03 s
> failures:
186.03 s
> public_linnest_momentum_layers_place_shafts_and_labels
186.03 s
>
186.03 s
> test result: FAILED. 0 passed; 1 failed; 0 ignored; 0 measured; 17 filtered out; finished in 122.71s
186.03 s
>
186.03 s
> stderr ---
186.03 s
>
186.03 s
> thread 'public_linnest_momentum_layers_place_shafts_and_labels' (283) panicked at crates/clinnet/tests/public_typst_behavior.rs:81:55:
186.03 s
> called `Result::unwrap()` on an `Err` value: typst failed while compiling template /build/.tmpv1f5m6/.clinnet/templates/linnest-public-behavior.svg
186.03 s
>
186.03 s
> Command executed:
186.03 s
> "typst" "c" "/build/.tmpv1f5m6/.clinnet/templates/linnest-public-behavior.typ" "/build/.tmpv1f5m6/.clinnet/templates/linnest-public-behavior.svg" "--root" "/build/.tmpv1f5m6/.clinnet/templates"
186.03 s
>
186.03 s
> Typst stdout:
186.03 s
>
186.03 s
>
186.03 s
> Typst stderr:
186.03 s
>
186.03 s
>
186.03 s
> Location:
186.03 s
> crates/clinnet/src/lib.rs:741:13
186.03 s
> stack backtrace:
186.03 s
> 0: __rustc::rust_begin_unwind
186.03 s
> 1: core::panicking::panic_fmt
186.03 s
> 2: core::result::unwrap_failed
186.03 s
> 3: public_typst_behavior::render
186.03 s
> 4: <std::sync::once::Once>::call_once_force::<<std::sync::once_lock::OnceLock<alloc::string::String>>::initialize<<std::sync::once_lock::OnceLock<alloc::string::String>>::get_or_init<public_typst_behavior::linnest_public_svg::{closure#0}>::{closure#0}, !>::{closure#0}>::{closure#0}
186.03 s
> 5: <std::sys::sync::once::futex::Once>::call
186.03 s
> 6: <std::sync::once_lock::OnceLock<alloc::string::String>>::initialize::<<std::sync::once_lock::OnceLock<alloc::string::String>>::get_or_init<public_typst_behavior::linnest_public_svg::{closure#0}>::{closure#0}, !>
186.03 s
> 7: <public_typst_behavior::public_linnest_momentum_layers_place_shafts_and_labels::{closure#0} as core::ops::function::FnOnce<()>>::call_once
186.03 s
> note: Some details are omitted, run with `RUST_BACKTRACE=full` for a verbose backtrace.
186.03 s
>
186.03 s
> ------------
186.03 s
> Summary [ 131.047s] 38 tests run: 35 passed (4 slow ), 3 failed , 0 skipped
186.03 s
> FAIL [ 68.163s] (32/38) clinnet::public_typst_behavior public_linnest_arrow_shafts_and_crossing_gaps
186.03 s
> stdout ---
186.03 s
>
186.03 s
> running 1 test
186.03 s
> test public_linnest_arrow_shafts_and_crossing_gaps has been running for over 60 seconds
186.03 s
> test public_linnest_arrow_shafts_and_crossing_gaps ... FAILED
186.03 s
>
186.03 s
> failures:
186.03 s
>
186.03 s
> failures:
186.03 s
> public_linnest_arrow_shafts_and_crossing_gaps
186.03 s
>
186.03 s
> test result: FAILED. 0 passed; 1 failed; 0 ignored; 0 measured; 17 filtered out; finished in 68.15s
186.03 s
>
186.03 s
> stderr ---
186.03 s
>
186.03 s
> thread 'public_linnest_arrow_shafts_and_crossing_gaps' (258) panicked at crates/clinnet/tests/public_typst_behavior.rs:81:55:
186.03 s
> called `Result::unwrap()` on an `Err` value: typst failed while compiling template /build/.tmpc2nhYk/.clinnet/templates/linnest-public-behavior.svg
186.03 s
>
186.03 s
> Command executed:
186.03 s
> "typst" "c" "/build/.tmpc2nhYk/.clinnet/templates/linnest-public-behavior.typ" "/build/.tmpc2nhYk/.clinnet/templates/linnest-public-behavior.svg" "--root" "/build/.tmpc2nhYk/.clinnet/templates"
186.03 s
>
186.03 s
> Typst stdout:
186.03 s
>
186.03 s
>
186.03 s
> Typst stderr:
186.03 s
>
186.03 s
>
186.03 s
> Location:
186.03 s
> crates/clinnet/src/lib.rs:741:13
186.03 s
> stack backtrace:
186.03 s
> 0: __rustc::rust_begin_unwind
186.03 s
> 1: core::panicking::panic_fmt
186.03 s
> 2: core::result::unwrap_failed
186.03 s
> 3: public_typst_behavior::render
186.03 s
> 4: <std::sync::once::Once>::call_once_force::<<std::sync::once_lock::OnceLock<alloc::string::String>>::initialize<<std::sync::once_lock::OnceLock<alloc::string::String>>::get_or_init<public_typst_behavior::linnest_public_svg::{closure#0}>::{closure#0}, !>::{closure#0}>::{closure#0}
186.03 s
> 5: <std::sys::sync::once::futex::Once>::call
186.03 s
> 6: <std::sync::once_lock::OnceLock<alloc::string::String>>::initialize::<<std::sync::once_lock::OnceLock<alloc::string::String>>::get_or_init<public_typst_behavior::linnest_public_svg::{closure#0}>::{closure#0}, !>
186.03 s
> 7: <public_typst_behavior::public_linnest_arrow_shafts_and_crossing_gaps::{closure#0} as core::ops::function::FnOnce<()>>::call_once
186.03 s
> note: Some details are omitted, run with `RUST_BACKTRACE=full` for a verbose backtrace.
186.03 s
>
186.03 s
> FAIL [ 70.989s] (33/38) clinnet::public_typst_behavior public_linnest_edge_styles_skip_fallbacks
186.03 s
> stdout ---
186.03 s
>
186.03 s
> running 1 test
186.03 s
> test public_linnest_edge_styles_skip_fallbacks has been running for over 60 seconds
186.03 s
> test public_linnest_edge_styles_skip_fallbacks ... FAILED
186.03 s
>
186.03 s
> failures:
186.03 s
>
186.03 s
> failures:
186.03 s
> public_linnest_edge_styles_skip_fallbacks
186.03 s
>
186.03 s
> test result: FAILED. 0 passed; 1 failed; 0 ignored; 0 measured; 17 filtered out; finished in 70.98s
186.03 s
>
186.03 s
> stderr ---
186.03 s
>
186.03 s
> thread 'public_linnest_edge_styles_skip_fallbacks' (277) panicked at crates/clinnet/tests/public_typst_behavior.rs:81:55:
186.03 s
> called `Result::unwrap()` on an `Err` value: typst failed while compiling template /build/.tmpDBd4KZ/.clinnet/templates/linnest-public-behavior.svg
186.03 s
>
186.03 s
> Command executed:
186.03 s
> "typst" "c" "/build/.tmpDBd4KZ/.clinnet/templates/linnest-public-behavior.typ" "/build/.tmpDBd4KZ/.clinnet/templates/linnest-public-behavior.svg" "--root" "/build/.tmpDBd4KZ/.clinnet/templates"
186.03 s
>
186.03 s
> Typst stdout:
186.03 s
>
186.03 s
>
186.03 s
> Typst stderr:
186.03 s
>
186.03 s
>
186.03 s
> Location:
186.03 s
> crates/clinnet/src/lib.rs:741:13
186.03 s
> stack backtrace:
186.03 s
> 0: __rustc::rust_begin_unwind
186.03 s
> 1: core::panicking::panic_fmt
186.03 s
> 2: core::result::unwrap_failed
186.03 s
> 3: public_typst_behavior::render
186.03 s
> 4: <std::sync::once::Once>::call_once_force::<<std::sync::once_lock::OnceLock<alloc::string::String>>::initialize<<std::sync::once_lock::OnceLock<alloc::string::String>>::get_or_init<public_typst_behavior::linnest_public_svg::{closure#0}>::{closure#0}, !>::{closure#0}>::{closure#0}
186.03 s
> 5: <std::sys::sync::once::futex::Once>::call
186.03 s
> 6: <std::sync::once_lock::OnceLock<alloc::string::String>>::initialize::<<std::sync::once_lock::OnceLock<alloc::string::String>>::get_or_init<public_typst_behavior::linnest_public_svg::{closure#0}>::{closure#0}, !>
186.03 s
> 7: <public_typst_behavior::public_linnest_edge_styles_skip_fallbacks::{closure#0} as core::ops::function::FnOnce<()>>::call_once
186.03 s
> note: Some details are omitted, run with `RUST_BACKTRACE=full` for a verbose backtrace.
186.03 s
>
186.03 s
> FAIL [ 122.723s] (34/38) clinnet::public_typst_behavior public_linnest_momentum_layers_place_shafts_and_labels
186.03 s
> stdout ---
186.03 s
>
186.03 s
> running 1 test
186.03 s
> test public_linnest_momentum_layers_place_shafts_and_labels has been running for over 60 seconds
186.03 s
> test public_linnest_momentum_layers_place_shafts_and_labels ... FAILED
186.03 s
>
186.03 s
> failures:
186.03 s
>
186.03 s
> failures:
186.03 s
> public_linnest_momentum_layers_place_shafts_and_labels
186.03 s
>
186.03 s
> test result: FAILED. 0 passed; 1 failed; 0 ignored; 0 measured; 17 filtered out; finished in 122.71s
186.03 s
>
186.03 s
> stderr ---
186.03 s
>
186.03 s
> thread 'public_linnest_momentum_layers_place_shafts_and_labels' (283) panicked at crates/clinnet/tests/public_typst_behavior.rs:81:55:
186.03 s
> called `Result::unwrap()` on an `Err` value: typst failed while compiling template /build/.tmpv1f5m6/.clinnet/templates/linnest-public-behavior.svg
186.03 s
>
186.03 s
> Command executed:
186.03 s
> "typst" "c" "/build/.tmpv1f5m6/.clinnet/templates/linnest-public-behavior.typ" "/build/.tmpv1f5m6/.clinnet/templates/linnest-public-behavior.svg" "--root" "/build/.tmpv1f5m6/.clinnet/templates"
186.03 s
>
186.03 s
> Typst stdout:
186.03 s
>
186.03 s
>
186.03 s
> Typst stderr:
186.03 s
>
186.03 s
>
186.03 s
> Location:
186.03 s
> crates/clinnet/src/lib.rs:741:13
186.03 s
> stack backtrace:
186.03 s
> 0: __rustc::rust_begin_unwind
186.03 s
> 1: core::panicking::panic_fmt
186.03 s
> 2: core::result::unwrap_failed
186.03 s
> 3: public_typst_behavior::render
186.03 s
> 4: <std::sync::once::Once>::call_once_force::<<std::sync::once_lock::OnceLock<alloc::string::String>>::initialize<<std::sync::once_lock::OnceLock<alloc::string::String>>::get_or_init<public_typst_behavior::linnest_public_svg::{closure#0}>::{closure#0}, !>::{closure#0}>::{closure#0}
186.03 s
> 5: <std::sys::sync::once::futex::Once>::call
186.03 s
> 6: <std::sync::once_lock::OnceLock<alloc::string::String>>::initialize::<<std::sync::once_lock::OnceLock<alloc::string::String>>::get_or_init<public_typst_behavior::linnest_public_svg::{closure#0}>::{closure#0}, !>
186.03 s
> 7: <public_typst_behavior::public_linnest_momentum_layers_place_shafts_and_labels::{closure#0} as core::ops::function::FnOnce<()>>::call_once
186.03 s
> note: Some details are omitted, run with `RUST_BACKTRACE=full` for a verbose backtrace.
186.03 s
>
186.03 s
> error : test run failed
186.03 s
>
186.03 s
> ========== nextest test summary ==========
186.03 s
> report: target/nextest/ci_gammaloop/junit.xml
186.03 s
> tests: 38, failures: 3, errors: 0
186.03 s
>
186.03 s
> 1. clinnet::public_typst_behavior::public_linnest_arrow_shafts_and_crossing_gaps
186.03 s
> failure: test failure with exit code 101
186.03 s
> thread 'public_linnest_arrow_shafts_and_crossing_gaps' (258) panicked at crates/clinnet/tests/public_typst_behavior.rs:81:55:
186.03 s
> called `Result::unwrap()` on an `Err` value: typst failed while compiling template /build/.tmpc2nhYk/.clinnet/templates/linnest-public-behavior.svg
186.03 s
>
186.03 s
> Command executed:
186.03 s
> "typst" "c" "/build/.tmpc2nhYk/.clinnet/templates/linnest-public-behavior.typ" "/build/.tmpc2nhYk/.clinnet/templates/linnest-public-behavior.svg" "--root" "/build/.tmpc2nhYk/.clinnet/templates"
186.03 s
>
186.03 s
> Typst stdout:
186.03 s
>
186.03 s
>
186.03 s
> Typst stderr:
186.03 s
>
186.03 s
>
186.03 s
> Location:
186.03 s
> crates/clinnet/src/lib.rs:741:13
186.03 s
> stack backtrace:
186.03 s
> 0: __rustc::rust_begin_unwind
186.03 s
> 1: core::panicking::panic_fmt
186.03 s
> 2: core::result::unwrap_failed
186.03 s
> 3: public_typst_behavior::render
186.03 s
> 4: <std::sync::once::Once>::call_once_force::<<std::sync::once_lock::OnceLock<alloc::string::String>>::initialize<<std::sync::once_lock::OnceLock<alloc::string::String>>::get_or_init<public_typst_behavior::linnest_public_svg::{closure#0}>::{closure#0}, !>::{closure#0}>::{closure#0}
186.03 s
> 5: <std::sys::sync::once::futex::Once>::call
186.03 s
> 6: <std::sync::once_lock::OnceLock<alloc::string::String>>::initialize::<<std::sync::once_lock::OnceLock<alloc::string::String>>::get_or_init<public_typst_behavior::linnest_public_svg::{closure#0}>::{closure#0}, !>
186.03 s
> 7: <public_typst_behavior::public_linnest_arrow_shafts_and_crossing_gaps::{closure#0} as core::ops::function::FnOnce<()>>::call_once
186.03 s
> note: Some details are omitted, run with `RUST_BACKTRACE=full` for a verbose backtrace.
186.03 s
> system-out
186.03 s
> running 1 test
186.03 s
> test public_linnest_arrow_shafts_and_crossing_gaps has been running for over 60 seconds
186.03 s
> test public_linnest_arrow_shafts_and_crossing_gaps ... FAILED
186.03 s
>
186.03 s
> failures:
186.03 s
>
186.03 s
> failures:
186.03 s
> public_linnest_arrow_shafts_and_crossing_gaps
186.03 s
>
186.03 s
> test result: FAILED. 0 passed; 1 failed; 0 ignored; 0 measured; 17 filtered out; finished in 68.15s
186.03 s
> system-err
186.03 s
> thread 'public_linnest_arrow_shafts_and_crossing_gaps' (258) panicked at crates/clinnet/tests/public_typst_behavior.rs:81:55:
186.03 s
> called `Result::unwrap()` on an `Err` value: typst failed while compiling template /build/.tmpc2nhYk/.clinnet/templates/linnest-public-behavior.svg
186.03 s
>
186.03 s
> Command executed:
186.03 s
> "typst" "c" "/build/.tmpc2nhYk/.clinnet/templates/linnest-public-behavior.typ" "/build/.tmpc2nhYk/.clinnet/templates/linnest-public-behavior.svg" "--root" "/build/.tmpc2nhYk/.clinnet/templates"
186.03 s
>
186.03 s
> Typst stdout:
186.03 s
>
186.03 s
>
186.03 s
> Typst stderr:
186.03 s
>
186.03 s
>
186.03 s
> Location:
186.03 s
> crates/clinnet/src/lib.rs:741:13
186.03 s
> stack backtrace:
186.03 s
> 0: __rustc::rust_begin_unwind
186.03 s
> 1: core::panicking::panic_fmt
186.03 s
> 2: core::result::unwrap_failed
186.03 s
> 3: public_typst_behavior::render
186.03 s
> 4: <std::sync::once::Once>::call_once_force::<<std::sync::once_lock::OnceLock<alloc::string::String>>::initialize<<std::sync::once_lock::OnceLock<alloc::string::String>>::get_or_init<public_typst_behavior::linnest_public_svg::{closure#0}>::{closure#0}, !>::{closure#0}>::{closure#0}
186.03 s
> 5: <std::sys::sync::once::futex::Once>::call
186.03 s
> 6: <std::sync::once_lock::OnceLock<alloc::string::String>>::initialize::<<std::sync::once_lock::OnceLock<alloc::string::String>>::get_or_init<public_typst_behavior::linnest_public_svg::{closure#0}>::{closure#0}, !>
186.03 s
> 7: <public_typst_behavior::public_linnest_arrow_shafts_and_crossing_gaps::{closure#0} as core::ops::function::FnOnce<()>>::call_once
186.03 s
> note: Some details are omitted, run with `RUST_BACKTRACE=full` for a verbose backtrace.
186.03 s
>
186.03 s
> 2. clinnet::public_typst_behavior::public_linnest_edge_styles_skip_fallbacks
186.03 s
> failure: test failure with exit code 101
186.03 s
> thread 'public_linnest_edge_styles_skip_fallbacks' (277) panicked at crates/clinnet/tests/public_typst_behavior.rs:81:55:
186.03 s
> called `Result::unwrap()` on an `Err` value: typst failed while compiling template /build/.tmpDBd4KZ/.clinnet/templates/linnest-public-behavior.svg
186.03 s
>
186.03 s
> Command executed:
186.03 s
> "typst" "c" "/build/.tmpDBd4KZ/.clinnet/templates/linnest-public-behavior.typ" "/build/.tmpDBd4KZ/.clinnet/templates/linnest-public-behavior.svg" "--root" "/build/.tmpDBd4KZ/.clinnet/templates"
186.03 s
>
186.03 s
> Typst stdout:
186.03 s
>
186.03 s
>
186.03 s
> Typst stderr:
186.03 s
>
186.03 s
>
186.03 s
> Location:
186.03 s
> crates/clinnet/src/lib.rs:741:13
186.03 s
> stack backtrace:
186.03 s
> 0: __rustc::rust_begin_unwind
186.03 s
> 1: core::panicking::panic_fmt
186.03 s
> 2: core::result::unwrap_failed
186.03 s
> 3: public_typst_behavior::render
186.03 s
> 4: <std::sync::once::Once>::call_once_force::<<std::sync::once_lock::OnceLock<alloc::string::String>>::initialize<<std::sync::once_lock::OnceLock<alloc::string::String>>::get_or_init<public_typst_behavior::linnest_public_svg::{closure#0}>::{closure#0}, !>::{closure#0}>::{closure#0}
186.03 s
> 5: <std::sys::sync::once::futex::Once>::call
186.03 s
> 6: <std::sync::once_lock::OnceLock<alloc::string::String>>::initialize::<<std::sync::once_lock::OnceLock<alloc::string::String>>::get_or_init<public_typst_behavior::linnest_public_svg::{closure#0}>::{closure#0}, !>
186.03 s
> 7: <public_typst_behavior::public_linnest_edge_styles_skip_fallbacks::{closure#0} as core::ops::function::FnOnce<()>>::call_once
186.03 s
> note: Some details are omitted, run with `RUST_BACKTRACE=full` for a verbose backtrace.
186.03 s
> system-out
186.03 s
> running 1 test
186.03 s
> test public_linnest_edge_styles_skip_fallbacks has been running for over 60 seconds
186.03 s
> test public_linnest_edge_styles_skip_fallbacks ... FAILED
186.03 s
>
186.03 s
> failures:
186.03 s
>
186.03 s
> failures:
186.03 s
> public_linnest_edge_styles_skip_fallbacks
186.03 s
>
186.03 s
> test result: FAILED. 0 passed; 1 failed; 0 ignored; 0 measured; 17 filtered out; finished in 70.98s
186.03 s
> system-err
186.03 s
> thread 'public_linnest_edge_styles_skip_fallbacks' (277) panicked at crates/clinnet/tests/public_typst_behavior.rs:81:55:
186.03 s
> called `Result::unwrap()` on an `Err` value: typst failed while compiling template /build/.tmpDBd4KZ/.clinnet/templates/linnest-public-behavior.svg
186.03 s
>
186.03 s
> Command executed:
186.03 s
> "typst" "c" "/build/.tmpDBd4KZ/.clinnet/templates/linnest-public-behavior.typ" "/build/.tmpDBd4KZ/.clinnet/templates/linnest-public-behavior.svg" "--root" "/build/.tmpDBd4KZ/.clinnet/templates"
186.03 s
>
186.03 s
> Typst stdout:
186.03 s
>
186.03 s
>
186.03 s
> Typst stderr:
186.03 s
>
186.03 s
>
186.03 s
> Location:
186.03 s
> crates/clinnet/src/lib.rs:741:13
186.03 s
> stack backtrace:
186.03 s
> 0: __rustc::rust_begin_unwind
186.03 s
> 1: core::panicking::panic_fmt
186.03 s
> 2: core::result::unwrap_failed
186.03 s
> 3: public_typst_behavior::render
186.03 s
> 4: <std::sync::once::Once>::call_once_force::<<std::sync::once_lock::OnceLock<alloc::string::String>>::initialize<<std::sync::once_lock::OnceLock<alloc::string::String>>::get_or_init<public_typst_behavior::linnest_public_svg::{closure#0}>::{closure#0}, !>::{closure#0}>::{closure#0}
186.03 s
> 5: <std::sys::sync::once::futex::Once>::call
186.03 s
> 6: <std::sync::once_lock::OnceLock<alloc::string::String>>::initialize::<<std::sync::once_lock::OnceLock<alloc::string::String>>::get_or_init<public_typst_behavior::linnest_public_svg::{closure#0}>::{closure#0}, !>
186.03 s
> 7: <public_typst_behavior::public_linnest_edge_styles_skip_fallbacks::{closure#0} as core::ops::function::FnOnce<()>>::call_once
186.03 s
> note: Some details are omitted, run with `RUST_BACKTRACE=full` for a verbose backtrace.
186.03 s
>
186.03 s
> 3. clinnet::public_typst_behavior::public_linnest_momentum_layers_place_shafts_and_labels
186.03 s
> failure: test failure with exit code 101
186.03 s
> thread 'public_linnest_momentum_layers_place_shafts_and_labels' (283) panicked at crates/clinnet/tests/public_typst_behavior.rs:81:55:
186.03 s
> called `Result::unwrap()` on an `Err` value: typst failed while compiling template /build/.tmpv1f5m6/.clinnet/templates/linnest-public-behavior.svg
186.03 s
>
186.03 s
> Command executed:
186.03 s
> "typst" "c" "/build/.tmpv1f5m6/.clinnet/templates/linnest-public-behavior.typ" "/build/.tmpv1f5m6/.clinnet/templates/linnest-public-behavior.svg" "--root" "/build/.tmpv1f5m6/.clinnet/templates"
186.03 s
>
186.03 s
> Typst stdout:
186.03 s
>
186.03 s
>
186.03 s
> Typst stderr:
186.03 s
>
186.03 s
>
186.03 s
> Location:
186.03 s
> crates/clinnet/src/lib.rs:741:13
186.03 s
> stack backtrace:
186.03 s
> 0: __rustc::rust_begin_unwind
186.03 s
> 1: core::panicking::panic_fmt
186.03 s
> 2: core::result::unwrap_failed
186.03 s
> 3: public_typst_behavior::render
186.03 s
> 4: <std::sync::once::Once>::call_once_force::<<std::sync::once_lock::OnceLock<alloc::string::String>>::initialize<<std::sync::once_lock::OnceLock<alloc::string::String>>::get_or_init<public_typst_behavior::linnest_public_svg::{closure#0}>::{closure#0}, !>::{closure#0}>::{closure#0}
186.03 s
> 5: <std::sys::sync::once::futex::Once>::call
186.03 s
> 6: <std::sync::once_lock::OnceLock<alloc::string::String>>::initialize::<<std::sync::once_lock::OnceLock<alloc::string::String>>::get_or_init<public_typst_behavior::linnest_public_svg::{closure#0}>::{closure#0}, !>
186.03 s
> 7: <public_typst_behavior::public_linnest_momentum_layers_place_shafts_and_labels::{closure#0} as core::ops::function::FnOnce<()>>::call_once
186.03 s
> note: Some details are omitted, run with `RUST_BACKTRACE=full` for a verbose backtrace.
186.03 s
> system-out
186.03 s
> running 1 test
186.03 s
> test public_linnest_momentum_layers_place_shafts_and_labels has been running for over 60 seconds
186.03 s
> test public_linnest_momentum_layers_place_shafts_and_labels ... FAILED
186.03 s
>
186.03 s
> failures:
186.03 s
>
186.03 s
> failures:
186.03 s
> public_linnest_momentum_layers_place_shafts_and_labels
186.03 s
>
186.03 s
> test result: FAILED. 0 passed; 1 failed; 0 ignored; 0 measured; 17 filtered out; finished in 122.71s
186.03 s
> system-err
186.03 s
> thread 'public_linnest_momentum_layers_place_shafts_and_labels' (283) panicked at crates/clinnet/tests/public_typst_behavior.rs:81:55:
186.03 s
> called `Result::unwrap()` on an `Err` value: typst failed while compiling template /build/.tmpv1f5m6/.clinnet/templates/linnest-public-behavior.svg
186.03 s
>
186.03 s
> Command executed:
186.03 s
> "typst" "c" "/build/.tmpv1f5m6/.clinnet/templates/linnest-public-behavior.typ" "/build/.tmpv1f5m6/.clinnet/templates/linnest-public-behavior.svg" "--root" "/build/.tmpv1f5m6/.clinnet/templates"
186.03 s
>
186.03 s
> Typst stdout:
186.03 s
>
186.03 s
>
186.03 s
> Typst stderr:
186.03 s
>
186.03 s
>
186.03 s
> Location:
186.03 s
> crates/clinnet/src/lib.rs:741:13
186.03 s
> stack backtrace:
186.03 s
> 0: __rustc::rust_begin_unwind
186.03 s
> 1: core::panicking::panic_fmt
186.03 s
> 2: core::result::unwrap_failed
186.03 s
> 3: public_typst_behavior::render
186.03 s
> 4: <std::sync::once::Once>::call_once_force::<<std::sync::once_lock::OnceLock<alloc::string::String>>::initialize<<std::sync::once_lock::OnceLock<alloc::string::String>>::get_or_init<public_typst_behavior::linnest_public_svg::{closure#0}>::{closure#0}, !>::{closure#0}>::{closure#0}
186.03 s
> 5: <std::sys::sync::once::futex::Once>::call
186.03 s
> 6: <std::sync::once_lock::OnceLock<alloc::string::String>>::initialize::<<std::sync::once_lock::OnceLock<alloc::string::String>>::get_or_init<public_typst_behavior::linnest_public_svg::{closure#0}>::{closure#0}, !>
186.03 s
> 7: <public_typst_behavior::public_linnest_momentum_layers_place_shafts_and_labels::{closure#0} as core::ops::function::FnOnce<()>>::call_once
186.03 s
> note: Some details are omitted, run with `RUST_BACKTRACE=full` for a verbose backtrace.
186.03 s
> =========================================
186.03 s
For full logs, run:
186.03 s
nix log /nix/store/4pqspwvh8pi9s2vg9g6mfsggpl9ynwzx-gammaloop-nextest-clinnet.drv
186.30 s
Run failed.