test packages.x86_64-linux.nix-ci-check-gammaloop-nextest-core

Reproduce this run
Retry Run
  1. 0.91 s $ /nix/store/9ypz3flqsrl5xl495mm8h645gadjsxi1-coreutils-9.11/bin/timeout --kill-after=15s 7200s /nix/store/23zk8sgzamrbmj1fday15szf7f2279s8-nix-2.34.7/bin/nix --extra-experimental-features nix-command --extra-experimental-features flakes flake clone git+https://github.com/alphal00p/gammaloop --dest /tmp/nix-ci-worker/stable-pwd/repo/
  2. 1.89 s Cloning into '/tmp/nix-ci-worker/stable-pwd/repo'...
  3. 1.89 s remote: Enumerating objects: 64188, done.
  4. 1.89 s remote: Counting objects: 0% (1/9554) remote: Counting objects: 1% (96/9554) remote: Counting objects: 2% (192/9554) remote: Counting objects: 3% (287/9554) remote: Counting objects: 4% (383/9554) remote: Counting objects: 5% (478/9554) remote: Counting objects: 6% (574/9554) remote: Counting objects: 7% (669/9554) remote: Counting objects: 8% (765/9554) remote: Counting objects: 9% (860/9554) remote: Counting objects: 10% (956/9554) remote: Counting objects: 11% (1051/9554) remote: Counting objects: 12% (1147/9554) remote: Counting objects: 13% (1243/9554) remote: Counting objects: 14% (1338/9554) remote: Counting objects: 15% (1434/9554) remote: Counting objects: 16% (1529/9554) remote: Counting objects: 17% (1625/9554) remote: Counting objects: 18% (1720/9554) remote: Counting objects: 19% (1816/9554) remote: Counting objects: 20% (1911/9554) remote: Counting objects: 21% (2007/9554) remote: Counting objects: 22% (2102/9554) remote: Counting objects: 23% (2198/9554) remote: Counting objects: 24% (2293/9554) remote: Counting objects: 25% (2389/9554) remote: Counting objects: 26% (2485/9554) remote: Counting objects: 27% (2580/9554) remote: Counting objects: 28% (2676/9554) remote: Counting objects: 29% (2771/9554) remote: Counting objects: 30% (2867/9554) remote: Counting objects: 31% (2962/9554) remote: Counting objects: 32% (3058/9554) remote: Counting objects: 33% (3153/9554) remote: Counting objects: 34% (3249/9554) remote: Counting objects: 35% (3344/9554) remote: Counting objects: 36% (3440/9554) remote: Counting objects: 37% (3535/9554) remote: Counting objects: 38% (3631/9554) remote: Counting objects: 39% (3727/9554) remote: Counting objects: 40% (3822/9554) remote: Counting objects: 41% (3918/9554) remote: Counting objects: 42% (4013/9554) remote: Counting objects: 43% (4109/9554) remote: Counting objects: 44% (4204/9554) remote: Counting objects: 45% (4300/9554) remote: Counting objects: 46% (4395/9554) remote: Counting objects: 47% (4491/9554) remote: Counting objects: 48% (4586/9554) remote: Counting objects: 49% (4682/9554) remote: Counting objects: 50% (4777/9554) remote: Counting objects: 51% (4873/9554) remote: Counting objects: 52% (4969/9554) remote: Counting objects: 53% (5064/9554) remote: Counting objects: 54% (5160/9554) remote: Counting objects: 55% (5255/9554) remote: Counting objects: 56% (5351/9554) remote: Counting objects: 57% (5446/9554) remote: Counting objects: 58% (5542/9554) remote: Counting objects: 59% (5637/9554) remote: Counting objects: 60% (5733/9554) remote: Counting objects: 61% (5828/9554) remote: Counting objects: 62% (5924/9554) remote: Counting objects: 63% (6020/9554) remote: Counting objects: 64% (6115/9554) remote: Counting objects: 65% (6211/9554) remote: Counting objects: 66% (6306/9554) remote: Counting objects: 67% (6402/9554) remote: Counting objects: 68% (6497/9554) remote: Counting objects: 69% (6593/9554) remote: Counting objects: 70% (6688/9554) remote: Counting objects: 71% (6784/9554) remote: Counting objects: 72% (6879/9554) remote: Counting objects: 73% (6975/9554) remote: Counting objects: 74% (7070/9554) remote: Counting objects: 75% (7166/9554) remote: Counting objects: 76% (7262/9554) remote: Counting objects: 77% (7357/9554) remote: Counting objects: 78% (7453/9554) remote: Counting objects: 79% (7548/9554) remote: Counting objects: 80% (7644/9554) remote: Counting objects: 81% (7739/9554) remote: Counting objects: 82% (7835/9554) remote: Counting objects: 83% (7930/9554) remote: Counting objects: 84% (8026/9554) remote: Counting objects: 85% (8121/9554) remote: Counting objects: 86% (8217/9554) remote: Counting objects: 87% (8312/9554) remote: Counting objects: 88% (8408/9554) remote: Counting objects: 89% (8504/9554) remote: Counting objects: 90% (8599/9554) remote: Counting objects: 91% (8695/9554) remote: Counting objects: 92% (8790/9554) remote: Counting objects: 93% (8886/9554) remote: Counting objects: 94% (8981/9554) remote: Counting objects: 95% (9077/9554) remote: Counting objects: 96% (9172/9554) remote: Counting objects: 97% (9268/9554) remote: Counting objects: 98% (9363/9554) remote: Counting objects: 99% (9459/9554) remote: Counting objects: 100% (9554/9554) remote: Counting objects: 100% (9554/9554), done.
  5. 3.45 s remote: Compressing objects: 0% (1/2328) remote: Compressing objects: 1% (24/2328) remote: Compressing objects: 2% (47/2328) remote: Compressing objects: 3% (70/2328) remote: Compressing objects: 4% (94/2328) remote: Compressing objects: 5% (117/2328) remote: Compressing objects: 6% (140/2328) remote: Compressing objects: 7% (163/2328) remote: Compressing objects: 8% (187/2328) remote: Compressing objects: 9% (210/2328) remote: Compressing objects: 10% (233/2328) remote: Compressing objects: 11% (257/2328) remote: Compressing objects: 12% (280/2328) remote: Compressing objects: 13% (303/2328) remote: Compressing objects: 14% (326/2328) remote: Compressing objects: 15% (350/2328) remote: Compressing objects: 16% (373/2328) remote: Compressing objects: 17% (396/2328) remote: Compressing objects: 18% (420/2328) remote: Compressing objects: 19% (443/2328) remote: Compressing objects: 20% (466/2328) remote: Compressing objects: 21% (489/2328) remote: Compressing objects: 22% (513/2328) remote: Compressing objects: 23% (536/2328) remote: Compressing objects: 23% (551/2328) remote: Compressing objects: 24% (559/2328) remote: Compressing objects: 25% (582/2328) remote: Compressing objects: 26% (606/2328) remote: Compressing objects: 27% (629/2328) remote: Compressing objects: 28% (652/2328) remote: Compressing objects: 29% (676/2328) remote: Compressing objects: 30% (699/2328) remote: Compressing objects: 31% (722/2328) remote: Compressing objects: 32% (745/2328) remote: Compressing objects: 32% (766/2328) remote: Compressing objects: 33% (769/2328) remote: Compressing objects: 34% (792/2328) remote: Compressing objects: 35% (815/2328) remote: Compressing objects: 36% (839/2328) remote: Compressing objects: 37% (862/2328) remote: Compressing objects: 38% (885/2328) remote: Compressing objects: 39% (908/2328) remote: Compressing objects: 40% (932/2328) remote: Compressing objects: 41% (955/2328) remote: Compressing objects: 42% (978/2328) remote: Compressing objects: 43% (1002/2328) remote: Compressing objects: 44% (1025/2328) remote: Compressing objects: 45% (1048/2328) remote: Compressing objects: 46% (1071/2328) remote: Compressing objects: 47% (1095/2328) remote: Compressing objects: 48% (1118/2328) remote: Compressing objects: 49% (1141/2328) remote: Compressing objects: 50% (1164/2328) remote: Compressing objects: 51% (1188/2328) remote: Compressing objects: 52% (1211/2328) remote: Compressing objects: 53% (1234/2328) remote: Compressing objects: 54% (1258/2328) remote: Compressing objects: 55% (1281/2328) remote: Compressing objects: 56% (1304/2328) remote: Compressing objects: 57% (1327/2328) remote: Compressing objects: 58% (1351/2328) remote: Compressing objects: 59% (1374/2328) remote: Compressing objects: 60% (1397/2328) remote: Compressing objects: 61% (1421/2328) remote: Compressing objects: 62% (1444/2328) remote: Compressing objects: 63% (1467/2328) remote: Compressing objects: 64% (1490/2328) remote: Compressing objects: 65% (1514/2328) remote: Compressing objects: 66% (1537/2328) remote: Compressing objects: 67% (1560/2328) remote: Compressing objects: 68% (1584/2328) remote: Compressing objects: 69% (1607/2328) remote: Compressing objects: 70% (1630/2328) remote: Compressing objects: 71% (1653/2328) remote: Compressing objects: 72% (1677/2328) remote: Compressing objects: 73% (1700/2328) remote: Compressing objects: 74% (1723/2328) remote: Compressing objects: 75% (1746/2328) remote: Compressing objects: 76% (1770/2328) remote: Compressing objects: 77% (1793/2328) remote: Compressing objects: 78% (1816/2328) remote: Compressing objects: 79% (1840/2328) remote: Compressing objects: 80% (1863/2328) remote: Compressing objects: 81% (1886/2328) remote: Compressing objects: 82% (1909/2328) remote: Compressing objects: 83% (1933/2328) remote: Compressing objects: 84% (1956/2328) remote: Compressing objects: 85% (1979/2328) remote: Compressing objects: 86% (2003/2328) remote: Compressing objects: 87% (2026/2328) remote: Compressing objects: 88% (2049/2328) remote: Compressing objects: 89% (2072/2328) remote: Compressing objects: 90% (2096/2328) remote: Compressing objects: 91% (2119/2328) remote: Compressing objects: 92% (2142/2328) remote: Compressing objects: 93% (2166/2328) remote: Compressing objects: 94% (2189/2328) remote: Compressing objects: 95% (2212/2328) remote: Compressing objects: 96% (2235/2328) remote: Compressing objects: 97% (2259/2328) remote: Compressing objects: 98% (2282/2328) remote: Compressing objects: 99% (2305/2328) remote: Compressing objects: 100% (2328/2328) remote: Compressing objects: 100% (2328/2328), done.
  6. 6.69 s Receiving objects: 0% (1/64188) Receiving objects: 1% (642/64188) Receiving objects: 2% (1284/64188) Receiving objects: 3% (1926/64188) Receiving objects: 4% (2568/64188) Receiving objects: 5% (3210/64188) Receiving objects: 6% (3852/64188) Receiving objects: 7% (4494/64188) Receiving objects: 8% (5136/64188) Receiving objects: 9% (5777/64188), 6.68 MiB | 13.33 MiB/s Receiving objects: 10% (6419/64188), 6.68 MiB | 13.33 MiB/s Receiving objects: 11% (7061/64188), 6.68 MiB | 13.33 MiB/s Receiving objects: 12% (7703/64188), 6.68 MiB | 13.33 MiB/s Receiving objects: 13% (8345/64188), 6.68 MiB | 13.33 MiB/s Receiving objects: 14% (8987/64188), 6.68 MiB | 13.33 MiB/s Receiving objects: 15% (9629/64188), 6.68 MiB | 13.33 MiB/s Receiving objects: 16% (10271/64188), 6.68 MiB | 13.33 MiB/s Receiving objects: 17% (10912/64188), 6.68 MiB | 13.33 MiB/s Receiving objects: 18% (11554/64188), 6.68 MiB | 13.33 MiB/s Receiving objects: 19% (12196/64188), 6.68 MiB | 13.33 MiB/s Receiving objects: 20% (12838/64188), 6.68 MiB | 13.33 MiB/s Receiving objects: 21% (13480/64188), 6.68 MiB | 13.33 MiB/s Receiving objects: 22% (14122/64188), 6.68 MiB | 13.33 MiB/s Receiving objects: 23% (14764/64188), 6.68 MiB | 13.33 MiB/s Receiving objects: 24% (15406/64188), 6.68 MiB | 13.33 MiB/s Receiving objects: 25% (16047/64188), 6.68 MiB | 13.33 MiB/s Receiving objects: 26% (16689/64188), 6.68 MiB | 13.33 MiB/s Receiving objects: 27% (17331/64188), 6.68 MiB | 13.33 MiB/s Receiving objects: 28% (17973/64188), 6.68 MiB | 13.33 MiB/s Receiving objects: 29% (18615/64188), 6.68 MiB | 13.33 MiB/s Receiving objects: 30% (19257/64188), 6.68 MiB | 13.33 MiB/s Receiving objects: 31% (19899/64188), 6.68 MiB | 13.33 MiB/s Receiving objects: 32% (20541/64188), 6.68 MiB | 13.33 MiB/s Receiving objects: 33% (21183/64188), 6.68 MiB | 13.33 MiB/s Receiving objects: 34% (21824/64188), 6.68 MiB | 13.33 MiB/s Receiving objects: 35% (22466/64188), 6.68 MiB | 13.33 MiB/s Receiving objects: 36% (23108/64188), 6.68 MiB | 13.33 MiB/s Receiving objects: 37% (23750/64188), 6.68 MiB | 13.33 MiB/s Receiving objects: 38% (24392/64188), 6.68 MiB | 13.33 MiB/s Receiving objects: 39% (25034/64188), 6.68 MiB | 13.33 MiB/s Receiving objects: 40% (25676/64188), 6.68 MiB | 13.33 MiB/s Receiving objects: 41% (26318/64188), 6.68 MiB | 13.33 MiB/s Receiving objects: 42% (26959/64188), 6.68 MiB | 13.33 MiB/s Receiving objects: 43% (27601/64188), 6.68 MiB | 13.33 MiB/s Receiving objects: 44% (28243/64188), 6.68 MiB | 13.33 MiB/s Receiving objects: 45% (28885/64188), 6.68 MiB | 13.33 MiB/s Receiving objects: 46% (29527/64188), 6.68 MiB | 13.33 MiB/s Receiving objects: 47% (30169/64188), 6.68 MiB | 13.33 MiB/s Receiving objects: 48% (30811/64188), 6.68 MiB | 13.33 MiB/s Receiving objects: 49% (31453/64188), 6.68 MiB | 13.33 MiB/s Receiving objects: 50% (32094/64188), 6.68 MiB | 13.33 MiB/s Receiving objects: 50% (32312/64188), 28.07 MiB | 28.06 MiB/s Receiving objects: 51% (32736/64188), 28.07 MiB | 28.06 MiB/s Receiving objects: 52% (33378/64188), 28.07 MiB | 28.06 MiB/s Receiving objects: 53% (34020/64188), 28.07 MiB | 28.06 MiB/s Receiving objects: 54% (34662/64188), 28.07 MiB | 28.06 MiB/s Receiving objects: 55% (35304/64188), 28.07 MiB | 28.06 MiB/s Receiving objects: 56% (35946/64188), 28.07 MiB | 28.06 MiB/s Receiving objects: 57% (36588/64188), 28.07 MiB | 28.06 MiB/s Receiving objects: 58% (37230/64188), 41.10 MiB | 27.38 MiB/s Receiving objects: 59% (37871/64188), 41.10 MiB | 27.38 MiB/s Receiving objects: 60% (38513/64188), 41.10 MiB | 27.38 MiB/s Receiving objects: 61% (39155/64188), 41.10 MiB | 27.38 MiB/s Receiving objects: 62% (39797/64188), 41.10 MiB | 27.38 MiB/s Receiving objects: 63% (40439/64188), 41.10 MiB | 27.38 MiB/s Receiving objects: 64% (41081/64188), 41.10 MiB | 27.38 MiB/s Receiving objects: 65% (41723/64188), 41.10 MiB | 27.38 MiB/s Receiving objects: 66% (42365/64188), 41.10 MiB | 27.38 MiB/s Receiving objects: 67% (43006/64188), 41.10 MiB | 27.38 MiB/s Receiving objects: 68% (43648/64188), 41.10 MiB | 27.38 MiB/s Receiving objects: 69% (44290/64188), 41.10 MiB | 27.38 MiB/s Receiving objects: 70% (44932/64188), 41.10 MiB | 27.38 MiB/s Receiving objects: 70% (45565/64188), 57.16 MiB | 28.22 MiB/s Receiving objects: 71% (45574/64188), 57.16 MiB | 28.22 MiB/s Receiving objects: 72% (46216/64188), 57.16 MiB | 28.22 MiB/s Receiving objects: 73% (46858/64188), 57.16 MiB | 28.22 MiB/s Receiving objects: 74% (47500/64188), 57.16 MiB | 28.22 MiB/s Receiving objects: 75% (48141/64188), 57.16 MiB | 28.22 MiB/s Receiving objects: 76% (48783/64188), 57.16 MiB | 28.22 MiB/s Receiving objects: 77% (49425/64188), 57.16 MiB | 28.22 MiB/s Receiving objects: 78% (50067/64188), 57.16 MiB | 28.22 MiB/s Receiving objects: 79% (50709/64188), 73.59 MiB | 29.14 MiB/s Receiving objects: 80% (51351/64188), 73.59 MiB | 29.14 MiB/s Receiving objects: 81% (51993/64188), 73.59 MiB | 29.14 MiB/s Receiving objects: 82% (52635/64188), 73.59 MiB | 29.14 MiB/s Receiving objects: 83% (53277/64188), 73.59 MiB | 29.14 MiB/s Receiving objects: 84% (53918/64188), 73.59 MiB | 29.14 MiB/s Receiving objects: 85% (54560/64188), 73.59 MiB | 29.14 MiB/s Receiving objects: 86% (55202/64188), 73.59 MiB | 29.14 MiB/s Receiving objects: 87% (55844/64188), 73.59 MiB | 29.14 MiB/s Receiving objects: 88% (56486/64188), 73.59 MiB | 29.14 MiB/s Receiving objects: 89% (57128/64188), 73.59 MiB | 29.14 MiB/s Receiving objects: 90% (57770/64188), 73.59 MiB | 29.14 MiB/s Receiving objects: 91% (58412/64188), 73.59 MiB | 29.14 MiB/s Receiving objects: 92% (59053/64188), 73.59 MiB | 29.14 MiB/s Receiving objects: 93% (59695/64188), 73.59 MiB | 29.14 MiB/s Receiving objects: 94% (60337/64188), 73.59 MiB | 29.14 MiB/s Receiving objects: 94% (60933/64188), 73.59 MiB | 29.14 MiB/s Receiving objects: 95% (60979/64188), 73.59 MiB | 29.14 MiB/s Receiving objects: 96% (61621/64188), 73.59 MiB | 29.14 MiB/s Receiving objects: 97% (62263/64188), 91.09 MiB | 30.11 MiB/s Receiving objects: 98% (62905/64188), 91.09 MiB | 30.11 MiB/s Receiving objects: 99% (63547/64188), 91.09 MiB | 30.11 MiB/s remote: Total 64188 (delta 7399), reused 7778 (delta 6681), pack-reused 54634 (from 3)
  7. 6.99 s Receiving objects: 100% (64188/64188), 91.09 MiB | 30.11 MiB/s Receiving objects: 100% (64188/64188), 97.84 MiB | 30.27 MiB/s, done.
  8. 7.55 s Resolving deltas: 0% (0/44318) Resolving deltas: 1% (444/44318) Resolving deltas: 2% (887/44318) Resolving deltas: 3% (1330/44318) Resolving deltas: 4% (1773/44318) Resolving deltas: 5% (2216/44318) Resolving deltas: 6% (2660/44318) Resolving deltas: 7% (3103/44318) Resolving deltas: 8% (3546/44318) Resolving deltas: 9% (3991/44318) Resolving deltas: 10% (4432/44318) Resolving deltas: 11% (4875/44318) Resolving deltas: 12% (5319/44318) Resolving deltas: 13% (5764/44318) Resolving deltas: 14% (6205/44318) Resolving deltas: 15% (6648/44318) Resolving deltas: 16% (7092/44318) Resolving deltas: 17% (7536/44318) Resolving deltas: 18% (7978/44318) Resolving deltas: 19% (8421/44318) Resolving deltas: 20% (8864/44318) Resolving deltas: 21% (9307/44318) Resolving deltas: 22% (9750/44318) Resolving deltas: 23% (10195/44318) Resolving deltas: 24% (10637/44318) Resolving deltas: 25% (11080/44318) Resolving deltas: 26% (11523/44318) Resolving deltas: 27% (11966/44318) Resolving deltas: 28% (12410/44318) Resolving deltas: 29% (12854/44318) Resolving deltas: 30% (13298/44318) Resolving deltas: 31% (13739/44318) Resolving deltas: 32% (14182/44318) Resolving deltas: 33% (14625/44318) Resolving deltas: 34% (15069/44318) Resolving deltas: 35% (15512/44318) Resolving deltas: 36% (15955/44318) Resolving deltas: 37% (16401/44318) Resolving deltas: 38% (16841/44318) Resolving deltas: 39% (17285/44318) Resolving deltas: 40% (17728/44318) Resolving deltas: 41% (18171/44318) Resolving deltas: 42% (18614/44318) Resolving deltas: 43% (19057/44318) Resolving deltas: 44% (19500/44318) Resolving deltas: 45% (19944/44318) Resolving deltas: 46% (20388/44318) Resolving deltas: 47% (20830/44318) Resolving deltas: 48% (21276/44318) Resolving deltas: 49% (21717/44318) Resolving deltas: 50% (22160/44318) Resolving deltas: 51% (22603/44318) Resolving deltas: 52% (23048/44318) Resolving deltas: 53% (23489/44318) Resolving deltas: 54% (23932/44318) Resolving deltas: 55% (24375/44318) Resolving deltas: 56% (24819/44318) Resolving deltas: 57% (25262/44318) Resolving deltas: 58% (25705/44318) Resolving deltas: 59% (26148/44318) Resolving deltas: 60% (26591/44318) Resolving deltas: 61% (27034/44318) Resolving deltas: 62% (27478/44318) Resolving deltas: 63% (27921/44318) Resolving deltas: 64% (28364/44318) Resolving deltas: 65% (28807/44318) Resolving deltas: 66% (29250/44318) Resolving deltas: 67% (29694/44318) Resolving deltas: 68% (30138/44318) Resolving deltas: 69% (30580/44318) Resolving deltas: 70% (31023/44318) Resolving deltas: 71% (31466/44318) Resolving deltas: 72% (31909/44318) Resolving deltas: 73% (32353/44318) Resolving deltas: 74% (32796/44318) Resolving deltas: 75% (33242/44318) Resolving deltas: 76% (33682/44318) Resolving deltas: 77% (34126/44318) Resolving deltas: 78% (34569/44318) Resolving deltas: 79% (35012/44318) Resolving deltas: 80% (35455/44318) Resolving deltas: 81% (35898/44318) Resolving deltas: 82% (36341/44318) Resolving deltas: 83% (36784/44318) Resolving deltas: 84% (37228/44318) Resolving deltas: 85% (37671/44318) Resolving deltas: 86% (38114/44318) Resolving deltas: 87% (38557/44318) Resolving deltas: 88% (39000/44318) Resolving deltas: 89% (39446/44318) Resolving deltas: 90% (39887/44318) Resolving deltas: 91% (40330/44318) Resolving deltas: 92% (40773/44318) Resolving deltas: 93% (41216/44318) Resolving deltas: 94% (41659/44318) Resolving deltas: 95% (42105/44318) Resolving deltas: 96% (42546/44318) Resolving deltas: 97% (42989/44318) Resolving deltas: 98% (43432/44318) Resolving deltas: 99% (43875/44318) Resolving deltas: 100% (44318/44318) Resolving deltas: 100% (44318/44318), done.
  9. 7.90 s Fetching commit 08898429f2a98faff9a8de1c43eb54edd82e450c for push-vrpyqyylypmw ...
  10. 7.90 s $ /nix/store/bcnisk3ydfgv26v2gw3zlky24g00yww2-git-2.54.0/bin/git fetch origin 08898429f2a98faff9a8de1c43eb54edd82e450c
  11. 8.33 s From https://github.com/alphal00p/gammaloop
  12. 8.33 s * branch 08898429f2a98faff9a8de1c43eb54edd82e450c -> FETCH_HEAD
  13. 8.34 s $ /nix/store/9ypz3flqsrl5xl495mm8h645gadjsxi1-coreutils-9.11/bin/timeout --kill-after=15s 7200s /nix/store/bcnisk3ydfgv26v2gw3zlky24g00yww2-git-2.54.0/bin/git -c advice.detachedHead=false checkout 08898429f2a98faff9a8de1c43eb54edd82e450c
  14. 8.66 s HEAD is now at 08898429 run documentation tests through the Nix CI secret runner
  15. 8.67 s $ /nix/store/9ypz3flqsrl5xl495mm8h645gadjsxi1-coreutils-9.11/bin/timeout --kill-after=15s 7200s /nix/store/23zk8sgzamrbmj1fday15szf7f2279s8-nix-2.34.7/bin/nix --extra-experimental-features nix-command --extra-experimental-features flakes --log-format internal-json run .#packages.x86_64-linux.nix-ci-check-gammaloop-nextest-core --print-build-logs
  16. 9.89 s
  17. 21.93 s Downloading cached gammaloop-nextest-binaries-core-gammaloop-api from https://cache.nix-ci.com
  18. 22.29 s Downloading cached gammaloop-nextest-binaries-core-gammaloop-tracing-filter from https://cache.nix-ci.com
  19. 22.29 s Downloading cached gammaloop-nextest-binaries-core-gammaloop-tracing-filter-macros from https://cache.nix-ci.com
  20. 22.29 s Downloading cached gammaloop-nextest-binaries-core-gammalooprs from https://cache.nix-ci.com
  21. 22.29 s Downloading cached xgcc-15.2.0-libgcc from https://cache.nix-ci.com
  22. 22.29 s Downloading cached busybox from https://cache.nix-ci.com
  23. 22.29 s Downloading cached gcc-15.2.0-libgcc from https://cache.nix-ci.com
  24. 22.29 s Downloading cached libunistring from https://cache.nix-ci.com
  25. 22.29 s Downloading cached publicsuffix-list-0-unstable-2026-05 from https://cache.nix-ci.com
  26. 22.30 s Downloaded cached gcc-15.2.0-libgcc (193 KiB) in 8ms
  27. 22.30 s Progress: 0 of 1 built, 1 of 71 downloaded from cache (8 downloading)
  28. 22.30 s Downloaded cached xgcc-15.2.0-libgcc (193 KiB) in 10ms
  29. 22.30 s Progress: 0 of 1 built, 2 of 71 downloaded from cache (7 downloading)
  30. 22.30 s Downloaded cached publicsuffix-list-0-unstable-2026-05 (329 KiB) in 11ms
  31. 22.30 s Progress: 0 of 1 built, 3 of 71 downloaded from cache (6 downloading)
  32. 22.31 s Downloaded cached busybox (230 KiB) in 13ms
  33. 22.31 s Progress: 0 of 1 built, 4 of 71 downloaded from cache (5 downloading)
  34. 22.31 s Downloaded cached libunistring (2 MiB) in 20ms
  35. 22.31 s Progress: 0 of 1 built, 5 of 71 downloaded from cache (4 downloading)
  36. 22.31 s Downloading cached libidn2 from https://cache.nix-ci.com
  37. 22.31 s Downloaded cached libidn2 in 0ms
  38. 22.31 s Progress: 0 of 1 built, 6 of 71 downloaded from cache (4 downloading)
  39. 22.31 s Downloading cached glibc-2.42 from https://cache.nix-ci.com
  40. 22.32 s Downloaded cached gammaloop-nextest-binaries-core-gammaloop-tracing-filter-macros (1.7 MiB) in 28ms
  41. 22.32 s Progress: 0 of 1 built, 7 of 71 downloaded from cache (4 downloading)
  42. 22.94 s Downloaded cached glibc-2.42 (33.5 MiB) in 624ms
  43. 22.94 s Progress: 0 of 1 built, 8 of 71 downloaded from cache (3 downloading)
  44. 22.94 s Downloading cached attr from https://cache.nix-ci.com
  45. 22.94 s Downloading cached aws-c-common from https://cache.nix-ci.com
  46. 22.94 s Downloaded cached attr in 0ms
  47. 22.94 s Downloaded cached aws-c-common in 0ms
  48. 22.94 s Downloading cached bash from https://cache.nix-ci.com
  49. 22.94 s Downloading cached brotli-1.2.0-lib from https://cache.nix-ci.com
  50. 22.94 s Downloading cached bzip2 from https://cache.nix-ci.com
  51. 22.94 s Downloaded cached brotli-1.2.0-lib in 0ms
  52. 22.94 s Downloaded cached bash in 0ms
  53. 22.94 s Downloaded cached bzip2 in 0ms
  54. 22.94 s Downloading cached editline-1.17.1-unstable-2025-05 from https://cache.nix-ci.com
  55. 22.94 s Downloaded cached editline-1.17.1-unstable-2025-05 in 0ms
  56. 22.94 s Downloading cached gcc-15.2.0-lib from https://cache.nix-ci.com
  57. 22.94 s Downloaded cached gcc-15.2.0-lib in 0ms
  58. 22.94 s Downloading cached hwloc-2.14.0-lib from https://cache.nix-ci.com
  59. 22.94 s Downloaded cached hwloc-2.14.0-lib in 0ms
  60. 22.94 s Downloading cached keyutils-1.6.3-lib from https://cache.nix-ci.com
  61. 22.94 s Downloaded cached keyutils-1.6.3-lib in 0ms
  62. 22.94 s Downloading cached libcpuid from https://cache.nix-ci.com
  63. 22.94 s Downloaded cached libcpuid in 0ms
  64. 22.94 s Downloading cached libpsl from https://cache.nix-ci.com
  65. 22.94 s Downloaded cached libpsl in 0ms
  66. 22.94 s Downloading cached libseccomp-2.6.0-lib from https://cache.nix-ci.com
  67. 22.94 s Downloaded cached libseccomp-2.6.0-lib in 0ms
  68. 22.94 s Downloading cached libsodium-1.0.22-unstable-2026-04 from https://cache.nix-ci.com
  69. 22.94 s Downloaded cached libsodium-1.0.22-unstable-2026-04 in 0ms
  70. 22.94 s Progress: 0 of 1 built, 9 of 71 downloaded from cache (15 downloading)
  71. 22.94 s Progress: 0 of 1 built, 10 of 71 downloaded from cache (14 downloading)
  72. 22.94 s Progress: 0 of 1 built, 11 of 71 downloaded from cache (13 downloading)
  73. 22.94 s Progress: 0 of 1 built, 12 of 71 downloaded from cache (12 downloading)
  74. 22.94 s Progress: 0 of 1 built, 13 of 71 downloaded from cache (11 downloading)
  75. 22.94 s Progress: 0 of 1 built, 14 of 71 downloaded from cache (10 downloading)
  76. 22.94 s Progress: 0 of 1 built, 15 of 71 downloaded from cache (9 downloading)
  77. 22.94 s Progress: 0 of 1 built, 16 of 71 downloaded from cache (8 downloading)
  78. 22.94 s Progress: 0 of 1 built, 17 of 71 downloaded from cache (7 downloading)
  79. 22.94 s Progress: 0 of 1 built, 18 of 71 downloaded from cache (6 downloading)
  80. 22.94 s Progress: 0 of 1 built, 19 of 71 downloaded from cache (5 downloading)
  81. 22.94 s Progress: 0 of 1 built, 20 of 71 downloaded from cache (4 downloading)
  82. 22.94 s Downloading cached libxml2 from https://cache.nix-ci.com
  83. 22.94 s Downloaded cached libxml2 in 0ms
  84. 22.94 s Downloading cached llhttp from https://cache.nix-ci.com
  85. 22.94 s Downloading cached lowdown-3.0.1-lib from https://cache.nix-ci.com
  86. 22.94 s Downloaded cached llhttp in 0ms
  87. 22.94 s Downloading cached nghttp2-1.69.0-lib from https://cache.nix-ci.com
  88. 22.94 s Downloaded cached lowdown-3.0.1-lib in 0ms
  89. 22.94 s Downloaded cached nghttp2-1.69.0-lib in 0ms
  90. 22.94 s Downloading cached nghttp3 from https://cache.nix-ci.com
  91. 22.94 s Downloaded cached nghttp3 in 0ms
  92. 22.94 s Downloading cached openssl from https://cache.nix-ci.com
  93. 22.94 s Downloaded cached openssl in 0ms
  94. 22.94 s Downloading cached pcre2 from https://cache.nix-ci.com
  95. 22.94 s Downloading cached xz from https://cache.nix-ci.com
  96. 22.94 s Downloaded cached pcre2 in 0ms
  97. 22.94 s Downloaded cached xz in 0ms
  98. 22.94 s Downloading cached zlib from https://cache.nix-ci.com
  99. 22.94 s Downloaded cached zlib in 0ms
  100. 22.94 s Downloading cached acl from https://cache.nix-ci.com
  101. 22.94 s Downloaded cached acl in 0ms
  102. 22.94 s Downloading cached aws-c-compression from https://cache.nix-ci.com
  103. 22.94 s Downloaded cached aws-c-compression in 0ms
  104. 22.94 s Downloading cached aws-c-sdkutils from https://cache.nix-ci.com
  105. 22.94 s Downloaded cached aws-c-sdkutils in 0ms
  106. 22.94 s Progress: 0 of 1 built, 21 of 71 downloaded from cache (15 downloading)
  107. 22.94 s Progress: 0 of 1 built, 22 of 71 downloaded from cache (14 downloading)
  108. 22.94 s Progress: 0 of 1 built, 23 of 71 downloaded from cache (13 downloading)
  109. 22.94 s Progress: 0 of 1 built, 24 of 71 downloaded from cache (12 downloading)
  110. 22.94 s Progress: 0 of 1 built, 25 of 71 downloaded from cache (11 downloading)
  111. 22.94 s Progress: 0 of 1 built, 26 of 71 downloaded from cache (10 downloading)
  112. 22.94 s Progress: 0 of 1 built, 27 of 71 downloaded from cache (9 downloading)
  113. 22.94 s Progress: 0 of 1 built, 28 of 71 downloaded from cache (8 downloading)
  114. 22.94 s Progress: 0 of 1 built, 29 of 71 downloaded from cache (7 downloading)
  115. 22.94 s Progress: 0 of 1 built, 30 of 71 downloaded from cache (6 downloading)
  116. 22.94 s Progress: 0 of 1 built, 31 of 71 downloaded from cache (5 downloading)
  117. 22.94 s Progress: 0 of 1 built, 32 of 71 downloaded from cache (4 downloading)
  118. 22.94 s Downloading cached aws-checksums from https://cache.nix-ci.com
  119. 22.94 s Downloading cached boehm-gc from https://cache.nix-ci.com
  120. 22.94 s Downloaded cached aws-checksums in 0ms
  121. 22.94 s Downloading cached icu4c from https://cache.nix-ci.com
  122. 22.94 s Downloading cached onetbb from https://cache.nix-ci.com
  123. 22.94 s Downloading cached zstd from https://cache.nix-ci.com
  124. 22.94 s Downloading cached aws-c-cal from https://cache.nix-ci.com
  125. 22.94 s Downloading cached krb5-1.22.2-lib from https://cache.nix-ci.com
  126. 22.94 s Downloading cached libssh2 from https://cache.nix-ci.com
  127. 22.94 s Downloading cached ngtcp2 from https://cache.nix-ci.com
  128. 22.94 s Downloading cached s2n-tls from https://cache.nix-ci.com
  129. 22.94 s Downloading cached sqlite from https://cache.nix-ci.com
  130. 22.94 s Progress: 0 of 1 built, 33 of 71 downloaded from cache (14 downloading)
  131. 22.94 s Progress: 0 of 1 built, 34 of 71 downloaded from cache (13 downloading)
  132. 23.09 s Downloaded cached aws-c-cal (158 KiB) in 145ms
  133. 23.09 s Progress: 0 of 1 built, 35 of 71 downloaded from cache (12 downloading)
  134. 23.09 s Downloaded cached ngtcp2 (515 KiB) in 148ms
  135. 23.09 s Progress: 0 of 1 built, 36 of 71 downloaded from cache (11 downloading)
  136. 23.10 s Downloaded cached boehm-gc (312 KiB) in 159ms
  137. 23.10 s Progress: 0 of 1 built, 37 of 71 downloaded from cache (10 downloading)
  138. 23.11 s Downloaded cached s2n-tls (1.3 MiB) in 171ms
  139. 23.11 s Progress: 0 of 1 built, 38 of 71 downloaded from cache (9 downloading)
  140. 23.11 s Downloading cached aws-c-io from https://cache.nix-ci.com
  141. 23.12 s Downloaded cached onetbb (626 KiB) in 179ms
  142. 23.12 s Progress: 0 of 1 built, 39 of 71 downloaded from cache (9 downloading)
  143. 23.12 s Downloading cached libblake3 from https://cache.nix-ci.com
  144. 23.16 s Downloaded cached krb5-1.22.2-lib (2.7 MiB) in 214ms
  145. 23.16 s Progress: 0 of 1 built, 40 of 71 downloaded from cache (9 downloading)
  146. 23.16 s Downloaded cached libssh2 (330 KiB) in 216ms
  147. 23.16 s Progress: 0 of 1 built, 41 of 71 downloaded from cache (8 downloading)
  148. 23.16 s Downloading cached libgit2-1.9.4-lib from https://cache.nix-ci.com
  149. 23.17 s Downloaded cached zstd (1.1 MiB) in 225ms
  150. 23.17 s Progress: 0 of 1 built, 42 of 71 downloaded from cache (8 downloading)
  151. 23.17 s Downloading cached curl from https://cache.nix-ci.com
  152. 23.17 s Downloading cached libarchive-3.8.8-lib from https://cache.nix-ci.com
  153. 23.24 s Downloaded cached sqlite (5.7 MiB) in 294ms
  154. 23.24 s Progress: 0 of 1 built, 43 of 71 downloaded from cache (9 downloading)
  155. 23.25 s Downloaded cached libblake3 (117 KiB) in 131ms
  156. 23.25 s Progress: 0 of 1 built, 44 of 71 downloaded from cache (8 downloading)
  157. 23.26 s Downloaded cached aws-c-io (648 KiB) in 148ms
  158. 23.26 s Progress: 0 of 1 built, 45 of 71 downloaded from cache (7 downloading)
  159. 23.26 s Downloading cached aws-c-event-stream from https://cache.nix-ci.com
  160. 23.26 s Downloading cached aws-c-http from https://cache.nix-ci.com
  161. 23.27 s Downloaded cached gammaloop-nextest-binaries-core-gammaloop-tracing-filter (8.1 MiB) in 981ms
  162. 23.27 s Progress: 0 of 1 built, 46 of 71 downloaded from cache (8 downloading)
  163. 23.33 s Downloaded cached libarchive-3.8.8-lib (953 KiB) in 163ms
  164. 23.33 s Progress: 0 of 1 built, 47 of 71 downloaded from cache (7 downloading)
  165. 23.34 s Downloaded cached curl (1.2 MiB) in 170ms
  166. 23.34 s Progress: 0 of 1 built, 48 of 71 downloaded from cache (6 downloading)
  167. 23.38 s Downloaded cached aws-c-event-stream (176 KiB) in 113ms
  168. 23.38 s Progress: 0 of 1 built, 49 of 71 downloaded from cache (5 downloading)
  169. 23.39 s Downloaded cached libgit2-1.9.4-lib (1.6 MiB) in 232ms
  170. 23.39 s Progress: 0 of 1 built, 50 of 71 downloaded from cache (4 downloading)
  171. 23.39 s Downloaded cached aws-c-http (641 KiB) in 130ms
  172. 23.39 s Progress: 0 of 1 built, 51 of 71 downloaded from cache (3 downloading)
  173. 23.39 s Downloading cached aws-c-mqtt from https://cache.nix-ci.com
  174. 23.39 s Downloaded cached aws-c-mqtt in 0ms
  175. 23.39 s Progress: 0 of 1 built, 52 of 71 downloaded from cache (4 downloading)
  176. 23.39 s Downloading cached aws-c-auth from https://cache.nix-ci.com
  177. 23.52 s Downloaded cached aws-c-auth (387 KiB) in 129ms
  178. 23.52 s Progress: 0 of 1 built, 53 of 71 downloaded from cache (3 downloading)
  179. 23.52 s Downloading cached aws-c-s3 from https://cache.nix-ci.com
  180. 23.62 s Downloaded cached aws-c-s3 (384 KiB) in 90ms
  181. 23.62 s Progress: 0 of 1 built, 54 of 71 downloaded from cache (3 downloading)
  182. 23.62 s Downloading cached aws-crt-cpp from https://cache.nix-ci.com
  183. 23.64 s Downloaded cached icu4c (38.2 MiB) in 699ms
  184. 23.64 s Progress: 0 of 1 built, 55 of 71 downloaded from cache (3 downloading)
  185. 23.64 s Downloading cached boost from https://cache.nix-ci.com
  186. 23.64 s Downloaded cached boost in 0ms
  187. 23.64 s Progress: 0 of 1 built, 56 of 71 downloaded from cache (3 downloading)
  188. 23.64 s Downloading cached nix-util from https://cache.nix-ci.com
  189. 23.64 s Downloaded cached nix-util in 0ms
  190. 23.64 s Progress: 0 of 1 built, 57 of 71 downloaded from cache (3 downloading)
  191. 23.64 s Downloading cached nix-nswrapper from https://cache.nix-ci.com
  192. 23.64 s Downloaded cached nix-nswrapper in 0ms
  193. 23.64 s Progress: 0 of 1 built, 58 of 71 downloaded from cache (3 downloading)
  194. 23.67 s Downloaded cached aws-crt-cpp (979 KiB) in 53ms
  195. 23.67 s Progress: 0 of 1 built, 59 of 71 downloaded from cache (2 downloading)
  196. 23.67 s Downloading cached nix-store from https://cache.nix-ci.com
  197. 23.76 s Downloaded cached nix-store (5.8 MiB) in 84ms
  198. 23.76 s Progress: 0 of 1 built, 60 of 71 downloaded from cache (2 downloading)
  199. 23.76 s Downloading cached nix-fetchers from https://cache.nix-ci.com
  200. 23.76 s Downloading cached nix-main from https://cache.nix-ci.com
  201. 23.81 s Downloaded cached nix-main (393 KiB) in 49ms
  202. 23.81 s Progress: 0 of 1 built, 61 of 71 downloaded from cache (3 downloading)
  203. 23.81 s Downloaded cached nix-fetchers (1.5 MiB) in 58ms
  204. 23.81 s Progress: 0 of 1 built, 62 of 71 downloaded from cache (2 downloading)
  205. 23.82 s Downloading cached nix-expr from https://cache.nix-ci.com
  206. 23.88 s Downloaded cached nix-expr (3.3 MiB) in 65ms
  207. 23.88 s Progress: 0 of 1 built, 63 of 71 downloaded from cache (2 downloading)
  208. 23.88 s Downloading cached nix-flake from https://cache.nix-ci.com
  209. 23.95 s Downloaded cached nix-flake (956 KiB) in 64ms
  210. 23.95 s Progress: 0 of 1 built, 64 of 71 downloaded from cache (2 downloading)
  211. 23.95 s Downloading cached nix-cmd from https://cache.nix-ci.com
  212. 24.00 s Downloaded cached nix-cmd (1 MiB) in 56ms
  213. 24.00 s Progress: 0 of 1 built, 65 of 71 downloaded from cache (2 downloading)
  214. 24.00 s Downloading cached nix from https://cache.nix-ci.com
  215. 24.09 s Downloaded cached nix (3.9 MiB) in 89ms
  216. 24.09 s Progress: 0 of 1 built, 66 of 71 downloaded from cache (2 downloading)
  217. 24.09 s Downloading cached nix from https://cache.nix-ci.com
  218. 24.14 s Downloaded cached nix (8848 B) in 49ms
  219. 24.14 s Progress: 0 of 1 built, 67 of 71 downloaded from cache (2 downloading)
  220. 27.81 s Downloaded cached gammaloop-nextest-binaries-core-gammaloop-api (68.4 MiB) in 5.8s
  221. 28.06 s Progress: 0 of 1 built, 68 of 71 downloaded from cache (1 downloading)
  222. 29.04 s Downloaded cached gammaloop-nextest-binaries-core-gammalooprs (79.4 MiB) in 6.7s
  223. 29.04 s Progress: 0 of 1 built, 69 of 71 downloaded from cache
  224. 29.04 s Downloading cached gammaloop-nextest-binaries-core from https://cache.nix-ci.com
  225. 29.18 s Downloaded cached gammaloop-nextest-binaries-core (1640 B) in 143ms
  226. 29.18 s Progress: 0 of 1 built, 70 of 71 downloaded from cache
  227. 29.18 s Downloading cached nix-ci-check-gammaloop-nextest-core from https://cache.nix-ci.com
  228. 29.38 s Downloaded cached nix-ci-check-gammaloop-nextest-core (1016 B) in 198ms
  229. 29.38 s Progress: 0 of 1 built, 71 of 71 downloaded from cache
  230. 35.22 s evaluating derivation 'g copying '/nix/store/0fcb evaluating derivation 'g copying '/nix/store/0fcb evaluating derivation 'g copying '/nix/store/0fcb evaluating derivation 'g copying '/nix/store/0fcb evaluating derivation 'g copying '/nix/store/0fcb evaluating derivation 'g copying '/nix/store/0fcb evaluating derivation 'g querying gammaloop-nexte [0.0 KiB DL] querying in [2.2 KiB DL] querying fl [4.8 KiB DL] querying gf [0/14 built, 4/0/15 copi [1/0/11 built, 5/0/11 cocrane-dummy-cargo-target.rs (post)> Uploading to the NixCI cache: /nix/store/hd50hqi25fymr09a2w4xdiy5jmb2cfl5-crane-dummy-cargo-target.rs
  231. 35.32 s [2/0/10 built, 4/3/11 cocrane-dummy-cargo-target.rs (post)> warning: 'warn-short-path-literals' is deprecated, use 'lint-short-path-literals = ignore' instead
  232. 35.34 s crane-dummy-cargo-target.rs (post)> copying 0 paths...
  233. 35.44 s crane-dummy-cargo-target.rs (post)> warning: 'warn-short-path-literals' is deprecated, use 'lint-short-path-literals = ignore' instead
  234. 35.53 s crane-dummy-cargo-target.rs (post)> copying 0 paths...
  235. 35.57 s crane-dummy-proc-macro-cargo-target.rs (post)> Uploading to the NixCI cache: /nix/store/z0b4s6pznqwlbyw5v4bbq7k1kp721g19-crane-dummy-proc-macro-cargo-target.rs
  236. 35.62 s [1/1/10 built, 1/6/11 cocrane-dummy-proc-macro-cargo-target.rs (post)> warning: 'warn-short-path-literals' is deprecated, use 'lint-short-path-literals = ignore' instead
  237. 35.69 s crane-dummy-proc-macro-cargo-target.rs (post)> copying 0 paths...
  238. 35.77 s crane-dummy-proc-macro-cargo-target.rs (post)> warning: 'warn-short-path-literals' is deprecated, use 'lint-short-path-literals = ignore' instead
  239. 35.85 s crane-dummy-proc-macro-cargo-target.rs (post)> copying 0 paths...
  240. 39.51 s [2/8 built, 1/9/11 copie [2/4 built, 11 copied (4 [1/2/3 built, 11 copied gammaloop-nextest-core> Extracting 3 binaries (including 1 non-test binary), 1 build script output directory, and 2 linked paths to /build/nextest-archive-ZhVsS2
  241. 40.07 s gammaloop-nextest-core> Extracted 18 files to /build/nextest-archive-ZhVsS2 in 0.56s
  242. 40.09 s gammaloop-nextest-core> ------------
  243. 40.09 s gammaloop-nextest-core> Nextest run ID 5c399ff2-372d-4c8e-80b9-9b0f945f02ad with nextest profile: ci_gammaloop
  244. 40.09 s gammaloop-nextest-core> Starting 339 tests across 2 binaries
  245. 40.38 s gammaloop-nextest-core> FAIL [ 0.019s] (247/339) gammaloop-api repl::tests::completion_shows_type_hint_for_non_boolean_settings_leaf
  246. 40.70 s gammaloop-nextest-core> stdout ---
  247. 40.70 s gammaloop-nextest-core>
  248. 40.70 s gammaloop-nextest-core> running 1 test
  249. 40.70 s gammaloop-nextest-core> test repl::tests::completion_shows_type_hint_for_non_boolean_settings_leaf ... FAILED
  250. 40.70 s gammaloop-nextest-core>
  251. 40.70 s gammaloop-nextest-core> failures:
  252. 40.70 s gammaloop-nextest-core>
  253. 40.70 s gammaloop-nextest-core> failures:
  254. 40.70 s gammaloop-nextest-core> repl::tests::completion_shows_type_hint_for_non_boolean_settings_leaf
  255. 40.70 s gammaloop-nextest-core>
  256. 40.70 s gammaloop-nextest-core> test result: FAILED. 0 passed; 1 failed; 0 ignored; 0 measured; 338 filtered out; finished in 0.01s
  257. 40.70 s gammaloop-nextest-core>
  258. 40.70 s gammaloop-nextest-core> stderr ---
  259. 40.70 s gammaloop-nextest-core>
  260. 40.70 s gammaloop-nextest-core> thread 'repl::tests::completion_shows_type_hint_for_non_boolean_settings_leaf' (775) panicked at crates/gammaloop-api/src/repl.rs:5778:9:
  261. 40.70 s gammaloop-nextest-core> [Suggestion { value: "", description: Some("Number of samples in the first Monte Carlo iteration."), style: None, extra: None, span: Span { start: 42, end: 42 }, append_whitespace: false }]
  262. 40.70 s gammaloop-nextest-core> stack backtrace:
  263. 40.70 s gammaloop-nextest-core> 0: __rustc::rust_begin_unwind
  264. 40.70 s gammaloop-nextest-core> 1: core::panicking::panic_fmt
  265. 40.70 s gammaloop-nextest-core> 2: gammaloop_api::repl::tests::completion_shows_type_hint_for_non_boolean_settings_leaf
  266. 40.70 s gammaloop-nextest-core> 3: <gammaloop_api::repl::tests::completion_shows_type_hint_for_non_boolean_settings_leaf::{closure#0} as core::ops::function::FnOnce<()>>::call_once
  267. 40.70 s gammaloop-nextest-core> note: Some details are omitted, run with `RUST_BACKTRACE=full` for a verbose backtrace.
  268. 40.70 s gammaloop-nextest-core>
  269. 40.70 s gammaloop-nextest-core> FAIL [ 0.025s] (278/339) gammaloop-api templates::tests::extract_templates_uses_canonical_package_layout
  270. 40.70 s gammaloop-nextest-core> stdout ---
  271. 40.70 s gammaloop-nextest-core>
  272. 40.70 s gammaloop-nextest-core> running 1 test
  273. 40.70 s gammaloop-nextest-core> test templates::tests::extract_templates_uses_canonical_package_layout ... FAILED
  274. 40.70 s gammaloop-nextest-core>
  275. 40.70 s gammaloop-nextest-core> failures:
  276. 40.70 s gammaloop-nextest-core>
  277. 40.70 s gammaloop-nextest-core> failures:
  278. 40.70 s gammaloop-nextest-core> templates::tests::extract_templates_uses_canonical_package_layout
  279. 40.70 s gammaloop-nextest-core>
  280. 40.70 s gammaloop-nextest-core> test result: FAILED. 0 passed; 1 failed; 0 ignored; 0 measured; 338 filtered out; finished in 0.02s
  281. 40.70 s gammaloop-nextest-core>
  282. 40.70 s gammaloop-nextest-core> stderr ---
  283. 40.70 s gammaloop-nextest-core>
  284. 40.70 s gammaloop-nextest-core> thread 'templates::tests::extract_templates_uses_canonical_package_layout' (872) panicked at crates/gammaloop-api/src/templates.rs:99:9:
  285. 40.70 s gammaloop-nextest-core> assertion failed: figure.contains("amplitude-mode")
  286. 40.70 s gammaloop-nextest-core> stack backtrace:
  287. 40.70 s gammaloop-nextest-core> 0: __rustc::rust_begin_unwind
  288. 40.70 s gammaloop-nextest-core> 1: core::panicking::panic_fmt
  289. 40.70 s gammaloop-nextest-core> 2: core::panicking::panic
  290. 40.70 s gammaloop-nextest-core> 3: gammaloop_api::templates::tests::extract_templates_uses_canonical_package_layout
  291. 40.70 s gammaloop-nextest-core> 4: <gammaloop_api::templates::tests::extract_templates_uses_canonical_package_layout::{closure#0} as core::ops::function::FnOnce<()>>::call_once
  292. 40.70 s gammaloop-nextest-core> note: Some details are omitted, run with `RUST_BACKTRACE=full` for a verbose backtrace.
  293. 40.70 s gammaloop-nextest-core>
  294. 40.70 s gammaloop-nextest-core> ------------
  295. 40.70 s gammaloop-nextest-core> Summary [ 0.476s] 339 tests run: 337 passed, 2 failed, 0 skipped
  296. 40.70 s gammaloop-nextest-core> FAIL [ 0.019s] (247/339) gammaloop-api repl::tests::completion_shows_type_hint_for_non_boolean_settings_leaf
  297. 40.70 s gammaloop-nextest-core> stdout ---
  298. 40.70 s gammaloop-nextest-core>
  299. 40.70 s gammaloop-nextest-core> running 1 test
  300. 40.70 s gammaloop-nextest-core> test repl::tests::completion_shows_type_hint_for_non_boolean_settings_leaf ... FAILED
  301. 40.70 s gammaloop-nextest-core>
  302. 40.70 s gammaloop-nextest-core> failures:
  303. 40.70 s gammaloop-nextest-core>
  304. 40.70 s gammaloop-nextest-core> failures:
  305. 40.70 s gammaloop-nextest-core> repl::tests::completion_shows_type_hint_for_non_boolean_settings_leaf
  306. 40.70 s gammaloop-nextest-core>
  307. 40.70 s gammaloop-nextest-core> test result: FAILED. 0 passed; 1 failed; 0 ignored; 0 measured; 338 filtered out; finished in 0.01s
  308. 40.70 s gammaloop-nextest-core>
  309. 40.70 s gammaloop-nextest-core> stderr ---
  310. 40.70 s gammaloop-nextest-core>
  311. 40.70 s gammaloop-nextest-core> thread 'repl::tests::completion_shows_type_hint_for_non_boolean_settings_leaf' (775) panicked at crates/gammaloop-api/src/repl.rs:5778:9:
  312. 40.70 s gammaloop-nextest-core> [Suggestion { value: "", description: Some("Number of samples in the first Monte Carlo iteration."), style: None, extra: None, span: Span { start: 42, end: 42 }, append_whitespace: false }]
  313. 40.70 s gammaloop-nextest-core> stack backtrace:
  314. 40.70 s gammaloop-nextest-core> 0: __rustc::rust_begin_unwind
  315. 40.70 s gammaloop-nextest-core> 1: core::panicking::panic_fmt
  316. 40.70 s gammaloop-nextest-core> 2: gammaloop_api::repl::tests::completion_shows_type_hint_for_non_boolean_settings_leaf
  317. 40.70 s gammaloop-nextest-core> 3: <gammaloop_api::repl::tests::completion_shows_type_hint_for_non_boolean_settings_leaf::{closure#0} as core::ops::function::FnOnce<()>>::call_once
  318. 40.70 s gammaloop-nextest-core> note: Some details are omitted, run with `RUST_BACKTRACE=full` for a verbose backtrace.
  319. 40.70 s gammaloop-nextest-core>
  320. 40.70 s gammaloop-nextest-core> FAIL [ 0.025s] (278/339) gammaloop-api templates::tests::extract_templates_uses_canonical_package_layout
  321. 40.70 s gammaloop-nextest-core> stdout ---
  322. 40.70 s gammaloop-nextest-core>
  323. 40.70 s gammaloop-nextest-core> running 1 test
  324. 40.70 s gammaloop-nextest-core> test templates::tests::extract_templates_uses_canonical_package_layout ... FAILED
  325. 40.70 s gammaloop-nextest-core>
  326. 40.70 s gammaloop-nextest-core> failures:
  327. 40.70 s gammaloop-nextest-core>
  328. 40.70 s gammaloop-nextest-core> failures:
  329. 40.70 s gammaloop-nextest-core> templates::tests::extract_templates_uses_canonical_package_layout
  330. 40.70 s gammaloop-nextest-core>
  331. 40.70 s gammaloop-nextest-core> test result: FAILED. 0 passed; 1 failed; 0 ignored; 0 measured; 338 filtered out; finished in 0.02s
  332. 40.70 s gammaloop-nextest-core>
  333. 40.70 s gammaloop-nextest-core> stderr ---
  334. 40.70 s gammaloop-nextest-core>
  335. 40.70 s gammaloop-nextest-core> thread 'templates::tests::extract_templates_uses_canonical_package_layout' (872) panicked at crates/gammaloop-api/src/templates.rs:99:9:
  336. 40.70 s gammaloop-nextest-core> assertion failed: figure.contains("amplitude-mode")
  337. 40.70 s gammaloop-nextest-core> stack backtrace:
  338. 40.70 s gammaloop-nextest-core> 0: __rustc::rust_begin_unwind
  339. 40.70 s gammaloop-nextest-core> 1: core::panicking::panic_fmt
  340. 40.70 s gammaloop-nextest-core> 2: core::panicking::panic
  341. 40.70 s gammaloop-nextest-core> 3: gammaloop_api::templates::tests::extract_templates_uses_canonical_package_layout
  342. 40.70 s gammaloop-nextest-core> 4: <gammaloop_api::templates::tests::extract_templates_uses_canonical_package_layout::{closure#0} as core::ops::function::FnOnce<()>>::call_once
  343. 40.70 s gammaloop-nextest-core> note: Some details are omitted, run with `RUST_BACKTRACE=full` for a verbose backtrace.
  344. 40.70 s gammaloop-nextest-core>
  345. 40.70 s gammaloop-nextest-core> error: test run failed
  346. 40.70 s gammaloop-nextest-core>
  347. 40.70 s gammaloop-nextest-core> ========== nextest test summary ==========
  348. 40.70 s gammaloop-nextest-core> report: target/nextest/ci_gammaloop/junit.xml
  349. 40.70 s gammaloop-nextest-core> tests: 339, failures: 2, errors: 0
  350. 40.70 s gammaloop-nextest-core>
  351. 40.70 s gammaloop-nextest-core> 1. gammaloop-api::repl::tests::completion_shows_type_hint_for_non_boolean_settings_leaf
  352. 40.70 s gammaloop-nextest-core> failure: test failure with exit code 101
  353. 40.70 s gammaloop-nextest-core> thread 'repl::tests::completion_shows_type_hint_for_non_boolean_settings_leaf' (775) panicked at crates/gammaloop-api/src/repl.rs:5778:9:
  354. 40.70 s gammaloop-nextest-core> [Suggestion { value: "", description: Some("Number of samples in the first Monte Carlo iteration."), style: None, extra: None, span: Span { start: 42, end: 42 }, append_whitespace: false }]
  355. 40.70 s gammaloop-nextest-core> stack backtrace:
  356. 40.70 s gammaloop-nextest-core> 0: __rustc::rust_begin_unwind
  357. 40.70 s gammaloop-nextest-core> 1: core::panicking::panic_fmt
  358. 40.70 s gammaloop-nextest-core> 2: gammaloop_api::repl::tests::completion_shows_type_hint_for_non_boolean_settings_leaf
  359. 40.70 s gammaloop-nextest-core> 3: <gammaloop_api::repl::tests::completion_shows_type_hint_for_non_boolean_settings_leaf::{closure#0} as core::ops::function::FnOnce<()>>::call_once
  360. 40.70 s gammaloop-nextest-core> note: Some details are omitted, run with `RUST_BACKTRACE=full` for a verbose backtrace.
  361. 40.70 s gammaloop-nextest-core> system-out
  362. 40.70 s gammaloop-nextest-core> running 1 test
  363. 40.70 s gammaloop-nextest-core> test repl::tests::completion_shows_type_hint_for_non_boolean_settings_leaf ... FAILED
  364. 40.70 s gammaloop-nextest-core>
  365. 40.70 s gammaloop-nextest-core> failures:
  366. 40.70 s gammaloop-nextest-core>
  367. 40.70 s gammaloop-nextest-core> failures:
  368. 40.70 s gammaloop-nextest-core> repl::tests::completion_shows_type_hint_for_non_boolean_settings_leaf
  369. 40.70 s gammaloop-nextest-core>
  370. 40.70 s gammaloop-nextest-core> test result: FAILED. 0 passed; 1 failed; 0 ignored; 0 measured; 338 filtered out; finished in 0.01s
  371. 40.70 s gammaloop-nextest-core> system-err
  372. 40.70 s gammaloop-nextest-core> thread 'repl::tests::completion_shows_type_hint_for_non_boolean_settings_leaf' (775) panicked at crates/gammaloop-api/src/repl.rs:5778:9:
  373. 40.70 s gammaloop-nextest-core> [Suggestion { value: "", description: Some("Number of samples in the first Monte Carlo iteration."), style: None, extra: None, span: Span { start: 42, end: 42 }, append_whitespace: false }]
  374. 40.70 s gammaloop-nextest-core> stack backtrace:
  375. 40.70 s gammaloop-nextest-core> 0: __rustc::rust_begin_unwind
  376. 40.70 s gammaloop-nextest-core> 1: core::panicking::panic_fmt
  377. 40.70 s gammaloop-nextest-core> 2: gammaloop_api::repl::tests::completion_shows_type_hint_for_non_boolean_settings_leaf
  378. 40.70 s gammaloop-nextest-core> 3: <gammaloop_api::repl::tests::completion_shows_type_hint_for_non_boolean_settings_leaf::{closure#0} as core::ops::function::FnOnce<()>>::call_once
  379. 40.70 s gammaloop-nextest-core> note: Some details are omitted, run with `RUST_BACKTRACE=full` for a verbose backtrace.
  380. 40.70 s gammaloop-nextest-core>
  381. 40.70 s gammaloop-nextest-core> 2. gammaloop-api::templates::tests::extract_templates_uses_canonical_package_layout
  382. 40.70 s gammaloop-nextest-core> failure: test failure with exit code 101
  383. 40.70 s gammaloop-nextest-core> thread 'templates::tests::extract_templates_uses_canonical_package_layout' (872) panicked at crates/gammaloop-api/src/templates.rs:99:9:
  384. 40.70 s gammaloop-nextest-core> assertion failed: figure.contains("amplitude-mode")
  385. 40.70 s gammaloop-nextest-core> stack backtrace:
  386. 40.70 s gammaloop-nextest-core> 0: __rustc::rust_begin_unwind
  387. 40.70 s gammaloop-nextest-core> 1: core::panicking::panic_fmt
  388. 40.70 s gammaloop-nextest-core> 2: core::panicking::panic
  389. 40.70 s gammaloop-nextest-core> 3: gammaloop_api::templates::tests::extract_templates_uses_canonical_package_layout
  390. 40.70 s gammaloop-nextest-core> 4: <gammaloop_api::templates::tests::extract_templates_uses_canonical_package_layout::{closure#0} as core::ops::function::FnOnce<()>>::call_once
  391. 40.70 s gammaloop-nextest-core> note: Some details are omitted, run with `RUST_BACKTRACE=full` for a verbose backtrace.
  392. 40.70 s gammaloop-nextest-core> system-out
  393. 40.70 s gammaloop-nextest-core> running 1 test
  394. 40.70 s gammaloop-nextest-core> test templates::tests::extract_templates_uses_canonical_package_layout ... FAILED
  395. 40.70 s gammaloop-nextest-core>
  396. 40.70 s gammaloop-nextest-core> failures:
  397. 40.70 s gammaloop-nextest-core>
  398. 40.70 s gammaloop-nextest-core> failures:
  399. 40.70 s gammaloop-nextest-core> templates::tests::extract_templates_uses_canonical_package_layout
  400. 40.70 s gammaloop-nextest-core>
  401. 40.70 s gammaloop-nextest-core> test result: FAILED. 0 passed; 1 failed; 0 ignored; 0 measured; 338 filtered out; finished in 0.02s
  402. 40.70 s gammaloop-nextest-core> system-err
  403. 40.70 s gammaloop-nextest-core> thread 'templates::tests::extract_templates_uses_canonical_package_layout' (872) panicked at crates/gammaloop-api/src/templates.rs:99:9:
  404. 40.70 s gammaloop-nextest-core> assertion failed: figure.contains("amplitude-mode")
  405. 40.70 s gammaloop-nextest-core> stack backtrace:
  406. 40.70 s gammaloop-nextest-core> 0: __rustc::rust_begin_unwind
  407. 40.70 s gammaloop-nextest-core> 1: core::panicking::panic_fmt
  408. 40.70 s gammaloop-nextest-core> 2: core::panicking::panic
  409. 40.70 s gammaloop-nextest-core> 3: gammaloop_api::templates::tests::extract_templates_uses_canonical_package_layout
  410. 40.70 s gammaloop-nextest-core> 4: <gammaloop_api::templates::tests::extract_templates_uses_canonical_package_layout::{closure#0} as core::ops::function::FnOnce<()>>::call_once
  411. 40.70 s gammaloop-nextest-core> note: Some details are omitted, run with `RUST_BACKTRACE=full` for a verbose backtrace.
  412. 40.70 s gammaloop-nextest-core> =========================================
  413. 40.70 s gammaloop-nextest-core> Extracting 1 binary and 1 linked path to /build/nextest-archive-zOznLq
  414. 40.74 s gammaloop-nextest-core> Extracted 7 files to /build/nextest-archive-zOznLq in 0.07s
  415. 40.75 s gammaloop-nextest-core> ------------
  416. 40.75 s gammaloop-nextest-core> Nextest run ID e95c5917-efbb-4327-b6b4-0ee290da4e98 with nextest profile: ci_gammaloop
  417. 40.75 s gammaloop-nextest-core> Starting 19 tests across 1 binary
  418. 40.76 s gammaloop-nextest-core> ------------
  419. 40.76 s gammaloop-nextest-core> Summary [ 0.011s] 19 tests run: 19 passed, 0 skipped
  420. 40.80 s gammaloop-nextest-core>
  421. 40.80 s gammaloop-nextest-core> ========== nextest test summary ==========
  422. 40.80 s gammaloop-nextest-core> report: target/nextest/ci_gammaloop/junit.xml
  423. 40.80 s gammaloop-nextest-core> tests: 19, failures: 0, errors: 0
  424. 40.80 s gammaloop-nextest-core> No failing testcases found.
  425. 40.80 s gammaloop-nextest-core> =========================================
  426. 40.82 s gammaloop-nextest-core> Extracting 1 binary to /build/nextest-archive-x6xLNm
  427. 40.85 s gammaloop-nextest-core> Extracted 4 files to /build/nextest-archive-x6xLNm in 0.03s
  428. 40.86 s gammaloop-nextest-core> ------------
  429. 40.86 s gammaloop-nextest-core> Nextest run ID 890b8ba6-593e-4a43-a774-aa040e795af4 with nextest profile: ci_gammaloop
  430. 40.86 s gammaloop-nextest-core> Starting 0 tests across 1 binary
  431. 40.86 s gammaloop-nextest-core> ------------
  432. 40.86 s gammaloop-nextest-core> Summary [ 0.000s] 0 tests run: 0 passed, 0 skipped
  433. 40.90 s gammaloop-nextest-core>
  434. 40.90 s gammaloop-nextest-core> ========== nextest test summary ==========
  435. 40.90 s gammaloop-nextest-core> report: target/nextest/ci_gammaloop/junit.xml
  436. 40.90 s gammaloop-nextest-core> tests: 0, failures: 0, errors: 0
  437. 40.90 s gammaloop-nextest-core> No failing testcases found.
  438. 40.90 s gammaloop-nextest-core> =========================================
  439. 40.91 s gammaloop-nextest-core> Extracting 4 binaries, 1 build script output directory, and 2 linked paths to /build/nextest-archive-MbxPzS
  440. 41.41 s gammaloop-nextest-core> Extracted 18 files to /build/nextest-archive-MbxPzS in 0.49s
  441. 41.42 s gammaloop-nextest-core> ------------
  442. 41.42 s gammaloop-nextest-core> Nextest run ID 23c40765-3664-471f-83b2-83c031c5db37 with nextest profile: ci_gammaloop
  443. 41.42 s gammaloop-nextest-core> Starting 456 tests across 4 binaries (61 tests skipped, including 60 tests via profile.ci_gammaloop.default-filter)
  444. 41.67 s gammaloop-nextest-core> FAIL [ 0.142s] ( 87/456) gammalooprs graph::parse::tests::parse_lmbsetting_crossection
  445. 41.67 s gammaloop-nextest-core> stdout ---
  446. 41.67 s gammaloop-nextest-core>
  447. 41.67 s gammaloop-nextest-core> running 1 test
  448. 41.67 s gammaloop-nextest-core> ━━━━━━━━━━━━━━━━━━━━━━━━━━━━━━━ Snapshot Summary ━━━━━━━━━━━━━━━━━━━━━━━━━━━━━━━
  449. 41.67 s gammaloop-nextest-core> Snapshot: parse_lmbsetting_crossection
  450. 41.67 s gammaloop-nextest-core> Source: crates/gammalooprs/src/graph/parse/tests.rs:252
  451. 41.67 s gammaloop-nextest-core> ────────────────────────────────────────────────────────────────────────────────
  452. 41.67 s gammaloop-nextest-core> Expression: g.debug_dot()
  453. 41.67 s gammaloop-nextest-core> ────────────────────────────────────────────────────────────────────────────────
  454. 41.67 s gammaloop-nextest-core> -old snapshot
  455. 41.67 s gammaloop-nextest-core> +new results
  456. 41.67 s gammaloop-nextest-core> ────────────┬───────────────────────────────────────────────────────────────────
  457. 41.67 s gammaloop-nextest-core> 1 │-digraph G{
  458. 41.67 s gammaloop-nextest-core> 1 │+digraph G {
  459. 41.67 s gammaloop-nextest-core> 2 2 │ num = "1/2";
  460. 41.68 s gammaloop-nextest-core> 3 3 │ overall_factor = "2*x";
  461. 41.68 s gammaloop-nextest-core> 4 4 │ overall_factor_evaluated = "2*x";
  462. 41.68 s gammaloop-nextest-core> 5 5 │ projector = "spenso::t";
  463. 41.68 s gammaloop-nextest-core> ────────────┴───────────────────────────────────────────────────────────────────
  464. 41.68 s gammaloop-nextest-core> To update snapshots run `cargo insta review`
  465. 41.68 s gammaloop-nextest-core> Stopped on the first failure. Run `cargo insta test` to run all snapshots.
  466. 41.68 s gammaloop-nextest-core> test graph::parse::tests::parse_lmbsetting_crossection ... FAILED
  467. 41.68 s gammaloop-nextest-core>
  468. 41.68 s gammaloop-nextest-core> failures:
  469. 41.68 s gammaloop-nextest-core>
  470. 41.68 s gammaloop-nextest-core> failures:
  471. 41.68 s gammaloop-nextest-core> graph::parse::tests::parse_lmbsetting_crossection
  472. 41.68 s gammaloop-nextest-core>
  473. 41.68 s gammaloop-nextest-core> test result: FAILED. 0 passed; 1 failed; 0 ignored; 0 measured; 508 filtered out; finished in 0.13s
  474. 41.68 s gammaloop-nextest-core>
  475. 41.68 s gammaloop-nextest-core> stderr ---
  476. 41.68 s gammaloop-nextest-core> [21:40:02.996] @gammalooprs::graph::attribute_warnings WARNING : Unknown node attribute 'color_num' on graph 'G', node 'A'; did you mean 'num'?
  477. 41.68 s gammaloop-nextest-core> at crates/gammalooprs/src/graph/attribute_warnings.rs:198
  478. 41.68 s gammaloop-nextest-core> The application panicked (crashed).
  479. 41.68 s gammaloop-nextest-core> Message: snapshot assertion for 'parse_lmbsetting_crossection' failed in line 252
  480. 41.68 s gammaloop-nextest-core> Location: /nix/store/xdy1vvhll2bijdplvl9fcc2b9plkxhaa-vendor-cargo-deps/c19b7c6f923b580ac259164a89f2577984ad5ab09ee9d583b888f934adbbe8d0/insta-1.47.2/src/runtime.rs:719
  481. 41.68 s gammaloop-nextest-core>
  482. 41.68 s gammaloop-nextest-core> ━━━━━━━━━━━━━━━━━━━━━━━━━━━━━━━━━━ BACKTRACE ━━━━━━━━━━━━━━━━━━━━━━━━━━━━━━━━━━━
  483. 41.68 s gammaloop-nextest-core> 1: <color_eyre[b0c9e66060e883b2]::config::PanicHook>::panic_report<unknown>
  484. 41.68 s gammaloop-nextest-core> at <unknown source file>:<unknown line>
  485. 41.68 s gammaloop-nextest-core> 2: <color_eyre[b0c9e66060e883b2]::config::PanicHook>::into_panic_hook::{closure#0}<unknown>
  486. 41.68 s gammaloop-nextest-core> at <unknown source file>:<unknown line>
  487. 41.68 s gammaloop-nextest-core> 3: std[bcb96dfbba0ab899]::panicking::panic_with_hook<unknown>
  488. 41.68 s gammaloop-nextest-core> at <unknown source file>:<unknown line>
  489. 41.68 s gammaloop-nextest-core> 4: std[bcb96dfbba0ab899]::panicking::panic_handler::{closure#0}<unknown>
  490. 41.68 s gammaloop-nextest-core> at <unknown source file>:<unknown line>
  491. 41.68 s gammaloop-nextest-core> 5: std[bcb96dfbba0ab899]::sys::backtrace::__rust_end_short_backtrace::<std[bcb96dfbba0ab899]::panicking::panic_handler::{closure#0}, !><unknown>
  492. 41.68 s gammaloop-nextest-core> at <unknown source file>:<unknown line>
  493. 41.68 s gammaloop-nextest-core> 6: __rustc[6c289b9f9c454d21]::rust_begin_unwind<unknown>
  494. 41.68 s gammaloop-nextest-core> at <unknown source file>:<unknown line>
  495. 41.68 s gammaloop-nextest-core> 7: core[940e698046960fd5]::panicking::panic_fmt<unknown>
  496. 41.68 s gammaloop-nextest-core> at <unknown source file>:<unknown line>
  497. 41.68 s gammaloop-nextest-core> 8: insta[307a548ac79ef4d9]::runtime::assert_snapshot<unknown>
  498. 41.68 s gammaloop-nextest-core> at <unknown source file>:<unknown line>
  499. 41.68 s gammaloop-nextest-core> 9: gammalooprs[5490727360442cce]::graph::parse::tests::parse_lmbsetting_crossection<unknown>
  500. 41.68 s gammaloop-nextest-core> at <unknown source file>:<unknown line>
  501. 41.68 s gammaloop-nextest-core> 10: <gammalooprs[5490727360442cce]::graph::parse::tests::parse_lmbsetting_crossection::{closure#0} as core[940e698046960fd5]::ops::function::FnOnce<()>>::call_once<unknown>
  502. 41.68 s gammaloop-nextest-core> at <unknown source file>:<unknown line>
  503. 41.68 s gammaloop-nextest-core> 11: test[75d6903177b1d7e9]::__rust_begin_short_backtrace::<core[940e698046960fd5]::result::Result<(), alloc[2ea6bcb46fca0c42]::string::String>, fn() -> core[940e698046960fd5]::result::Result<(), alloc[2ea6bcb46fca0c42]::string::String>><unknown>
  504. 41.68 s gammaloop-nextest-core> at <unknown source file>:<unknown line>
  505. 41.68 s gammaloop-nextest-core> 12: test[75d6903177b1d7e9]::run_test::{closure#0}<unknown>
  506. 41.68 s gammaloop-nextest-core> at <unknown source file>:<unknown line>
  507. 41.68 s gammaloop-nextest-core> 13: std[bcb96dfbba0ab899]::sys::backtrace::__rust_begin_short_backtrace::<test[75d6903177b1d7e9]::run_test::{closure#1}, ()><unknown>
  508. 41.68 s gammaloop-nextest-core> at <unknown source file>:<unknown line>
  509. 41.68 s gammaloop-nextest-core> 14: <std[bcb96dfbba0ab899]::thread::lifecycle::spawn_unchecked<test[75d6903177b1d7e9]::run_test::{closure#1}, ()>::{closure#1} as core[940e698046960fd5]::ops::function::FnOnce<()>>::call_once::{shim:vtable#0}<unknown>
  510. 41.68 s gammaloop-nextest-core> at <unknown source file>:<unknown line>
  511. 41.68 s gammaloop-nextest-core> 15: <std[bcb96dfbba0ab899]::sys::thread::unix::Thread>::new::thread_start<unknown>
  512. 41.68 s gammaloop-nextest-core> at <unknown source file>:<unknown line>
  513. 41.68 s gammaloop-nextest-core> 16: start_thread<unknown>
  514. 41.68 s gammaloop-nextest-core> at <unknown source file>:<unknown line>
  515. 41.68 s gammaloop-nextest-core> 17: __clone3<unknown>
  516. 41.68 s gammaloop-nextest-core> at <unknown source file>:<unknown line>
  517. 41.68 s gammaloop-nextest-core>
  518. 41.68 s gammaloop-nextest-core> Run with COLORBT_SHOW_HIDDEN=1 environment variable to disable frame filtering.
  519. 41.68 s gammaloop-nextest-core> Run with RUST_BACKTRACE=full to include source snippets.
  520. 41.68 s gammaloop-nextest-core>
  521. 42.57 s gammaloop-nextest-core> FAIL [ 0.155s] (406/456) gammalooprs uv::export::tests::computed_node_full_numerator_is_a_spenso_aware_typst_fragment
  522. 42.57 s gammaloop-nextest-core> stdout ---
  523. 42.57 s gammaloop-nextest-core>
  524. 42.57 s gammaloop-nextest-core> running 1 test
  525. 42.57 s gammaloop-nextest-core> test uv::export::tests::computed_node_full_numerator_is_a_spenso_aware_typst_fragment ... FAILED
  526. 42.57 s gammaloop-nextest-core>
  527. 42.57 s gammaloop-nextest-core> failures:
  528. 42.57 s gammaloop-nextest-core>
  529. 42.57 s gammaloop-nextest-core> failures:
  530. 42.57 s gammaloop-nextest-core> uv::export::tests::computed_node_full_numerator_is_a_spenso_aware_typst_fragment
  531. 42.57 s gammaloop-nextest-core>
  532. 42.57 s gammaloop-nextest-core> test result: FAILED. 0 passed; 1 failed; 0 ignored; 0 measured; 508 filtered out; finished in 0.13s
  533. 42.57 s gammaloop-nextest-core>
  534. 42.57 s gammaloop-nextest-core> stderr ---
  535. 42.57 s gammaloop-nextest-core> The application panicked (crashed).
  536. 42.57 s gammaloop-nextest-core> Message: assertion failed: exported.dot.contains(r#"full_num = "op(\"Tr\")(1)";"#)
  537. 42.57 s gammaloop-nextest-core> Location: crates/gammalooprs/src/uv/export.rs:483
  538. 42.57 s gammaloop-nextest-core>
  539. 42.57 s gammaloop-nextest-core> ━━━━━━━━━━━━━━━━━━━━━━━━━━━━━━━━━━ BACKTRACE ━━━━━━━━━━━━━━━━━━━━━━━━━━━━━━━━━━━
  540. 42.57 s gammaloop-nextest-core> 1: <color_eyre[b0c9e66060e883b2]::config::PanicHook>::panic_report<unknown>
  541. 42.57 s gammaloop-nextest-core> at <unknown source file>:<unknown line>
  542. 42.57 s gammaloop-nextest-core> 2: <color_eyre[b0c9e66060e883b2]::config::PanicHook>::into_panic_hook::{closure#0}<unknown>
  543. 42.57 s gammaloop-nextest-core> at <unknown source file>:<unknown line>
  544. 42.57 s gammaloop-nextest-core> 3: std[bcb96dfbba0ab899]::panicking::panic_with_hook<unknown>
  545. 42.57 s gammaloop-nextest-core> at <unknown source file>:<unknown line>
  546. 42.57 s gammaloop-nextest-core> 4: std[bcb96dfbba0ab899]::panicking::panic_handler::{closure#0}<unknown>
  547. 42.57 s gammaloop-nextest-core> at <unknown source file>:<unknown line>
  548. 42.57 s gammaloop-nextest-core> 5: std[bcb96dfbba0ab899]::sys::backtrace::__rust_end_short_backtrace::<std[bcb96dfbba0ab899]::panicking::panic_handler::{closure#0}, !><unknown>
  549. 42.57 s gammaloop-nextest-core> at <unknown source file>:<unknown line>
  550. 42.57 s gammaloop-nextest-core> 6: __rustc[6c289b9f9c454d21]::rust_begin_unwind<unknown>
  551. 42.57 s gammaloop-nextest-core> at <unknown source file>:<unknown line>
  552. 42.57 s gammaloop-nextest-core> 7: core[940e698046960fd5]::panicking::panic_fmt<unknown>
  553. 42.57 s gammaloop-nextest-core> at <unknown source file>:<unknown line>
  554. 42.57 s gammaloop-nextest-core> 8: core[940e698046960fd5]::panicking::panic<unknown>
  555. 42.57 s gammaloop-nextest-core> at <unknown source file>:<unknown line>
  556. 42.57 s gammaloop-nextest-core> 9: gammalooprs[5490727360442cce]::uv::export::tests::computed_node_full_numerator_is_a_spenso_aware_typst_fragment<unknown>
  557. 42.57 s gammaloop-nextest-core> at <unknown source file>:<unknown line>
  558. 42.57 s gammaloop-nextest-core> 10: <gammalooprs[5490727360442cce]::uv::export::tests::computed_node_full_numerator_is_a_spenso_aware_typst_fragment::{closure#0} as core[940e698046960fd5]::ops::function::FnOnce<()>>::call_once<unknown>
  559. 42.57 s gammaloop-nextest-core> at <unknown source file>:<unknown line>
  560. 42.57 s gammaloop-nextest-core> 11: test[75d6903177b1d7e9]::__rust_begin_short_backtrace::<core[940e698046960fd5]::result::Result<(), alloc[2ea6bcb46fca0c42]::string::String>, fn() -> core[940e698046960fd5]::result::Result<(), alloc[2ea6bcb46fca0c42]::string::String>><unknown>
  561. 42.57 s gammaloop-nextest-core> at <unknown source file>:<unknown line>
  562. 42.57 s gammaloop-nextest-core> 12: test[75d6903177b1d7e9]::run_test::{closure#0}<unknown>
  563. 42.57 s gammaloop-nextest-core> at <unknown source file>:<unknown line>
  564. 42.57 s gammaloop-nextest-core> 13: std[bcb96dfbba0ab899]::sys::backtrace::__rust_begin_short_backtrace::<test[75d6903177b1d7e9]::run_test::{closure#1}, ()><unknown>
  565. 42.57 s gammaloop-nextest-core> at <unknown source file>:<unknown line>
  566. 42.57 s gammaloop-nextest-core> 14: <std[bcb96dfbba0ab899]::thread::lifecycle::spawn_unchecked<test[75d6903177b1d7e9]::run_test::{closure#1}, ()>::{closure#1} as core[940e698046960fd5]::ops::function::FnOnce<()>>::call_once::{shim:vtable#0}<unknown>
  567. 42.57 s gammaloop-nextest-core> at <unknown source file>:<unknown line>
  568. 42.57 s gammaloop-nextest-core> 15: <std[bcb96dfbba0ab899]::sys::thread::unix::Thread>::new::thread_start<unknown>
  569. 42.57 s gammaloop-nextest-core> at <unknown source file>:<unknown line>
  570. 42.57 s gammaloop-nextest-core> 16: start_thread<unknown>
  571. 42.57 s gammaloop-nextest-core> at <unknown source file>:<unknown line>
  572. 42.57 s gammaloop-nextest-core> 17: __clone3<unknown>
  573. 42.57 s gammaloop-nextest-core> at <unknown source file>:<unknown line>
  574. 42.57 s gammaloop-nextest-core>
  575. 42.57 s gammaloop-nextest-core> Run with COLORBT_SHOW_HIDDEN=1 environment variable to disable frame filtering.
  576. 42.57 s gammaloop-nextest-core> Run with RUST_BACKTRACE=full to include source snippets.
  577. 42.57 s gammaloop-nextest-core>
  578. 55.66 s gammaloop-nextest-core> ------------
  579. 55.67 s gammaloop-nextest-core> Summary [ 14.238s] 456 tests run: 454 passed, 2 failed, 61 skipped
  580. 55.67 s gammaloop-nextest-core> FAIL [ 0.142s] ( 87/456) gammalooprs graph::parse::tests::parse_lmbsetting_crossection
  581. 55.67 s gammaloop-nextest-core> stdout ---
  582. 55.67 s gammaloop-nextest-core>
  583. 55.67 s gammaloop-nextest-core> running 1 test
  584. 55.67 s gammaloop-nextest-core> ━━━━━━━━━━━━━━━━━━━━━━━━━━━━━━━ Snapshot Summary ━━━━━━━━━━━━━━━━━━━━━━━━━━━━━━━
  585. 55.67 s gammaloop-nextest-core> Snapshot: parse_lmbsetting_crossection
  586. 55.67 s gammaloop-nextest-core> Source: crates/gammalooprs/src/graph/parse/tests.rs:252
  587. 55.67 s gammaloop-nextest-core> ────────────────────────────────────────────────────────────────────────────────
  588. 55.67 s gammaloop-nextest-core> Expression: g.debug_dot()
  589. 55.67 s gammaloop-nextest-core> ────────────────────────────────────────────────────────────────────────────────
  590. 55.67 s gammaloop-nextest-core> -old snapshot
  591. 55.67 s gammaloop-nextest-core> +new results
  592. 55.67 s gammaloop-nextest-core> ────────────┬───────────────────────────────────────────────────────────────────
  593. 55.67 s gammaloop-nextest-core> 1 │-digraph G{
  594. 55.67 s gammaloop-nextest-core> 1 │+digraph G {
  595. 55.67 s gammaloop-nextest-core> 2 2 │ num = "1/2";
  596. 55.67 s gammaloop-nextest-core> 3 3 │ overall_factor = "2*x";
  597. 55.67 s gammaloop-nextest-core> 4 4 │ overall_factor_evaluated = "2*x";
  598. 55.67 s gammaloop-nextest-core> 5 5 │ projector = "spenso::t";
  599. 55.67 s gammaloop-nextest-core> ────────────┴───────────────────────────────────────────────────────────────────
  600. 55.67 s gammaloop-nextest-core> To update snapshots run `cargo insta review`
  601. 55.67 s gammaloop-nextest-core> Stopped on the first failure. Run `cargo insta test` to run all snapshots.
  602. 55.67 s gammaloop-nextest-core> test graph::parse::tests::parse_lmbsetting_crossection ... FAILED
  603. 55.67 s gammaloop-nextest-core>
  604. 55.67 s gammaloop-nextest-core> failures:
  605. 55.67 s gammaloop-nextest-core>
  606. 55.67 s gammaloop-nextest-core> failures:
  607. 55.67 s gammaloop-nextest-core> graph::parse::tests::parse_lmbsetting_crossection
  608. 55.67 s gammaloop-nextest-core>
  609. 55.67 s gammaloop-nextest-core> test result: FAILED. 0 passed; 1 failed; 0 ignored; 0 measured; 508 filtered out; finished in 0.13s
  610. 55.67 s gammaloop-nextest-core>
  611. 55.67 s gammaloop-nextest-core> stderr ---
  612. 55.67 s gammaloop-nextest-core> [21:40:02.996] @gammalooprs::graph::attribute_warnings WARNING : Unknown node attribute 'color_num' on graph 'G', node 'A'; did you mean 'num'?
  613. 55.67 s gammaloop-nextest-core> at crates/gammalooprs/src/graph/attribute_warnings.rs:198
  614. 55.67 s gammaloop-nextest-core> The application panicked (crashed).
  615. 55.67 s gammaloop-nextest-core> Message: snapshot assertion for 'parse_lmbsetting_crossection' failed in line 252
  616. 55.67 s gammaloop-nextest-core> Location: /nix/store/xdy1vvhll2bijdplvl9fcc2b9plkxhaa-vendor-cargo-deps/c19b7c6f923b580ac259164a89f2577984ad5ab09ee9d583b888f934adbbe8d0/insta-1.47.2/src/runtime.rs:719
  617. 55.67 s gammaloop-nextest-core>
  618. 55.67 s gammaloop-nextest-core> ━━━━━━━━━━━━━━━━━━━━━━━━━━━━━━━━━━ BACKTRACE ━━━━━━━━━━━━━━━━━━━━━━━━━━━━━━━━━━━
  619. 55.67 s gammaloop-nextest-core> 1: <color_eyre[b0c9e66060e883b2]::config::PanicHook>::panic_report<unknown>
  620. 55.67 s gammaloop-nextest-core> at <unknown source file>:<unknown line>
  621. 55.67 s gammaloop-nextest-core> 2: <color_eyre[b0c9e66060e883b2]::config::PanicHook>::into_panic_hook::{closure#0}<unknown>
  622. 55.67 s gammaloop-nextest-core> at <unknown source file>:<unknown line>
  623. 55.67 s gammaloop-nextest-core> 3: std[bcb96dfbba0ab899]::panicking::panic_with_hook<unknown>
  624. 55.67 s gammaloop-nextest-core> at <unknown source file>:<unknown line>
  625. 55.67 s gammaloop-nextest-core> 4: std[bcb96dfbba0ab899]::panicking::panic_handler::{closure#0}<unknown>
  626. 55.67 s gammaloop-nextest-core> at <unknown source file>:<unknown line>
  627. 55.67 s gammaloop-nextest-core> 5: std[bcb96dfbba0ab899]::sys::backtrace::__rust_end_short_backtrace::<std[bcb96dfbba0ab899]::panicking::panic_handler::{closure#0}, !><unknown>
  628. 55.67 s gammaloop-nextest-core> at <unknown source file>:<unknown line>
  629. 55.67 s gammaloop-nextest-core> 6: __rustc[6c289b9f9c454d21]::rust_begin_unwind<unknown>
  630. 55.67 s gammaloop-nextest-core> at <unknown source file>:<unknown line>
  631. 55.67 s gammaloop-nextest-core> 7: core[940e698046960fd5]::panicking::panic_fmt<unknown>
  632. 55.67 s gammaloop-nextest-core> at <unknown source file>:<unknown line>
  633. 55.67 s gammaloop-nextest-core> 8: insta[307a548ac79ef4d9]::runtime::assert_snapshot<unknown>
  634. 55.67 s gammaloop-nextest-core> at <unknown source file>:<unknown line>
  635. 55.67 s gammaloop-nextest-core> 9: gammalooprs[5490727360442cce]::graph::parse::tests::parse_lmbsetting_crossection<unknown>
  636. 55.67 s gammaloop-nextest-core> at <unknown source file>:<unknown line>
  637. 55.67 s gammaloop-nextest-core> 10: <gammalooprs[5490727360442cce]::graph::parse::tests::parse_lmbsetting_crossection::{closure#0} as core[940e698046960fd5]::ops::function::FnOnce<()>>::call_once<unknown>
  638. 55.67 s gammaloop-nextest-core> at <unknown source file>:<unknown line>
  639. 55.67 s gammaloop-nextest-core> 11: test[75d6903177b1d7e9]::__rust_begin_short_backtrace::<core[940e698046960fd5]::result::Result<(), alloc[2ea6bcb46fca0c42]::string::String>, fn() -> core[940e698046960fd5]::result::Result<(), alloc[2ea6bcb46fca0c42]::string::String>><unknown>
  640. 55.67 s gammaloop-nextest-core> at <unknown source file>:<unknown line>
  641. 55.67 s gammaloop-nextest-core> 12: test[75d6903177b1d7e9]::run_test::{closure#0}<unknown>
  642. 55.67 s gammaloop-nextest-core> at <unknown source file>:<unknown line>
  643. 55.67 s gammaloop-nextest-core> 13: std[bcb96dfbba0ab899]::sys::backtrace::__rust_begin_short_backtrace::<test[75d6903177b1d7e9]::run_test::{closure#1}, ()><unknown>
  644. 55.67 s gammaloop-nextest-core> at <unknown source file>:<unknown line>
  645. 55.67 s gammaloop-nextest-core> 14: <std[bcb96dfbba0ab899]::thread::lifecycle::spawn_unchecked<test[75d6903177b1d7e9]::run_test::{closure#1}, ()>::{closure#1} as core[940e698046960fd5]::ops::function::FnOnce<()>>::call_once::{shim:vtable#0}<unknown>
  646. 55.67 s gammaloop-nextest-core> at <unknown source file>:<unknown line>
  647. 55.67 s gammaloop-nextest-core> 15: <std[bcb96dfbba0ab899]::sys::thread::unix::Thread>::new::thread_start<unknown>
  648. 55.67 s gammaloop-nextest-core> at <unknown source file>:<unknown line>
  649. 55.67 s gammaloop-nextest-core> 16: start_thread<unknown>
  650. 55.67 s gammaloop-nextest-core> at <unknown source file>:<unknown line>
  651. 55.67 s gammaloop-nextest-core> 17: __clone3<unknown>
  652. 55.67 s gammaloop-nextest-core> at <unknown source file>:<unknown line>
  653. 55.67 s gammaloop-nextest-core>
  654. 55.67 s gammaloop-nextest-core> Run with COLORBT_SHOW_HIDDEN=1 environment variable to disable frame filtering.
  655. 55.67 s gammaloop-nextest-core> Run with RUST_BACKTRACE=full to include source snippets.
  656. 55.67 s gammaloop-nextest-core>
  657. 55.67 s gammaloop-nextest-core> FAIL [ 0.155s] (406/456) gammalooprs uv::export::tests::computed_node_full_numerator_is_a_spenso_aware_typst_fragment
  658. 55.67 s gammaloop-nextest-core> stdout ---
  659. 55.67 s gammaloop-nextest-core>
  660. 55.67 s gammaloop-nextest-core> running 1 test
  661. 55.67 s gammaloop-nextest-core> test uv::export::tests::computed_node_full_numerator_is_a_spenso_aware_typst_fragment ... FAILED
  662. 55.67 s gammaloop-nextest-core>
  663. 55.67 s gammaloop-nextest-core> failures:
  664. 55.67 s gammaloop-nextest-core>
  665. 55.67 s gammaloop-nextest-core> failures:
  666. 55.67 s gammaloop-nextest-core> uv::export::tests::computed_node_full_numerator_is_a_spenso_aware_typst_fragment
  667. 55.67 s gammaloop-nextest-core>
  668. 55.67 s gammaloop-nextest-core> test result: FAILED. 0 passed; 1 failed; 0 ignored; 0 measured; 508 filtered out; finished in 0.13s
  669. 55.67 s gammaloop-nextest-core>
  670. 55.67 s gammaloop-nextest-core> stderr ---
  671. 55.67 s gammaloop-nextest-core> The application panicked (crashed).
  672. 55.67 s gammaloop-nextest-core> Message: assertion failed: exported.dot.contains(r#"full_num = "op(\"Tr\")(1)";"#)
  673. 55.67 s gammaloop-nextest-core> Location: crates/gammalooprs/src/uv/export.rs:483
  674. 55.67 s gammaloop-nextest-core>
  675. 55.67 s gammaloop-nextest-core> ━━━━━━━━━━━━━━━━━━━━━━━━━━━━━━━━━━ BACKTRACE ━━━━━━━━━━━━━━━━━━━━━━━━━━━━━━━━━━━
  676. 55.67 s gammaloop-nextest-core> 1: <color_eyre[b0c9e66060e883b2]::config::PanicHook>::panic_report<unknown>
  677. 55.67 s gammaloop-nextest-core> at <unknown source file>:<unknown line>
  678. 55.67 s gammaloop-nextest-core> 2: <color_eyre[b0c9e66060e883b2]::config::PanicHook>::into_panic_hook::{closure#0}<unknown>
  679. 55.67 s gammaloop-nextest-core> at <unknown source file>:<unknown line>
  680. 55.67 s gammaloop-nextest-core> 3: std[bcb96dfbba0ab899]::panicking::panic_with_hook<unknown>
  681. 55.67 s gammaloop-nextest-core> at <unknown source file>:<unknown line>
  682. 55.67 s gammaloop-nextest-core> 4: std[bcb96dfbba0ab899]::panicking::panic_handler::{closure#0}<unknown>
  683. 55.67 s gammaloop-nextest-core> at <unknown source file>:<unknown line>
  684. 55.67 s gammaloop-nextest-core> 5: std[bcb96dfbba0ab899]::sys::backtrace::__rust_end_short_backtrace::<std[bcb96dfbba0ab899]::panicking::panic_handler::{closure#0}, !><unknown>
  685. 55.67 s gammaloop-nextest-core> at <unknown source file>:<unknown line>
  686. 55.67 s gammaloop-nextest-core> 6: __rustc[6c289b9f9c454d21]::rust_begin_unwind<unknown>
  687. 55.67 s gammaloop-nextest-core> at <unknown source file>:<unknown line>
  688. 55.67 s gammaloop-nextest-core> 7: core[940e698046960fd5]::panicking::panic_fmt<unknown>
  689. 55.67 s gammaloop-nextest-core> at <unknown source file>:<unknown line>
  690. 55.67 s gammaloop-nextest-core> 8: core[940e698046960fd5]::panicking::panic<unknown>
  691. 55.67 s gammaloop-nextest-core> at <unknown source file>:<unknown line>
  692. 55.67 s gammaloop-nextest-core> 9: gammalooprs[5490727360442cce]::uv::export::tests::computed_node_full_numerator_is_a_spenso_aware_typst_fragment<unknown>
  693. 55.67 s gammaloop-nextest-core> at <unknown source file>:<unknown line>
  694. 55.67 s gammaloop-nextest-core> 10: <gammalooprs[5490727360442cce]::uv::export::tests::computed_node_full_numerator_is_a_spenso_aware_typst_fragment::{closure#0} as core[940e698046960fd5]::ops::function::FnOnce<()>>::call_once<unknown>
  695. 55.67 s gammaloop-nextest-core> at <unknown source file>:<unknown line>
  696. 55.67 s gammaloop-nextest-core> 11: test[75d6903177b1d7e9]::__rust_begin_short_backtrace::<core[940e698046960fd5]::result::Result<(), alloc[2ea6bcb46fca0c42]::string::String>, fn() -> core[940e698046960fd5]::result::Result<(), alloc[2ea6bcb46fca0c42]::string::String>><unknown>
  697. 55.67 s gammaloop-nextest-core> at <unknown source file>:<unknown line>
  698. 55.67 s gammaloop-nextest-core> 12: test[75d6903177b1d7e9]::run_test::{closure#0}<unknown>
  699. 55.67 s gammaloop-nextest-core> at <unknown source file>:<unknown line>
  700. 55.67 s gammaloop-nextest-core> 13: std[bcb96dfbba0ab899]::sys::backtrace::__rust_begin_short_backtrace::<test[75d6903177b1d7e9]::run_test::{closure#1}, ()><unknown>
  701. 55.67 s gammaloop-nextest-core> at <unknown source file>:<unknown line>
  702. 55.67 s gammaloop-nextest-core> 14: <std[bcb96dfbba0ab899]::thread::lifecycle::spawn_unchecked<test[75d6903177b1d7e9]::run_test::{closure#1}, ()>::{closure#1} as core[940e698046960fd5]::ops::function::FnOnce<()>>::call_once::{shim:vtable#0}<unknown>
  703. 55.67 s gammaloop-nextest-core> at <unknown source file>:<unknown line>
  704. 55.67 s gammaloop-nextest-core> 15: <std[bcb96dfbba0ab899]::sys::thread::unix::Thread>::new::thread_start<unknown>
  705. 55.67 s gammaloop-nextest-core> at <unknown source file>:<unknown line>
  706. 55.67 s gammaloop-nextest-core> 16: start_thread<unknown>
  707. 55.67 s gammaloop-nextest-core> at <unknown source file>:<unknown line>
  708. 55.67 s gammaloop-nextest-core> 17: __clone3<unknown>
  709. 55.67 s gammaloop-nextest-core> at <unknown source file>:<unknown line>
  710. 55.67 s gammaloop-nextest-core>
  711. 55.67 s gammaloop-nextest-core> Run with COLORBT_SHOW_HIDDEN=1 environment variable to disable frame filtering.
  712. 55.67 s gammaloop-nextest-core> Run with RUST_BACKTRACE=full to include source snippets.
  713. 55.67 s gammaloop-nextest-core>
  714. 55.74 s gammaloop-nextest-core> error: test run failed
  715. 55.79 s gammaloop-nextest-core>
  716. 55.79 s gammaloop-nextest-core> ========== nextest test summary ==========
  717. 55.79 s gammaloop-nextest-core> report: target/nextest/ci_gammaloop/junit.xml
  718. 55.79 s gammaloop-nextest-core> tests: 456, failures: 2, errors: 0
  719. 55.79 s gammaloop-nextest-core>
  720. 55.79 s gammaloop-nextest-core> 1. gammalooprs::graph::parse::tests::parse_lmbsetting_crossection
  721. 55.79 s gammaloop-nextest-core> failure: test failure with exit code 101
  722. 55.79 s gammaloop-nextest-core> system-out
  723. 55.79 s gammaloop-nextest-core> running 1 test
  724. 55.79 s gammaloop-nextest-core> ━━━━━━━━━━━━━━━━━━━━━━━━━━━━━━━ Snapshot Summary ━━━━━━━━━━━━━━━━━━━━━━━━━━━━━━━
  725. 55.79 s gammaloop-nextest-core> Snapshot: parse_lmbsetting_crossection
  726. 55.79 s gammaloop-nextest-core> Source: crates/gammalooprs/src/graph/parse/tests.rs:252
  727. 55.79 s gammaloop-nextest-core> ────────────────────────────────────────────────────────────────────────────────
  728. 55.79 s gammaloop-nextest-core> Expression: g.debug_dot()
  729. 55.79 s gammaloop-nextest-core> ────────────────────────────────────────────────────────────────────────────────
  730. 55.79 s gammaloop-nextest-core> -old snapshot
  731. 55.79 s gammaloop-nextest-core> +new results
  732. 55.79 s gammaloop-nextest-core> ────────────┬───────────────────────────────────────────────────────────────────
  733. 55.79 s gammaloop-nextest-core> 1 │-digraph G{
  734. 55.79 s gammaloop-nextest-core> 1 │+digraph G {
  735. 55.79 s gammaloop-nextest-core> 2 2 │ num = "1/2";
  736. 55.79 s gammaloop-nextest-core> 3 3 │ overall_factor = "2*x";
  737. 55.79 s gammaloop-nextest-core> 4 4 │ overall_factor_evaluated = "2*x";
  738. 55.79 s gammaloop-nextest-core> 5 5 │ projector = "spenso::t";
  739. 55.79 s gammaloop-nextest-core> ────────────┴───────────────────────────────────────────────────────────────────
  740. 55.79 s gammaloop-nextest-core> To update snapshots run `cargo insta review`
  741. 55.79 s gammaloop-nextest-core> Stopped on the first failure. Run `cargo insta test` to run all snapshots.
  742. 55.79 s gammaloop-nextest-core> test graph::parse::tests::parse_lmbsetting_crossection ... FAILED
  743. 55.79 s gammaloop-nextest-core>
  744. 55.79 s gammaloop-nextest-core> failures:
  745. 55.79 s gammaloop-nextest-core>
  746. 55.79 s gammaloop-nextest-core> failures:
  747. 55.79 s gammaloop-nextest-core> graph::parse::tests::parse_lmbsetting_crossection
  748. 55.79 s gammaloop-nextest-core>
  749. 55.79 s gammaloop-nextest-core> test result: FAILED. 0 passed; 1 failed; 0 ignored; 0 measured; 508 filtered out; finished in 0.13s
  750. 55.79 s gammaloop-nextest-core> system-err
  751. 55.79 s gammaloop-nextest-core> [21:40:02.996] @gammalooprs::graph::attribute_warnings WARNING : Unknown node attribute 'color_num' on graph 'G', node 'A'; did you mean 'num'?
  752. 55.79 s gammaloop-nextest-core> at crates/gammalooprs/src/graph/attribute_warnings.rs:198
  753. 55.79 s gammaloop-nextest-core> The application panicked (crashed).
  754. 55.79 s gammaloop-nextest-core> Message: snapshot assertion for 'parse_lmbsetting_crossection' failed in line 252
  755. 55.79 s gammaloop-nextest-core> Location: /nix/store/xdy1vvhll2bijdplvl9fcc2b9plkxhaa-vendor-cargo-deps/c19b7c6f923b580ac259164a89f2577984ad5ab09ee9d583b888f934adbbe8d0/insta-1.47.2/src/runtime.rs:719
  756. 55.79 s gammaloop-nextest-core>
  757. 55.79 s gammaloop-nextest-core> ━━━━━━━━━━━━━━━━━━━━━━━━━━━━━━━━━━ BACKTRACE ━━━━━━━━━━━━━━━━━━━━━━━━━━━━━━━━━━━
  758. 55.79 s gammaloop-nextest-core> 1: <color_eyre[b0c9e66060e883b2]::config::PanicHook>::panic_report<unknown>
  759. 55.79 s gammaloop-nextest-core> at <unknown source file>:<unknown line>
  760. 55.79 s gammaloop-nextest-core> 2: <color_eyre[b0c9e66060e883b2]::config::PanicHook>::into_panic_hook::{closure#0}<unknown>
  761. 55.79 s gammaloop-nextest-core> at <unknown source file>:<unknown line>
  762. 55.79 s gammaloop-nextest-core> 3: std[bcb96dfbba0ab899]::panicking::panic_with_hook<unknown>
  763. 55.79 s gammaloop-nextest-core> at <unknown source file>:<unknown line>
  764. 55.79 s gammaloop-nextest-core> 4: std[bcb96dfbba0ab899]::panicking::panic_handler::{closure#0}<unknown>
  765. 55.79 s gammaloop-nextest-core> at <unknown source file>:<unknown line>
  766. 55.79 s gammaloop-nextest-core> 5: std[bcb96dfbba0ab899]::sys::backtrace::__rust_end_short_backtrace::<std[bcb96dfbba0ab899]::panicking::panic_handler::{closure#0}, !><unknown>
  767. 55.79 s gammaloop-nextest-core> at <unknown source file>:<unknown line>
  768. 55.79 s gammaloop-nextest-core> 6: __rustc[6c289b9f9c454d21]::rust_begin_unwind<unknown>
  769. 55.79 s gammaloop-nextest-core> at <unknown source file>:<unknown line>
  770. 55.79 s gammaloop-nextest-core> 7: core[940e698046960fd5]::panicking::panic_fmt<unknown>
  771. 55.79 s gammaloop-nextest-core> at <unknown source file>:<unknown line>
  772. 55.79 s gammaloop-nextest-core> 8: insta[307a548ac79ef4d9]::runtime::assert_snapshot<unknown>
  773. 55.79 s gammaloop-nextest-core> at <unknown source file>:<unknown line>
  774. 55.79 s gammaloop-nextest-core> 9: gammalooprs[5490727360442cce]::graph::parse::tests::parse_lmbsetting_crossection<unknown>
  775. 55.79 s gammaloop-nextest-core> at <unknown source file>:<unknown line>
  776. 55.79 s gammaloop-nextest-core> 10: <gammalooprs[5490727360442cce]::graph::parse::tests::parse_lmbsetting_crossection::{closure#0} as core[940e698046960fd5]::ops::function::FnOnce<()>>::call_once<unknown>
  777. 55.79 s gammaloop-nextest-core> at <unknown source file>:<unknown line>
  778. 55.79 s gammaloop-nextest-core> 11: test[75d6903177b1d7e9]::__rust_begin_short_backtrace::<core[940e698046960fd5]::result::Result<(), alloc[2ea6bcb46fca0c42]::string::String>, fn() -> core[940e698046960fd5]::result::Result<(), alloc[2ea6bcb46fca0c42]::string::String>><unknown>
  779. 55.79 s gammaloop-nextest-core> at <unknown source file>:<unknown line>
  780. 55.79 s gammaloop-nextest-core> 12: test[75d6903177b1d7e9]::run_test::{closure#0}<unknown>
  781. 55.79 s gammaloop-nextest-core> at <unknown source file>:<unknown line>
  782. 55.79 s gammaloop-nextest-core> 13: std[bcb96dfbba0ab899]::sys::backtrace::__rust_begin_short_backtrace::<test[75d6903177b1d7e9]::run_test::{closure#1}, ()><unknown>
  783. 55.79 s gammaloop-nextest-core> at <unknown source file>:<unknown line>
  784. 55.79 s gammaloop-nextest-core> 14: <std[bcb96dfbba0ab899]::thread::lifecycle::spawn_unchecked<test[75d6903177b1d7e9]::run_test::{closure#1}, ()>::{closure#1} as core[940e698046960fd5]::ops::function::FnOnce<()>>::call_once::{shim:vtable#0}<unknown>
  785. 55.79 s gammaloop-nextest-core> at <unknown source file>:<unknown line>
  786. 55.79 s gammaloop-nextest-core> 15: <std[bcb96dfbba0ab899]::sys::thread::unix::Thread>::new::thread_start<unknown>
  787. 55.79 s gammaloop-nextest-core> at <unknown source file>:<unknown line>
  788. 55.79 s gammaloop-nextest-core> 16: start_thread<unknown>
  789. 55.79 s gammaloop-nextest-core> at <unknown source file>:<unknown line>
  790. 55.79 s gammaloop-nextest-core> 17: __clone3<unknown>
  791. 55.79 s gammaloop-nextest-core> at <unknown source file>:<unknown line>
  792. 55.79 s gammaloop-nextest-core>
  793. 55.79 s gammaloop-nextest-core> Run with COLORBT_SHOW_HIDDEN=1 environment variable to disable frame filtering.
  794. 55.79 s gammaloop-nextest-core> Run with RUST_BACKTRACE=full to include source snippets.
  795. 55.79 s gammaloop-nextest-core>
  796. 55.79 s gammaloop-nextest-core> 2. gammalooprs::uv::export::tests::computed_node_full_numerator_is_a_spenso_aware_typst_fragment
  797. 55.79 s gammaloop-nextest-core> failure: test failure with exit code 101
  798. 55.79 s gammaloop-nextest-core> system-out
  799. 55.79 s gammaloop-nextest-core> running 1 test
  800. 55.79 s gammaloop-nextest-core> test uv::export::tests::computed_node_full_numerator_is_a_spenso_aware_typst_fragment ... FAILED
  801. 55.79 s gammaloop-nextest-core>
  802. 55.79 s gammaloop-nextest-core> failures:
  803. 55.79 s gammaloop-nextest-core>
  804. 55.79 s gammaloop-nextest-core> failures:
  805. 55.79 s gammaloop-nextest-core> uv::export::tests::computed_node_full_numerator_is_a_spenso_aware_typst_fragment
  806. 55.79 s gammaloop-nextest-core>
  807. 55.79 s gammaloop-nextest-core> test result: FAILED. 0 passed; 1 failed; 0 ignored; 0 measured; 508 filtered out; finished in 0.13s
  808. 55.79 s gammaloop-nextest-core> system-err
  809. 55.79 s gammaloop-nextest-core> The application panicked (crashed).
  810. 55.79 s gammaloop-nextest-core> Message: assertion failed: exported.dot.contains(r#"full_num = "op(\"Tr\")(1)";"#)
  811. 55.79 s gammaloop-nextest-core> Location: crates/gammalooprs/src/uv/export.rs:483
  812. 55.79 s gammaloop-nextest-core>
  813. 55.79 s gammaloop-nextest-core> ━━━━━━━━━━━━━━━━━━━━━━━━━━━━━━━━━━ BACKTRACE ━━━━━━━━━━━━━━━━━━━━━━━━━━━━━━━━━━━
  814. 55.79 s gammaloop-nextest-core> 1: <color_eyre[b0c9e66060e883b2]::config::PanicHook>::panic_report<unknown>
  815. 55.79 s gammaloop-nextest-core> at <unknown source file>:<unknown line>
  816. 55.79 s gammaloop-nextest-core> 2: <color_eyre[b0c9e66060e883b2]::config::PanicHook>::into_panic_hook::{closure#0}<unknown>
  817. 55.79 s gammaloop-nextest-core> at <unknown source file>:<unknown line>
  818. 55.79 s gammaloop-nextest-core> 3: std[bcb96dfbba0ab899]::panicking::panic_with_hook<unknown>
  819. 55.79 s gammaloop-nextest-core> at <unknown source file>:<unknown line>
  820. 55.79 s gammaloop-nextest-core> 4: std[bcb96dfbba0ab899]::panicking::panic_handler::{closure#0}<unknown>
  821. 55.79 s gammaloop-nextest-core> at <unknown source file>:<unknown line>
  822. 55.79 s gammaloop-nextest-core> 5: std[bcb96dfbba0ab899]::sys::backtrace::__rust_end_short_backtrace::<std[bcb96dfbba0ab899]::panicking::panic_handler::{closure#0}, !><unknown>
  823. 55.79 s gammaloop-nextest-core> at <unknown source file>:<unknown line>
  824. 55.79 s gammaloop-nextest-core> 6: __rustc[6c289b9f9c454d21]::rust_begin_unwind<unknown>
  825. 55.79 s gammaloop-nextest-core> at <unknown source file>:<unknown line>
  826. 55.79 s gammaloop-nextest-core> 7: core[940e698046960fd5]::panicking::panic_fmt<unknown>
  827. 55.79 s gammaloop-nextest-core> at <unknown source file>:<unknown line>
  828. 55.79 s gammaloop-nextest-core> 8: core[940e698046960fd5]::panicking::panic<unknown>
  829. 55.79 s gammaloop-nextest-core> at <unknown source file>:<unknown line>
  830. 55.79 s gammaloop-nextest-core> 9: gammalooprs[5490727360442cce]::uv::export::tests::computed_node_full_numerator_is_a_spenso_aware_typst_fragment<unknown>
  831. 55.79 s gammaloop-nextest-core> at <unknown source file>:<unknown line>
  832. 55.79 s gammaloop-nextest-core> 10: <gammalooprs[5490727360442cce]::uv::export::tests::computed_node_full_numerator_is_a_spenso_aware_typst_fragment::{closure#0} as core[940e698046960fd5]::ops::function::FnOnce<()>>::call_once<unknown>
  833. 55.79 s gammaloop-nextest-core> at <unknown source file>:<unknown line>
  834. 55.79 s gammaloop-nextest-core> 11: test[75d6903177b1d7e9]::__rust_begin_short_backtrace::<core[940e698046960fd5]::result::Result<(), alloc[2ea6bcb46fca0c42]::string::String>, fn() -> core[940e698046960fd5]::result::Result<(), alloc[2ea6bcb46fca0c42]::string::String>><unknown>
  835. 55.79 s gammaloop-nextest-core> at <unknown source file>:<unknown line>
  836. 55.79 s gammaloop-nextest-core> 12: test[75d6903177b1d7e9]::run_test::{closure#0}<unknown>
  837. 55.79 s gammaloop-nextest-core> at <unknown source file>:<unknown line>
  838. 55.79 s gammaloop-nextest-core> 13: std[bcb96dfbba0ab899]::sys::backtrace::__rust_begin_short_backtrace::<test[75d6903177b1d7e9]::run_test::{closure#1}, ()><unknown>
  839. 55.79 s gammaloop-nextest-core> at <unknown source file>:<unknown line>
  840. 55.79 s gammaloop-nextest-core> 14: <std[bcb96dfbba0ab899]::thread::lifecycle::spawn_unchecked<test[75d6903177b1d7e9]::run_test::{closure#1}, ()>::{closure#1} as core[940e698046960fd5]::ops::function::FnOnce<()>>::call_once::{shim:vtable#0}<unknown>
  841. 55.79 s gammaloop-nextest-core> at <unknown source file>:<unknown line>
  842. 55.79 s gammaloop-nextest-core> 15: <std[bcb96dfbba0ab899]::sys::thread::unix::Thread>::new::thread_start<unknown>
  843. 55.79 s gammaloop-nextest-core> at <unknown source file>:<unknown line>
  844. 55.79 s gammaloop-nextest-core> 16: start_thread<unknown>
  845. 55.79 s gammaloop-nextest-core> at <unknown source file>:<unknown line>
  846. 55.79 s gammaloop-nextest-core> 17: __clone3<unknown>
  847. 55.79 s gammaloop-nextest-core> at <unknown source file>:<unknown line>
  848. 55.79 s gammaloop-nextest-core>
  849. 55.79 s gammaloop-nextest-core> Run with COLORBT_SHOW_HIDDEN=1 environment variable to disable frame filtering.
  850. 55.79 s gammaloop-nextest-core> Run with RUST_BACKTRACE=full to include source snippets.
  851. 55.79 s gammaloop-nextest-core> =========================================
  852. 55.86 s error: Cannot build '/nix/store/07lma8g6p1n7jxf8azmxf90ca6pqjydj-gammaloop-nextest-core.drv'.
  853. 55.86 s Reason: builder failed with exit code 100.
  854. 55.86 s Output paths:
  855. 55.86 s /nix/store/cb0qr129ypswd8fgpp9k932nrjfvk3s0-gammaloop-nextest-core
  856. 55.86 s Last 612 log lines:
  857. 55.86 s > Extracting 3 binaries (including 1 non-test binary), 1 build script output directory, and 2 linked paths to /build/nextest-archive-ZhVsS2
  858. 55.86 s > Extracted 18 files to /build/nextest-archive-ZhVsS2 in 0.56s
  859. 55.86 s > ------------
  860. 55.86 s > Nextest run ID 5c399ff2-372d-4c8e-80b9-9b0f945f02ad with nextest profile: ci_gammaloop
  861. 55.86 s > Starting 339 tests across 2 binaries
  862. 55.86 s > FAIL [ 0.019s] (247/339) gammaloop-api repl::tests::completion_shows_type_hint_for_non_boolean_settings_leaf
  863. 55.86 s > stdout ---
  864. 55.86 s >
  865. 55.86 s > running 1 test
  866. 55.86 s > test repl::tests::completion_shows_type_hint_for_non_boolean_settings_leaf ... FAILED
  867. 55.86 s >
  868. 55.86 s > failures:
  869. 55.86 s >
  870. 55.86 s > failures:
  871. 55.86 s > repl::tests::completion_shows_type_hint_for_non_boolean_settings_leaf
  872. 55.86 s >
  873. 55.86 s > test result: FAILED. 0 passed; 1 failed; 0 ignored; 0 measured; 338 filtered out; finished in 0.01s
  874. 55.86 s >
  875. 55.86 s > stderr ---
  876. 55.86 s >
  877. 55.86 s > thread 'repl::tests::completion_shows_type_hint_for_non_boolean_settings_leaf' (775) panicked at crates/gammaloop-api/src/repl.rs:5778:9:
  878. 55.86 s > [Suggestion { value: "", description: Some("Number of samples in the first Monte Carlo iteration."), style: None, extra: None, span: Span { start: 42, end: 42 }, append_whitespace: false }]
  879. 55.86 s > stack backtrace:
  880. 55.86 s > 0: __rustc::rust_begin_unwind
  881. 55.86 s > 1: core::panicking::panic_fmt
  882. 55.86 s > 2: gammaloop_api::repl::tests::completion_shows_type_hint_for_non_boolean_settings_leaf
  883. 55.86 s > 3: <gammaloop_api::repl::tests::completion_shows_type_hint_for_non_boolean_settings_leaf::{closure#0} as core::ops::function::FnOnce<()>>::call_once
  884. 55.86 s > note: Some details are omitted, run with `RUST_BACKTRACE=full` for a verbose backtrace.
  885. 55.86 s >
  886. 55.86 s > FAIL [ 0.025s] (278/339) gammaloop-api templates::tests::extract_templates_uses_canonical_package_layout
  887. 55.86 s > stdout ---
  888. 55.86 s >
  889. 55.86 s > running 1 test
  890. 55.86 s > test templates::tests::extract_templates_uses_canonical_package_layout ... FAILED
  891. 55.86 s >
  892. 55.86 s > failures:
  893. 55.86 s >
  894. 55.86 s > failures:
  895. 55.86 s > templates::tests::extract_templates_uses_canonical_package_layout
  896. 55.86 s >
  897. 55.86 s > test result: FAILED. 0 passed; 1 failed; 0 ignored; 0 measured; 338 filtered out; finished in 0.02s
  898. 55.86 s >
  899. 55.86 s > stderr ---
  900. 55.86 s >
  901. 55.86 s > thread 'templates::tests::extract_templates_uses_canonical_package_layout' (872) panicked at crates/gammaloop-api/src/templates.rs:99:9:
  902. 55.86 s > assertion failed: figure.contains("amplitude-mode")
  903. 55.86 s > stack backtrace:
  904. 55.86 s > 0: __rustc::rust_begin_unwind
  905. 55.86 s > 1: core::panicking::panic_fmt
  906. 55.86 s > 2: core::panicking::panic
  907. 55.86 s > 3: gammaloop_api::templates::tests::extract_templates_uses_canonical_package_layout
  908. 55.86 s > 4: <gammaloop_api::templates::tests::extract_templates_uses_canonical_package_layout::{closure#0} as core::ops::function::FnOnce<()>>::call_once
  909. 55.86 s > note: Some details are omitted, run with `RUST_BACKTRACE=full` for a verbose backtrace.
  910. 55.86 s >
  911. 55.86 s > ------------
  912. 55.86 s > Summary [ 0.476s] 339 tests run: 337 passed, 2 failed, 0 skipped
  913. 55.86 s > FAIL [ 0.019s] (247/339) gammaloop-api repl::tests::completion_shows_type_hint_for_non_boolean_settings_leaf
  914. 55.86 s > stdout ---
  915. 55.86 s >
  916. 55.86 s > running 1 test
  917. 55.86 s > test repl::tests::completion_shows_type_hint_for_non_boolean_settings_leaf ... FAILED
  918. 55.86 s >
  919. 55.86 s > failures:
  920. 55.86 s >
  921. 55.86 s > failures:
  922. 55.86 s > repl::tests::completion_shows_type_hint_for_non_boolean_settings_leaf
  923. 55.86 s >
  924. 55.86 s > test result: FAILED. 0 passed; 1 failed; 0 ignored; 0 measured; 338 filtered out; finished in 0.01s
  925. 55.86 s >
  926. 55.86 s > stderr ---
  927. 55.86 s >
  928. 55.86 s > thread 'repl::tests::completion_shows_type_hint_for_non_boolean_settings_leaf' (775) panicked at crates/gammaloop-api/src/repl.rs:5778:9:
  929. 55.86 s > [Suggestion { value: "", description: Some("Number of samples in the first Monte Carlo iteration."), style: None, extra: None, span: Span { start: 42, end: 42 }, append_whitespace: false }]
  930. 55.86 s > stack backtrace:
  931. 55.86 s > 0: __rustc::rust_begin_unwind
  932. 55.86 s > 1: core::panicking::panic_fmt
  933. 55.86 s > 2: gammaloop_api::repl::tests::completion_shows_type_hint_for_non_boolean_settings_leaf
  934. 55.86 s > 3: <gammaloop_api::repl::tests::completion_shows_type_hint_for_non_boolean_settings_leaf::{closure#0} as core::ops::function::FnOnce<()>>::call_once
  935. 55.86 s > note: Some details are omitted, run with `RUST_BACKTRACE=full` for a verbose backtrace.
  936. 55.86 s >
  937. 55.86 s > FAIL [ 0.025s] (278/339) gammaloop-api templates::tests::extract_templates_uses_canonical_package_layout
  938. 55.86 s > stdout ---
  939. 55.86 s >
  940. 55.86 s > running 1 test
  941. 55.86 s > test templates::tests::extract_templates_uses_canonical_package_layout ... FAILED
  942. 55.86 s >
  943. 55.86 s > failures:
  944. 55.86 s >
  945. 55.86 s > failures:
  946. 55.86 s > templates::tests::extract_templates_uses_canonical_package_layout
  947. 55.86 s >
  948. 55.86 s > test result: FAILED. 0 passed; 1 failed; 0 ignored; 0 measured; 338 filtered out; finished in 0.02s
  949. 55.86 s >
  950. 55.86 s > stderr ---
  951. 55.86 s >
  952. 55.86 s > thread 'templates::tests::extract_templates_uses_canonical_package_layout' (872) panicked at crates/gammaloop-api/src/templates.rs:99:9:
  953. 55.86 s > assertion failed: figure.contains("amplitude-mode")
  954. 55.86 s > stack backtrace:
  955. 55.86 s > 0: __rustc::rust_begin_unwind
  956. 55.86 s > 1: core::panicking::panic_fmt
  957. 55.86 s > 2: core::panicking::panic
  958. 55.86 s > 3: gammaloop_api::templates::tests::extract_templates_uses_canonical_package_layout
  959. 55.86 s > 4: <gammaloop_api::templates::tests::extract_templates_uses_canonical_package_layout::{closure#0} as core::ops::function::FnOnce<()>>::call_once
  960. 55.86 s > note: Some details are omitted, run with `RUST_BACKTRACE=full` for a verbose backtrace.
  961. 55.86 s >
  962. 55.86 s > error: test run failed
  963. 55.86 s >
  964. 55.86 s > ========== nextest test summary ==========
  965. 55.86 s > report: target/nextest/ci_gammaloop/junit.xml
  966. 55.86 s > tests: 339, failures: 2, errors: 0
  967. 55.86 s >
  968. 55.86 s > 1. gammaloop-api::repl::tests::completion_shows_type_hint_for_non_boolean_settings_leaf
  969. 55.86 s > failure: test failure with exit code 101
  970. 55.86 s > thread 'repl::tests::completion_shows_type_hint_for_non_boolean_settings_leaf' (775) panicked at crates/gammaloop-api/src/repl.rs:5778:9:
  971. 55.86 s > [Suggestion { value: "", description: Some("Number of samples in the first Monte Carlo iteration."), style: None, extra: None, span: Span { start: 42, end: 42 }, append_whitespace: false }]
  972. 55.86 s > stack backtrace:
  973. 55.86 s > 0: __rustc::rust_begin_unwind
  974. 55.86 s > 1: core::panicking::panic_fmt
  975. 55.86 s > 2: gammaloop_api::repl::tests::completion_shows_type_hint_for_non_boolean_settings_leaf
  976. 55.86 s > 3: <gammaloop_api::repl::tests::completion_shows_type_hint_for_non_boolean_settings_leaf::{closure#0} as core::ops::function::FnOnce<()>>::call_once
  977. 55.86 s > note: Some details are omitted, run with `RUST_BACKTRACE=full` for a verbose backtrace.
  978. 55.86 s > system-out
  979. 55.86 s > running 1 test
  980. 55.86 s > test repl::tests::completion_shows_type_hint_for_non_boolean_settings_leaf ... FAILED
  981. 55.86 s >
  982. 55.86 s > failures:
  983. 55.86 s >
  984. 55.86 s > failures:
  985. 55.86 s > repl::tests::completion_shows_type_hint_for_non_boolean_settings_leaf
  986. 55.86 s >
  987. 55.86 s > test result: FAILED. 0 passed; 1 failed; 0 ignored; 0 measured; 338 filtered out; finished in 0.01s
  988. 55.86 s > system-err
  989. 55.86 s > thread 'repl::tests::completion_shows_type_hint_for_non_boolean_settings_leaf' (775) panicked at crates/gammaloop-api/src/repl.rs:5778:9:
  990. 55.86 s > [Suggestion { value: "", description: Some("Number of samples in the first Monte Carlo iteration."), style: None, extra: None, span: Span { start: 42, end: 42 }, append_whitespace: false }]
  991. 55.86 s > stack backtrace:
  992. 55.86 s > 0: __rustc::rust_begin_unwind
  993. 55.86 s > 1: core::panicking::panic_fmt
  994. 55.86 s > 2: gammaloop_api::repl::tests::completion_shows_type_hint_for_non_boolean_settings_leaf
  995. 55.86 s > 3: <gammaloop_api::repl::tests::completion_shows_type_hint_for_non_boolean_settings_leaf::{closure#0} as core::ops::function::FnOnce<()>>::call_once
  996. 55.86 s > note: Some details are omitted, run with `RUST_BACKTRACE=full` for a verbose backtrace.
  997. 55.86 s >
  998. 55.86 s > 2. gammaloop-api::templates::tests::extract_templates_uses_canonical_package_layout
  999. 55.86 s > failure: test failure with exit code 101
  1000. 55.86 s > thread 'templates::tests::extract_templates_uses_canonical_package_layout' (872) panicked at crates/gammaloop-api/src/templates.rs:99:9:
  1001. 55.86 s > assertion failed: figure.contains("amplitude-mode")
  1002. 55.86 s > stack backtrace:
  1003. 55.86 s > 0: __rustc::rust_begin_unwind
  1004. 55.86 s > 1: core::panicking::panic_fmt
  1005. 55.86 s > 2: core::panicking::panic
  1006. 55.86 s > 3: gammaloop_api::templates::tests::extract_templates_uses_canonical_package_layout
  1007. 55.86 s > 4: <gammaloop_api::templates::tests::extract_templates_uses_canonical_package_layout::{closure#0} as core::ops::function::FnOnce<()>>::call_once
  1008. 55.86 s > note: Some details are omitted, run with `RUST_BACKTRACE=full` for a verbose backtrace.
  1009. 55.86 s > system-out
  1010. 55.86 s > running 1 test
  1011. 55.86 s > test templates::tests::extract_templates_uses_canonical_package_layout ... FAILED
  1012. 55.86 s >
  1013. 55.86 s > failures:
  1014. 55.86 s >
  1015. 55.86 s > failures:
  1016. 55.86 s > templates::tests::extract_templates_uses_canonical_package_layout
  1017. 55.86 s >
  1018. 55.86 s > test result: FAILED. 0 passed; 1 failed; 0 ignored; 0 measured; 338 filtered out; finished in 0.02s
  1019. 55.86 s > system-err
  1020. 55.86 s > thread 'templates::tests::extract_templates_uses_canonical_package_layout' (872) panicked at crates/gammaloop-api/src/templates.rs:99:9:
  1021. 55.86 s > assertion failed: figure.contains("amplitude-mode")
  1022. 55.86 s > stack backtrace:
  1023. 55.86 s > 0: __rustc::rust_begin_unwind
  1024. 55.86 s > 1: core::panicking::panic_fmt
  1025. 55.86 s > 2: core::panicking::panic
  1026. 55.86 s > 3: gammaloop_api::templates::tests::extract_templates_uses_canonical_package_layout
  1027. 55.86 s > 4: <gammaloop_api::templates::tests::extract_templates_uses_canonical_package_layout::{closure#0} as core::ops::function::FnOnce<()>>::call_once
  1028. 55.86 s > note: Some details are omitted, run with `RUST_BACKTRACE=full` for a verbose backtrace.
  1029. 55.86 s > =========================================
  1030. 55.86 s > Extracting 1 binary and 1 linked path to /build/nextest-archive-zOznLq
  1031. 55.86 s > Extracted 7 files to /build/nextest-archive-zOznLq in 0.07s
  1032. 55.86 s > ------------
  1033. 55.86 s > Nextest run ID e95c5917-efbb-4327-b6b4-0ee290da4e98 with nextest profile: ci_gammaloop
  1034. 55.86 s > Starting 19 tests across 1 binary
  1035. 55.86 s > ------------
  1036. 55.86 s > Summary [ 0.011s] 19 tests run: 19 passed, 0 skipped
  1037. 55.86 s >
  1038. 55.86 s > ========== nextest test summary ==========
  1039. 55.86 s > report: target/nextest/ci_gammaloop/junit.xml
  1040. 55.86 s > tests: 19, failures: 0, errors: 0
  1041. 55.86 s > No failing testcases found.
  1042. 55.86 s > =========================================
  1043. 55.86 s > Extracting 1 binary to /build/nextest-archive-x6xLNm
  1044. 55.86 s > Extracted 4 files to /build/nextest-archive-x6xLNm in 0.03s
  1045. 55.86 s > ------------
  1046. 55.86 s > Nextest run ID 890b8ba6-593e-4a43-a774-aa040e795af4 with nextest profile: ci_gammaloop
  1047. 55.86 s > Starting 0 tests across 1 binary
  1048. 55.86 s > ------------
  1049. 55.86 s > Summary [ 0.000s] 0 tests run: 0 passed, 0 skipped
  1050. 55.86 s >
  1051. 55.86 s > ========== nextest test summary ==========
  1052. 55.86 s > report: target/nextest/ci_gammaloop/junit.xml
  1053. 55.86 s > tests: 0, failures: 0, errors: 0
  1054. 55.86 s > No failing testcases found.
  1055. 55.86 s > =========================================
  1056. 55.86 s > Extracting 4 binaries, 1 build script output directory, and 2 linked paths to /build/nextest-archive-MbxPzS
  1057. 55.86 s > Extracted 18 files to /build/nextest-archive-MbxPzS in 0.49s
  1058. 55.86 s > ------------
  1059. 55.86 s > Nextest run ID 23c40765-3664-471f-83b2-83c031c5db37 with nextest profile: ci_gammaloop
  1060. 55.86 s > Starting 456 tests across 4 binaries (61 tests skipped, including 60 tests via profile.ci_gammaloop.default-filter)
  1061. 55.86 s > FAIL [ 0.142s] ( 87/456) gammalooprs graph::parse::tests::parse_lmbsetting_crossection
  1062. 55.86 s > stdout ---
  1063. 55.86 s >
  1064. 55.86 s > running 1 test
  1065. 55.86 s > ━━━━━━━━━━━━━━━━━━━━━━━━━━━━━━━ Snapshot Summary ━━━━━━━━━━━━━━━━━━━━━━━━━━━━━━━
  1066. 55.86 s > Snapshot: parse_lmbsetting_crossection
  1067. 55.86 s > Source: crates/gammalooprs/src/graph/parse/tests.rs:252
  1068. 55.86 s > ────────────────────────────────────────────────────────────────────────────────
  1069. 55.86 s > Expression: g.debug_dot()
  1070. 55.86 s > ────────────────────────────────────────────────────────────────────────────────
  1071. 55.86 s > -old snapshot
  1072. 55.86 s > +new results
  1073. 55.86 s > ────────────┬───────────────────────────────────────────────────────────────────
  1074. 55.86 s > 1 │-digraph G{
  1075. 55.86 s > 1 │+digraph G {
  1076. 55.86 s > 2 2 │ num = "1/2";
  1077. 55.86 s > 3 3 │ overall_factor = "2*x";
  1078. 55.86 s > 4 4 │ overall_factor_evaluated = "2*x";
  1079. 55.86 s > 5 5 │ projector = "spenso::t";
  1080. 55.86 s > ────────────┴───────────────────────────────────────────────────────────────────
  1081. 55.86 s > To update snapshots run `cargo insta review`
  1082. 55.86 s > Stopped on the first failure. Run `cargo insta test` to run all snapshots.
  1083. 55.86 s > test graph::parse::tests::parse_lmbsetting_crossection ... FAILED
  1084. 55.86 s >
  1085. 55.86 s > failures:
  1086. 55.86 s >
  1087. 55.86 s > failures:
  1088. 55.86 s > graph::parse::tests::parse_lmbsetting_crossection
  1089. 55.86 s >
  1090. 55.86 s > test result: FAILED. 0 passed; 1 failed; 0 ignored; 0 measured; 508 filtered out; finished in 0.13s
  1091. 55.86 s >
  1092. 55.86 s > stderr ---
  1093. 55.86 s > [21:40:02.996] @gammalooprs::graph::attribute_warnings WARNING : Unknown node attribute 'color_num' on graph 'G', node 'A'; did you mean 'num'?
  1094. 55.86 s > at crates/gammalooprs/src/graph/attribute_warnings.rs:198
  1095. 55.86 s > The application panicked (crashed).
  1096. 55.86 s > Message: snapshot assertion for 'parse_lmbsetting_crossection' failed in line 252
  1097. 55.86 s > Location: /nix/store/xdy1vvhll2bijdplvl9fcc2b9plkxhaa-vendor-cargo-deps/c19b7c6f923b580ac259164a89f2577984ad5ab09ee9d583b888f934adbbe8d0/insta-1.47.2/src/runtime.rs:719
  1098. 55.86 s >
  1099. 55.86 s > ━━━━━━━━━━━━━━━━━━━━━━━━━━━━━━━━━━ BACKTRACE ━━━━━━━━━━━━━━━━━━━━━━━━━━━━━━━━━━━
  1100. 55.86 s > 1: <color_eyre[b0c9e66060e883b2]::config::PanicHook>::panic_report<unknown>
  1101. 55.86 s > at <unknown source file>:<unknown line>
  1102. 55.86 s > 2: <color_eyre[b0c9e66060e883b2]::config::PanicHook>::into_panic_hook::{closure#0}<unknown>
  1103. 55.86 s > at <unknown source file>:<unknown line>
  1104. 55.86 s > 3: std[bcb96dfbba0ab899]::panicking::panic_with_hook<unknown>
  1105. 55.86 s > at <unknown source file>:<unknown line>
  1106. 55.86 s > 4: std[bcb96dfbba0ab899]::panicking::panic_handler::{closure#0}<unknown>
  1107. 55.86 s > at <unknown source file>:<unknown line>
  1108. 55.86 s > 5: std[bcb96dfbba0ab899]::sys::backtrace::__rust_end_short_backtrace::<std[bcb96dfbba0ab899]::panicking::panic_handler::{closure#0}, !><unknown>
  1109. 55.86 s > at <unknown source file>:<unknown line>
  1110. 55.86 s > 6: __rustc[6c289b9f9c454d21]::rust_begin_unwind<unknown>
  1111. 55.86 s > at <unknown source file>:<unknown line>
  1112. 55.86 s > 7: core[940e698046960fd5]::panicking::panic_fmt<unknown>
  1113. 55.86 s > at <unknown source file>:<unknown line>
  1114. 55.86 s > 8: insta[307a548ac79ef4d9]::runtime::assert_snapshot<unknown>
  1115. 55.86 s > at <unknown source file>:<unknown line>
  1116. 55.86 s > 9: gammalooprs[5490727360442cce]::graph::parse::tests::parse_lmbsetting_crossection<unknown>
  1117. 55.86 s > at <unknown source file>:<unknown line>
  1118. 55.86 s > 10: <gammalooprs[5490727360442cce]::graph::parse::tests::parse_lmbsetting_crossection::{closure#0} as core[940e698046960fd5]::ops::function::FnOnce<()>>::call_once<unknown>
  1119. 55.86 s > at <unknown source file>:<unknown line>
  1120. 55.86 s > 11: test[75d6903177b1d7e9]::__rust_begin_short_backtrace::<core[940e698046960fd5]::result::Result<(), alloc[2ea6bcb46fca0c42]::string::String>, fn() -> core[940e698046960fd5]::result::Result<(), alloc[2ea6bcb46fca0c42]::string::String>><unknown>
  1121. 55.86 s > at <unknown source file>:<unknown line>
  1122. 55.86 s > 12: test[75d6903177b1d7e9]::run_test::{closure#0}<unknown>
  1123. 55.86 s > at <unknown source file>:<unknown line>
  1124. 55.86 s > 13: std[bcb96dfbba0ab899]::sys::backtrace::__rust_begin_short_backtrace::<test[75d6903177b1d7e9]::run_test::{closure#1}, ()><unknown>
  1125. 55.86 s > at <unknown source file>:<unknown line>
  1126. 55.86 s > 14: <std[bcb96dfbba0ab899]::thread::lifecycle::spawn_unchecked<test[75d6903177b1d7e9]::run_test::{closure#1}, ()>::{closure#1} as core[940e698046960fd5]::ops::function::FnOnce<()>>::call_once::{shim:vtable#0}<unknown>
  1127. 55.86 s > at <unknown source file>:<unknown line>
  1128. 55.86 s > 15: <std[bcb96dfbba0ab899]::sys::thread::unix::Thread>::new::thread_start<unknown>
  1129. 55.86 s > at <unknown source file>:<unknown line>
  1130. 55.86 s > 16: start_thread<unknown>
  1131. 55.86 s > at <unknown source file>:<unknown line>
  1132. 55.86 s > 17: __clone3<unknown>
  1133. 55.86 s > at <unknown source file>:<unknown line>
  1134. 55.86 s >
  1135. 55.86 s > Run with COLORBT_SHOW_HIDDEN=1 environment variable to disable frame filtering.
  1136. 55.86 s > Run with RUST_BACKTRACE=full to include source snippets.
  1137. 55.86 s >
  1138. 55.86 s > FAIL [ 0.155s] (406/456) gammalooprs uv::export::tests::computed_node_full_numerator_is_a_spenso_aware_typst_fragment
  1139. 55.86 s > stdout ---
  1140. 55.86 s >
  1141. 55.86 s > running 1 test
  1142. 55.86 s > test uv::export::tests::computed_node_full_numerator_is_a_spenso_aware_typst_fragment ... FAILED
  1143. 55.86 s >
  1144. 55.86 s > failures:
  1145. 55.86 s >
  1146. 55.86 s > failures:
  1147. 55.86 s > uv::export::tests::computed_node_full_numerator_is_a_spenso_aware_typst_fragment
  1148. 55.86 s >
  1149. 55.86 s > test result: FAILED. 0 passed; 1 failed; 0 ignored; 0 measured; 508 filtered out; finished in 0.13s
  1150. 55.86 s >
  1151. 55.86 s > stderr ---
  1152. 55.86 s > The application panicked (crashed).
  1153. 55.86 s > Message: assertion failed: exported.dot.contains(r#"full_num = "op(\"Tr\")(1)";"#)
  1154. 55.86 s > Location: crates/gammalooprs/src/uv/export.rs:483
  1155. 55.86 s >
  1156. 55.86 s > ━━━━━━━━━━━━━━━━━━━━━━━━━━━━━━━━━━ BACKTRACE ━━━━━━━━━━━━━━━━━━━━━━━━━━━━━━━━━━━
  1157. 55.86 s > 1: <color_eyre[b0c9e66060e883b2]::config::PanicHook>::panic_report<unknown>
  1158. 55.86 s > at <unknown source file>:<unknown line>
  1159. 55.86 s > 2: <color_eyre[b0c9e66060e883b2]::config::PanicHook>::into_panic_hook::{closure#0}<unknown>
  1160. 55.86 s > at <unknown source file>:<unknown line>
  1161. 55.86 s > 3: std[bcb96dfbba0ab899]::panicking::panic_with_hook<unknown>
  1162. 55.86 s > at <unknown source file>:<unknown line>
  1163. 55.86 s > 4: std[bcb96dfbba0ab899]::panicking::panic_handler::{closure#0}<unknown>
  1164. 55.86 s > at <unknown source file>:<unknown line>
  1165. 55.86 s > 5: std[bcb96dfbba0ab899]::sys::backtrace::__rust_end_short_backtrace::<std[bcb96dfbba0ab899]::panicking::panic_handler::{closure#0}, !><unknown>
  1166. 55.86 s > at <unknown source file>:<unknown line>
  1167. 55.86 s > 6: __rustc[6c289b9f9c454d21]::rust_begin_unwind<unknown>
  1168. 55.86 s > at <unknown source file>:<unknown line>
  1169. 55.86 s > 7: core[940e698046960fd5]::panicking::panic_fmt<unknown>
  1170. 55.86 s > at <unknown source file>:<unknown line>
  1171. 55.86 s > 8: core[940e698046960fd5]::panicking::panic<unknown>
  1172. 55.86 s > at <unknown source file>:<unknown line>
  1173. 55.86 s > 9: gammalooprs[5490727360442cce]::uv::export::tests::computed_node_full_numerator_is_a_spenso_aware_typst_fragment<unknown>
  1174. 55.86 s > at <unknown source file>:<unknown line>
  1175. 55.86 s > 10: <gammalooprs[5490727360442cce]::uv::export::tests::computed_node_full_numerator_is_a_spenso_aware_typst_fragment::{closure#0} as core[940e698046960fd5]::ops::function::FnOnce<()>>::call_once<unknown>
  1176. 55.86 s > at <unknown source file>:<unknown line>
  1177. 55.86 s > 11: test[75d6903177b1d7e9]::__rust_begin_short_backtrace::<core[940e698046960fd5]::result::Result<(), alloc[2ea6bcb46fca0c42]::string::String>, fn() -> core[940e698046960fd5]::result::Result<(), alloc[2ea6bcb46fca0c42]::string::String>><unknown>
  1178. 55.86 s > at <unknown source file>:<unknown line>
  1179. 55.86 s > 12: test[75d6903177b1d7e9]::run_test::{closure#0}<unknown>
  1180. 55.86 s > at <unknown source file>:<unknown line>
  1181. 55.86 s > 13: std[bcb96dfbba0ab899]::sys::backtrace::__rust_begin_short_backtrace::<test[75d6903177b1d7e9]::run_test::{closure#1}, ()><unknown>
  1182. 55.86 s > at <unknown source file>:<unknown line>
  1183. 55.86 s > 14: <std[bcb96dfbba0ab899]::thread::lifecycle::spawn_unchecked<test[75d6903177b1d7e9]::run_test::{closure#1}, ()>::{closure#1} as core[940e698046960fd5]::ops::function::FnOnce<()>>::call_once::{shim:vtable#0}<unknown>
  1184. 55.86 s > at <unknown source file>:<unknown line>
  1185. 55.86 s > 15: <std[bcb96dfbba0ab899]::sys::thread::unix::Thread>::new::thread_start<unknown>
  1186. 55.86 s > at <unknown source file>:<unknown line>
  1187. 55.86 s > 16: start_thread<unknown>
  1188. 55.86 s > at <unknown source file>:<unknown line>
  1189. 55.86 s > 17: __clone3<unknown>
  1190. 55.86 s > at <unknown source file>:<unknown line>
  1191. 55.86 s >
  1192. 55.86 s > Run with COLORBT_SHOW_HIDDEN=1 environment variable to disable frame filtering.
  1193. 55.86 s > Run with RUST_BACKTRACE=full to include source snippets.
  1194. 55.86 s >
  1195. 55.86 s > ------------
  1196. 55.86 s > Summary [ 14.238s] 456 tests run: 454 passed, 2 failed, 61 skipped
  1197. 55.86 s > FAIL [ 0.142s] ( 87/456) gammalooprs graph::parse::tests::parse_lmbsetting_crossection
  1198. 55.86 s > stdout ---
  1199. 55.86 s >
  1200. 55.86 s > running 1 test
  1201. 55.86 s > ━━━━━━━━━━━━━━━━━━━━━━━━━━━━━━━ Snapshot Summary ━━━━━━━━━━━━━━━━━━━━━━━━━━━━━━━
  1202. 55.86 s > Snapshot: parse_lmbsetting_crossection
  1203. 55.86 s > Source: crates/gammalooprs/src/graph/parse/tests.rs:252
  1204. 55.86 s > ────────────────────────────────────────────────────────────────────────────────
  1205. 55.86 s > Expression: g.debug_dot()
  1206. 55.86 s > ────────────────────────────────────────────────────────────────────────────────
  1207. 55.86 s > -old snapshot
  1208. 55.86 s > +new results
  1209. 55.86 s > ────────────┬───────────────────────────────────────────────────────────────────
  1210. 55.86 s > 1 │-digraph G{
  1211. 55.86 s > 1 │+digraph G {
  1212. 55.86 s > 2 2 │ num = "1/2";
  1213. 55.86 s > 3 3 │ overall_factor = "2*x";
  1214. 55.86 s > 4 4 │ overall_factor_evaluated = "2*x";
  1215. 55.86 s > 5 5 │ projector = "spenso::t";
  1216. 55.86 s > ────────────┴───────────────────────────────────────────────────────────────────
  1217. 55.86 s > To update snapshots run `cargo insta review`
  1218. 55.86 s > Stopped on the first failure. Run `cargo insta test` to run all snapshots.
  1219. 55.86 s > test graph::parse::tests::parse_lmbsetting_crossection ... FAILED
  1220. 55.86 s >
  1221. 55.86 s > failures:
  1222. 55.86 s >
  1223. 55.86 s > failures:
  1224. 55.86 s > graph::parse::tests::parse_lmbsetting_crossection
  1225. 55.86 s >
  1226. 55.86 s > test result: FAILED. 0 passed; 1 failed; 0 ignored; 0 measured; 508 filtered out; finished in 0.13s
  1227. 55.86 s >
  1228. 55.86 s > stderr ---
  1229. 55.86 s > [21:40:02.996] @gammalooprs::graph::attribute_warnings WARNING : Unknown node attribute 'color_num' on graph 'G', node 'A'; did you mean 'num'?
  1230. 55.86 s > at crates/gammalooprs/src/graph/attribute_warnings.rs:198
  1231. 55.86 s > The application panicked (crashed).
  1232. 55.86 s > Message: snapshot assertion for 'parse_lmbsetting_crossection' failed in line 252
  1233. 55.86 s > Location: /nix/store/xdy1vvhll2bijdplvl9fcc2b9plkxhaa-vendor-cargo-deps/c19b7c6f923b580ac259164a89f2577984ad5ab09ee9d583b888f934adbbe8d0/insta-1.47.2/src/runtime.rs:719
  1234. 55.86 s >
  1235. 55.86 s > ━━━━━━━━━━━━━━━━━━━━━━━━━━━━━━━━━━ BACKTRACE ━━━━━━━━━━━━━━━━━━━━━━━━━━━━━━━━━━━
  1236. 55.86 s > 1: <color_eyre[b0c9e66060e883b2]::config::PanicHook>::panic_report<unknown>
  1237. 55.86 s > at <unknown source file>:<unknown line>
  1238. 55.86 s > 2: <color_eyre[b0c9e66060e883b2]::config::PanicHook>::into_panic_hook::{closure#0}<unknown>
  1239. 55.86 s > at <unknown source file>:<unknown line>
  1240. 55.86 s > 3: std[bcb96dfbba0ab899]::panicking::panic_with_hook<unknown>
  1241. 55.86 s > at <unknown source file>:<unknown line>
  1242. 55.86 s > 4: std[bcb96dfbba0ab899]::panicking::panic_handler::{closure#0}<unknown>
  1243. 55.86 s > at <unknown source file>:<unknown line>
  1244. 55.86 s > 5: std[bcb96dfbba0ab899]::sys::backtrace::__rust_end_short_backtrace::<std[bcb96dfbba0ab899]::panicking::panic_handler::{closure#0}, !><unknown>
  1245. 55.86 s > at <unknown source file>:<unknown line>
  1246. 55.86 s > 6: __rustc[6c289b9f9c454d21]::rust_begin_unwind<unknown>
  1247. 55.86 s > at <unknown source file>:<unknown line>
  1248. 55.86 s > 7: core[940e698046960fd5]::panicking::panic_fmt<unknown>
  1249. 55.86 s > at <unknown source file>:<unknown line>
  1250. 55.86 s > 8: insta[307a548ac79ef4d9]::runtime::assert_snapshot<unknown>
  1251. 55.86 s > at <unknown source file>:<unknown line>
  1252. 55.86 s > 9: gammalooprs[5490727360442cce]::graph::parse::tests::parse_lmbsetting_crossection<unknown>
  1253. 55.86 s > at <unknown source file>:<unknown line>
  1254. 55.86 s > 10: <gammalooprs[5490727360442cce]::graph::parse::tests::parse_lmbsetting_crossection::{closure#0} as core[940e698046960fd5]::ops::function::FnOnce<()>>::call_once<unknown>
  1255. 55.86 s > at <unknown source file>:<unknown line>
  1256. 55.86 s > 11: test[75d6903177b1d7e9]::__rust_begin_short_backtrace::<core[940e698046960fd5]::result::Result<(), alloc[2ea6bcb46fca0c42]::string::String>, fn() -> core[940e698046960fd5]::result::Result<(), alloc[2ea6bcb46fca0c42]::string::String>><unknown>
  1257. 55.86 s > at <unknown source file>:<unknown line>
  1258. 55.86 s > 12: test[75d6903177b1d7e9]::run_test::{closure#0}<unknown>
  1259. 55.86 s > at <unknown source file>:<unknown line>
  1260. 55.86 s > 13: std[bcb96dfbba0ab899]::sys::backtrace::__rust_begin_short_backtrace::<test[75d6903177b1d7e9]::run_test::{closure#1}, ()><unknown>
  1261. 55.86 s > at <unknown source file>:<unknown line>
  1262. 55.86 s > 14: <std[bcb96dfbba0ab899]::thread::lifecycle::spawn_unchecked<test[75d6903177b1d7e9]::run_test::{closure#1}, ()>::{closure#1} as core[940e698046960fd5]::ops::function::FnOnce<()>>::call_once::{shim:vtable#0}<unknown>
  1263. 55.86 s > at <unknown source file>:<unknown line>
  1264. 55.86 s > 15: <std[bcb96dfbba0ab899]::sys::thread::unix::Thread>::new::thread_start<unknown>
  1265. 55.86 s > at <unknown source file>:<unknown line>
  1266. 55.86 s > 16: start_thread<unknown>
  1267. 55.86 s > at <unknown source file>:<unknown line>
  1268. 55.86 s > 17: __clone3<unknown>
  1269. 55.86 s > at <unknown source file>:<unknown line>
  1270. 55.86 s >
  1271. 55.86 s > Run with COLORBT_SHOW_HIDDEN=1 environment variable to disable frame filtering.
  1272. 55.86 s > Run with RUST_BACKTRACE=full to include source snippets.
  1273. 55.86 s >
  1274. 55.86 s > FAIL [ 0.155s] (406/456) gammalooprs uv::export::tests::computed_node_full_numerator_is_a_spenso_aware_typst_fragment
  1275. 55.86 s > stdout ---
  1276. 55.86 s >
  1277. 55.86 s > running 1 test
  1278. 55.86 s > test uv::export::tests::computed_node_full_numerator_is_a_spenso_aware_typst_fragment ... FAILED
  1279. 55.86 s >
  1280. 55.86 s > failures:
  1281. 55.86 s >
  1282. 55.86 s > failures:
  1283. 55.86 s > uv::export::tests::computed_node_full_numerator_is_a_spenso_aware_typst_fragment
  1284. 55.86 s >
  1285. 55.86 s > test result: FAILED. 0 passed; 1 failed; 0 ignored; 0 measured; 508 filtered out; finished in 0.13s
  1286. 55.86 s >
  1287. 55.86 s > stderr ---
  1288. 55.86 s > The application panicked (crashed).
  1289. 55.86 s > Message: assertion failed: exported.dot.contains(r#"full_num = "op(\"Tr\")(1)";"#)
  1290. 55.86 s > Location: crates/gammalooprs/src/uv/export.rs:483
  1291. 55.86 s >
  1292. 55.86 s > ━━━━━━━━━━━━━━━━━━━━━━━━━━━━━━━━━━ BACKTRACE ━━━━━━━━━━━━━━━━━━━━━━━━━━━━━━━━━━━
  1293. 55.86 s > 1: <color_eyre[b0c9e66060e883b2]::config::PanicHook>::panic_report<unknown>
  1294. 55.86 s > at <unknown source file>:<unknown line>
  1295. 55.86 s > 2: <color_eyre[b0c9e66060e883b2]::config::PanicHook>::into_panic_hook::{closure#0}<unknown>
  1296. 55.86 s > at <unknown source file>:<unknown line>
  1297. 55.86 s > 3: std[bcb96dfbba0ab899]::panicking::panic_with_hook<unknown>
  1298. 55.86 s > at <unknown source file>:<unknown line>
  1299. 55.86 s > 4: std[bcb96dfbba0ab899]::panicking::panic_handler::{closure#0}<unknown>
  1300. 55.86 s > at <unknown source file>:<unknown line>
  1301. 55.86 s > 5: std[bcb96dfbba0ab899]::sys::backtrace::__rust_end_short_backtrace::<std[bcb96dfbba0ab899]::panicking::panic_handler::{closure#0}, !><unknown>
  1302. 55.86 s > at <unknown source file>:<unknown line>
  1303. 55.86 s > 6: __rustc[6c289b9f9c454d21]::rust_begin_unwind<unknown>
  1304. 55.86 s > at <unknown source file>:<unknown line>
  1305. 55.86 s > 7: core[940e698046960fd5]::panicking::panic_fmt<unknown>
  1306. 55.86 s > at <unknown source file>:<unknown line>
  1307. 55.86 s > 8: core[940e698046960fd5]::panicking::panic<unknown>
  1308. 55.86 s > at <unknown source file>:<unknown line>
  1309. 55.86 s > 9: gammalooprs[5490727360442cce]::uv::export::tests::computed_node_full_numerator_is_a_spenso_aware_typst_fragment<unknown>
  1310. 55.86 s > at <unknown source file>:<unknown line>
  1311. 55.86 s > 10: <gammalooprs[5490727360442cce]::uv::export::tests::computed_node_full_numerator_is_a_spenso_aware_typst_fragment::{closure#0} as core[940e698046960fd5]::ops::function::FnOnce<()>>::call_once<unknown>
  1312. 55.86 s > at <unknown source file>:<unknown line>
  1313. 55.86 s > 11: test[75d6903177b1d7e9]::__rust_begin_short_backtrace::<core[940e698046960fd5]::result::Result<(), alloc[2ea6bcb46fca0c42]::string::String>, fn() -> core[940e698046960fd5]::result::Result<(), alloc[2ea6bcb46fca0c42]::string::String>><unknown>
  1314. 55.86 s > at <unknown source file>:<unknown line>
  1315. 55.86 s > 12: test[75d6903177b1d7e9]::run_test::{closure#0}<unknown>
  1316. 55.86 s > at <unknown source file>:<unknown line>
  1317. 55.86 s > 13: std[bcb96dfbba0ab899]::sys::backtrace::__rust_begin_short_backtrace::<test[75d6903177b1d7e9]::run_test::{closure#1}, ()><unknown>
  1318. 55.86 s > at <unknown source file>:<unknown line>
  1319. 55.86 s > 14: <std[bcb96dfbba0ab899]::thread::lifecycle::spawn_unchecked<test[75d6903177b1d7e9]::run_test::{closure#1}, ()>::{closure#1} as core[940e698046960fd5]::ops::function::FnOnce<()>>::call_once::{shim:vtable#0}<unknown>
  1320. 55.86 s > at <unknown source file>:<unknown line>
  1321. 55.86 s > 15: <std[bcb96dfbba0ab899]::sys::thread::unix::Thread>::new::thread_start<unknown>
  1322. 55.86 s > at <unknown source file>:<unknown line>
  1323. 55.86 s > 16: start_thread<unknown>
  1324. 55.86 s > at <unknown source file>:<unknown line>
  1325. 55.86 s > 17: __clone3<unknown>
  1326. 55.86 s > at <unknown source file>:<unknown line>
  1327. 55.86 s >
  1328. 55.86 s > Run with COLORBT_SHOW_HIDDEN=1 environment variable to disable frame filtering.
  1329. 55.86 s > Run with RUST_BACKTRACE=full to include source snippets.
  1330. 55.86 s >
  1331. 55.86 s > error: test run failed
  1332. 55.86 s >
  1333. 55.86 s > ========== nextest test summary ==========
  1334. 55.86 s > report: target/nextest/ci_gammaloop/junit.xml
  1335. 55.86 s > tests: 456, failures: 2, errors: 0
  1336. 55.86 s >
  1337. 55.86 s > 1. gammalooprs::graph::parse::tests::parse_lmbsetting_crossection
  1338. 55.86 s > failure: test failure with exit code 101
  1339. 55.86 s > system-out
  1340. 55.86 s > running 1 test
  1341. 55.86 s > ━━━━━━━━━━━━━━━━━━━━━━━━━━━━━━━ Snapshot Summary ━━━━━━━━━━━━━━━━━━━━━━━━━━━━━━━
  1342. 55.86 s > Snapshot: parse_lmbsetting_crossection
  1343. 55.86 s > Source: crates/gammalooprs/src/graph/parse/tests.rs:252
  1344. 55.86 s > ────────────────────────────────────────────────────────────────────────────────
  1345. 55.86 s > Expression: g.debug_dot()
  1346. 55.86 s > ────────────────────────────────────────────────────────────────────────────────
  1347. 55.86 s > -old snapshot
  1348. 55.86 s > +new results
  1349. 55.86 s > ────────────┬───────────────────────────────────────────────────────────────────
  1350. 55.86 s > 1 │-digraph G{
  1351. 55.86 s > 1 │+digraph G {
  1352. 55.86 s > 2 2 │ num = "1/2";
  1353. 55.86 s > 3 3 │ overall_factor = "2*x";
  1354. 55.86 s > 4 4 │ overall_factor_evaluated = "2*x";
  1355. 55.86 s > 5 5 │ projector = "spenso::t";
  1356. 55.86 s > ────────────┴───────────────────────────────────────────────────────────────────
  1357. 55.86 s > To update snapshots run `cargo insta review`
  1358. 55.86 s > Stopped on the first failure. Run `cargo insta test` to run all snapshots.
  1359. 55.86 s > test graph::parse::tests::parse_lmbsetting_crossection ... FAILED
  1360. 55.86 s >
  1361. 55.86 s > failures:
  1362. 55.86 s >
  1363. 55.86 s > failures:
  1364. 55.86 s > graph::parse::tests::parse_lmbsetting_crossection
  1365. 55.86 s >
  1366. 55.86 s > test result: FAILED. 0 passed; 1 failed; 0 ignored; 0 measured; 508 filtered out; finished in 0.13s
  1367. 55.86 s > system-err
  1368. 55.86 s > [21:40:02.996] @gammalooprs::graph::attribute_warnings WARNING : Unknown node attribute 'color_num' on graph 'G', node 'A'; did you mean 'num'?
  1369. 55.86 s > at crates/gammalooprs/src/graph/attribute_warnings.rs:198
  1370. 55.86 s > The application panicked (crashed).
  1371. 55.86 s > Message: snapshot assertion for 'parse_lmbsetting_crossection' failed in line 252
  1372. 55.86 s > Location: /nix/store/xdy1vvhll2bijdplvl9fcc2b9plkxhaa-vendor-cargo-deps/c19b7c6f923b580ac259164a89f2577984ad5ab09ee9d583b888f934adbbe8d0/insta-1.47.2/src/runtime.rs:719
  1373. 55.86 s >
  1374. 55.86 s > ━━━━━━━━━━━━━━━━━━━━━━━━━━━━━━━━━━ BACKTRACE ━━━━━━━━━━━━━━━━━━━━━━━━━━━━━━━━━━━
  1375. 55.86 s > 1: <color_eyre[b0c9e66060e883b2]::config::PanicHook>::panic_report<unknown>
  1376. 55.86 s > at <unknown source file>:<unknown line>
  1377. 55.86 s > 2: <color_eyre[b0c9e66060e883b2]::config::PanicHook>::into_panic_hook::{closure#0}<unknown>
  1378. 55.86 s > at <unknown source file>:<unknown line>
  1379. 55.86 s > 3: std[bcb96dfbba0ab899]::panicking::panic_with_hook<unknown>
  1380. 55.87 s > at <unknown source file>:<unknown line>
  1381. 55.87 s > 4: std[bcb96dfbba0ab899]::panicking::panic_handler::{closure#0}<unknown>
  1382. 55.87 s > at <unknown source file>:<unknown line>
  1383. 55.87 s > 5: std[bcb96dfbba0ab899]::sys::backtrace::__rust_end_short_backtrace::<std[bcb96dfbba0ab899]::panicking::panic_handler::{closure#0}, !><unknown>
  1384. 55.87 s > at <unknown source file>:<unknown line>
  1385. 55.87 s > 6: __rustc[6c289b9f9c454d21]::rust_begin_unwind<unknown>
  1386. 55.87 s > at <unknown source file>:<unknown line>
  1387. 55.87 s > 7: core[940e698046960fd5]::panicking::panic_fmt<unknown>
  1388. 55.87 s > at <unknown source file>:<unknown line>
  1389. 55.87 s > 8: insta[307a548ac79ef4d9]::runtime::assert_snapshot<unknown>
  1390. 55.87 s > at <unknown source file>:<unknown line>
  1391. 55.87 s > 9: gammalooprs[5490727360442cce]::graph::parse::tests::parse_lmbsetting_crossection<unknown>
  1392. 55.87 s > at <unknown source file>:<unknown line>
  1393. 55.87 s > 10: <gammalooprs[5490727360442cce]::graph::parse::tests::parse_lmbsetting_crossection::{closure#0} as core[940e698046960fd5]::ops::function::FnOnce<()>>::call_once<unknown>
  1394. 55.87 s > at <unknown source file>:<unknown line>
  1395. 55.87 s > 11: test[75d6903177b1d7e9]::__rust_begin_short_backtrace::<core[940e698046960fd5]::result::Result<(), alloc[2ea6bcb46fca0c42]::string::String>, fn() -> core[940e698046960fd5]::result::Result<(), alloc[2ea6bcb46fca0c42]::string::String>><unknown>
  1396. 55.87 s > at <unknown source file>:<unknown line>
  1397. 55.87 s > 12: test[75d6903177b1d7e9]::run_test::{closure#0}<unknown>
  1398. 55.87 s > at <unknown source file>:<unknown line>
  1399. 55.87 s > 13: std[bcb96dfbba0ab899]::sys::backtrace::__rust_begin_short_backtrace::<test[75d6903177b1d7e9]::run_test::{closure#1}, ()><unknown>
  1400. 55.87 s > at <unknown source file>:<unknown line>
  1401. 55.87 s > 14: <std[bcb96dfbba0ab899]::thread::lifecycle::spawn_unchecked<test[75d6903177b1d7e9]::run_test::{closure#1}, ()>::{closure#1} as core[940e698046960fd5]::ops::function::FnOnce<()>>::call_once::{shim:vtable#0}<unknown>
  1402. 55.87 s > at <unknown source file>:<unknown line>
  1403. 55.87 s > 15: <std[bcb96dfbba0ab899]::sys::thread::unix::Thread>::new::thread_start<unknown>
  1404. 55.87 s > at <unknown source file>:<unknown line>
  1405. 55.87 s > 16: start_thread<unknown>
  1406. 55.87 s > at <unknown source file>:<unknown line>
  1407. 55.87 s > 17: __clone3<unknown>
  1408. 55.87 s > at <unknown source file>:<unknown line>
  1409. 55.87 s >
  1410. 55.87 s > Run with COLORBT_SHOW_HIDDEN=1 environment variable to disable frame filtering.
  1411. 55.87 s > Run with RUST_BACKTRACE=full to include source snippets.
  1412. 55.87 s >
  1413. 55.87 s > 2. gammalooprs::uv::export::tests::computed_node_full_numerator_is_a_spenso_aware_typst_fragment
  1414. 55.87 s > failure: test failure with exit code 101
  1415. 55.87 s > system-out
  1416. 55.87 s > running 1 test
  1417. 55.87 s > test uv::export::tests::computed_node_full_numerator_is_a_spenso_aware_typst_fragment ... FAILED
  1418. 55.87 s >
  1419. 55.87 s > failures:
  1420. 55.87 s >
  1421. 55.87 s > failures:
  1422. 55.87 s > uv::export::tests::computed_node_full_numerator_is_a_spenso_aware_typst_fragment
  1423. 55.87 s >
  1424. 55.87 s > test result: FAILED. 0 passed; 1 failed; 0 ignored; 0 measured; 508 filtered out; finished in 0.13s
  1425. 55.87 s > system-err
  1426. 55.87 s > The application panicked (crashed).
  1427. 55.87 s > Message: assertion failed: exported.dot.contains(r#"full_num = "op(\"Tr\")(1)";"#)
  1428. 55.87 s > Location: crates/gammalooprs/src/uv/export.rs:483
  1429. 55.87 s >
  1430. 55.87 s > ━━━━━━━━━━━━━━━━━━━━━━━━━━━━━━━━━━ BACKTRACE ━━━━━━━━━━━━━━━━━━━━━━━━━━━━━━━━━━━
  1431. 55.87 s > 1: <color_eyre[b0c9e66060e883b2]::config::PanicHook>::panic_report<unknown>
  1432. 55.87 s > at <unknown source file>:<unknown line>
  1433. 55.87 s > 2: <color_eyre[b0c9e66060e883b2]::config::PanicHook>::into_panic_hook::{closure#0}<unknown>
  1434. 55.87 s > at <unknown source file>:<unknown line>
  1435. 55.87 s > 3: std[bcb96dfbba0ab899]::panicking::panic_with_hook<unknown>
  1436. 55.87 s > at <unknown source file>:<unknown line>
  1437. 55.87 s > 4: std[bcb96dfbba0ab899]::panicking::panic_handler::{closure#0}<unknown>
  1438. 55.87 s > at <unknown source file>:<unknown line>
  1439. 55.87 s > 5: std[bcb96dfbba0ab899]::sys::backtrace::__rust_end_short_backtrace::<std[bcb96dfbba0ab899]::panicking::panic_handler::{closure#0}, !><unknown>
  1440. 55.87 s > at <unknown source file>:<unknown line>
  1441. 55.87 s > 6: __rustc[6c289b9f9c454d21]::rust_begin_unwind<unknown>
  1442. 55.87 s > at <unknown source file>:<unknown line>
  1443. 55.87 s > 7: core[940e698046960fd5]::panicking::panic_fmt<unknown>
  1444. 55.87 s > at <unknown source file>:<unknown line>
  1445. 55.87 s > 8: core[940e698046960fd5]::panicking::panic<unknown>
  1446. 55.87 s > at <unknown source file>:<unknown line>
  1447. 55.87 s > 9: gammalooprs[5490727360442cce]::uv::export::tests::computed_node_full_numerator_is_a_spenso_aware_typst_fragment<unknown>
  1448. 55.87 s > at <unknown source file>:<unknown line>
  1449. 55.87 s > 10: <gammalooprs[5490727360442cce]::uv::export::tests::computed_node_full_numerator_is_a_spenso_aware_typst_fragment::{closure#0} as core[940e698046960fd5]::ops::function::FnOnce<()>>::call_once<unknown>
  1450. 55.87 s > at <unknown source file>:<unknown line>
  1451. 55.87 s > 11: test[75d6903177b1d7e9]::__rust_begin_short_backtrace::<core[940e698046960fd5]::result::Result<(), alloc[2ea6bcb46fca0c42]::string::String>, fn() -> core[940e698046960fd5]::result::Result<(), alloc[2ea6bcb46fca0c42]::string::String>><unknown>
  1452. 55.87 s > at <unknown source file>:<unknown line>
  1453. 55.87 s > 12: test[75d6903177b1d7e9]::run_test::{closure#0}<unknown>
  1454. 55.87 s > at <unknown source file>:<unknown line>
  1455. 55.87 s > 13: std[bcb96dfbba0ab899]::sys::backtrace::__rust_begin_short_backtrace::<test[75d6903177b1d7e9]::run_test::{closure#1}, ()><unknown>
  1456. 55.87 s > at <unknown source file>:<unknown line>
  1457. 55.87 s > 14: <std[bcb96dfbba0ab899]::thread::lifecycle::spawn_unchecked<test[75d6903177b1d7e9]::run_test::{closure#1}, ()>::{closure#1} as core[940e698046960fd5]::ops::function::FnOnce<()>>::call_once::{shim:vtable#0}<unknown>
  1458. 55.87 s > at <unknown source file>:<unknown line>
  1459. 55.87 s > 15: <std[bcb96dfbba0ab899]::sys::thread::unix::Thread>::new::thread_start<unknown>
  1460. 55.87 s > at <unknown source file>:<unknown line>
  1461. 55.87 s > 16: start_thread<unknown>
  1462. 55.87 s > at <unknown source file>:<unknown line>
  1463. 55.87 s > 17: __clone3<unknown>
  1464. 55.87 s > at <unknown source file>:<unknown line>
  1465. 55.87 s >
  1466. 55.87 s > Run with COLORBT_SHOW_HIDDEN=1 environment variable to disable frame filtering.
  1467. 55.87 s > Run with RUST_BACKTRACE=full to include source snippets.
  1468. 55.87 s > =========================================
  1469. 55.87 s For full logs, run:
  1470. 55.87 s nix log /nix/store/07lma8g6p1n7jxf8azmxf90ca6pqjydj-gammaloop-nextest-core.drv
  1471. 56.00 s [2 built (1 failed), 11 Run failed.