test packages.x86_64-linux.nix-ci-check-gammaloop-nextest-core

Reproduce this run
Original Run
  1. 0.76 s $ /nix/store/9ypz3flqsrl5xl495mm8h645gadjsxi1-coreutils-9.11/bin/timeout --kill-after=15s 7200s /nix/store/23zk8sgzamrbmj1fday15szf7f2279s8-nix-2.34.7/bin/nix --extra-experimental-features nix-command --extra-experimental-features flakes flake clone git+https://github.com/alphal00p/gammaloop --dest /tmp/nix-ci-worker/stable-pwd/repo/
  2. 0.83 s Cloning into '/tmp/nix-ci-worker/stable-pwd/repo'...
  3. 1.34 s remote: Enumerating objects: 64188, done.
  4. 1.45 s remote: Counting objects: 0% (1/9542) remote: Counting objects: 1% (96/9542) remote: Counting objects: 2% (191/9542) remote: Counting objects: 3% (287/9542) remote: Counting objects: 4% (382/9542) remote: Counting objects: 5% (478/9542) remote: Counting objects: 6% (573/9542) remote: Counting objects: 7% (668/9542) remote: Counting objects: 8% (764/9542) remote: Counting objects: 9% (859/9542) remote: Counting objects: 10% (955/9542) remote: Counting objects: 11% (1050/9542) remote: Counting objects: 12% (1146/9542) remote: Counting objects: 13% (1241/9542) remote: Counting objects: 14% (1336/9542) remote: Counting objects: 15% (1432/9542) remote: Counting objects: 16% (1527/9542) remote: Counting objects: 17% (1623/9542) remote: Counting objects: 18% (1718/9542) remote: Counting objects: 19% (1813/9542) remote: Counting objects: 20% (1909/9542) remote: Counting objects: 21% (2004/9542) remote: Counting objects: 22% (2100/9542) remote: Counting objects: 23% (2195/9542) remote: Counting objects: 24% (2291/9542) remote: Counting objects: 25% (2386/9542) remote: Counting objects: 26% (2481/9542) remote: Counting objects: 27% (2577/9542) remote: Counting objects: 28% (2672/9542) remote: Counting objects: 29% (2768/9542) remote: Counting objects: 30% (2863/9542) remote: Counting objects: 31% (2959/9542) remote: Counting objects: 32% (3054/9542) remote: Counting objects: 33% (3149/9542) remote: Counting objects: 34% (3245/9542) remote: Counting objects: 35% (3340/9542) remote: Counting objects: 36% (3436/9542) remote: Counting objects: 37% (3531/9542) remote: Counting objects: 38% (3626/9542) remote: Counting objects: 39% (3722/9542) remote: Counting objects: 40% (3817/9542) remote: Counting objects: 41% (3913/9542) remote: Counting objects: 42% (4008/9542) remote: Counting objects: 43% (4104/9542) remote: Counting objects: 44% (4199/9542) remote: Counting objects: 45% (4294/9542) remote: Counting objects: 46% (4390/9542) remote: Counting objects: 47% (4485/9542) remote: Counting objects: 48% (4581/9542) remote: Counting objects: 49% (4676/9542) remote: Counting objects: 50% (4771/9542) remote: Counting objects: 51% (4867/9542) remote: Counting objects: 52% (4962/9542) remote: Counting objects: 53% (5058/9542) remote: Counting objects: 54% (5153/9542) remote: Counting objects: 55% (5249/9542) remote: Counting objects: 56% (5344/9542) remote: Counting objects: 57% (5439/9542) remote: Counting objects: 58% (5535/9542) remote: Counting objects: 59% (5630/9542) remote: Counting objects: 60% (5726/9542) remote: Counting objects: 61% (5821/9542) remote: Counting objects: 62% (5917/9542) remote: Counting objects: 63% (6012/9542) remote: Counting objects: 64% (6107/9542) remote: Counting objects: 65% (6203/9542) remote: Counting objects: 66% (6298/9542) remote: Counting objects: 67% (6394/9542) remote: Counting objects: 68% (6489/9542) remote: Counting objects: 69% (6584/9542) remote: Counting objects: 70% (6680/9542) remote: Counting objects: 71% (6775/9542) remote: Counting objects: 72% (6871/9542) remote: Counting objects: 73% (6966/9542) remote: Counting objects: 74% (7062/9542) remote: Counting objects: 75% (7157/9542) remote: Counting objects: 76% (7252/9542) remote: Counting objects: 77% (7348/9542) remote: Counting objects: 78% (7443/9542) remote: Counting objects: 79% (7539/9542) remote: Counting objects: 80% (7634/9542) remote: Counting objects: 81% (7730/9542) remote: Counting objects: 82% (7825/9542) remote: Counting objects: 83% (7920/9542) remote: Counting objects: 84% (8016/9542) remote: Counting objects: 85% (8111/9542) remote: Counting objects: 86% (8207/9542) remote: Counting objects: 87% (8302/9542) remote: Counting objects: 88% (8397/9542) remote: Counting objects: 89% (8493/9542) remote: Counting objects: 90% (8588/9542) remote: Counting objects: 91% (8684/9542) remote: Counting objects: 92% (8779/9542) remote: Counting objects: 93% (8875/9542) remote: Counting objects: 94% (8970/9542) remote: Counting objects: 95% (9065/9542) remote: Counting objects: 96% (9161/9542) remote: Counting objects: 97% (9256/9542) remote: Counting objects: 98% (9352/9542) remote: Counting objects: 99% (9447/9542) remote: Counting objects: 100% (9542/9542) remote: Counting objects: 100% (9542/9542), done.
  5. 4.54 s remote: Compressing objects: 0% (1/2327) remote: Compressing objects: 1% (24/2327) remote: Compressing objects: 2% (47/2327) remote: Compressing objects: 3% (70/2327) remote: Compressing objects: 4% (94/2327) remote: Compressing objects: 5% (117/2327) remote: Compressing objects: 6% (140/2327) remote: Compressing objects: 7% (163/2327) remote: Compressing objects: 8% (187/2327) remote: Compressing objects: 9% (210/2327) remote: Compressing objects: 10% (233/2327) remote: Compressing objects: 11% (256/2327) remote: Compressing objects: 12% (280/2327) remote: Compressing objects: 13% (303/2327) remote: Compressing objects: 14% (326/2327) remote: Compressing objects: 15% (350/2327) remote: Compressing objects: 16% (373/2327) remote: Compressing objects: 17% (396/2327) remote: Compressing objects: 18% (419/2327) remote: Compressing objects: 19% (443/2327) remote: Compressing objects: 20% (466/2327) remote: Compressing objects: 21% (489/2327) remote: Compressing objects: 22% (512/2327) remote: Compressing objects: 22% (528/2327) remote: Compressing objects: 23% (536/2327) remote: Compressing objects: 24% (559/2327) remote: Compressing objects: 25% (582/2327) remote: Compressing objects: 26% (606/2327) remote: Compressing objects: 26% (612/2327) remote: Compressing objects: 27% (629/2327) remote: Compressing objects: 28% (652/2327) remote: Compressing objects: 29% (675/2327) remote: Compressing objects: 30% (699/2327) remote: Compressing objects: 31% (722/2327) remote: Compressing objects: 32% (745/2327) remote: Compressing objects: 33% (768/2327) remote: Compressing objects: 34% (792/2327) remote: Compressing objects: 35% (815/2327) remote: Compressing objects: 36% (838/2327) remote: Compressing objects: 36% (852/2327) remote: Compressing objects: 37% (861/2327) remote: Compressing objects: 38% (885/2327) remote: Compressing objects: 39% (908/2327) remote: Compressing objects: 40% (931/2327) remote: Compressing objects: 41% (955/2327) remote: Compressing objects: 42% (978/2327) remote: Compressing objects: 43% (1001/2327) remote: Compressing objects: 44% (1024/2327) remote: Compressing objects: 45% (1048/2327) remote: Compressing objects: 46% (1071/2327) remote: Compressing objects: 47% (1094/2327) remote: Compressing objects: 48% (1117/2327) remote: Compressing objects: 49% (1141/2327) remote: Compressing objects: 50% (1164/2327) remote: Compressing objects: 51% (1187/2327) remote: Compressing objects: 52% (1211/2327) remote: Compressing objects: 53% (1234/2327) remote: Compressing objects: 54% (1257/2327) remote: Compressing objects: 55% (1280/2327) remote: Compressing objects: 56% (1304/2327) remote: Compressing objects: 57% (1327/2327) remote: Compressing objects: 58% (1350/2327) remote: Compressing objects: 59% (1373/2327) remote: Compressing objects: 60% (1397/2327) remote: Compressing objects: 61% (1420/2327) remote: Compressing objects: 62% (1443/2327) remote: Compressing objects: 63% (1467/2327) remote: Compressing objects: 64% (1490/2327) remote: Compressing objects: 65% (1513/2327) remote: Compressing objects: 66% (1536/2327) remote: Compressing objects: 67% (1560/2327) remote: Compressing objects: 68% (1583/2327) remote: Compressing objects: 69% (1606/2327) remote: Compressing objects: 70% (1629/2327) remote: Compressing objects: 71% (1653/2327) remote: Compressing objects: 72% (1676/2327) remote: Compressing objects: 73% (1699/2327) remote: Compressing objects: 74% (1722/2327) remote: Compressing objects: 75% (1746/2327) remote: Compressing objects: 76% (1769/2327) remote: Compressing objects: 77% (1792/2327) remote: Compressing objects: 78% (1816/2327) remote: Compressing objects: 79% (1839/2327) remote: Compressing objects: 80% (1862/2327) remote: Compressing objects: 81% (1885/2327) remote: Compressing objects: 82% (1909/2327) remote: Compressing objects: 83% (1932/2327) remote: Compressing objects: 84% (1955/2327) remote: Compressing objects: 85% (1978/2327) remote: Compressing objects: 86% (2002/2327) remote: Compressing objects: 87% (2025/2327) remote: Compressing objects: 88% (2048/2327) remote: Compressing objects: 89% (2072/2327) remote: Compressing objects: 90% (2095/2327) remote: Compressing objects: 91% (2118/2327) remote: Compressing objects: 92% (2141/2327) remote: Compressing objects: 93% (2165/2327) remote: Compressing objects: 94% (2188/2327) remote: Compressing objects: 95% (2211/2327) remote: Compressing objects: 96% (2234/2327) remote: Compressing objects: 97% (2258/2327) remote: Compressing objects: 98% (2281/2327) remote: Compressing objects: 99% (2304/2327) remote: Compressing objects: 100% (2327/2327) remote: Compressing objects: 100% (2327/2327), done.
  6. 7.51 s Receiving objects: 0% (1/64188) Receiving objects: 1% (642/64188) Receiving objects: 2% (1284/64188) Receiving objects: 3% (1926/64188) Receiving objects: 4% (2568/64188) Receiving objects: 5% (3210/64188) Receiving objects: 6% (3852/64188) Receiving objects: 7% (4494/64188) Receiving objects: 8% (5136/64188) Receiving objects: 9% (5777/64188) Receiving objects: 10% (6419/64188), 10.04 MiB | 20.05 MiB/s Receiving objects: 11% (7061/64188), 10.04 MiB | 20.05 MiB/s Receiving objects: 12% (7703/64188), 10.04 MiB | 20.05 MiB/s Receiving objects: 13% (8345/64188), 10.04 MiB | 20.05 MiB/s Receiving objects: 14% (8987/64188), 10.04 MiB | 20.05 MiB/s Receiving objects: 15% (9629/64188), 10.04 MiB | 20.05 MiB/s Receiving objects: 16% (10271/64188), 10.04 MiB | 20.05 MiB/s Receiving objects: 17% (10912/64188), 10.04 MiB | 20.05 MiB/s Receiving objects: 18% (11554/64188), 10.04 MiB | 20.05 MiB/s Receiving objects: 19% (12196/64188), 10.04 MiB | 20.05 MiB/s Receiving objects: 20% (12838/64188), 10.04 MiB | 20.05 MiB/s Receiving objects: 21% (13480/64188), 10.04 MiB | 20.05 MiB/s Receiving objects: 22% (14122/64188), 10.04 MiB | 20.05 MiB/s Receiving objects: 23% (14764/64188), 10.04 MiB | 20.05 MiB/s Receiving objects: 24% (15406/64188), 10.04 MiB | 20.05 MiB/s Receiving objects: 25% (16047/64188), 10.04 MiB | 20.05 MiB/s Receiving objects: 26% (16689/64188), 10.04 MiB | 20.05 MiB/s Receiving objects: 27% (17331/64188), 10.04 MiB | 20.05 MiB/s Receiving objects: 28% (17973/64188), 10.04 MiB | 20.05 MiB/s Receiving objects: 29% (18615/64188), 10.04 MiB | 20.05 MiB/s Receiving objects: 30% (19257/64188), 10.04 MiB | 20.05 MiB/s Receiving objects: 31% (19899/64188), 10.04 MiB | 20.05 MiB/s Receiving objects: 32% (20541/64188), 10.04 MiB | 20.05 MiB/s Receiving objects: 33% (21183/64188), 10.04 MiB | 20.05 MiB/s Receiving objects: 34% (21824/64188), 10.04 MiB | 20.05 MiB/s Receiving objects: 35% (22466/64188), 10.04 MiB | 20.05 MiB/s Receiving objects: 36% (23108/64188), 10.04 MiB | 20.05 MiB/s Receiving objects: 37% (23750/64188), 10.04 MiB | 20.05 MiB/s Receiving objects: 38% (24392/64188), 10.04 MiB | 20.05 MiB/s Receiving objects: 39% (25034/64188), 10.04 MiB | 20.05 MiB/s Receiving objects: 40% (25676/64188), 10.04 MiB | 20.05 MiB/s Receiving objects: 41% (26318/64188), 10.04 MiB | 20.05 MiB/s Receiving objects: 42% (26959/64188), 10.04 MiB | 20.05 MiB/s Receiving objects: 43% (27601/64188), 10.04 MiB | 20.05 MiB/s Receiving objects: 44% (28243/64188), 10.04 MiB | 20.05 MiB/s Receiving objects: 45% (28885/64188), 10.04 MiB | 20.05 MiB/s Receiving objects: 46% (29527/64188), 10.04 MiB | 20.05 MiB/s Receiving objects: 47% (30169/64188), 10.04 MiB | 20.05 MiB/s Receiving objects: 48% (30811/64188), 10.04 MiB | 20.05 MiB/s Receiving objects: 49% (31453/64188), 10.04 MiB | 20.05 MiB/s Receiving objects: 50% (32094/64188), 10.04 MiB | 20.05 MiB/s Receiving objects: 51% (32736/64188), 10.04 MiB | 20.05 MiB/s Receiving objects: 52% (33378/64188), 10.04 MiB | 20.05 MiB/s Receiving objects: 52% (33531/64188), 10.04 MiB | 20.05 MiB/s Receiving objects: 53% (34020/64188), 32.35 MiB | 32.34 MiB/s Receiving objects: 54% (34662/64188), 32.35 MiB | 32.34 MiB/s Receiving objects: 55% (35304/64188), 32.35 MiB | 32.34 MiB/s Receiving objects: 56% (35946/64188), 32.35 MiB | 32.34 MiB/s Receiving objects: 57% (36588/64188), 32.35 MiB | 32.34 MiB/s Receiving objects: 58% (37230/64188), 32.35 MiB | 32.34 MiB/s Receiving objects: 59% (37871/64188), 32.35 MiB | 32.34 MiB/s Receiving objects: 60% (38513/64188), 32.35 MiB | 32.34 MiB/s Receiving objects: 61% (39155/64188), 47.97 MiB | 31.97 MiB/s Receiving objects: 62% (39797/64188), 47.97 MiB | 31.97 MiB/s Receiving objects: 63% (40439/64188), 47.97 MiB | 31.97 MiB/s Receiving objects: 64% (41081/64188), 47.97 MiB | 31.97 MiB/s Receiving objects: 65% (41723/64188), 47.97 MiB | 31.97 MiB/s Receiving objects: 66% (42365/64188), 47.97 MiB | 31.97 MiB/s Receiving objects: 67% (43006/64188), 47.97 MiB | 31.97 MiB/s Receiving objects: 68% (43648/64188), 47.97 MiB | 31.97 MiB/s Receiving objects: 69% (44290/64188), 47.97 MiB | 31.97 MiB/s Receiving objects: 70% (44932/64188), 47.97 MiB | 31.97 MiB/s Receiving objects: 70% (45384/64188), 47.97 MiB | 31.97 MiB/s Receiving objects: 71% (45574/64188), 65.95 MiB | 32.97 MiB/s Receiving objects: 72% (46216/64188), 65.95 MiB | 32.97 MiB/s Receiving objects: 73% (46858/64188), 65.95 MiB | 32.97 MiB/s Receiving objects: 74% (47500/64188), 65.95 MiB | 32.97 MiB/s Receiving objects: 75% (48141/64188), 65.95 MiB | 32.97 MiB/s Receiving objects: 76% (48783/64188), 65.95 MiB | 32.97 MiB/s Receiving objects: 77% (49425/64188), 65.95 MiB | 32.97 MiB/s Receiving objects: 78% (50067/64188), 65.95 MiB | 32.97 MiB/s Receiving objects: 79% (50709/64188), 65.95 MiB | 32.97 MiB/s Receiving objects: 80% (51351/64188), 65.95 MiB | 32.97 MiB/s Receiving objects: 81% (51993/64188), 65.95 MiB | 32.97 MiB/s Receiving objects: 82% (52635/64188), 65.95 MiB | 32.97 MiB/s Receiving objects: 83% (53277/64188), 65.95 MiB | 32.97 MiB/s Receiving objects: 84% (53918/64188), 65.95 MiB | 32.97 MiB/s Receiving objects: 85% (54560/64188), 82.05 MiB | 32.82 MiB/s Receiving objects: 86% (55202/64188), 82.05 MiB | 32.82 MiB/s Receiving objects: 87% (55844/64188), 82.05 MiB | 32.82 MiB/s Receiving objects: 88% (56486/64188), 82.05 MiB | 32.82 MiB/s Receiving objects: 89% (57128/64188), 82.05 MiB | 32.82 MiB/s Receiving objects: 90% (57770/64188), 82.05 MiB | 32.82 MiB/s Receiving objects: 91% (58412/64188), 82.05 MiB | 32.82 MiB/s Receiving objects: 92% (59053/64188), 82.05 MiB | 32.82 MiB/s Receiving objects: 93% (59695/64188), 82.05 MiB | 32.82 MiB/s Receiving objects: 94% (60337/64188), 82.05 MiB | 32.82 MiB/s Receiving objects: 95% (60979/64188), 82.05 MiB | 32.82 MiB/s Receiving objects: 96% (61621/64188), 82.05 MiB | 32.82 MiB/s Receiving objects: 97% (62263/64188), 82.05 MiB | 32.82 MiB/s Receiving objects: 98% (62905/64188), 82.05 MiB | 32.82 MiB/s Receiving objects: 99% (63547/64188), 82.05 MiB | 32.82 MiB/s remote: Total 64188 (delta 7388), reused 7767 (delta 6670), pack-reused 54646 (from 3)
  7. 7.52 s Receiving objects: 100% (64188/64188), 82.05 MiB | 32.82 MiB/s Receiving objects: 100% (64188/64188), 97.83 MiB | 32.98 MiB/s, done.
  8. 8.74 s Resolving deltas: 0% (0/44318) Resolving deltas: 1% (444/44318) Resolving deltas: 2% (887/44318) Resolving deltas: 3% (1330/44318) Resolving deltas: 4% (1773/44318) Resolving deltas: 5% (2216/44318) Resolving deltas: 6% (2661/44318) Resolving deltas: 7% (3103/44318) Resolving deltas: 8% (3546/44318) Resolving deltas: 9% (3989/44318) Resolving deltas: 10% (4432/44318) Resolving deltas: 11% (4875/44318) Resolving deltas: 12% (5319/44318) Resolving deltas: 13% (5762/44318) Resolving deltas: 14% (6205/44318) Resolving deltas: 15% (6648/44318) Resolving deltas: 16% (7091/44318) Resolving deltas: 17% (7535/44318) Resolving deltas: 18% (7978/44318) Resolving deltas: 19% (8421/44318) Resolving deltas: 20% (8864/44318) Resolving deltas: 21% (9307/44318) Resolving deltas: 22% (9750/44318) Resolving deltas: 23% (10194/44318) Resolving deltas: 24% (10637/44318) Resolving deltas: 25% (11080/44318) Resolving deltas: 26% (11523/44318) Resolving deltas: 27% (11966/44318) Resolving deltas: 28% (12410/44318) Resolving deltas: 29% (12854/44318) Resolving deltas: 30% (13296/44318) Resolving deltas: 31% (13739/44318) Resolving deltas: 32% (14182/44318) Resolving deltas: 33% (14625/44318) Resolving deltas: 34% (15069/44318) Resolving deltas: 35% (15512/44318) Resolving deltas: 36% (15955/44318) Resolving deltas: 37% (16398/44318) Resolving deltas: 38% (16841/44318) Resolving deltas: 39% (17285/44318) Resolving deltas: 40% (17728/44318) Resolving deltas: 41% (18171/44318) Resolving deltas: 42% (18614/44318) Resolving deltas: 43% (19059/44318) Resolving deltas: 44% (19500/44318) Resolving deltas: 45% (19944/44318) Resolving deltas: 46% (20388/44318) Resolving deltas: 47% (20831/44318) Resolving deltas: 48% (21274/44318) Resolving deltas: 49% (21717/44318) Resolving deltas: 50% (22159/44318) Resolving deltas: 51% (22603/44318) Resolving deltas: 52% (23046/44318) Resolving deltas: 53% (23489/44318) Resolving deltas: 54% (23932/44318) Resolving deltas: 55% (24375/44318) Resolving deltas: 56% (24819/44318) Resolving deltas: 57% (25262/44318) Resolving deltas: 58% (25705/44318) Resolving deltas: 59% (26148/44318) Resolving deltas: 60% (26591/44318) Resolving deltas: 61% (27034/44318) Resolving deltas: 62% (27478/44318) Resolving deltas: 63% (27921/44318) Resolving deltas: 64% (28364/44318) Resolving deltas: 65% (28807/44318) Resolving deltas: 66% (29250/44318) Resolving deltas: 67% (29696/44318) Resolving deltas: 68% (30139/44318) Resolving deltas: 69% (30580/44318) Resolving deltas: 70% (31023/44318) Resolving deltas: 71% (31466/44318) Resolving deltas: 72% (31909/44318) Resolving deltas: 73% (32354/44318) Resolving deltas: 74% (32796/44318) Resolving deltas: 75% (33239/44318) Resolving deltas: 76% (33682/44318) Resolving deltas: 77% (34125/44318) Resolving deltas: 78% (34570/44318) Resolving deltas: 79% (35012/44318) Resolving deltas: 80% (35455/44318) Resolving deltas: 80% (35867/44318) Resolving deltas: 81% (35898/44318) Resolving deltas: 82% (36344/44318) Resolving deltas: 83% (36784/44318) Resolving deltas: 84% (37228/44318) Resolving deltas: 85% (37671/44318) Resolving deltas: 86% (38114/44318) Resolving deltas: 87% (38557/44318) Resolving deltas: 88% (39000/44318) Resolving deltas: 89% (39444/44318) Resolving deltas: 90% (39892/44318) Resolving deltas: 91% (40330/44318) Resolving deltas: 92% (40773/44318) Resolving deltas: 93% (41216/44318) Resolving deltas: 94% (41659/44318) Resolving deltas: 95% (42103/44318) Resolving deltas: 96% (42547/44318) Resolving deltas: 97% (42990/44318) Resolving deltas: 98% (43434/44318) Resolving deltas: 99% (43875/44318) Resolving deltas: 100% (44318/44318) Resolving deltas: 100% (44318/44318), done.
  9. 9.17 s Fetching commit 08898429f2a98faff9a8de1c43eb54edd82e450c for push-vrpyqyylypmw ...
  10. 9.18 s $ /nix/store/bcnisk3ydfgv26v2gw3zlky24g00yww2-git-2.54.0/bin/git fetch origin 08898429f2a98faff9a8de1c43eb54edd82e450c
  11. 9.66 s From https://github.com/alphal00p/gammaloop
  12. 9.66 s * branch 08898429f2a98faff9a8de1c43eb54edd82e450c -> FETCH_HEAD
  13. 9.69 s $ /nix/store/9ypz3flqsrl5xl495mm8h645gadjsxi1-coreutils-9.11/bin/timeout --kill-after=15s 7200s /nix/store/bcnisk3ydfgv26v2gw3zlky24g00yww2-git-2.54.0/bin/git -c advice.detachedHead=false checkout 08898429f2a98faff9a8de1c43eb54edd82e450c
  14. 9.88 s HEAD is now at 08898429 run documentation tests through the Nix CI secret runner
  15. 9.89 s $ /nix/store/9ypz3flqsrl5xl495mm8h645gadjsxi1-coreutils-9.11/bin/timeout --kill-after=15s 7200s /nix/store/23zk8sgzamrbmj1fday15szf7f2279s8-nix-2.34.7/bin/nix --extra-experimental-features nix-command --extra-experimental-features flakes --log-format internal-json run .#packages.x86_64-linux.nix-ci-check-gammaloop-nextest-core --print-build-logs
  16. 17.23 s
  17. 24.19 s evaluating derivation 'g copying '/nix/store/0fcb evaluating derivation 'g copying '/nix/store/0fcb evaluating derivation 'g copying '/nix/store/0fcb evaluating derivation 'g copying '/nix/store/0fcb evaluating derivation 'g copying '/nix/store/0fcb evaluating derivation 'g copying '/nix/store/0fcb evaluating derivation 'g copying '/nix/store/0fcb evaluating derivation 'g copying '/nix/store/0fcb evaluating derivation 'g copying '/nix/store/0fcb evaluating derivation 'g [0/1 built] [1/0/1 built] building ggammaloop-nextest-core> Extracting 3 binaries (including 1 non-test binary), 1 build script output directory, and 2 linked paths to /build/nextest-archive-8SpQ3N
  18. 24.88 s gammaloop-nextest-core> Extracted 18 files to /build/nextest-archive-8SpQ3N in 0.69s
  19. 24.90 s gammaloop-nextest-core> ------------
  20. 24.90 s gammaloop-nextest-core> Nextest run ID ce44fbbc-58b7-4f0e-a9de-f3d6c319fa74 with nextest profile: ci_gammaloop
  21. 24.90 s gammaloop-nextest-core> Starting 339 tests across 2 binaries
  22. 25.36 s gammaloop-nextest-core> FAIL [ 0.039s] (248/339) gammaloop-api repl::tests::completion_shows_type_hint_for_non_boolean_settings_leaf
  23. 25.36 s gammaloop-nextest-core> stdout ---
  24. 25.36 s gammaloop-nextest-core>
  25. 25.36 s gammaloop-nextest-core> running 1 test
  26. 25.36 s gammaloop-nextest-core> test repl::tests::completion_shows_type_hint_for_non_boolean_settings_leaf ... FAILED
  27. 25.36 s gammaloop-nextest-core>
  28. 25.36 s gammaloop-nextest-core> failures:
  29. 25.36 s gammaloop-nextest-core>
  30. 25.36 s gammaloop-nextest-core> failures:
  31. 25.36 s gammaloop-nextest-core> repl::tests::completion_shows_type_hint_for_non_boolean_settings_leaf
  32. 25.36 s gammaloop-nextest-core>
  33. 25.36 s gammaloop-nextest-core> test result: FAILED. 0 passed; 1 failed; 0 ignored; 0 measured; 338 filtered out; finished in 0.02s
  34. 25.36 s gammaloop-nextest-core>
  35. 25.36 s gammaloop-nextest-core> stderr ---
  36. 25.36 s gammaloop-nextest-core>
  37. 25.36 s gammaloop-nextest-core> thread 'repl::tests::completion_shows_type_hint_for_non_boolean_settings_leaf' (774) panicked at crates/gammaloop-api/src/repl.rs:5778:9:
  38. 25.36 s gammaloop-nextest-core> [Suggestion { value: "", description: Some("Number of samples in the first Monte Carlo iteration."), style: None, extra: None, span: Span { start: 42, end: 42 }, append_whitespace: false }]
  39. 25.36 s gammaloop-nextest-core> stack backtrace:
  40. 25.36 s gammaloop-nextest-core> 0: __rustc::rust_begin_unwind
  41. 25.36 s gammaloop-nextest-core> 1: core::panicking::panic_fmt
  42. 25.36 s gammaloop-nextest-core> 2: gammaloop_api::repl::tests::completion_shows_type_hint_for_non_boolean_settings_leaf
  43. 25.36 s gammaloop-nextest-core> 3: <gammaloop_api::repl::tests::completion_shows_type_hint_for_non_boolean_settings_leaf::{closure#0} as core::ops::function::FnOnce<()>>::call_once
  44. 25.36 s gammaloop-nextest-core> note: Some details are omitted, run with `RUST_BACKTRACE=full` for a verbose backtrace.
  45. 25.36 s gammaloop-nextest-core>
  46. 25.43 s gammaloop-nextest-core> FAIL [ 0.037s] (277/339) gammaloop-api templates::tests::extract_templates_uses_canonical_package_layout
  47. 25.43 s gammaloop-nextest-core> stdout ---
  48. 25.43 s gammaloop-nextest-core>
  49. 25.43 s gammaloop-nextest-core> running 1 test
  50. 25.43 s gammaloop-nextest-core> test templates::tests::extract_templates_uses_canonical_package_layout ... FAILED
  51. 25.43 s gammaloop-nextest-core>
  52. 25.43 s gammaloop-nextest-core> failures:
  53. 25.43 s gammaloop-nextest-core>
  54. 25.43 s gammaloop-nextest-core> failures:
  55. 25.43 s gammaloop-nextest-core> templates::tests::extract_templates_uses_canonical_package_layout
  56. 25.43 s gammaloop-nextest-core>
  57. 25.43 s gammaloop-nextest-core> test result: FAILED. 0 passed; 1 failed; 0 ignored; 0 measured; 338 filtered out; finished in 0.03s
  58. 25.43 s gammaloop-nextest-core>
  59. 25.43 s gammaloop-nextest-core> stderr ---
  60. 25.43 s gammaloop-nextest-core>
  61. 25.43 s gammaloop-nextest-core> thread 'templates::tests::extract_templates_uses_canonical_package_layout' (871) panicked at crates/gammaloop-api/src/templates.rs:99:9:
  62. 25.43 s gammaloop-nextest-core> assertion failed: figure.contains("amplitude-mode")
  63. 25.43 s gammaloop-nextest-core> stack backtrace:
  64. 25.43 s gammaloop-nextest-core> 0: __rustc::rust_begin_unwind
  65. 25.43 s gammaloop-nextest-core> 1: core::panicking::panic_fmt
  66. 25.43 s gammaloop-nextest-core> 2: core::panicking::panic
  67. 25.43 s gammaloop-nextest-core> 3: gammaloop_api::templates::tests::extract_templates_uses_canonical_package_layout
  68. 25.43 s gammaloop-nextest-core> 4: <gammaloop_api::templates::tests::extract_templates_uses_canonical_package_layout::{closure#0} as core::ops::function::FnOnce<()>>::call_once
  69. 25.43 s gammaloop-nextest-core> note: Some details are omitted, run with `RUST_BACKTRACE=full` for a verbose backtrace.
  70. 25.43 s gammaloop-nextest-core>
  71. 25.53 s gammaloop-nextest-core> ------------
  72. 25.53 s gammaloop-nextest-core> Summary [ 0.627s] 339 tests run: 337 passed, 2 failed, 0 skipped
  73. 25.53 s gammaloop-nextest-core> FAIL [ 0.039s] (248/339) gammaloop-api repl::tests::completion_shows_type_hint_for_non_boolean_settings_leaf
  74. 25.53 s gammaloop-nextest-core> stdout ---
  75. 25.53 s gammaloop-nextest-core>
  76. 25.53 s gammaloop-nextest-core> running 1 test
  77. 25.53 s gammaloop-nextest-core> test repl::tests::completion_shows_type_hint_for_non_boolean_settings_leaf ... FAILED
  78. 25.53 s gammaloop-nextest-core>
  79. 25.53 s gammaloop-nextest-core> failures:
  80. 25.53 s gammaloop-nextest-core>
  81. 25.53 s gammaloop-nextest-core> failures:
  82. 25.53 s gammaloop-nextest-core> repl::tests::completion_shows_type_hint_for_non_boolean_settings_leaf
  83. 25.53 s gammaloop-nextest-core>
  84. 25.53 s gammaloop-nextest-core> test result: FAILED. 0 passed; 1 failed; 0 ignored; 0 measured; 338 filtered out; finished in 0.02s
  85. 25.53 s gammaloop-nextest-core>
  86. 25.53 s gammaloop-nextest-core> stderr ---
  87. 25.53 s gammaloop-nextest-core>
  88. 25.53 s gammaloop-nextest-core> thread 'repl::tests::completion_shows_type_hint_for_non_boolean_settings_leaf' (774) panicked at crates/gammaloop-api/src/repl.rs:5778:9:
  89. 25.53 s gammaloop-nextest-core> [Suggestion { value: "", description: Some("Number of samples in the first Monte Carlo iteration."), style: None, extra: None, span: Span { start: 42, end: 42 }, append_whitespace: false }]
  90. 25.53 s gammaloop-nextest-core> stack backtrace:
  91. 25.53 s gammaloop-nextest-core> 0: __rustc::rust_begin_unwind
  92. 25.53 s gammaloop-nextest-core> 1: core::panicking::panic_fmt
  93. 25.53 s gammaloop-nextest-core> 2: gammaloop_api::repl::tests::completion_shows_type_hint_for_non_boolean_settings_leaf
  94. 25.53 s gammaloop-nextest-core> 3: <gammaloop_api::repl::tests::completion_shows_type_hint_for_non_boolean_settings_leaf::{closure#0} as core::ops::function::FnOnce<()>>::call_once
  95. 25.53 s gammaloop-nextest-core> note: Some details are omitted, run with `RUST_BACKTRACE=full` for a verbose backtrace.
  96. 25.53 s gammaloop-nextest-core>
  97. 25.53 s gammaloop-nextest-core> FAIL [ 0.037s] (277/339) gammaloop-api templates::tests::extract_templates_uses_canonical_package_layout
  98. 25.53 s gammaloop-nextest-core> stdout ---
  99. 25.53 s gammaloop-nextest-core>
  100. 25.53 s gammaloop-nextest-core> running 1 test
  101. 25.53 s gammaloop-nextest-core> test templates::tests::extract_templates_uses_canonical_package_layout ... FAILED
  102. 25.53 s gammaloop-nextest-core>
  103. 25.53 s gammaloop-nextest-core> failures:
  104. 25.53 s gammaloop-nextest-core>
  105. 25.53 s gammaloop-nextest-core> failures:
  106. 25.53 s gammaloop-nextest-core> templates::tests::extract_templates_uses_canonical_package_layout
  107. 25.53 s gammaloop-nextest-core>
  108. 25.53 s gammaloop-nextest-core> test result: FAILED. 0 passed; 1 failed; 0 ignored; 0 measured; 338 filtered out; finished in 0.03s
  109. 25.53 s gammaloop-nextest-core>
  110. 25.53 s gammaloop-nextest-core> stderr ---
  111. 25.53 s gammaloop-nextest-core>
  112. 25.53 s gammaloop-nextest-core> thread 'templates::tests::extract_templates_uses_canonical_package_layout' (871) panicked at crates/gammaloop-api/src/templates.rs:99:9:
  113. 25.53 s gammaloop-nextest-core> assertion failed: figure.contains("amplitude-mode")
  114. 25.53 s gammaloop-nextest-core> stack backtrace:
  115. 25.53 s gammaloop-nextest-core> 0: __rustc::rust_begin_unwind
  116. 25.53 s gammaloop-nextest-core> 1: core::panicking::panic_fmt
  117. 25.53 s gammaloop-nextest-core> 2: core::panicking::panic
  118. 25.53 s gammaloop-nextest-core> 3: gammaloop_api::templates::tests::extract_templates_uses_canonical_package_layout
  119. 25.53 s gammaloop-nextest-core> 4: <gammaloop_api::templates::tests::extract_templates_uses_canonical_package_layout::{closure#0} as core::ops::function::FnOnce<()>>::call_once
  120. 25.53 s gammaloop-nextest-core> note: Some details are omitted, run with `RUST_BACKTRACE=full` for a verbose backtrace.
  121. 25.53 s gammaloop-nextest-core>
  122. 25.60 s gammaloop-nextest-core> error: test run failed
  123. 25.64 s gammaloop-nextest-core>
  124. 25.64 s gammaloop-nextest-core> ========== nextest test summary ==========
  125. 25.64 s gammaloop-nextest-core> report: target/nextest/ci_gammaloop/junit.xml
  126. 25.64 s gammaloop-nextest-core> tests: 339, failures: 2, errors: 0
  127. 25.64 s gammaloop-nextest-core>
  128. 25.64 s gammaloop-nextest-core> 1. gammaloop-api::repl::tests::completion_shows_type_hint_for_non_boolean_settings_leaf
  129. 25.64 s gammaloop-nextest-core> failure: test failure with exit code 101
  130. 25.64 s gammaloop-nextest-core> thread 'repl::tests::completion_shows_type_hint_for_non_boolean_settings_leaf' (774) panicked at crates/gammaloop-api/src/repl.rs:5778:9:
  131. 25.64 s gammaloop-nextest-core> [Suggestion { value: "", description: Some("Number of samples in the first Monte Carlo iteration."), style: None, extra: None, span: Span { start: 42, end: 42 }, append_whitespace: false }]
  132. 25.64 s gammaloop-nextest-core> stack backtrace:
  133. 25.64 s gammaloop-nextest-core> 0: __rustc::rust_begin_unwind
  134. 25.64 s gammaloop-nextest-core> 1: core::panicking::panic_fmt
  135. 25.64 s gammaloop-nextest-core> 2: gammaloop_api::repl::tests::completion_shows_type_hint_for_non_boolean_settings_leaf
  136. 25.64 s gammaloop-nextest-core> 3: <gammaloop_api::repl::tests::completion_shows_type_hint_for_non_boolean_settings_leaf::{closure#0} as core::ops::function::FnOnce<()>>::call_once
  137. 25.64 s gammaloop-nextest-core> note: Some details are omitted, run with `RUST_BACKTRACE=full` for a verbose backtrace.
  138. 25.64 s gammaloop-nextest-core> system-out
  139. 25.64 s gammaloop-nextest-core> running 1 test
  140. 25.64 s gammaloop-nextest-core> test repl::tests::completion_shows_type_hint_for_non_boolean_settings_leaf ... FAILED
  141. 25.64 s gammaloop-nextest-core>
  142. 25.64 s gammaloop-nextest-core> failures:
  143. 25.64 s gammaloop-nextest-core>
  144. 25.64 s gammaloop-nextest-core> failures:
  145. 25.64 s gammaloop-nextest-core> repl::tests::completion_shows_type_hint_for_non_boolean_settings_leaf
  146. 25.64 s gammaloop-nextest-core>
  147. 25.64 s gammaloop-nextest-core> test result: FAILED. 0 passed; 1 failed; 0 ignored; 0 measured; 338 filtered out; finished in 0.02s
  148. 25.64 s gammaloop-nextest-core> system-err
  149. 25.64 s gammaloop-nextest-core> thread 'repl::tests::completion_shows_type_hint_for_non_boolean_settings_leaf' (774) panicked at crates/gammaloop-api/src/repl.rs:5778:9:
  150. 25.64 s gammaloop-nextest-core> [Suggestion { value: "", description: Some("Number of samples in the first Monte Carlo iteration."), style: None, extra: None, span: Span { start: 42, end: 42 }, append_whitespace: false }]
  151. 25.64 s gammaloop-nextest-core> stack backtrace:
  152. 25.64 s gammaloop-nextest-core> 0: __rustc::rust_begin_unwind
  153. 25.64 s gammaloop-nextest-core> 1: core::panicking::panic_fmt
  154. 25.64 s gammaloop-nextest-core> 2: gammaloop_api::repl::tests::completion_shows_type_hint_for_non_boolean_settings_leaf
  155. 25.64 s gammaloop-nextest-core> 3: <gammaloop_api::repl::tests::completion_shows_type_hint_for_non_boolean_settings_leaf::{closure#0} as core::ops::function::FnOnce<()>>::call_once
  156. 25.64 s gammaloop-nextest-core> note: Some details are omitted, run with `RUST_BACKTRACE=full` for a verbose backtrace.
  157. 25.64 s gammaloop-nextest-core>
  158. 25.64 s gammaloop-nextest-core> 2. gammaloop-api::templates::tests::extract_templates_uses_canonical_package_layout
  159. 25.64 s gammaloop-nextest-core> failure: test failure with exit code 101
  160. 25.64 s gammaloop-nextest-core> thread 'templates::tests::extract_templates_uses_canonical_package_layout' (871) panicked at crates/gammaloop-api/src/templates.rs:99:9:
  161. 25.64 s gammaloop-nextest-core> assertion failed: figure.contains("amplitude-mode")
  162. 25.64 s gammaloop-nextest-core> stack backtrace:
  163. 25.64 s gammaloop-nextest-core> 0: __rustc::rust_begin_unwind
  164. 25.64 s gammaloop-nextest-core> 1: core::panicking::panic_fmt
  165. 25.64 s gammaloop-nextest-core> 2: core::panicking::panic
  166. 25.64 s gammaloop-nextest-core> 3: gammaloop_api::templates::tests::extract_templates_uses_canonical_package_layout
  167. 25.64 s gammaloop-nextest-core> 4: <gammaloop_api::templates::tests::extract_templates_uses_canonical_package_layout::{closure#0} as core::ops::function::FnOnce<()>>::call_once
  168. 25.64 s gammaloop-nextest-core> note: Some details are omitted, run with `RUST_BACKTRACE=full` for a verbose backtrace.
  169. 25.64 s gammaloop-nextest-core> system-out
  170. 25.64 s gammaloop-nextest-core> running 1 test
  171. 25.64 s gammaloop-nextest-core> test templates::tests::extract_templates_uses_canonical_package_layout ... FAILED
  172. 25.64 s gammaloop-nextest-core>
  173. 25.64 s gammaloop-nextest-core> failures:
  174. 25.64 s gammaloop-nextest-core>
  175. 25.64 s gammaloop-nextest-core> failures:
  176. 25.64 s gammaloop-nextest-core> templates::tests::extract_templates_uses_canonical_package_layout
  177. 25.64 s gammaloop-nextest-core>
  178. 25.64 s gammaloop-nextest-core> test result: FAILED. 0 passed; 1 failed; 0 ignored; 0 measured; 338 filtered out; finished in 0.03s
  179. 25.64 s gammaloop-nextest-core> system-err
  180. 25.64 s gammaloop-nextest-core> thread 'templates::tests::extract_templates_uses_canonical_package_layout' (871) panicked at crates/gammaloop-api/src/templates.rs:99:9:
  181. 25.64 s gammaloop-nextest-core> assertion failed: figure.contains("amplitude-mode")
  182. 25.64 s gammaloop-nextest-core> stack backtrace:
  183. 25.64 s gammaloop-nextest-core> 0: __rustc::rust_begin_unwind
  184. 25.64 s gammaloop-nextest-core> 1: core::panicking::panic_fmt
  185. 25.64 s gammaloop-nextest-core> 2: core::panicking::panic
  186. 25.64 s gammaloop-nextest-core> 3: gammaloop_api::templates::tests::extract_templates_uses_canonical_package_layout
  187. 25.64 s gammaloop-nextest-core> 4: <gammaloop_api::templates::tests::extract_templates_uses_canonical_package_layout::{closure#0} as core::ops::function::FnOnce<()>>::call_once
  188. 25.64 s gammaloop-nextest-core> note: Some details are omitted, run with `RUST_BACKTRACE=full` for a verbose backtrace.
  189. 25.64 s gammaloop-nextest-core> =========================================
  190. 25.65 s gammaloop-nextest-core> Extracting 1 binary and 1 linked path to /build/nextest-archive-5kw878
  191. 25.74 s gammaloop-nextest-core> Extracted 7 files to /build/nextest-archive-5kw878 in 0.08s
  192. 25.75 s gammaloop-nextest-core> ------------
  193. 25.75 s gammaloop-nextest-core> Nextest run ID 947b3323-af1f-4698-9ffd-196a4672e31d with nextest profile: ci_gammaloop
  194. 25.75 s gammaloop-nextest-core> Starting 19 tests across 1 binary
  195. 25.76 s gammaloop-nextest-core> ------------
  196. 25.76 s gammaloop-nextest-core> Summary [ 0.014s] 19 tests run: 19 passed, 0 skipped
  197. 25.81 s gammaloop-nextest-core>
  198. 25.81 s gammaloop-nextest-core> ========== nextest test summary ==========
  199. 25.81 s gammaloop-nextest-core> report: target/nextest/ci_gammaloop/junit.xml
  200. 25.81 s gammaloop-nextest-core> tests: 19, failures: 0, errors: 0
  201. 25.81 s gammaloop-nextest-core> No failing testcases found.
  202. 25.81 s gammaloop-nextest-core> =========================================
  203. 25.83 s gammaloop-nextest-core> Extracting 1 binary to /build/nextest-archive-mScqjw
  204. 25.87 s gammaloop-nextest-core> Extracted 4 files to /build/nextest-archive-mScqjw in 0.04s
  205. 25.88 s gammaloop-nextest-core> ------------
  206. 25.88 s gammaloop-nextest-core> Nextest run ID 840c0053-722d-4e68-a0e3-22ff6c463eef with nextest profile: ci_gammaloop
  207. 25.88 s gammaloop-nextest-core> Starting 0 tests across 1 binary
  208. 25.88 s gammaloop-nextest-core> ------------
  209. 25.88 s gammaloop-nextest-core> Summary [ 0.000s] 0 tests run: 0 passed, 0 skipped
  210. 25.93 s gammaloop-nextest-core>
  211. 25.93 s gammaloop-nextest-core> ========== nextest test summary ==========
  212. 25.93 s gammaloop-nextest-core> report: target/nextest/ci_gammaloop/junit.xml
  213. 25.93 s gammaloop-nextest-core> tests: 0, failures: 0, errors: 0
  214. 25.93 s gammaloop-nextest-core> No failing testcases found.
  215. 25.93 s gammaloop-nextest-core> =========================================
  216. 25.95 s gammaloop-nextest-core> Extracting 4 binaries, 1 build script output directory, and 2 linked paths to /build/nextest-archive-Tz43KM
  217. 26.61 s gammaloop-nextest-core> Extracted 18 files to /build/nextest-archive-Tz43KM in 0.67s
  218. 26.62 s gammaloop-nextest-core> ------------
  219. 26.62 s gammaloop-nextest-core> Nextest run ID 836820cc-4195-47a7-907d-cce6db46c658 with nextest profile: ci_gammaloop
  220. 26.62 s gammaloop-nextest-core> Starting 456 tests across 4 binaries (61 tests skipped, including 60 tests via profile.ci_gammaloop.default-filter)
  221. 27.00 s gammaloop-nextest-core> FAIL [ 0.184s] ( 76/456) gammalooprs graph::parse::tests::parse_lmbsetting_crossection
  222. 27.00 s gammaloop-nextest-core> stdout ---
  223. 27.00 s gammaloop-nextest-core>
  224. 27.00 s gammaloop-nextest-core> running 1 test
  225. 27.00 s gammaloop-nextest-core> ━━━━━━━━━━━━━━━━━━━━━━━━━━━━━━━ Snapshot Summary ━━━━━━━━━━━━━━━━━━━━━━━━━━━━━━━
  226. 27.00 s gammaloop-nextest-core> Snapshot: parse_lmbsetting_crossection
  227. 27.00 s gammaloop-nextest-core> Source: crates/gammalooprs/src/graph/parse/tests.rs:252
  228. 27.00 s gammaloop-nextest-core> ────────────────────────────────────────────────────────────────────────────────
  229. 27.00 s gammaloop-nextest-core> Expression: g.debug_dot()
  230. 27.00 s gammaloop-nextest-core> ────────────────────────────────────────────────────────────────────────────────
  231. 27.00 s gammaloop-nextest-core> -old snapshot
  232. 27.00 s gammaloop-nextest-core> +new results
  233. 27.00 s gammaloop-nextest-core> ────────────┬───────────────────────────────────────────────────────────────────
  234. 27.00 s gammaloop-nextest-core> 1 │-digraph G{
  235. 27.00 s gammaloop-nextest-core> 1 │+digraph G {
  236. 27.00 s gammaloop-nextest-core> 2 2 │ num = "1/2";
  237. 27.00 s gammaloop-nextest-core> 3 3 │ overall_factor = "2*x";
  238. 27.00 s gammaloop-nextest-core> 4 4 │ overall_factor_evaluated = "2*x";
  239. 27.00 s gammaloop-nextest-core> 5 5 │ projector = "spenso::t";
  240. 27.00 s gammaloop-nextest-core> ────────────┴───────────────────────────────────────────────────────────────────
  241. 27.00 s gammaloop-nextest-core> To update snapshots run `cargo insta review`
  242. 27.00 s gammaloop-nextest-core> Stopped on the first failure. Run `cargo insta test` to run all snapshots.
  243. 27.00 s gammaloop-nextest-core> test graph::parse::tests::parse_lmbsetting_crossection ... FAILED
  244. 27.00 s gammaloop-nextest-core>
  245. 27.00 s gammaloop-nextest-core> failures:
  246. 27.00 s gammaloop-nextest-core>
  247. 27.00 s gammaloop-nextest-core> failures:
  248. 27.00 s gammaloop-nextest-core> graph::parse::tests::parse_lmbsetting_crossection
  249. 27.00 s gammaloop-nextest-core>
  250. 27.00 s gammaloop-nextest-core> test result: FAILED. 0 passed; 1 failed; 0 ignored; 0 measured; 508 filtered out; finished in 0.17s
  251. 27.00 s gammaloop-nextest-core>
  252. 27.00 s gammaloop-nextest-core> stderr ---
  253. 27.00 s gammaloop-nextest-core> [21:40:47.785] @gammalooprs::graph::attribute_warnings WARNING : Unknown node attribute 'color_num' on graph 'G', node 'A'; did you mean 'num'?
  254. 27.00 s gammaloop-nextest-core> at crates/gammalooprs/src/graph/attribute_warnings.rs:198
  255. 27.00 s gammaloop-nextest-core> The application panicked (crashed).
  256. 27.00 s gammaloop-nextest-core> Message: snapshot assertion for 'parse_lmbsetting_crossection' failed in line 252
  257. 27.00 s gammaloop-nextest-core> Location: /nix/store/xdy1vvhll2bijdplvl9fcc2b9plkxhaa-vendor-cargo-deps/c19b7c6f923b580ac259164a89f2577984ad5ab09ee9d583b888f934adbbe8d0/insta-1.47.2/src/runtime.rs:719
  258. 27.00 s gammaloop-nextest-core>
  259. 27.00 s gammaloop-nextest-core> ━━━━━━━━━━━━━━━━━━━━━━━━━━━━━━━━━━ BACKTRACE ━━━━━━━━━━━━━━━━━━━━━━━━━━━━━━━━━━━
  260. 27.00 s gammaloop-nextest-core> 1: <color_eyre[b0c9e66060e883b2]::config::PanicHook>::panic_report<unknown>
  261. 27.00 s gammaloop-nextest-core> at <unknown source file>:<unknown line>
  262. 27.00 s gammaloop-nextest-core> 2: <color_eyre[b0c9e66060e883b2]::config::PanicHook>::into_panic_hook::{closure#0}<unknown>
  263. 27.00 s gammaloop-nextest-core> at <unknown source file>:<unknown line>
  264. 27.00 s gammaloop-nextest-core> 3: std[bcb96dfbba0ab899]::panicking::panic_with_hook<unknown>
  265. 27.00 s gammaloop-nextest-core> at <unknown source file>:<unknown line>
  266. 27.00 s gammaloop-nextest-core> 4: std[bcb96dfbba0ab899]::panicking::panic_handler::{closure#0}<unknown>
  267. 27.00 s gammaloop-nextest-core> at <unknown source file>:<unknown line>
  268. 27.00 s gammaloop-nextest-core> 5: std[bcb96dfbba0ab899]::sys::backtrace::__rust_end_short_backtrace::<std[bcb96dfbba0ab899]::panicking::panic_handler::{closure#0}, !><unknown>
  269. 27.01 s gammaloop-nextest-core> at <unknown source file>:<unknown line>
  270. 27.01 s gammaloop-nextest-core> 6: __rustc[6c289b9f9c454d21]::rust_begin_unwind<unknown>
  271. 27.01 s gammaloop-nextest-core> at <unknown source file>:<unknown line>
  272. 27.01 s gammaloop-nextest-core> 7: core[940e698046960fd5]::panicking::panic_fmt<unknown>
  273. 27.01 s gammaloop-nextest-core> at <unknown source file>:<unknown line>
  274. 27.01 s gammaloop-nextest-core> 8: insta[307a548ac79ef4d9]::runtime::assert_snapshot<unknown>
  275. 27.01 s gammaloop-nextest-core> at <unknown source file>:<unknown line>
  276. 27.01 s gammaloop-nextest-core> 9: gammalooprs[5490727360442cce]::graph::parse::tests::parse_lmbsetting_crossection<unknown>
  277. 27.01 s gammaloop-nextest-core> at <unknown source file>:<unknown line>
  278. 27.01 s gammaloop-nextest-core> 10: <gammalooprs[5490727360442cce]::graph::parse::tests::parse_lmbsetting_crossection::{closure#0} as core[940e698046960fd5]::ops::function::FnOnce<()>>::call_once<unknown>
  279. 27.01 s gammaloop-nextest-core> at <unknown source file>:<unknown line>
  280. 27.01 s gammaloop-nextest-core> 11: test[75d6903177b1d7e9]::__rust_begin_short_backtrace::<core[940e698046960fd5]::result::Result<(), alloc[2ea6bcb46fca0c42]::string::String>, fn() -> core[940e698046960fd5]::result::Result<(), alloc[2ea6bcb46fca0c42]::string::String>><unknown>
  281. 27.01 s gammaloop-nextest-core> at <unknown source file>:<unknown line>
  282. 27.01 s gammaloop-nextest-core> 12: test[75d6903177b1d7e9]::run_test::{closure#0}<unknown>
  283. 27.01 s gammaloop-nextest-core> at <unknown source file>:<unknown line>
  284. 27.01 s gammaloop-nextest-core> 13: std[bcb96dfbba0ab899]::sys::backtrace::__rust_begin_short_backtrace::<test[75d6903177b1d7e9]::run_test::{closure#1}, ()><unknown>
  285. 27.01 s gammaloop-nextest-core> at <unknown source file>:<unknown line>
  286. 27.01 s gammaloop-nextest-core> 14: <std[bcb96dfbba0ab899]::thread::lifecycle::spawn_unchecked<test[75d6903177b1d7e9]::run_test::{closure#1}, ()>::{closure#1} as core[940e698046960fd5]::ops::function::FnOnce<()>>::call_once::{shim:vtable#0}<unknown>
  287. 27.01 s gammaloop-nextest-core> at <unknown source file>:<unknown line>
  288. 27.01 s gammaloop-nextest-core> 15: <std[bcb96dfbba0ab899]::sys::thread::unix::Thread>::new::thread_start<unknown>
  289. 27.01 s gammaloop-nextest-core> at <unknown source file>:<unknown line>
  290. 27.01 s gammaloop-nextest-core> 16: start_thread<unknown>
  291. 27.01 s gammaloop-nextest-core> at <unknown source file>:<unknown line>
  292. 27.01 s gammaloop-nextest-core> 17: __clone3<unknown>
  293. 27.01 s gammaloop-nextest-core> at <unknown source file>:<unknown line>
  294. 27.01 s gammaloop-nextest-core>
  295. 27.01 s gammaloop-nextest-core> Run with COLORBT_SHOW_HIDDEN=1 environment variable to disable frame filtering.
  296. 27.01 s gammaloop-nextest-core> Run with RUST_BACKTRACE=full to include source snippets.
  297. 27.01 s gammaloop-nextest-core>
  298. 27.98 s gammaloop-nextest-core> FAIL [ 0.246s] (411/456) gammalooprs uv::export::tests::computed_node_full_numerator_is_a_spenso_aware_typst_fragment
  299. 27.98 s gammaloop-nextest-core> stdout ---
  300. 27.98 s gammaloop-nextest-core>
  301. 27.98 s gammaloop-nextest-core> running 1 test
  302. 27.98 s gammaloop-nextest-core> test uv::export::tests::computed_node_full_numerator_is_a_spenso_aware_typst_fragment ... FAILED
  303. 27.98 s gammaloop-nextest-core>
  304. 27.98 s gammaloop-nextest-core> failures:
  305. 27.98 s gammaloop-nextest-core>
  306. 27.98 s gammaloop-nextest-core> failures:
  307. 27.98 s gammaloop-nextest-core> uv::export::tests::computed_node_full_numerator_is_a_spenso_aware_typst_fragment
  308. 27.98 s gammaloop-nextest-core>
  309. 27.98 s gammaloop-nextest-core> test result: FAILED. 0 passed; 1 failed; 0 ignored; 0 measured; 508 filtered out; finished in 0.22s
  310. 27.98 s gammaloop-nextest-core>
  311. 27.98 s gammaloop-nextest-core> stderr ---
  312. 27.98 s gammaloop-nextest-core> The application panicked (crashed).
  313. 27.98 s gammaloop-nextest-core> Message: assertion failed: exported.dot.contains(r#"full_num = "op(\"Tr\")(1)";"#)
  314. 27.98 s gammaloop-nextest-core> Location: crates/gammalooprs/src/uv/export.rs:483
  315. 27.98 s gammaloop-nextest-core>
  316. 27.98 s gammaloop-nextest-core> ━━━━━━━━━━━━━━━━━━━━━━━━━━━━━━━━━━ BACKTRACE ━━━━━━━━━━━━━━━━━━━━━━━━━━━━━━━━━━━
  317. 27.98 s gammaloop-nextest-core> 1: <color_eyre[b0c9e66060e883b2]::config::PanicHook>::panic_report<unknown>
  318. 27.98 s gammaloop-nextest-core> at <unknown source file>:<unknown line>
  319. 27.98 s gammaloop-nextest-core> 2: <color_eyre[b0c9e66060e883b2]::config::PanicHook>::into_panic_hook::{closure#0}<unknown>
  320. 27.98 s gammaloop-nextest-core> at <unknown source file>:<unknown line>
  321. 27.98 s gammaloop-nextest-core> 3: std[bcb96dfbba0ab899]::panicking::panic_with_hook<unknown>
  322. 27.98 s gammaloop-nextest-core> at <unknown source file>:<unknown line>
  323. 27.98 s gammaloop-nextest-core> 4: std[bcb96dfbba0ab899]::panicking::panic_handler::{closure#0}<unknown>
  324. 27.98 s gammaloop-nextest-core> at <unknown source file>:<unknown line>
  325. 27.98 s gammaloop-nextest-core> 5: std[bcb96dfbba0ab899]::sys::backtrace::__rust_end_short_backtrace::<std[bcb96dfbba0ab899]::panicking::panic_handler::{closure#0}, !><unknown>
  326. 27.98 s gammaloop-nextest-core> at <unknown source file>:<unknown line>
  327. 27.98 s gammaloop-nextest-core> 6: __rustc[6c289b9f9c454d21]::rust_begin_unwind<unknown>
  328. 27.98 s gammaloop-nextest-core> at <unknown source file>:<unknown line>
  329. 27.98 s gammaloop-nextest-core> 7: core[940e698046960fd5]::panicking::panic_fmt<unknown>
  330. 27.98 s gammaloop-nextest-core> at <unknown source file>:<unknown line>
  331. 27.98 s gammaloop-nextest-core> 8: core[940e698046960fd5]::panicking::panic<unknown>
  332. 27.98 s gammaloop-nextest-core> at <unknown source file>:<unknown line>
  333. 27.98 s gammaloop-nextest-core> 9: gammalooprs[5490727360442cce]::uv::export::tests::computed_node_full_numerator_is_a_spenso_aware_typst_fragment<unknown>
  334. 27.98 s gammaloop-nextest-core> at <unknown source file>:<unknown line>
  335. 27.98 s gammaloop-nextest-core> 10: <gammalooprs[5490727360442cce]::uv::export::tests::computed_node_full_numerator_is_a_spenso_aware_typst_fragment::{closure#0} as core[940e698046960fd5]::ops::function::FnOnce<()>>::call_once<unknown>
  336. 27.98 s gammaloop-nextest-core> at <unknown source file>:<unknown line>
  337. 27.98 s gammaloop-nextest-core> 11: test[75d6903177b1d7e9]::__rust_begin_short_backtrace::<core[940e698046960fd5]::result::Result<(), alloc[2ea6bcb46fca0c42]::string::String>, fn() -> core[940e698046960fd5]::result::Result<(), alloc[2ea6bcb46fca0c42]::string::String>><unknown>
  338. 27.98 s gammaloop-nextest-core> at <unknown source file>:<unknown line>
  339. 27.98 s gammaloop-nextest-core> 12: test[75d6903177b1d7e9]::run_test::{closure#0}<unknown>
  340. 27.98 s gammaloop-nextest-core> at <unknown source file>:<unknown line>
  341. 27.98 s gammaloop-nextest-core> 13: std[bcb96dfbba0ab899]::sys::backtrace::__rust_begin_short_backtrace::<test[75d6903177b1d7e9]::run_test::{closure#1}, ()><unknown>
  342. 27.98 s gammaloop-nextest-core> at <unknown source file>:<unknown line>
  343. 27.98 s gammaloop-nextest-core> 14: <std[bcb96dfbba0ab899]::thread::lifecycle::spawn_unchecked<test[75d6903177b1d7e9]::run_test::{closure#1}, ()>::{closure#1} as core[940e698046960fd5]::ops::function::FnOnce<()>>::call_once::{shim:vtable#0}<unknown>
  344. 27.98 s gammaloop-nextest-core> at <unknown source file>:<unknown line>
  345. 27.98 s gammaloop-nextest-core> 15: <std[bcb96dfbba0ab899]::sys::thread::unix::Thread>::new::thread_start<unknown>
  346. 27.98 s gammaloop-nextest-core> at <unknown source file>:<unknown line>
  347. 27.98 s gammaloop-nextest-core> 16: start_thread<unknown>
  348. 27.98 s gammaloop-nextest-core> at <unknown source file>:<unknown line>
  349. 27.98 s gammaloop-nextest-core> 17: __clone3<unknown>
  350. 27.98 s gammaloop-nextest-core> at <unknown source file>:<unknown line>
  351. 27.98 s gammaloop-nextest-core>
  352. 27.98 s gammaloop-nextest-core> Run with COLORBT_SHOW_HIDDEN=1 environment variable to disable frame filtering.
  353. 27.98 s gammaloop-nextest-core> Run with RUST_BACKTRACE=full to include source snippets.
  354. 27.98 s gammaloop-nextest-core>
  355. 41.01 s gammaloop-nextest-core> ------------
  356. 41.02 s gammaloop-nextest-core> Summary [ 14.383s] 456 tests run: 454 passed, 2 failed, 61 skipped
  357. 41.02 s gammaloop-nextest-core> FAIL [ 0.184s] ( 76/456) gammalooprs graph::parse::tests::parse_lmbsetting_crossection
  358. 41.02 s gammaloop-nextest-core> stdout ---
  359. 41.02 s gammaloop-nextest-core>
  360. 41.02 s gammaloop-nextest-core> running 1 test
  361. 41.02 s gammaloop-nextest-core> ━━━━━━━━━━━━━━━━━━━━━━━━━━━━━━━ Snapshot Summary ━━━━━━━━━━━━━━━━━━━━━━━━━━━━━━━
  362. 41.02 s gammaloop-nextest-core> Snapshot: parse_lmbsetting_crossection
  363. 41.02 s gammaloop-nextest-core> Source: crates/gammalooprs/src/graph/parse/tests.rs:252
  364. 41.02 s gammaloop-nextest-core> ────────────────────────────────────────────────────────────────────────────────
  365. 41.02 s gammaloop-nextest-core> Expression: g.debug_dot()
  366. 41.02 s gammaloop-nextest-core> ────────────────────────────────────────────────────────────────────────────────
  367. 41.02 s gammaloop-nextest-core> -old snapshot
  368. 41.02 s gammaloop-nextest-core> +new results
  369. 41.02 s gammaloop-nextest-core> ────────────┬───────────────────────────────────────────────────────────────────
  370. 41.02 s gammaloop-nextest-core> 1 │-digraph G{
  371. 41.02 s gammaloop-nextest-core> 1 │+digraph G {
  372. 41.02 s gammaloop-nextest-core> 2 2 │ num = "1/2";
  373. 41.02 s gammaloop-nextest-core> 3 3 │ overall_factor = "2*x";
  374. 41.02 s gammaloop-nextest-core> 4 4 │ overall_factor_evaluated = "2*x";
  375. 41.02 s gammaloop-nextest-core> 5 5 │ projector = "spenso::t";
  376. 41.02 s gammaloop-nextest-core> ────────────┴───────────────────────────────────────────────────────────────────
  377. 41.02 s gammaloop-nextest-core> To update snapshots run `cargo insta review`
  378. 41.02 s gammaloop-nextest-core> Stopped on the first failure. Run `cargo insta test` to run all snapshots.
  379. 41.02 s gammaloop-nextest-core> test graph::parse::tests::parse_lmbsetting_crossection ... FAILED
  380. 41.02 s gammaloop-nextest-core>
  381. 41.02 s gammaloop-nextest-core> failures:
  382. 41.02 s gammaloop-nextest-core>
  383. 41.02 s gammaloop-nextest-core> failures:
  384. 41.02 s gammaloop-nextest-core> graph::parse::tests::parse_lmbsetting_crossection
  385. 41.02 s gammaloop-nextest-core>
  386. 41.02 s gammaloop-nextest-core> test result: FAILED. 0 passed; 1 failed; 0 ignored; 0 measured; 508 filtered out; finished in 0.17s
  387. 41.02 s gammaloop-nextest-core>
  388. 41.02 s gammaloop-nextest-core> stderr ---
  389. 41.02 s gammaloop-nextest-core> [21:40:47.785] @gammalooprs::graph::attribute_warnings WARNING : Unknown node attribute 'color_num' on graph 'G', node 'A'; did you mean 'num'?
  390. 41.02 s gammaloop-nextest-core> at crates/gammalooprs/src/graph/attribute_warnings.rs:198
  391. 41.02 s gammaloop-nextest-core> The application panicked (crashed).
  392. 41.02 s gammaloop-nextest-core> Message: snapshot assertion for 'parse_lmbsetting_crossection' failed in line 252
  393. 41.02 s gammaloop-nextest-core> Location: /nix/store/xdy1vvhll2bijdplvl9fcc2b9plkxhaa-vendor-cargo-deps/c19b7c6f923b580ac259164a89f2577984ad5ab09ee9d583b888f934adbbe8d0/insta-1.47.2/src/runtime.rs:719
  394. 41.02 s gammaloop-nextest-core>
  395. 41.02 s gammaloop-nextest-core> ━━━━━━━━━━━━━━━━━━━━━━━━━━━━━━━━━━ BACKTRACE ━━━━━━━━━━━━━━━━━━━━━━━━━━━━━━━━━━━
  396. 41.02 s gammaloop-nextest-core> 1: <color_eyre[b0c9e66060e883b2]::config::PanicHook>::panic_report<unknown>
  397. 41.02 s gammaloop-nextest-core> at <unknown source file>:<unknown line>
  398. 41.02 s gammaloop-nextest-core> 2: <color_eyre[b0c9e66060e883b2]::config::PanicHook>::into_panic_hook::{closure#0}<unknown>
  399. 41.02 s gammaloop-nextest-core> at <unknown source file>:<unknown line>
  400. 41.02 s gammaloop-nextest-core> 3: std[bcb96dfbba0ab899]::panicking::panic_with_hook<unknown>
  401. 41.02 s gammaloop-nextest-core> at <unknown source file>:<unknown line>
  402. 41.02 s gammaloop-nextest-core> 4: std[bcb96dfbba0ab899]::panicking::panic_handler::{closure#0}<unknown>
  403. 41.02 s gammaloop-nextest-core> at <unknown source file>:<unknown line>
  404. 41.02 s gammaloop-nextest-core> 5: std[bcb96dfbba0ab899]::sys::backtrace::__rust_end_short_backtrace::<std[bcb96dfbba0ab899]::panicking::panic_handler::{closure#0}, !><unknown>
  405. 41.02 s gammaloop-nextest-core> at <unknown source file>:<unknown line>
  406. 41.02 s gammaloop-nextest-core> 6: __rustc[6c289b9f9c454d21]::rust_begin_unwind<unknown>
  407. 41.02 s gammaloop-nextest-core> at <unknown source file>:<unknown line>
  408. 41.02 s gammaloop-nextest-core> 7: core[940e698046960fd5]::panicking::panic_fmt<unknown>
  409. 41.02 s gammaloop-nextest-core> at <unknown source file>:<unknown line>
  410. 41.02 s gammaloop-nextest-core> 8: insta[307a548ac79ef4d9]::runtime::assert_snapshot<unknown>
  411. 41.02 s gammaloop-nextest-core> at <unknown source file>:<unknown line>
  412. 41.02 s gammaloop-nextest-core> 9: gammalooprs[5490727360442cce]::graph::parse::tests::parse_lmbsetting_crossection<unknown>
  413. 41.02 s gammaloop-nextest-core> at <unknown source file>:<unknown line>
  414. 41.02 s gammaloop-nextest-core> 10: <gammalooprs[5490727360442cce]::graph::parse::tests::parse_lmbsetting_crossection::{closure#0} as core[940e698046960fd5]::ops::function::FnOnce<()>>::call_once<unknown>
  415. 41.02 s gammaloop-nextest-core> at <unknown source file>:<unknown line>
  416. 41.02 s gammaloop-nextest-core> 11: test[75d6903177b1d7e9]::__rust_begin_short_backtrace::<core[940e698046960fd5]::result::Result<(), alloc[2ea6bcb46fca0c42]::string::String>, fn() -> core[940e698046960fd5]::result::Result<(), alloc[2ea6bcb46fca0c42]::string::String>><unknown>
  417. 41.02 s gammaloop-nextest-core> at <unknown source file>:<unknown line>
  418. 41.02 s gammaloop-nextest-core> 12: test[75d6903177b1d7e9]::run_test::{closure#0}<unknown>
  419. 41.02 s gammaloop-nextest-core> at <unknown source file>:<unknown line>
  420. 41.02 s gammaloop-nextest-core> 13: std[bcb96dfbba0ab899]::sys::backtrace::__rust_begin_short_backtrace::<test[75d6903177b1d7e9]::run_test::{closure#1}, ()><unknown>
  421. 41.02 s gammaloop-nextest-core> at <unknown source file>:<unknown line>
  422. 41.02 s gammaloop-nextest-core> 14: <std[bcb96dfbba0ab899]::thread::lifecycle::spawn_unchecked<test[75d6903177b1d7e9]::run_test::{closure#1}, ()>::{closure#1} as core[940e698046960fd5]::ops::function::FnOnce<()>>::call_once::{shim:vtable#0}<unknown>
  423. 41.02 s gammaloop-nextest-core> at <unknown source file>:<unknown line>
  424. 41.02 s gammaloop-nextest-core> 15: <std[bcb96dfbba0ab899]::sys::thread::unix::Thread>::new::thread_start<unknown>
  425. 41.02 s gammaloop-nextest-core> at <unknown source file>:<unknown line>
  426. 41.02 s gammaloop-nextest-core> 16: start_thread<unknown>
  427. 41.02 s gammaloop-nextest-core> at <unknown source file>:<unknown line>
  428. 41.02 s gammaloop-nextest-core> 17: __clone3<unknown>
  429. 41.02 s gammaloop-nextest-core> at <unknown source file>:<unknown line>
  430. 41.02 s gammaloop-nextest-core>
  431. 41.02 s gammaloop-nextest-core> Run with COLORBT_SHOW_HIDDEN=1 environment variable to disable frame filtering.
  432. 41.02 s gammaloop-nextest-core> Run with RUST_BACKTRACE=full to include source snippets.
  433. 41.02 s gammaloop-nextest-core>
  434. 41.02 s gammaloop-nextest-core> FAIL [ 0.246s] (411/456) gammalooprs uv::export::tests::computed_node_full_numerator_is_a_spenso_aware_typst_fragment
  435. 41.02 s gammaloop-nextest-core> stdout ---
  436. 41.02 s gammaloop-nextest-core>
  437. 41.02 s gammaloop-nextest-core> running 1 test
  438. 41.02 s gammaloop-nextest-core> test uv::export::tests::computed_node_full_numerator_is_a_spenso_aware_typst_fragment ... FAILED
  439. 41.02 s gammaloop-nextest-core>
  440. 41.02 s gammaloop-nextest-core> failures:
  441. 41.02 s gammaloop-nextest-core>
  442. 41.02 s gammaloop-nextest-core> failures:
  443. 41.02 s gammaloop-nextest-core> uv::export::tests::computed_node_full_numerator_is_a_spenso_aware_typst_fragment
  444. 41.02 s gammaloop-nextest-core>
  445. 41.02 s gammaloop-nextest-core> test result: FAILED. 0 passed; 1 failed; 0 ignored; 0 measured; 508 filtered out; finished in 0.22s
  446. 41.02 s gammaloop-nextest-core>
  447. 41.02 s gammaloop-nextest-core> stderr ---
  448. 41.02 s gammaloop-nextest-core> The application panicked (crashed).
  449. 41.02 s gammaloop-nextest-core> Message: assertion failed: exported.dot.contains(r#"full_num = "op(\"Tr\")(1)";"#)
  450. 41.02 s gammaloop-nextest-core> Location: crates/gammalooprs/src/uv/export.rs:483
  451. 41.02 s gammaloop-nextest-core>
  452. 41.02 s gammaloop-nextest-core> ━━━━━━━━━━━━━━━━━━━━━━━━━━━━━━━━━━ BACKTRACE ━━━━━━━━━━━━━━━━━━━━━━━━━━━━━━━━━━━
  453. 41.02 s gammaloop-nextest-core> 1: <color_eyre[b0c9e66060e883b2]::config::PanicHook>::panic_report<unknown>
  454. 41.02 s gammaloop-nextest-core> at <unknown source file>:<unknown line>
  455. 41.02 s gammaloop-nextest-core> 2: <color_eyre[b0c9e66060e883b2]::config::PanicHook>::into_panic_hook::{closure#0}<unknown>
  456. 41.02 s gammaloop-nextest-core> at <unknown source file>:<unknown line>
  457. 41.02 s gammaloop-nextest-core> 3: std[bcb96dfbba0ab899]::panicking::panic_with_hook<unknown>
  458. 41.02 s gammaloop-nextest-core> at <unknown source file>:<unknown line>
  459. 41.02 s gammaloop-nextest-core> 4: std[bcb96dfbba0ab899]::panicking::panic_handler::{closure#0}<unknown>
  460. 41.02 s gammaloop-nextest-core> at <unknown source file>:<unknown line>
  461. 41.02 s gammaloop-nextest-core> 5: std[bcb96dfbba0ab899]::sys::backtrace::__rust_end_short_backtrace::<std[bcb96dfbba0ab899]::panicking::panic_handler::{closure#0}, !><unknown>
  462. 41.02 s gammaloop-nextest-core> at <unknown source file>:<unknown line>
  463. 41.02 s gammaloop-nextest-core> 6: __rustc[6c289b9f9c454d21]::rust_begin_unwind<unknown>
  464. 41.02 s gammaloop-nextest-core> at <unknown source file>:<unknown line>
  465. 41.02 s gammaloop-nextest-core> 7: core[940e698046960fd5]::panicking::panic_fmt<unknown>
  466. 41.02 s gammaloop-nextest-core> at <unknown source file>:<unknown line>
  467. 41.02 s gammaloop-nextest-core> 8: core[940e698046960fd5]::panicking::panic<unknown>
  468. 41.02 s gammaloop-nextest-core> at <unknown source file>:<unknown line>
  469. 41.02 s gammaloop-nextest-core> 9: gammalooprs[5490727360442cce]::uv::export::tests::computed_node_full_numerator_is_a_spenso_aware_typst_fragment<unknown>
  470. 41.02 s gammaloop-nextest-core> at <unknown source file>:<unknown line>
  471. 41.02 s gammaloop-nextest-core> 10: <gammalooprs[5490727360442cce]::uv::export::tests::computed_node_full_numerator_is_a_spenso_aware_typst_fragment::{closure#0} as core[940e698046960fd5]::ops::function::FnOnce<()>>::call_once<unknown>
  472. 41.02 s gammaloop-nextest-core> at <unknown source file>:<unknown line>
  473. 41.02 s gammaloop-nextest-core> 11: test[75d6903177b1d7e9]::__rust_begin_short_backtrace::<core[940e698046960fd5]::result::Result<(), alloc[2ea6bcb46fca0c42]::string::String>, fn() -> core[940e698046960fd5]::result::Result<(), alloc[2ea6bcb46fca0c42]::string::String>><unknown>
  474. 41.02 s gammaloop-nextest-core> at <unknown source file>:<unknown line>
  475. 41.02 s gammaloop-nextest-core> 12: test[75d6903177b1d7e9]::run_test::{closure#0}<unknown>
  476. 41.02 s gammaloop-nextest-core> at <unknown source file>:<unknown line>
  477. 41.02 s gammaloop-nextest-core> 13: std[bcb96dfbba0ab899]::sys::backtrace::__rust_begin_short_backtrace::<test[75d6903177b1d7e9]::run_test::{closure#1}, ()><unknown>
  478. 41.02 s gammaloop-nextest-core> at <unknown source file>:<unknown line>
  479. 41.02 s gammaloop-nextest-core> 14: <std[bcb96dfbba0ab899]::thread::lifecycle::spawn_unchecked<test[75d6903177b1d7e9]::run_test::{closure#1}, ()>::{closure#1} as core[940e698046960fd5]::ops::function::FnOnce<()>>::call_once::{shim:vtable#0}<unknown>
  480. 41.02 s gammaloop-nextest-core> at <unknown source file>:<unknown line>
  481. 41.02 s gammaloop-nextest-core> 15: <std[bcb96dfbba0ab899]::sys::thread::unix::Thread>::new::thread_start<unknown>
  482. 41.02 s gammaloop-nextest-core> at <unknown source file>:<unknown line>
  483. 41.02 s gammaloop-nextest-core> 16: start_thread<unknown>
  484. 41.02 s gammaloop-nextest-core> at <unknown source file>:<unknown line>
  485. 41.02 s gammaloop-nextest-core> 17: __clone3<unknown>
  486. 41.02 s gammaloop-nextest-core> at <unknown source file>:<unknown line>
  487. 41.02 s gammaloop-nextest-core>
  488. 41.02 s gammaloop-nextest-core> Run with COLORBT_SHOW_HIDDEN=1 environment variable to disable frame filtering.
  489. 41.02 s gammaloop-nextest-core> Run with RUST_BACKTRACE=full to include source snippets.
  490. 41.02 s gammaloop-nextest-core>
  491. 41.11 s gammaloop-nextest-core> error: test run failed
  492. 41.16 s gammaloop-nextest-core>
  493. 41.16 s gammaloop-nextest-core> ========== nextest test summary ==========
  494. 41.16 s gammaloop-nextest-core> report: target/nextest/ci_gammaloop/junit.xml
  495. 41.16 s gammaloop-nextest-core> tests: 456, failures: 2, errors: 0
  496. 41.16 s gammaloop-nextest-core>
  497. 41.16 s gammaloop-nextest-core> 1. gammalooprs::graph::parse::tests::parse_lmbsetting_crossection
  498. 41.16 s gammaloop-nextest-core> failure: test failure with exit code 101
  499. 41.16 s gammaloop-nextest-core> system-out
  500. 41.16 s gammaloop-nextest-core> running 1 test
  501. 41.16 s gammaloop-nextest-core> ━━━━━━━━━━━━━━━━━━━━━━━━━━━━━━━ Snapshot Summary ━━━━━━━━━━━━━━━━━━━━━━━━━━━━━━━
  502. 41.16 s gammaloop-nextest-core> Snapshot: parse_lmbsetting_crossection
  503. 41.16 s gammaloop-nextest-core> Source: crates/gammalooprs/src/graph/parse/tests.rs:252
  504. 41.16 s gammaloop-nextest-core> ────────────────────────────────────────────────────────────────────────────────
  505. 41.16 s gammaloop-nextest-core> Expression: g.debug_dot()
  506. 41.16 s gammaloop-nextest-core> ────────────────────────────────────────────────────────────────────────────────
  507. 41.16 s gammaloop-nextest-core> -old snapshot
  508. 41.16 s gammaloop-nextest-core> +new results
  509. 41.16 s gammaloop-nextest-core> ────────────┬───────────────────────────────────────────────────────────────────
  510. 41.16 s gammaloop-nextest-core> 1 │-digraph G{
  511. 41.16 s gammaloop-nextest-core> 1 │+digraph G {
  512. 41.16 s gammaloop-nextest-core> 2 2 │ num = "1/2";
  513. 41.16 s gammaloop-nextest-core> 3 3 │ overall_factor = "2*x";
  514. 41.16 s gammaloop-nextest-core> 4 4 │ overall_factor_evaluated = "2*x";
  515. 41.16 s gammaloop-nextest-core> 5 5 │ projector = "spenso::t";
  516. 41.16 s gammaloop-nextest-core> ────────────┴───────────────────────────────────────────────────────────────────
  517. 41.16 s gammaloop-nextest-core> To update snapshots run `cargo insta review`
  518. 41.16 s gammaloop-nextest-core> Stopped on the first failure. Run `cargo insta test` to run all snapshots.
  519. 41.16 s gammaloop-nextest-core> test graph::parse::tests::parse_lmbsetting_crossection ... FAILED
  520. 41.16 s gammaloop-nextest-core>
  521. 41.16 s gammaloop-nextest-core> failures:
  522. 41.16 s gammaloop-nextest-core>
  523. 41.16 s gammaloop-nextest-core> failures:
  524. 41.16 s gammaloop-nextest-core> graph::parse::tests::parse_lmbsetting_crossection
  525. 41.16 s gammaloop-nextest-core>
  526. 41.16 s gammaloop-nextest-core> test result: FAILED. 0 passed; 1 failed; 0 ignored; 0 measured; 508 filtered out; finished in 0.17s
  527. 41.16 s gammaloop-nextest-core> system-err
  528. 41.16 s gammaloop-nextest-core> [21:40:47.785] @gammalooprs::graph::attribute_warnings WARNING : Unknown node attribute 'color_num' on graph 'G', node 'A'; did you mean 'num'?
  529. 41.16 s gammaloop-nextest-core> at crates/gammalooprs/src/graph/attribute_warnings.rs:198
  530. 41.16 s gammaloop-nextest-core> The application panicked (crashed).
  531. 41.16 s gammaloop-nextest-core> Message: snapshot assertion for 'parse_lmbsetting_crossection' failed in line 252
  532. 41.16 s gammaloop-nextest-core> Location: /nix/store/xdy1vvhll2bijdplvl9fcc2b9plkxhaa-vendor-cargo-deps/c19b7c6f923b580ac259164a89f2577984ad5ab09ee9d583b888f934adbbe8d0/insta-1.47.2/src/runtime.rs:719
  533. 41.16 s gammaloop-nextest-core>
  534. 41.16 s gammaloop-nextest-core> ━━━━━━━━━━━━━━━━━━━━━━━━━━━━━━━━━━ BACKTRACE ━━━━━━━━━━━━━━━━━━━━━━━━━━━━━━━━━━━
  535. 41.16 s gammaloop-nextest-core> 1: <color_eyre[b0c9e66060e883b2]::config::PanicHook>::panic_report<unknown>
  536. 41.16 s gammaloop-nextest-core> at <unknown source file>:<unknown line>
  537. 41.16 s gammaloop-nextest-core> 2: <color_eyre[b0c9e66060e883b2]::config::PanicHook>::into_panic_hook::{closure#0}<unknown>
  538. 41.16 s gammaloop-nextest-core> at <unknown source file>:<unknown line>
  539. 41.16 s gammaloop-nextest-core> 3: std[bcb96dfbba0ab899]::panicking::panic_with_hook<unknown>
  540. 41.16 s gammaloop-nextest-core> at <unknown source file>:<unknown line>
  541. 41.16 s gammaloop-nextest-core> 4: std[bcb96dfbba0ab899]::panicking::panic_handler::{closure#0}<unknown>
  542. 41.16 s gammaloop-nextest-core> at <unknown source file>:<unknown line>
  543. 41.16 s gammaloop-nextest-core> 5: std[bcb96dfbba0ab899]::sys::backtrace::__rust_end_short_backtrace::<std[bcb96dfbba0ab899]::panicking::panic_handler::{closure#0}, !><unknown>
  544. 41.16 s gammaloop-nextest-core> at <unknown source file>:<unknown line>
  545. 41.16 s gammaloop-nextest-core> 6: __rustc[6c289b9f9c454d21]::rust_begin_unwind<unknown>
  546. 41.16 s gammaloop-nextest-core> at <unknown source file>:<unknown line>
  547. 41.16 s gammaloop-nextest-core> 7: core[940e698046960fd5]::panicking::panic_fmt<unknown>
  548. 41.16 s gammaloop-nextest-core> at <unknown source file>:<unknown line>
  549. 41.16 s gammaloop-nextest-core> 8: insta[307a548ac79ef4d9]::runtime::assert_snapshot<unknown>
  550. 41.16 s gammaloop-nextest-core> at <unknown source file>:<unknown line>
  551. 41.16 s gammaloop-nextest-core> 9: gammalooprs[5490727360442cce]::graph::parse::tests::parse_lmbsetting_crossection<unknown>
  552. 41.16 s gammaloop-nextest-core> at <unknown source file>:<unknown line>
  553. 41.16 s gammaloop-nextest-core> 10: <gammalooprs[5490727360442cce]::graph::parse::tests::parse_lmbsetting_crossection::{closure#0} as core[940e698046960fd5]::ops::function::FnOnce<()>>::call_once<unknown>
  554. 41.16 s gammaloop-nextest-core> at <unknown source file>:<unknown line>
  555. 41.16 s gammaloop-nextest-core> 11: test[75d6903177b1d7e9]::__rust_begin_short_backtrace::<core[940e698046960fd5]::result::Result<(), alloc[2ea6bcb46fca0c42]::string::String>, fn() -> core[940e698046960fd5]::result::Result<(), alloc[2ea6bcb46fca0c42]::string::String>><unknown>
  556. 41.16 s gammaloop-nextest-core> at <unknown source file>:<unknown line>
  557. 41.16 s gammaloop-nextest-core> 12: test[75d6903177b1d7e9]::run_test::{closure#0}<unknown>
  558. 41.16 s gammaloop-nextest-core> at <unknown source file>:<unknown line>
  559. 41.16 s gammaloop-nextest-core> 13: std[bcb96dfbba0ab899]::sys::backtrace::__rust_begin_short_backtrace::<test[75d6903177b1d7e9]::run_test::{closure#1}, ()><unknown>
  560. 41.16 s gammaloop-nextest-core> at <unknown source file>:<unknown line>
  561. 41.16 s gammaloop-nextest-core> 14: <std[bcb96dfbba0ab899]::thread::lifecycle::spawn_unchecked<test[75d6903177b1d7e9]::run_test::{closure#1}, ()>::{closure#1} as core[940e698046960fd5]::ops::function::FnOnce<()>>::call_once::{shim:vtable#0}<unknown>
  562. 41.16 s gammaloop-nextest-core> at <unknown source file>:<unknown line>
  563. 41.16 s gammaloop-nextest-core> 15: <std[bcb96dfbba0ab899]::sys::thread::unix::Thread>::new::thread_start<unknown>
  564. 41.16 s gammaloop-nextest-core> at <unknown source file>:<unknown line>
  565. 41.16 s gammaloop-nextest-core> 16: start_thread<unknown>
  566. 41.16 s gammaloop-nextest-core> at <unknown source file>:<unknown line>
  567. 41.16 s gammaloop-nextest-core> 17: __clone3<unknown>
  568. 41.16 s gammaloop-nextest-core> at <unknown source file>:<unknown line>
  569. 41.16 s gammaloop-nextest-core>
  570. 41.16 s gammaloop-nextest-core> Run with COLORBT_SHOW_HIDDEN=1 environment variable to disable frame filtering.
  571. 41.16 s gammaloop-nextest-core> Run with RUST_BACKTRACE=full to include source snippets.
  572. 41.16 s gammaloop-nextest-core>
  573. 41.16 s gammaloop-nextest-core> 2. gammalooprs::uv::export::tests::computed_node_full_numerator_is_a_spenso_aware_typst_fragment
  574. 41.16 s gammaloop-nextest-core> failure: test failure with exit code 101
  575. 41.16 s gammaloop-nextest-core> system-out
  576. 41.16 s gammaloop-nextest-core> running 1 test
  577. 41.16 s gammaloop-nextest-core> test uv::export::tests::computed_node_full_numerator_is_a_spenso_aware_typst_fragment ... FAILED
  578. 41.16 s gammaloop-nextest-core>
  579. 41.16 s gammaloop-nextest-core> failures:
  580. 41.16 s gammaloop-nextest-core>
  581. 41.16 s gammaloop-nextest-core> failures:
  582. 41.16 s gammaloop-nextest-core> uv::export::tests::computed_node_full_numerator_is_a_spenso_aware_typst_fragment
  583. 41.16 s gammaloop-nextest-core>
  584. 41.16 s gammaloop-nextest-core> test result: FAILED. 0 passed; 1 failed; 0 ignored; 0 measured; 508 filtered out; finished in 0.22s
  585. 41.16 s gammaloop-nextest-core> system-err
  586. 41.16 s gammaloop-nextest-core> The application panicked (crashed).
  587. 41.16 s gammaloop-nextest-core> Message: assertion failed: exported.dot.contains(r#"full_num = "op(\"Tr\")(1)";"#)
  588. 41.16 s gammaloop-nextest-core> Location: crates/gammalooprs/src/uv/export.rs:483
  589. 41.16 s gammaloop-nextest-core>
  590. 41.16 s gammaloop-nextest-core> ━━━━━━━━━━━━━━━━━━━━━━━━━━━━━━━━━━ BACKTRACE ━━━━━━━━━━━━━━━━━━━━━━━━━━━━━━━━━━━
  591. 41.16 s gammaloop-nextest-core> 1: <color_eyre[b0c9e66060e883b2]::config::PanicHook>::panic_report<unknown>
  592. 41.16 s gammaloop-nextest-core> at <unknown source file>:<unknown line>
  593. 41.16 s gammaloop-nextest-core> 2: <color_eyre[b0c9e66060e883b2]::config::PanicHook>::into_panic_hook::{closure#0}<unknown>
  594. 41.16 s gammaloop-nextest-core> at <unknown source file>:<unknown line>
  595. 41.16 s gammaloop-nextest-core> 3: std[bcb96dfbba0ab899]::panicking::panic_with_hook<unknown>
  596. 41.16 s gammaloop-nextest-core> at <unknown source file>:<unknown line>
  597. 41.16 s gammaloop-nextest-core> 4: std[bcb96dfbba0ab899]::panicking::panic_handler::{closure#0}<unknown>
  598. 41.16 s gammaloop-nextest-core> at <unknown source file>:<unknown line>
  599. 41.16 s gammaloop-nextest-core> 5: std[bcb96dfbba0ab899]::sys::backtrace::__rust_end_short_backtrace::<std[bcb96dfbba0ab899]::panicking::panic_handler::{closure#0}, !><unknown>
  600. 41.16 s gammaloop-nextest-core> at <unknown source file>:<unknown line>
  601. 41.16 s gammaloop-nextest-core> 6: __rustc[6c289b9f9c454d21]::rust_begin_unwind<unknown>
  602. 41.16 s gammaloop-nextest-core> at <unknown source file>:<unknown line>
  603. 41.16 s gammaloop-nextest-core> 7: core[940e698046960fd5]::panicking::panic_fmt<unknown>
  604. 41.16 s gammaloop-nextest-core> at <unknown source file>:<unknown line>
  605. 41.16 s gammaloop-nextest-core> 8: core[940e698046960fd5]::panicking::panic<unknown>
  606. 41.16 s gammaloop-nextest-core> at <unknown source file>:<unknown line>
  607. 41.16 s gammaloop-nextest-core> 9: gammalooprs[5490727360442cce]::uv::export::tests::computed_node_full_numerator_is_a_spenso_aware_typst_fragment<unknown>
  608. 41.16 s gammaloop-nextest-core> at <unknown source file>:<unknown line>
  609. 41.16 s gammaloop-nextest-core> 10: <gammalooprs[5490727360442cce]::uv::export::tests::computed_node_full_numerator_is_a_spenso_aware_typst_fragment::{closure#0} as core[940e698046960fd5]::ops::function::FnOnce<()>>::call_once<unknown>
  610. 41.16 s gammaloop-nextest-core> at <unknown source file>:<unknown line>
  611. 41.16 s gammaloop-nextest-core> 11: test[75d6903177b1d7e9]::__rust_begin_short_backtrace::<core[940e698046960fd5]::result::Result<(), alloc[2ea6bcb46fca0c42]::string::String>, fn() -> core[940e698046960fd5]::result::Result<(), alloc[2ea6bcb46fca0c42]::string::String>><unknown>
  612. 41.16 s gammaloop-nextest-core> at <unknown source file>:<unknown line>
  613. 41.16 s gammaloop-nextest-core> 12: test[75d6903177b1d7e9]::run_test::{closure#0}<unknown>
  614. 41.16 s gammaloop-nextest-core> at <unknown source file>:<unknown line>
  615. 41.16 s gammaloop-nextest-core> 13: std[bcb96dfbba0ab899]::sys::backtrace::__rust_begin_short_backtrace::<test[75d6903177b1d7e9]::run_test::{closure#1}, ()><unknown>
  616. 41.16 s gammaloop-nextest-core> at <unknown source file>:<unknown line>
  617. 41.16 s gammaloop-nextest-core> 14: <std[bcb96dfbba0ab899]::thread::lifecycle::spawn_unchecked<test[75d6903177b1d7e9]::run_test::{closure#1}, ()>::{closure#1} as core[940e698046960fd5]::ops::function::FnOnce<()>>::call_once::{shim:vtable#0}<unknown>
  618. 41.16 s gammaloop-nextest-core> at <unknown source file>:<unknown line>
  619. 41.16 s gammaloop-nextest-core> 15: <std[bcb96dfbba0ab899]::sys::thread::unix::Thread>::new::thread_start<unknown>
  620. 41.16 s gammaloop-nextest-core> at <unknown source file>:<unknown line>
  621. 41.16 s gammaloop-nextest-core> 16: start_thread<unknown>
  622. 41.16 s gammaloop-nextest-core> at <unknown source file>:<unknown line>
  623. 41.16 s gammaloop-nextest-core> 17: __clone3<unknown>
  624. 41.16 s gammaloop-nextest-core> at <unknown source file>:<unknown line>
  625. 41.16 s gammaloop-nextest-core>
  626. 41.16 s gammaloop-nextest-core> Run with COLORBT_SHOW_HIDDEN=1 environment variable to disable frame filtering.
  627. 41.16 s gammaloop-nextest-core> Run with RUST_BACKTRACE=full to include source snippets.
  628. 41.16 s gammaloop-nextest-core> =========================================
  629. 41.46 s error: Cannot build '/nix/store/07lma8g6p1n7jxf8azmxf90ca6pqjydj-gammaloop-nextest-core.drv'.
  630. 41.46 s Reason: builder failed with exit code 100.
  631. 41.46 s Output paths:
  632. 41.46 s /nix/store/cb0qr129ypswd8fgpp9k932nrjfvk3s0-gammaloop-nextest-core
  633. 41.46 s Last 612 log lines:
  634. 41.46 s > Extracting 3 binaries (including 1 non-test binary), 1 build script output directory, and 2 linked paths to /build/nextest-archive-8SpQ3N
  635. 41.46 s > Extracted 18 files to /build/nextest-archive-8SpQ3N in 0.69s
  636. 41.46 s > ------------
  637. 41.46 s > Nextest run ID ce44fbbc-58b7-4f0e-a9de-f3d6c319fa74 with nextest profile: ci_gammaloop
  638. 41.46 s > Starting 339 tests across 2 binaries
  639. 41.46 s > FAIL [ 0.039s] (248/339) gammaloop-api repl::tests::completion_shows_type_hint_for_non_boolean_settings_leaf
  640. 41.46 s > stdout ---
  641. 41.46 s >
  642. 41.46 s > running 1 test
  643. 41.46 s > test repl::tests::completion_shows_type_hint_for_non_boolean_settings_leaf ... FAILED
  644. 41.46 s >
  645. 41.46 s > failures:
  646. 41.46 s >
  647. 41.46 s > failures:
  648. 41.46 s > repl::tests::completion_shows_type_hint_for_non_boolean_settings_leaf
  649. 41.46 s >
  650. 41.46 s > test result: FAILED. 0 passed; 1 failed; 0 ignored; 0 measured; 338 filtered out; finished in 0.02s
  651. 41.46 s >
  652. 41.46 s > stderr ---
  653. 41.46 s >
  654. 41.46 s > thread 'repl::tests::completion_shows_type_hint_for_non_boolean_settings_leaf' (774) panicked at crates/gammaloop-api/src/repl.rs:5778:9:
  655. 41.46 s > [Suggestion { value: "", description: Some("Number of samples in the first Monte Carlo iteration."), style: None, extra: None, span: Span { start: 42, end: 42 }, append_whitespace: false }]
  656. 41.46 s > stack backtrace:
  657. 41.46 s > 0: __rustc::rust_begin_unwind
  658. 41.46 s > 1: core::panicking::panic_fmt
  659. 41.46 s > 2: gammaloop_api::repl::tests::completion_shows_type_hint_for_non_boolean_settings_leaf
  660. 41.46 s > 3: <gammaloop_api::repl::tests::completion_shows_type_hint_for_non_boolean_settings_leaf::{closure#0} as core::ops::function::FnOnce<()>>::call_once
  661. 41.46 s > note: Some details are omitted, run with `RUST_BACKTRACE=full` for a verbose backtrace.
  662. 41.46 s >
  663. 41.46 s > FAIL [ 0.037s] (277/339) gammaloop-api templates::tests::extract_templates_uses_canonical_package_layout
  664. 41.46 s > stdout ---
  665. 41.46 s >
  666. 41.46 s > running 1 test
  667. 41.46 s > test templates::tests::extract_templates_uses_canonical_package_layout ... FAILED
  668. 41.46 s >
  669. 41.46 s > failures:
  670. 41.46 s >
  671. 41.46 s > failures:
  672. 41.46 s > templates::tests::extract_templates_uses_canonical_package_layout
  673. 41.46 s >
  674. 41.46 s > test result: FAILED. 0 passed; 1 failed; 0 ignored; 0 measured; 338 filtered out; finished in 0.03s
  675. 41.46 s >
  676. 41.46 s > stderr ---
  677. 41.46 s >
  678. 41.46 s > thread 'templates::tests::extract_templates_uses_canonical_package_layout' (871) panicked at crates/gammaloop-api/src/templates.rs:99:9:
  679. 41.46 s > assertion failed: figure.contains("amplitude-mode")
  680. 41.46 s > stack backtrace:
  681. 41.46 s > 0: __rustc::rust_begin_unwind
  682. 41.46 s > 1: core::panicking::panic_fmt
  683. 41.46 s > 2: core::panicking::panic
  684. 41.46 s > 3: gammaloop_api::templates::tests::extract_templates_uses_canonical_package_layout
  685. 41.46 s > 4: <gammaloop_api::templates::tests::extract_templates_uses_canonical_package_layout::{closure#0} as core::ops::function::FnOnce<()>>::call_once
  686. 41.46 s > note: Some details are omitted, run with `RUST_BACKTRACE=full` for a verbose backtrace.
  687. 41.46 s >
  688. 41.46 s > ------------
  689. 41.47 s > Summary [ 0.627s] 339 tests run: 337 passed, 2 failed, 0 skipped
  690. 41.47 s > FAIL [ 0.039s] (248/339) gammaloop-api repl::tests::completion_shows_type_hint_for_non_boolean_settings_leaf
  691. 41.47 s > stdout ---
  692. 41.47 s >
  693. 41.47 s > running 1 test
  694. 41.47 s > test repl::tests::completion_shows_type_hint_for_non_boolean_settings_leaf ... FAILED
  695. 41.47 s >
  696. 41.47 s > failures:
  697. 41.47 s >
  698. 41.47 s > failures:
  699. 41.47 s > repl::tests::completion_shows_type_hint_for_non_boolean_settings_leaf
  700. 41.47 s >
  701. 41.47 s > test result: FAILED. 0 passed; 1 failed; 0 ignored; 0 measured; 338 filtered out; finished in 0.02s
  702. 41.47 s >
  703. 41.47 s > stderr ---
  704. 41.47 s >
  705. 41.47 s > thread 'repl::tests::completion_shows_type_hint_for_non_boolean_settings_leaf' (774) panicked at crates/gammaloop-api/src/repl.rs:5778:9:
  706. 41.47 s > [Suggestion { value: "", description: Some("Number of samples in the first Monte Carlo iteration."), style: None, extra: None, span: Span { start: 42, end: 42 }, append_whitespace: false }]
  707. 41.47 s > stack backtrace:
  708. 41.47 s > 0: __rustc::rust_begin_unwind
  709. 41.47 s > 1: core::panicking::panic_fmt
  710. 41.47 s > 2: gammaloop_api::repl::tests::completion_shows_type_hint_for_non_boolean_settings_leaf
  711. 41.47 s > 3: <gammaloop_api::repl::tests::completion_shows_type_hint_for_non_boolean_settings_leaf::{closure#0} as core::ops::function::FnOnce<()>>::call_once
  712. 41.47 s > note: Some details are omitted, run with `RUST_BACKTRACE=full` for a verbose backtrace.
  713. 41.47 s >
  714. 41.47 s > FAIL [ 0.037s] (277/339) gammaloop-api templates::tests::extract_templates_uses_canonical_package_layout
  715. 41.47 s > stdout ---
  716. 41.47 s >
  717. 41.47 s > running 1 test
  718. 41.47 s > test templates::tests::extract_templates_uses_canonical_package_layout ... FAILED
  719. 41.47 s >
  720. 41.47 s > failures:
  721. 41.47 s >
  722. 41.47 s > failures:
  723. 41.47 s > templates::tests::extract_templates_uses_canonical_package_layout
  724. 41.47 s >
  725. 41.47 s > test result: FAILED. 0 passed; 1 failed; 0 ignored; 0 measured; 338 filtered out; finished in 0.03s
  726. 41.47 s >
  727. 41.47 s > stderr ---
  728. 41.47 s >
  729. 41.47 s > thread 'templates::tests::extract_templates_uses_canonical_package_layout' (871) panicked at crates/gammaloop-api/src/templates.rs:99:9:
  730. 41.47 s > assertion failed: figure.contains("amplitude-mode")
  731. 41.47 s > stack backtrace:
  732. 41.47 s > 0: __rustc::rust_begin_unwind
  733. 41.47 s > 1: core::panicking::panic_fmt
  734. 41.47 s > 2: core::panicking::panic
  735. 41.47 s > 3: gammaloop_api::templates::tests::extract_templates_uses_canonical_package_layout
  736. 41.47 s > 4: <gammaloop_api::templates::tests::extract_templates_uses_canonical_package_layout::{closure#0} as core::ops::function::FnOnce<()>>::call_once
  737. 41.47 s > note: Some details are omitted, run with `RUST_BACKTRACE=full` for a verbose backtrace.
  738. 41.47 s >
  739. 41.47 s > error: test run failed
  740. 41.47 s >
  741. 41.47 s > ========== nextest test summary ==========
  742. 41.47 s > report: target/nextest/ci_gammaloop/junit.xml
  743. 41.47 s > tests: 339, failures: 2, errors: 0
  744. 41.47 s >
  745. 41.47 s > 1. gammaloop-api::repl::tests::completion_shows_type_hint_for_non_boolean_settings_leaf
  746. 41.47 s > failure: test failure with exit code 101
  747. 41.47 s > thread 'repl::tests::completion_shows_type_hint_for_non_boolean_settings_leaf' (774) panicked at crates/gammaloop-api/src/repl.rs:5778:9:
  748. 41.47 s > [Suggestion { value: "", description: Some("Number of samples in the first Monte Carlo iteration."), style: None, extra: None, span: Span { start: 42, end: 42 }, append_whitespace: false }]
  749. 41.47 s > stack backtrace:
  750. 41.47 s > 0: __rustc::rust_begin_unwind
  751. 41.47 s > 1: core::panicking::panic_fmt
  752. 41.47 s > 2: gammaloop_api::repl::tests::completion_shows_type_hint_for_non_boolean_settings_leaf
  753. 41.47 s > 3: <gammaloop_api::repl::tests::completion_shows_type_hint_for_non_boolean_settings_leaf::{closure#0} as core::ops::function::FnOnce<()>>::call_once
  754. 41.47 s > note: Some details are omitted, run with `RUST_BACKTRACE=full` for a verbose backtrace.
  755. 41.47 s > system-out
  756. 41.47 s > running 1 test
  757. 41.47 s > test repl::tests::completion_shows_type_hint_for_non_boolean_settings_leaf ... FAILED
  758. 41.47 s >
  759. 41.47 s > failures:
  760. 41.47 s >
  761. 41.47 s > failures:
  762. 41.47 s > repl::tests::completion_shows_type_hint_for_non_boolean_settings_leaf
  763. 41.47 s >
  764. 41.47 s > test result: FAILED. 0 passed; 1 failed; 0 ignored; 0 measured; 338 filtered out; finished in 0.02s
  765. 41.47 s > system-err
  766. 41.47 s > thread 'repl::tests::completion_shows_type_hint_for_non_boolean_settings_leaf' (774) panicked at crates/gammaloop-api/src/repl.rs:5778:9:
  767. 41.47 s > [Suggestion { value: "", description: Some("Number of samples in the first Monte Carlo iteration."), style: None, extra: None, span: Span { start: 42, end: 42 }, append_whitespace: false }]
  768. 41.47 s > stack backtrace:
  769. 41.47 s > 0: __rustc::rust_begin_unwind
  770. 41.47 s > 1: core::panicking::panic_fmt
  771. 41.47 s > 2: gammaloop_api::repl::tests::completion_shows_type_hint_for_non_boolean_settings_leaf
  772. 41.47 s > 3: <gammaloop_api::repl::tests::completion_shows_type_hint_for_non_boolean_settings_leaf::{closure#0} as core::ops::function::FnOnce<()>>::call_once
  773. 41.47 s > note: Some details are omitted, run with `RUST_BACKTRACE=full` for a verbose backtrace.
  774. 41.47 s >
  775. 41.47 s > 2. gammaloop-api::templates::tests::extract_templates_uses_canonical_package_layout
  776. 41.47 s > failure: test failure with exit code 101
  777. 41.47 s > thread 'templates::tests::extract_templates_uses_canonical_package_layout' (871) panicked at crates/gammaloop-api/src/templates.rs:99:9:
  778. 41.47 s > assertion failed: figure.contains("amplitude-mode")
  779. 41.47 s > stack backtrace:
  780. 41.47 s > 0: __rustc::rust_begin_unwind
  781. 41.47 s > 1: core::panicking::panic_fmt
  782. 41.47 s > 2: core::panicking::panic
  783. 41.47 s > 3: gammaloop_api::templates::tests::extract_templates_uses_canonical_package_layout
  784. 41.47 s > 4: <gammaloop_api::templates::tests::extract_templates_uses_canonical_package_layout::{closure#0} as core::ops::function::FnOnce<()>>::call_once
  785. 41.47 s > note: Some details are omitted, run with `RUST_BACKTRACE=full` for a verbose backtrace.
  786. 41.47 s > system-out
  787. 41.47 s > running 1 test
  788. 41.47 s > test templates::tests::extract_templates_uses_canonical_package_layout ... FAILED
  789. 41.47 s >
  790. 41.47 s > failures:
  791. 41.47 s >
  792. 41.47 s > failures:
  793. 41.47 s > templates::tests::extract_templates_uses_canonical_package_layout
  794. 41.47 s >
  795. 41.47 s > test result: FAILED. 0 passed; 1 failed; 0 ignored; 0 measured; 338 filtered out; finished in 0.03s
  796. 41.47 s > system-err
  797. 41.47 s > thread 'templates::tests::extract_templates_uses_canonical_package_layout' (871) panicked at crates/gammaloop-api/src/templates.rs:99:9:
  798. 41.47 s > assertion failed: figure.contains("amplitude-mode")
  799. 41.47 s > stack backtrace:
  800. 41.47 s > 0: __rustc::rust_begin_unwind
  801. 41.47 s > 1: core::panicking::panic_fmt
  802. 41.47 s > 2: core::panicking::panic
  803. 41.47 s > 3: gammaloop_api::templates::tests::extract_templates_uses_canonical_package_layout
  804. 41.47 s > 4: <gammaloop_api::templates::tests::extract_templates_uses_canonical_package_layout::{closure#0} as core::ops::function::FnOnce<()>>::call_once
  805. 41.47 s > note: Some details are omitted, run with `RUST_BACKTRACE=full` for a verbose backtrace.
  806. 41.47 s > =========================================
  807. 41.47 s > Extracting 1 binary and 1 linked path to /build/nextest-archive-5kw878
  808. 41.47 s > Extracted 7 files to /build/nextest-archive-5kw878 in 0.08s
  809. 41.47 s > ------------
  810. 41.47 s > Nextest run ID 947b3323-af1f-4698-9ffd-196a4672e31d with nextest profile: ci_gammaloop
  811. 41.47 s > Starting 19 tests across 1 binary
  812. 41.47 s > ------------
  813. 41.47 s > Summary [ 0.014s] 19 tests run: 19 passed, 0 skipped
  814. 41.47 s >
  815. 41.47 s > ========== nextest test summary ==========
  816. 41.47 s > report: target/nextest/ci_gammaloop/junit.xml
  817. 41.47 s > tests: 19, failures: 0, errors: 0
  818. 41.47 s > No failing testcases found.
  819. 41.47 s > =========================================
  820. 41.47 s > Extracting 1 binary to /build/nextest-archive-mScqjw
  821. 41.47 s > Extracted 4 files to /build/nextest-archive-mScqjw in 0.04s
  822. 41.47 s > ------------
  823. 41.47 s > Nextest run ID 840c0053-722d-4e68-a0e3-22ff6c463eef with nextest profile: ci_gammaloop
  824. 41.47 s > Starting 0 tests across 1 binary
  825. 41.47 s > ------------
  826. 41.47 s > Summary [ 0.000s] 0 tests run: 0 passed, 0 skipped
  827. 41.47 s >
  828. 41.47 s > ========== nextest test summary ==========
  829. 41.47 s > report: target/nextest/ci_gammaloop/junit.xml
  830. 41.47 s > tests: 0, failures: 0, errors: 0
  831. 41.47 s > No failing testcases found.
  832. 41.47 s > =========================================
  833. 41.47 s > Extracting 4 binaries, 1 build script output directory, and 2 linked paths to /build/nextest-archive-Tz43KM
  834. 41.47 s > Extracted 18 files to /build/nextest-archive-Tz43KM in 0.67s
  835. 41.47 s > ------------
  836. 41.47 s > Nextest run ID 836820cc-4195-47a7-907d-cce6db46c658 with nextest profile: ci_gammaloop
  837. 41.47 s > Starting 456 tests across 4 binaries (61 tests skipped, including 60 tests via profile.ci_gammaloop.default-filter)
  838. 41.47 s > FAIL [ 0.184s] ( 76/456) gammalooprs graph::parse::tests::parse_lmbsetting_crossection
  839. 41.47 s > stdout ---
  840. 41.47 s >
  841. 41.47 s > running 1 test
  842. 41.47 s > ━━━━━━━━━━━━━━━━━━━━━━━━━━━━━━━ Snapshot Summary ━━━━━━━━━━━━━━━━━━━━━━━━━━━━━━━
  843. 41.47 s > Snapshot: parse_lmbsetting_crossection
  844. 41.47 s > Source: crates/gammalooprs/src/graph/parse/tests.rs:252
  845. 41.47 s > ────────────────────────────────────────────────────────────────────────────────
  846. 41.47 s > Expression: g.debug_dot()
  847. 41.47 s > ────────────────────────────────────────────────────────────────────────────────
  848. 41.47 s > -old snapshot
  849. 41.47 s > +new results
  850. 41.47 s > ────────────┬───────────────────────────────────────────────────────────────────
  851. 41.47 s > 1 │-digraph G{
  852. 41.47 s > 1 │+digraph G {
  853. 41.47 s > 2 2 │ num = "1/2";
  854. 41.47 s > 3 3 │ overall_factor = "2*x";
  855. 41.47 s > 4 4 │ overall_factor_evaluated = "2*x";
  856. 41.47 s > 5 5 │ projector = "spenso::t";
  857. 41.47 s > ────────────┴───────────────────────────────────────────────────────────────────
  858. 41.47 s > To update snapshots run `cargo insta review`
  859. 41.47 s > Stopped on the first failure. Run `cargo insta test` to run all snapshots.
  860. 41.47 s > test graph::parse::tests::parse_lmbsetting_crossection ... FAILED
  861. 41.47 s >
  862. 41.47 s > failures:
  863. 41.47 s >
  864. 41.47 s > failures:
  865. 41.47 s > graph::parse::tests::parse_lmbsetting_crossection
  866. 41.47 s >
  867. 41.47 s > test result: FAILED. 0 passed; 1 failed; 0 ignored; 0 measured; 508 filtered out; finished in 0.17s
  868. 41.47 s >
  869. 41.47 s > stderr ---
  870. 41.47 s > [21:40:47.785] @gammalooprs::graph::attribute_warnings WARNING : Unknown node attribute 'color_num' on graph 'G', node 'A'; did you mean 'num'?
  871. 41.47 s > at crates/gammalooprs/src/graph/attribute_warnings.rs:198
  872. 41.47 s > The application panicked (crashed).
  873. 41.47 s > Message: snapshot assertion for 'parse_lmbsetting_crossection' failed in line 252
  874. 41.47 s > Location: /nix/store/xdy1vvhll2bijdplvl9fcc2b9plkxhaa-vendor-cargo-deps/c19b7c6f923b580ac259164a89f2577984ad5ab09ee9d583b888f934adbbe8d0/insta-1.47.2/src/runtime.rs:719
  875. 41.47 s >
  876. 41.47 s > ━━━━━━━━━━━━━━━━━━━━━━━━━━━━━━━━━━ BACKTRACE ━━━━━━━━━━━━━━━━━━━━━━━━━━━━━━━━━━━
  877. 41.47 s > 1: <color_eyre[b0c9e66060e883b2]::config::PanicHook>::panic_report<unknown>
  878. 41.47 s > at <unknown source file>:<unknown line>
  879. 41.47 s > 2: <color_eyre[b0c9e66060e883b2]::config::PanicHook>::into_panic_hook::{closure#0}<unknown>
  880. 41.47 s > at <unknown source file>:<unknown line>
  881. 41.47 s > 3: std[bcb96dfbba0ab899]::panicking::panic_with_hook<unknown>
  882. 41.47 s > at <unknown source file>:<unknown line>
  883. 41.47 s > 4: std[bcb96dfbba0ab899]::panicking::panic_handler::{closure#0}<unknown>
  884. 41.47 s > at <unknown source file>:<unknown line>
  885. 41.47 s > 5: std[bcb96dfbba0ab899]::sys::backtrace::__rust_end_short_backtrace::<std[bcb96dfbba0ab899]::panicking::panic_handler::{closure#0}, !><unknown>
  886. 41.47 s > at <unknown source file>:<unknown line>
  887. 41.47 s > 6: __rustc[6c289b9f9c454d21]::rust_begin_unwind<unknown>
  888. 41.47 s > at <unknown source file>:<unknown line>
  889. 41.47 s > 7: core[940e698046960fd5]::panicking::panic_fmt<unknown>
  890. 41.47 s > at <unknown source file>:<unknown line>
  891. 41.47 s > 8: insta[307a548ac79ef4d9]::runtime::assert_snapshot<unknown>
  892. 41.47 s > at <unknown source file>:<unknown line>
  893. 41.47 s > 9: gammalooprs[5490727360442cce]::graph::parse::tests::parse_lmbsetting_crossection<unknown>
  894. 41.47 s > at <unknown source file>:<unknown line>
  895. 41.47 s > 10: <gammalooprs[5490727360442cce]::graph::parse::tests::parse_lmbsetting_crossection::{closure#0} as core[940e698046960fd5]::ops::function::FnOnce<()>>::call_once<unknown>
  896. 41.47 s > at <unknown source file>:<unknown line>
  897. 41.47 s > 11: test[75d6903177b1d7e9]::__rust_begin_short_backtrace::<core[940e698046960fd5]::result::Result<(), alloc[2ea6bcb46fca0c42]::string::String>, fn() -> core[940e698046960fd5]::result::Result<(), alloc[2ea6bcb46fca0c42]::string::String>><unknown>
  898. 41.47 s > at <unknown source file>:<unknown line>
  899. 41.47 s > 12: test[75d6903177b1d7e9]::run_test::{closure#0}<unknown>
  900. 41.47 s > at <unknown source file>:<unknown line>
  901. 41.47 s > 13: std[bcb96dfbba0ab899]::sys::backtrace::__rust_begin_short_backtrace::<test[75d6903177b1d7e9]::run_test::{closure#1}, ()><unknown>
  902. 41.47 s > at <unknown source file>:<unknown line>
  903. 41.47 s > 14: <std[bcb96dfbba0ab899]::thread::lifecycle::spawn_unchecked<test[75d6903177b1d7e9]::run_test::{closure#1}, ()>::{closure#1} as core[940e698046960fd5]::ops::function::FnOnce<()>>::call_once::{shim:vtable#0}<unknown>
  904. 41.47 s > at <unknown source file>:<unknown line>
  905. 41.47 s > 15: <std[bcb96dfbba0ab899]::sys::thread::unix::Thread>::new::thread_start<unknown>
  906. 41.47 s > at <unknown source file>:<unknown line>
  907. 41.47 s > 16: start_thread<unknown>
  908. 41.47 s > at <unknown source file>:<unknown line>
  909. 41.47 s > 17: __clone3<unknown>
  910. 41.47 s > at <unknown source file>:<unknown line>
  911. 41.47 s >
  912. 41.47 s > Run with COLORBT_SHOW_HIDDEN=1 environment variable to disable frame filtering.
  913. 41.47 s > Run with RUST_BACKTRACE=full to include source snippets.
  914. 41.47 s >
  915. 41.47 s > FAIL [ 0.246s] (411/456) gammalooprs uv::export::tests::computed_node_full_numerator_is_a_spenso_aware_typst_fragment
  916. 41.47 s > stdout ---
  917. 41.47 s >
  918. 41.47 s > running 1 test
  919. 41.47 s > test uv::export::tests::computed_node_full_numerator_is_a_spenso_aware_typst_fragment ... FAILED
  920. 41.47 s >
  921. 41.47 s > failures:
  922. 41.47 s >
  923. 41.47 s > failures:
  924. 41.47 s > uv::export::tests::computed_node_full_numerator_is_a_spenso_aware_typst_fragment
  925. 41.47 s >
  926. 41.47 s > test result: FAILED. 0 passed; 1 failed; 0 ignored; 0 measured; 508 filtered out; finished in 0.22s
  927. 41.47 s >
  928. 41.47 s > stderr ---
  929. 41.47 s > The application panicked (crashed).
  930. 41.47 s > Message: assertion failed: exported.dot.contains(r#"full_num = "op(\"Tr\")(1)";"#)
  931. 41.47 s > Location: crates/gammalooprs/src/uv/export.rs:483
  932. 41.47 s >
  933. 41.47 s > ━━━━━━━━━━━━━━━━━━━━━━━━━━━━━━━━━━ BACKTRACE ━━━━━━━━━━━━━━━━━━━━━━━━━━━━━━━━━━━
  934. 41.47 s > 1: <color_eyre[b0c9e66060e883b2]::config::PanicHook>::panic_report<unknown>
  935. 41.47 s > at <unknown source file>:<unknown line>
  936. 41.47 s > 2: <color_eyre[b0c9e66060e883b2]::config::PanicHook>::into_panic_hook::{closure#0}<unknown>
  937. 41.47 s > at <unknown source file>:<unknown line>
  938. 41.47 s > 3: std[bcb96dfbba0ab899]::panicking::panic_with_hook<unknown>
  939. 41.47 s > at <unknown source file>:<unknown line>
  940. 41.47 s > 4: std[bcb96dfbba0ab899]::panicking::panic_handler::{closure#0}<unknown>
  941. 41.47 s > at <unknown source file>:<unknown line>
  942. 41.47 s > 5: std[bcb96dfbba0ab899]::sys::backtrace::__rust_end_short_backtrace::<std[bcb96dfbba0ab899]::panicking::panic_handler::{closure#0}, !><unknown>
  943. 41.47 s > at <unknown source file>:<unknown line>
  944. 41.47 s > 6: __rustc[6c289b9f9c454d21]::rust_begin_unwind<unknown>
  945. 41.47 s > at <unknown source file>:<unknown line>
  946. 41.47 s > 7: core[940e698046960fd5]::panicking::panic_fmt<unknown>
  947. 41.47 s > at <unknown source file>:<unknown line>
  948. 41.47 s > 8: core[940e698046960fd5]::panicking::panic<unknown>
  949. 41.47 s > at <unknown source file>:<unknown line>
  950. 41.47 s > 9: gammalooprs[5490727360442cce]::uv::export::tests::computed_node_full_numerator_is_a_spenso_aware_typst_fragment<unknown>
  951. 41.47 s > at <unknown source file>:<unknown line>
  952. 41.47 s > 10: <gammalooprs[5490727360442cce]::uv::export::tests::computed_node_full_numerator_is_a_spenso_aware_typst_fragment::{closure#0} as core[940e698046960fd5]::ops::function::FnOnce<()>>::call_once<unknown>
  953. 41.47 s > at <unknown source file>:<unknown line>
  954. 41.47 s > 11: test[75d6903177b1d7e9]::__rust_begin_short_backtrace::<core[940e698046960fd5]::result::Result<(), alloc[2ea6bcb46fca0c42]::string::String>, fn() -> core[940e698046960fd5]::result::Result<(), alloc[2ea6bcb46fca0c42]::string::String>><unknown>
  955. 41.47 s > at <unknown source file>:<unknown line>
  956. 41.47 s > 12: test[75d6903177b1d7e9]::run_test::{closure#0}<unknown>
  957. 41.47 s > at <unknown source file>:<unknown line>
  958. 41.47 s > 13: std[bcb96dfbba0ab899]::sys::backtrace::__rust_begin_short_backtrace::<test[75d6903177b1d7e9]::run_test::{closure#1}, ()><unknown>
  959. 41.47 s > at <unknown source file>:<unknown line>
  960. 41.47 s > 14: <std[bcb96dfbba0ab899]::thread::lifecycle::spawn_unchecked<test[75d6903177b1d7e9]::run_test::{closure#1}, ()>::{closure#1} as core[940e698046960fd5]::ops::function::FnOnce<()>>::call_once::{shim:vtable#0}<unknown>
  961. 41.47 s > at <unknown source file>:<unknown line>
  962. 41.47 s > 15: <std[bcb96dfbba0ab899]::sys::thread::unix::Thread>::new::thread_start<unknown>
  963. 41.47 s > at <unknown source file>:<unknown line>
  964. 41.47 s > 16: start_thread<unknown>
  965. 41.47 s > at <unknown source file>:<unknown line>
  966. 41.47 s > 17: __clone3<unknown>
  967. 41.47 s > at <unknown source file>:<unknown line>
  968. 41.47 s >
  969. 41.47 s > Run with COLORBT_SHOW_HIDDEN=1 environment variable to disable frame filtering.
  970. 41.47 s > Run with RUST_BACKTRACE=full to include source snippets.
  971. 41.47 s >
  972. 41.47 s > ------------
  973. 41.47 s > Summary [ 14.383s] 456 tests run: 454 passed, 2 failed, 61 skipped
  974. 41.47 s > FAIL [ 0.184s] ( 76/456) gammalooprs graph::parse::tests::parse_lmbsetting_crossection
  975. 41.47 s > stdout ---
  976. 41.47 s >
  977. 41.47 s > running 1 test
  978. 41.47 s > ━━━━━━━━━━━━━━━━━━━━━━━━━━━━━━━ Snapshot Summary ━━━━━━━━━━━━━━━━━━━━━━━━━━━━━━━
  979. 41.47 s > Snapshot: parse_lmbsetting_crossection
  980. 41.47 s > Source: crates/gammalooprs/src/graph/parse/tests.rs:252
  981. 41.47 s > ────────────────────────────────────────────────────────────────────────────────
  982. 41.47 s > Expression: g.debug_dot()
  983. 41.47 s > ────────────────────────────────────────────────────────────────────────────────
  984. 41.47 s > -old snapshot
  985. 41.47 s > +new results
  986. 41.47 s > ────────────┬───────────────────────────────────────────────────────────────────
  987. 41.47 s > 1 │-digraph G{
  988. 41.47 s > 1 │+digraph G {
  989. 41.47 s > 2 2 │ num = "1/2";
  990. 41.47 s > 3 3 │ overall_factor = "2*x";
  991. 41.47 s > 4 4 │ overall_factor_evaluated = "2*x";
  992. 41.47 s > 5 5 │ projector = "spenso::t";
  993. 41.47 s > ────────────┴───────────────────────────────────────────────────────────────────
  994. 41.47 s > To update snapshots run `cargo insta review`
  995. 41.47 s > Stopped on the first failure. Run `cargo insta test` to run all snapshots.
  996. 41.47 s > test graph::parse::tests::parse_lmbsetting_crossection ... FAILED
  997. 41.47 s >
  998. 41.47 s > failures:
  999. 41.47 s >
  1000. 41.47 s > failures:
  1001. 41.47 s > graph::parse::tests::parse_lmbsetting_crossection
  1002. 41.47 s >
  1003. 41.47 s > test result: FAILED. 0 passed; 1 failed; 0 ignored; 0 measured; 508 filtered out; finished in 0.17s
  1004. 41.47 s >
  1005. 41.47 s > stderr ---
  1006. 41.47 s > [21:40:47.785] @gammalooprs::graph::attribute_warnings WARNING : Unknown node attribute 'color_num' on graph 'G', node 'A'; did you mean 'num'?
  1007. 41.47 s > at crates/gammalooprs/src/graph/attribute_warnings.rs:198
  1008. 41.47 s > The application panicked (crashed).
  1009. 41.47 s > Message: snapshot assertion for 'parse_lmbsetting_crossection' failed in line 252
  1010. 41.47 s > Location: /nix/store/xdy1vvhll2bijdplvl9fcc2b9plkxhaa-vendor-cargo-deps/c19b7c6f923b580ac259164a89f2577984ad5ab09ee9d583b888f934adbbe8d0/insta-1.47.2/src/runtime.rs:719
  1011. 41.47 s >
  1012. 41.47 s > ━━━━━━━━━━━━━━━━━━━━━━━━━━━━━━━━━━ BACKTRACE ━━━━━━━━━━━━━━━━━━━━━━━━━━━━━━━━━━━
  1013. 41.47 s > 1: <color_eyre[b0c9e66060e883b2]::config::PanicHook>::panic_report<unknown>
  1014. 41.47 s > at <unknown source file>:<unknown line>
  1015. 41.47 s > 2: <color_eyre[b0c9e66060e883b2]::config::PanicHook>::into_panic_hook::{closure#0}<unknown>
  1016. 41.47 s > at <unknown source file>:<unknown line>
  1017. 41.47 s > 3: std[bcb96dfbba0ab899]::panicking::panic_with_hook<unknown>
  1018. 41.47 s > at <unknown source file>:<unknown line>
  1019. 41.47 s > 4: std[bcb96dfbba0ab899]::panicking::panic_handler::{closure#0}<unknown>
  1020. 41.47 s > at <unknown source file>:<unknown line>
  1021. 41.47 s > 5: std[bcb96dfbba0ab899]::sys::backtrace::__rust_end_short_backtrace::<std[bcb96dfbba0ab899]::panicking::panic_handler::{closure#0}, !><unknown>
  1022. 41.47 s > at <unknown source file>:<unknown line>
  1023. 41.47 s > 6: __rustc[6c289b9f9c454d21]::rust_begin_unwind<unknown>
  1024. 41.47 s > at <unknown source file>:<unknown line>
  1025. 41.47 s > 7: core[940e698046960fd5]::panicking::panic_fmt<unknown>
  1026. 41.47 s > at <unknown source file>:<unknown line>
  1027. 41.47 s > 8: insta[307a548ac79ef4d9]::runtime::assert_snapshot<unknown>
  1028. 41.47 s > at <unknown source file>:<unknown line>
  1029. 41.47 s > 9: gammalooprs[5490727360442cce]::graph::parse::tests::parse_lmbsetting_crossection<unknown>
  1030. 41.47 s > at <unknown source file>:<unknown line>
  1031. 41.47 s > 10: <gammalooprs[5490727360442cce]::graph::parse::tests::parse_lmbsetting_crossection::{closure#0} as core[940e698046960fd5]::ops::function::FnOnce<()>>::call_once<unknown>
  1032. 41.47 s > at <unknown source file>:<unknown line>
  1033. 41.47 s > 11: test[75d6903177b1d7e9]::__rust_begin_short_backtrace::<core[940e698046960fd5]::result::Result<(), alloc[2ea6bcb46fca0c42]::string::String>, fn() -> core[940e698046960fd5]::result::Result<(), alloc[2ea6bcb46fca0c42]::string::String>><unknown>
  1034. 41.47 s > at <unknown source file>:<unknown line>
  1035. 41.47 s > 12: test[75d6903177b1d7e9]::run_test::{closure#0}<unknown>
  1036. 41.47 s > at <unknown source file>:<unknown line>
  1037. 41.47 s > 13: std[bcb96dfbba0ab899]::sys::backtrace::__rust_begin_short_backtrace::<test[75d6903177b1d7e9]::run_test::{closure#1}, ()><unknown>
  1038. 41.47 s > at <unknown source file>:<unknown line>
  1039. 41.47 s > 14: <std[bcb96dfbba0ab899]::thread::lifecycle::spawn_unchecked<test[75d6903177b1d7e9]::run_test::{closure#1}, ()>::{closure#1} as core[940e698046960fd5]::ops::function::FnOnce<()>>::call_once::{shim:vtable#0}<unknown>
  1040. 41.47 s > at <unknown source file>:<unknown line>
  1041. 41.47 s > 15: <std[bcb96dfbba0ab899]::sys::thread::unix::Thread>::new::thread_start<unknown>
  1042. 41.47 s > at <unknown source file>:<unknown line>
  1043. 41.47 s > 16: start_thread<unknown>
  1044. 41.47 s > at <unknown source file>:<unknown line>
  1045. 41.47 s > 17: __clone3<unknown>
  1046. 41.47 s > at <unknown source file>:<unknown line>
  1047. 41.47 s >
  1048. 41.47 s > Run with COLORBT_SHOW_HIDDEN=1 environment variable to disable frame filtering.
  1049. 41.47 s > Run with RUST_BACKTRACE=full to include source snippets.
  1050. 41.47 s >
  1051. 41.47 s > FAIL [ 0.246s] (411/456) gammalooprs uv::export::tests::computed_node_full_numerator_is_a_spenso_aware_typst_fragment
  1052. 41.47 s > stdout ---
  1053. 41.47 s >
  1054. 41.47 s > running 1 test
  1055. 41.47 s > test uv::export::tests::computed_node_full_numerator_is_a_spenso_aware_typst_fragment ... FAILED
  1056. 41.47 s >
  1057. 41.47 s > failures:
  1058. 41.47 s >
  1059. 41.47 s > failures:
  1060. 41.47 s > uv::export::tests::computed_node_full_numerator_is_a_spenso_aware_typst_fragment
  1061. 41.47 s >
  1062. 41.47 s > test result: FAILED. 0 passed; 1 failed; 0 ignored; 0 measured; 508 filtered out; finished in 0.22s
  1063. 41.47 s >
  1064. 41.47 s > stderr ---
  1065. 41.47 s > The application panicked (crashed).
  1066. 41.47 s > Message: assertion failed: exported.dot.contains(r#"full_num = "op(\"Tr\")(1)";"#)
  1067. 41.47 s > Location: crates/gammalooprs/src/uv/export.rs:483
  1068. 41.47 s >
  1069. 41.47 s > ━━━━━━━━━━━━━━━━━━━━━━━━━━━━━━━━━━ BACKTRACE ━━━━━━━━━━━━━━━━━━━━━━━━━━━━━━━━━━━
  1070. 41.47 s > 1: <color_eyre[b0c9e66060e883b2]::config::PanicHook>::panic_report<unknown>
  1071. 41.47 s > at <unknown source file>:<unknown line>
  1072. 41.47 s > 2: <color_eyre[b0c9e66060e883b2]::config::PanicHook>::into_panic_hook::{closure#0}<unknown>
  1073. 41.47 s > at <unknown source file>:<unknown line>
  1074. 41.47 s > 3: std[bcb96dfbba0ab899]::panicking::panic_with_hook<unknown>
  1075. 41.47 s > at <unknown source file>:<unknown line>
  1076. 41.47 s > 4: std[bcb96dfbba0ab899]::panicking::panic_handler::{closure#0}<unknown>
  1077. 41.47 s > at <unknown source file>:<unknown line>
  1078. 41.47 s > 5: std[bcb96dfbba0ab899]::sys::backtrace::__rust_end_short_backtrace::<std[bcb96dfbba0ab899]::panicking::panic_handler::{closure#0}, !><unknown>
  1079. 41.47 s > at <unknown source file>:<unknown line>
  1080. 41.47 s > 6: __rustc[6c289b9f9c454d21]::rust_begin_unwind<unknown>
  1081. 41.47 s > at <unknown source file>:<unknown line>
  1082. 41.47 s > 7: core[940e698046960fd5]::panicking::panic_fmt<unknown>
  1083. 41.47 s > at <unknown source file>:<unknown line>
  1084. 41.47 s > 8: core[940e698046960fd5]::panicking::panic<unknown>
  1085. 41.47 s > at <unknown source file>:<unknown line>
  1086. 41.47 s > 9: gammalooprs[5490727360442cce]::uv::export::tests::computed_node_full_numerator_is_a_spenso_aware_typst_fragment<unknown>
  1087. 41.47 s > at <unknown source file>:<unknown line>
  1088. 41.47 s > 10: <gammalooprs[5490727360442cce]::uv::export::tests::computed_node_full_numerator_is_a_spenso_aware_typst_fragment::{closure#0} as core[940e698046960fd5]::ops::function::FnOnce<()>>::call_once<unknown>
  1089. 41.47 s > at <unknown source file>:<unknown line>
  1090. 41.47 s > 11: test[75d6903177b1d7e9]::__rust_begin_short_backtrace::<core[940e698046960fd5]::result::Result<(), alloc[2ea6bcb46fca0c42]::string::String>, fn() -> core[940e698046960fd5]::result::Result<(), alloc[2ea6bcb46fca0c42]::string::String>><unknown>
  1091. 41.47 s > at <unknown source file>:<unknown line>
  1092. 41.47 s > 12: test[75d6903177b1d7e9]::run_test::{closure#0}<unknown>
  1093. 41.47 s > at <unknown source file>:<unknown line>
  1094. 41.47 s > 13: std[bcb96dfbba0ab899]::sys::backtrace::__rust_begin_short_backtrace::<test[75d6903177b1d7e9]::run_test::{closure#1}, ()><unknown>
  1095. 41.47 s > at <unknown source file>:<unknown line>
  1096. 41.47 s > 14: <std[bcb96dfbba0ab899]::thread::lifecycle::spawn_unchecked<test[75d6903177b1d7e9]::run_test::{closure#1}, ()>::{closure#1} as core[940e698046960fd5]::ops::function::FnOnce<()>>::call_once::{shim:vtable#0}<unknown>
  1097. 41.47 s > at <unknown source file>:<unknown line>
  1098. 41.47 s > 15: <std[bcb96dfbba0ab899]::sys::thread::unix::Thread>::new::thread_start<unknown>
  1099. 41.47 s > at <unknown source file>:<unknown line>
  1100. 41.47 s > 16: start_thread<unknown>
  1101. 41.47 s > at <unknown source file>:<unknown line>
  1102. 41.47 s > 17: __clone3<unknown>
  1103. 41.47 s > at <unknown source file>:<unknown line>
  1104. 41.47 s >
  1105. 41.47 s > Run with COLORBT_SHOW_HIDDEN=1 environment variable to disable frame filtering.
  1106. 41.47 s > Run with RUST_BACKTRACE=full to include source snippets.
  1107. 41.47 s >
  1108. 41.47 s > error: test run failed
  1109. 41.47 s >
  1110. 41.47 s > ========== nextest test summary ==========
  1111. 41.47 s > report: target/nextest/ci_gammaloop/junit.xml
  1112. 41.47 s > tests: 456, failures: 2, errors: 0
  1113. 41.47 s >
  1114. 41.47 s > 1. gammalooprs::graph::parse::tests::parse_lmbsetting_crossection
  1115. 41.47 s > failure: test failure with exit code 101
  1116. 41.47 s > system-out
  1117. 41.47 s > running 1 test
  1118. 41.47 s > ━━━━━━━━━━━━━━━━━━━━━━━━━━━━━━━ Snapshot Summary ━━━━━━━━━━━━━━━━━━━━━━━━━━━━━━━
  1119. 41.47 s > Snapshot: parse_lmbsetting_crossection
  1120. 41.47 s > Source: crates/gammalooprs/src/graph/parse/tests.rs:252
  1121. 41.47 s > ────────────────────────────────────────────────────────────────────────────────
  1122. 41.47 s > Expression: g.debug_dot()
  1123. 41.47 s > ────────────────────────────────────────────────────────────────────────────────
  1124. 41.47 s > -old snapshot
  1125. 41.47 s > +new results
  1126. 41.47 s > ────────────┬───────────────────────────────────────────────────────────────────
  1127. 41.47 s > 1 │-digraph G{
  1128. 41.47 s > 1 │+digraph G {
  1129. 41.47 s > 2 2 │ num = "1/2";
  1130. 41.47 s > 3 3 │ overall_factor = "2*x";
  1131. 41.47 s > 4 4 │ overall_factor_evaluated = "2*x";
  1132. 41.47 s > 5 5 │ projector = "spenso::t";
  1133. 41.47 s > ────────────┴───────────────────────────────────────────────────────────────────
  1134. 41.47 s > To update snapshots run `cargo insta review`
  1135. 41.47 s > Stopped on the first failure. Run `cargo insta test` to run all snapshots.
  1136. 41.47 s > test graph::parse::tests::parse_lmbsetting_crossection ... FAILED
  1137. 41.47 s >
  1138. 41.47 s > failures:
  1139. 41.47 s >
  1140. 41.47 s > failures:
  1141. 41.47 s > graph::parse::tests::parse_lmbsetting_crossection
  1142. 41.47 s >
  1143. 41.47 s > test result: FAILED. 0 passed; 1 failed; 0 ignored; 0 measured; 508 filtered out; finished in 0.17s
  1144. 41.47 s > system-err
  1145. 41.47 s > [21:40:47.785] @gammalooprs::graph::attribute_warnings WARNING : Unknown node attribute 'color_num' on graph 'G', node 'A'; did you mean 'num'?
  1146. 41.47 s > at crates/gammalooprs/src/graph/attribute_warnings.rs:198
  1147. 41.47 s > The application panicked (crashed).
  1148. 41.47 s > Message: snapshot assertion for 'parse_lmbsetting_crossection' failed in line 252
  1149. 41.47 s > Location: /nix/store/xdy1vvhll2bijdplvl9fcc2b9plkxhaa-vendor-cargo-deps/c19b7c6f923b580ac259164a89f2577984ad5ab09ee9d583b888f934adbbe8d0/insta-1.47.2/src/runtime.rs:719
  1150. 41.47 s >
  1151. 41.47 s > ━━━━━━━━━━━━━━━━━━━━━━━━━━━━━━━━━━ BACKTRACE ━━━━━━━━━━━━━━━━━━━━━━━━━━━━━━━━━━━
  1152. 41.47 s > 1: <color_eyre[b0c9e66060e883b2]::config::PanicHook>::panic_report<unknown>
  1153. 41.47 s > at <unknown source file>:<unknown line>
  1154. 41.47 s > 2: <color_eyre[b0c9e66060e883b2]::config::PanicHook>::into_panic_hook::{closure#0}<unknown>
  1155. 41.47 s > at <unknown source file>:<unknown line>
  1156. 41.47 s > 3: std[bcb96dfbba0ab899]::panicking::panic_with_hook<unknown>
  1157. 41.47 s > at <unknown source file>:<unknown line>
  1158. 41.47 s > 4: std[bcb96dfbba0ab899]::panicking::panic_handler::{closure#0}<unknown>
  1159. 41.47 s > at <unknown source file>:<unknown line>
  1160. 41.47 s > 5: std[bcb96dfbba0ab899]::sys::backtrace::__rust_end_short_backtrace::<std[bcb96dfbba0ab899]::panicking::panic_handler::{closure#0}, !><unknown>
  1161. 41.47 s > at <unknown source file>:<unknown line>
  1162. 41.47 s > 6: __rustc[6c289b9f9c454d21]::rust_begin_unwind<unknown>
  1163. 41.47 s > at <unknown source file>:<unknown line>
  1164. 41.47 s > 7: core[940e698046960fd5]::panicking::panic_fmt<unknown>
  1165. 41.47 s > at <unknown source file>:<unknown line>
  1166. 41.47 s > 8: insta[307a548ac79ef4d9]::runtime::assert_snapshot<unknown>
  1167. 41.47 s > at <unknown source file>:<unknown line>
  1168. 41.47 s > 9: gammalooprs[5490727360442cce]::graph::parse::tests::parse_lmbsetting_crossection<unknown>
  1169. 41.47 s > at <unknown source file>:<unknown line>
  1170. 41.47 s > 10: <gammalooprs[5490727360442cce]::graph::parse::tests::parse_lmbsetting_crossection::{closure#0} as core[940e698046960fd5]::ops::function::FnOnce<()>>::call_once<unknown>
  1171. 41.47 s > at <unknown source file>:<unknown line>
  1172. 41.47 s > 11: test[75d6903177b1d7e9]::__rust_begin_short_backtrace::<core[940e698046960fd5]::result::Result<(), alloc[2ea6bcb46fca0c42]::string::String>, fn() -> core[940e698046960fd5]::result::Result<(), alloc[2ea6bcb46fca0c42]::string::String>><unknown>
  1173. 41.47 s > at <unknown source file>:<unknown line>
  1174. 41.47 s > 12: test[75d6903177b1d7e9]::run_test::{closure#0}<unknown>
  1175. 41.47 s > at <unknown source file>:<unknown line>
  1176. 41.47 s > 13: std[bcb96dfbba0ab899]::sys::backtrace::__rust_begin_short_backtrace::<test[75d6903177b1d7e9]::run_test::{closure#1}, ()><unknown>
  1177. 41.47 s > at <unknown source file>:<unknown line>
  1178. 41.47 s > 14: <std[bcb96dfbba0ab899]::thread::lifecycle::spawn_unchecked<test[75d6903177b1d7e9]::run_test::{closure#1}, ()>::{closure#1} as core[940e698046960fd5]::ops::function::FnOnce<()>>::call_once::{shim:vtable#0}<unknown>
  1179. 41.47 s > at <unknown source file>:<unknown line>
  1180. 41.47 s > 15: <std[bcb96dfbba0ab899]::sys::thread::unix::Thread>::new::thread_start<unknown>
  1181. 41.47 s > at <unknown source file>:<unknown line>
  1182. 41.47 s > 16: start_thread<unknown>
  1183. 41.47 s > at <unknown source file>:<unknown line>
  1184. 41.47 s > 17: __clone3<unknown>
  1185. 41.47 s > at <unknown source file>:<unknown line>
  1186. 41.47 s >
  1187. 41.47 s > Run with COLORBT_SHOW_HIDDEN=1 environment variable to disable frame filtering.
  1188. 41.47 s > Run with RUST_BACKTRACE=full to include source snippets.
  1189. 41.47 s >
  1190. 41.47 s > 2. gammalooprs::uv::export::tests::computed_node_full_numerator_is_a_spenso_aware_typst_fragment
  1191. 41.47 s > failure: test failure with exit code 101
  1192. 41.47 s > system-out
  1193. 41.47 s > running 1 test
  1194. 41.47 s > test uv::export::tests::computed_node_full_numerator_is_a_spenso_aware_typst_fragment ... FAILED
  1195. 41.47 s >
  1196. 41.47 s > failures:
  1197. 41.47 s >
  1198. 41.47 s > failures:
  1199. 41.47 s > uv::export::tests::computed_node_full_numerator_is_a_spenso_aware_typst_fragment
  1200. 41.47 s >
  1201. 41.47 s > test result: FAILED. 0 passed; 1 failed; 0 ignored; 0 measured; 508 filtered out; finished in 0.22s
  1202. 41.47 s > system-err
  1203. 41.47 s > The application panicked (crashed).
  1204. 41.47 s > Message: assertion failed: exported.dot.contains(r#"full_num = "op(\"Tr\")(1)";"#)
  1205. 41.47 s > Location: crates/gammalooprs/src/uv/export.rs:483
  1206. 41.47 s >
  1207. 41.47 s > ━━━━━━━━━━━━━━━━━━━━━━━━━━━━━━━━━━ BACKTRACE ━━━━━━━━━━━━━━━━━━━━━━━━━━━━━━━━━━━
  1208. 41.47 s > 1: <color_eyre[b0c9e66060e883b2]::config::PanicHook>::panic_report<unknown>
  1209. 41.47 s > at <unknown source file>:<unknown line>
  1210. 41.47 s > 2: <color_eyre[b0c9e66060e883b2]::config::PanicHook>::into_panic_hook::{closure#0}<unknown>
  1211. 41.47 s > at <unknown source file>:<unknown line>
  1212. 41.47 s > 3: std[bcb96dfbba0ab899]::panicking::panic_with_hook<unknown>
  1213. 41.47 s > at <unknown source file>:<unknown line>
  1214. 41.47 s > 4: std[bcb96dfbba0ab899]::panicking::panic_handler::{closure#0}<unknown>
  1215. 41.47 s > at <unknown source file>:<unknown line>
  1216. 41.47 s > 5: std[bcb96dfbba0ab899]::sys::backtrace::__rust_end_short_backtrace::<std[bcb96dfbba0ab899]::panicking::panic_handler::{closure#0}, !><unknown>
  1217. 41.47 s > at <unknown source file>:<unknown line>
  1218. 41.47 s > 6: __rustc[6c289b9f9c454d21]::rust_begin_unwind<unknown>
  1219. 41.47 s > at <unknown source file>:<unknown line>
  1220. 41.47 s > 7: core[940e698046960fd5]::panicking::panic_fmt<unknown>
  1221. 41.47 s > at <unknown source file>:<unknown line>
  1222. 41.47 s > 8: core[940e698046960fd5]::panicking::panic<unknown>
  1223. 41.47 s > at <unknown source file>:<unknown line>
  1224. 41.47 s > 9: gammalooprs[5490727360442cce]::uv::export::tests::computed_node_full_numerator_is_a_spenso_aware_typst_fragment<unknown>
  1225. 41.47 s > at <unknown source file>:<unknown line>
  1226. 41.47 s > 10: <gammalooprs[5490727360442cce]::uv::export::tests::computed_node_full_numerator_is_a_spenso_aware_typst_fragment::{closure#0} as core[940e698046960fd5]::ops::function::FnOnce<()>>::call_once<unknown>
  1227. 41.47 s > at <unknown source file>:<unknown line>
  1228. 41.47 s > 11: test[75d6903177b1d7e9]::__rust_begin_short_backtrace::<core[940e698046960fd5]::result::Result<(), alloc[2ea6bcb46fca0c42]::string::String>, fn() -> core[940e698046960fd5]::result::Result<(), alloc[2ea6bcb46fca0c42]::string::String>><unknown>
  1229. 41.47 s > at <unknown source file>:<unknown line>
  1230. 41.47 s > 12: test[75d6903177b1d7e9]::run_test::{closure#0}<unknown>
  1231. 41.47 s > at <unknown source file>:<unknown line>
  1232. 41.47 s > 13: std[bcb96dfbba0ab899]::sys::backtrace::__rust_begin_short_backtrace::<test[75d6903177b1d7e9]::run_test::{closure#1}, ()><unknown>
  1233. 41.47 s > at <unknown source file>:<unknown line>
  1234. 41.47 s > 14: <std[bcb96dfbba0ab899]::thread::lifecycle::spawn_unchecked<test[75d6903177b1d7e9]::run_test::{closure#1}, ()>::{closure#1} as core[940e698046960fd5]::ops::function::FnOnce<()>>::call_once::{shim:vtable#0}<unknown>
  1235. 41.47 s > at <unknown source file>:<unknown line>
  1236. 41.47 s > 15: <std[bcb96dfbba0ab899]::sys::thread::unix::Thread>::new::thread_start<unknown>
  1237. 41.47 s > at <unknown source file>:<unknown line>
  1238. 41.47 s > 16: start_thread<unknown>
  1239. 41.47 s > at <unknown source file>:<unknown line>
  1240. 41.47 s > 17: __clone3<unknown>
  1241. 41.47 s > at <unknown source file>:<unknown line>
  1242. 41.47 s >
  1243. 41.47 s > Run with COLORBT_SHOW_HIDDEN=1 environment variable to disable frame filtering.
  1244. 41.47 s > Run with RUST_BACKTRACE=full to include source snippets.
  1245. 41.47 s > =========================================
  1246. 41.47 s For full logs, run:
  1247. 41.47 s nix log /nix/store/07lma8g6p1n7jxf8azmxf90ca6pqjydj-gammaloop-nextest-core.drv
  1248. 41.62 s [0 built (1 failed)]Run failed.