test packages.x86_64-linux.nix-ci-check-gammaloop-nextest-docs

Reproduce this run
Original Run
  1. 32.68 s gammaloop-nextest-docs> Caused by:
  2. 32.68 s gammaloop-nextest-docs> No such file or directory (os error 2)
  3. 32.68 s gammaloop-nextest-docs>
  4. 32.68 s gammaloop-nextest-docs> Location:
  5. 32.68 s gammaloop-nextest-docs> crates/alphal00p-docs-builder/src/lib.rs:582:14
  6. 32.68 s gammaloop-nextest-docs> stack backtrace:
  7. 32.68 s gammaloop-nextest-docs> 0: __rustc::rust_begin_unwind
  8. 32.68 s gammaloop-nextest-docs> 1: core::panicking::panic_fmt
  9. 32.68 s gammaloop-nextest-docs> 2: core::result::unwrap_failed
  10. 32.68 s gammaloop-nextest-docs> 3: alphal00p_docs_builder::tests::generated_link_validation_rejects_phantom_anchors
  11. 32.68 s gammaloop-nextest-docs> 4: <alphal00p_docs_builder::tests::generated_link_validation_rejects_phantom_anchors::{closure#0} as core::ops::function::FnOnce<()>>::call_once
  12. 32.68 s gammaloop-nextest-docs> note: Some details are omitted, run with `RUST_BACKTRACE=full` for a verbose backtrace.
  13. 32.68 s gammaloop-nextest-docs>
  14. 32.68 s gammaloop-nextest-docs> 19. alphal00p-docs-builder::tests::immutable_snapshot_navigation_does_not_link_mutable_developer_notes
  15. 32.68 s gammaloop-nextest-docs> failure: test failure with exit code 101
  16. 32.68 s gammaloop-nextest-docs> thread 'tests::immutable_snapshot_navigation_does_not_link_mutable_developer_notes' (291) panicked at crates/alphal00p-docs-builder/src/lib.rs:9041:47:
  17. 32.68 s gammaloop-nextest-docs> called `Result::unwrap()` on an `Err` value: failed to read /build/source/docs/portal.toml
  18. 32.68 s gammaloop-nextest-docs>
  19. 32.68 s gammaloop-nextest-docs> Caused by:
  20. 32.68 s gammaloop-nextest-docs> No such file or directory (os error 2)
  21. 32.68 s gammaloop-nextest-docs>
  22. 32.68 s gammaloop-nextest-docs> Location:
  23. 32.68 s gammaloop-nextest-docs> crates/alphal00p-docs-builder/src/lib.rs:582:14
  24. 32.68 s gammaloop-nextest-docs> stack backtrace:
  25. 32.68 s gammaloop-nextest-docs> 0: __rustc::rust_begin_unwind
  26. 32.68 s gammaloop-nextest-docs> 1: core::panicking::panic_fmt
  27. 32.68 s gammaloop-nextest-docs> 2: core::result::unwrap_failed
  28. 32.68 s gammaloop-nextest-docs> 3: alphal00p_docs_builder::tests::immutable_snapshot_navigation_does_not_link_mutable_developer_notes
  29. 32.68 s gammaloop-nextest-docs> 4: <alphal00p_docs_builder::tests::immutable_snapshot_navigation_does_not_link_mutable_developer_notes::{closure#0} as core::ops::function::FnOnce<()>>::call_once
  30. 32.68 s gammaloop-nextest-docs> note: Some details are omitted, run with `RUST_BACKTRACE=full` for a verbose backtrace.
  31. 32.68 s gammaloop-nextest-docs> system-out
  32. 32.68 s gammaloop-nextest-docs> running 1 test
  33. 32.68 s gammaloop-nextest-docs> test tests::immutable_snapshot_navigation_does_not_link_mutable_developer_notes ... FAILED
  34. 32.68 s gammaloop-nextest-docs>
  35. 32.68 s gammaloop-nextest-docs> failures:
  36. 32.68 s gammaloop-nextest-docs>
  37. 32.68 s gammaloop-nextest-docs> failures:
  38. 32.68 s gammaloop-nextest-docs> tests::immutable_snapshot_navigation_does_not_link_mutable_developer_notes
  39. 32.68 s gammaloop-nextest-docs>
  40. 32.68 s gammaloop-nextest-docs> test result: FAILED. 0 passed; 1 failed; 0 ignored; 0 measured; 101 filtered out; finished in 0.00s
  41. 32.68 s gammaloop-nextest-docs> system-err
  42. 32.68 s gammaloop-nextest-docs> thread 'tests::immutable_snapshot_navigation_does_not_link_mutable_developer_notes' (291) panicked at crates/alphal00p-docs-builder/src/lib.rs:9041:47:
  43. 32.68 s gammaloop-nextest-docs> called `Result::unwrap()` on an `Err` value: failed to read /build/source/docs/portal.toml
  44. 32.68 s gammaloop-nextest-docs>
  45. 32.68 s gammaloop-nextest-docs> Caused by:
  46. 32.68 s gammaloop-nextest-docs> No such file or directory (os error 2)
  47. 32.68 s gammaloop-nextest-docs>
  48. 32.68 s gammaloop-nextest-docs> Location:
  49. 32.68 s gammaloop-nextest-docs> crates/alphal00p-docs-builder/src/lib.rs:582:14
  50. 32.68 s gammaloop-nextest-docs> stack backtrace:
  51. 32.68 s gammaloop-nextest-docs> 0: __rustc::rust_begin_unwind
  52. 32.68 s gammaloop-nextest-docs> 1: core::panicking::panic_fmt
  53. 32.68 s gammaloop-nextest-docs> 2: core::result::unwrap_failed
  54. 32.68 s gammaloop-nextest-docs> 3: alphal00p_docs_builder::tests::immutable_snapshot_navigation_does_not_link_mutable_developer_notes
  55. 32.68 s gammaloop-nextest-docs> 4: <alphal00p_docs_builder::tests::immutable_snapshot_navigation_does_not_link_mutable_developer_notes::{closure#0} as core::ops::function::FnOnce<()>>::call_once
  56. 32.68 s gammaloop-nextest-docs> note: Some details are omitted, run with `RUST_BACKTRACE=full` for a verbose backtrace.
  57. 32.68 s gammaloop-nextest-docs>
  58. 32.68 s gammaloop-nextest-docs> 20. alphal00p-docs-builder::tests::generated_search_links_are_validated_without_rewriting_html
  59. 32.68 s gammaloop-nextest-docs> failure: test failure with exit code 101
  60. 32.68 s gammaloop-nextest-docs> thread 'tests::generated_search_links_are_validated_without_rewriting_html' (284) panicked at crates/alphal00p-docs-builder/src/lib.rs:10077:47:
  61. 32.68 s gammaloop-nextest-docs> called `Result::unwrap()` on an `Err` value: failed to read /build/source/docs/portal.toml
  62. 32.68 s gammaloop-nextest-docs>
  63. 32.68 s gammaloop-nextest-docs> Caused by:
  64. 32.68 s gammaloop-nextest-docs> No such file or directory (os error 2)
  65. 32.68 s gammaloop-nextest-docs>
  66. 32.68 s gammaloop-nextest-docs> Location:
  67. 32.68 s gammaloop-nextest-docs> crates/alphal00p-docs-builder/src/lib.rs:582:14
  68. 32.68 s gammaloop-nextest-docs> stack backtrace:
  69. 32.68 s gammaloop-nextest-docs> 0: __rustc::rust_begin_unwind
  70. 32.68 s gammaloop-nextest-docs> 1: core::panicking::panic_fmt
  71. 32.68 s gammaloop-nextest-docs> 2: core::result::unwrap_failed
  72. 32.68 s gammaloop-nextest-docs> 3: alphal00p_docs_builder::tests::generated_search_links_are_validated_without_rewriting_html
  73. 32.68 s gammaloop-nextest-docs> 4: <alphal00p_docs_builder::tests::generated_search_links_are_validated_without_rewriting_html::{closure#0} as core::ops::function::FnOnce<()>>::call_once
  74. 32.68 s gammaloop-nextest-docs> note: Some details are omitted, run with `RUST_BACKTRACE=full` for a verbose backtrace.
  75. 32.68 s gammaloop-nextest-docs> system-out
  76. 32.68 s gammaloop-nextest-docs> running 1 test
  77. 32.68 s gammaloop-nextest-docs> test tests::generated_search_links_are_validated_without_rewriting_html ... FAILED
  78. 32.68 s gammaloop-nextest-docs>
  79. 32.68 s gammaloop-nextest-docs> failures:
  80. 32.68 s gammaloop-nextest-docs>
  81. 32.68 s gammaloop-nextest-docs> failures:
  82. 32.68 s gammaloop-nextest-docs> tests::generated_search_links_are_validated_without_rewriting_html
  83. 32.68 s gammaloop-nextest-docs>
  84. 32.68 s gammaloop-nextest-docs> test result: FAILED. 0 passed; 1 failed; 0 ignored; 0 measured; 101 filtered out; finished in 0.01s
  85. 32.68 s gammaloop-nextest-docs> system-err
  86. 32.68 s gammaloop-nextest-docs> thread 'tests::generated_search_links_are_validated_without_rewriting_html' (284) panicked at crates/alphal00p-docs-builder/src/lib.rs:10077:47:
  87. 32.68 s gammaloop-nextest-docs> called `Result::unwrap()` on an `Err` value: failed to read /build/source/docs/portal.toml
  88. 32.68 s gammaloop-nextest-docs>
  89. 32.68 s gammaloop-nextest-docs> Caused by:
  90. 32.68 s gammaloop-nextest-docs> No such file or directory (os error 2)
  91. 32.68 s gammaloop-nextest-docs>
  92. 32.68 s gammaloop-nextest-docs> Location:
  93. 32.68 s gammaloop-nextest-docs> crates/alphal00p-docs-builder/src/lib.rs:582:14
  94. 32.68 s gammaloop-nextest-docs> stack backtrace:
  95. 32.68 s gammaloop-nextest-docs> 0: __rustc::rust_begin_unwind
  96. 32.68 s gammaloop-nextest-docs> 1: core::panicking::panic_fmt
  97. 32.68 s gammaloop-nextest-docs> 2: core::result::unwrap_failed
  98. 32.68 s gammaloop-nextest-docs> 3: alphal00p_docs_builder::tests::generated_search_links_are_validated_without_rewriting_html
  99. 32.68 s gammaloop-nextest-docs> 4: <alphal00p_docs_builder::tests::generated_search_links_are_validated_without_rewriting_html::{closure#0} as core::ops::function::FnOnce<()>>::call_once
  100. 32.68 s gammaloop-nextest-docs> note: Some details are omitted, run with `RUST_BACKTRACE=full` for a verbose backtrace.
  101. 32.68 s gammaloop-nextest-docs>
  102. 32.68 s gammaloop-nextest-docs> ... omitted 26 more failing tests
  103. 32.68 s gammaloop-nextest-docs> =========================================
  104. 32.69 s gammaloop-nextest-docs> Extracting 2 binaries to /build/nextest-archive-k4JG5X
  105. 32.73 s gammaloop-nextest-docs> Extracted 5 files to /build/nextest-archive-k4JG5X in 0.05s
  106. 32.75 s gammaloop-nextest-docs> ------------
  107. 32.75 s gammaloop-nextest-docs> Nextest run ID 62a8b5cf-3144-4e48-8f00-adbe4b77cc45 with nextest profile: ci_gammaloop
  108. 32.75 s gammaloop-nextest-docs> Starting 22 tests across 2 binaries
  109. 32.77 s gammaloop-nextest-docs> ------------
  110. 32.77 s gammaloop-nextest-docs> Summary [ 0.026s] 22 tests run: 22 passed, 0 skipped
  111. 32.82 s gammaloop-nextest-docs>
  112. 32.82 s gammaloop-nextest-docs> ========== nextest test summary ==========
  113. 32.82 s gammaloop-nextest-docs> report: target/nextest/ci_gammaloop/junit.xml
  114. 32.82 s gammaloop-nextest-docs> tests: 22, failures: 0, errors: 0
  115. 32.82 s gammaloop-nextest-docs> No failing testcases found.
  116. 32.82 s gammaloop-nextest-docs> =========================================
  117. 32.84 s gammaloop-nextest-docs> Extracting 1 binary, 1 build script output directory, and 2 linked paths to /build/nextest-archive-AtunNQ
  118. 32.95 s gammaloop-nextest-docs> Extracted 18 files to /build/nextest-archive-AtunNQ in 0.11s
  119. 32.96 s gammaloop-nextest-docs> ------------
  120. 32.96 s gammaloop-nextest-docs> Nextest run ID 917b8e37-1bb1-4425-bb29-74b1abf09b1f with nextest profile: ci_gammaloop
  121. 32.96 s gammaloop-nextest-docs> Starting 85 tests across 1 binary
  122. 33.00 s gammaloop-nextest-docs> FAIL [ 0.035s] (27/85) alphal00p-docs-examples catalog_examples::python_catalog_examples_compile_without_importing_products
  123. 33.00 s gammaloop-nextest-docs> stdout ---
  124. 33.00 s gammaloop-nextest-docs>
  125. 33.00 s gammaloop-nextest-docs> running 1 test
  126. 33.00 s gammaloop-nextest-docs> test catalog_examples::python_catalog_examples_compile_without_importing_products ... FAILED
  127. 33.00 s gammaloop-nextest-docs>
  128. 33.00 s gammaloop-nextest-docs> failures:
  129. 33.00 s gammaloop-nextest-docs>
  130. 33.00 s gammaloop-nextest-docs> failures:
  131. 33.00 s gammaloop-nextest-docs> catalog_examples::python_catalog_examples_compile_without_importing_products
  132. 33.00 s gammaloop-nextest-docs>
  133. 33.00 s gammaloop-nextest-docs> test result: FAILED. 0 passed; 1 failed; 0 ignored; 0 measured; 84 filtered out; finished in 0.01s
  134. 33.00 s gammaloop-nextest-docs>
  135. 33.00 s gammaloop-nextest-docs> stderr ---
  136. 33.00 s gammaloop-nextest-docs>
  137. 33.00 s gammaloop-nextest-docs> thread 'catalog_examples::python_catalog_examples_compile_without_importing_products' (577) panicked at crates/alphal00p-docs-examples/src/lib.rs:39:17:
  138. 33.00 s gammaloop-nextest-docs> failed to start Python interpreter python3: No such file or directory (os error 2)
  139. 33.00 s gammaloop-nextest-docs> stack backtrace:
  140. 33.00 s gammaloop-nextest-docs> 0: __rustc::rust_begin_unwind
  141. 33.00 s gammaloop-nextest-docs> 1: core::panicking::panic_fmt
  142. 33.00 s gammaloop-nextest-docs> 2: alphal00p_docs_examples::catalog_examples::python_catalog_examples_compile_without_importing_products::{closure#0}
  143. 33.00 s gammaloop-nextest-docs> 3: alphal00p_docs_examples::catalog_examples::python_catalog_examples_compile_without_importing_products
  144. 33.00 s gammaloop-nextest-docs> 4: <alphal00p_docs_examples::catalog_examples::python_catalog_examples_compile_without_importing_products::{closure#0} as core::ops::function::FnOnce<()>>::call_once
  145. 33.00 s gammaloop-nextest-docs> note: Some details are omitted, run with `RUST_BACKTRACE=full` for a verbose backtrace.
  146. 33.00 s gammaloop-nextest-docs>
  147. 33.07 s gammaloop-nextest-docs> FAIL [ 0.019s] (85/85) alphal00p-docs-examples catalog_examples::shell_catalog_examples_parse_without_execution
  148. 33.07 s gammaloop-nextest-docs> stdout ---
  149. 33.07 s gammaloop-nextest-docs>
  150. 33.07 s gammaloop-nextest-docs> running 1 test
  151. 33.07 s gammaloop-nextest-docs> test catalog_examples::shell_catalog_examples_parse_without_execution ... FAILED
  152. 33.07 s gammaloop-nextest-docs>
  153. 33.07 s gammaloop-nextest-docs> failures:
  154. 33.07 s gammaloop-nextest-docs>
  155. 33.07 s gammaloop-nextest-docs> failures:
  156. 33.07 s gammaloop-nextest-docs> catalog_examples::shell_catalog_examples_parse_without_execution
  157. 33.07 s gammaloop-nextest-docs>
  158. 33.07 s gammaloop-nextest-docs> test result: FAILED. 0 passed; 1 failed; 0 ignored; 0 measured; 84 filtered out; finished in 0.01s
  159. 33.07 s gammaloop-nextest-docs>
  160. 33.07 s gammaloop-nextest-docs> stderr ---
  161. 33.07 s gammaloop-nextest-docs>
  162. 33.07 s gammaloop-nextest-docs> thread 'catalog_examples::shell_catalog_examples_parse_without_execution' (692) panicked at crates/alphal00p-docs-examples/src/lib.rs:25:9:
  163. 33.07 s gammaloop-nextest-docs> shell documentation example validation failed:
  164. 33.07 s gammaloop-nextest-docs> bash: /build/source/target/ci-optim/build/alphal00p-docs-examples-48b938e1dbf43715/out/shell_catalog_examples.sh: No such file or directory
  165. 33.07 s gammaloop-nextest-docs>
  166. 33.07 s gammaloop-nextest-docs> stack backtrace:
  167. 33.07 s gammaloop-nextest-docs> 0: __rustc::rust_begin_unwind
  168. 33.07 s gammaloop-nextest-docs> 1: core::panicking::panic_fmt
  169. 33.07 s gammaloop-nextest-docs> 2: alphal00p_docs_examples::catalog_examples::shell_catalog_examples_parse_without_execution
  170. 33.07 s gammaloop-nextest-docs> 3: <alphal00p_docs_examples::catalog_examples::shell_catalog_examples_parse_without_execution::{closure#0} as core::ops::function::FnOnce<()>>::call_once
  171. 33.07 s gammaloop-nextest-docs> note: Some details are omitted, run with `RUST_BACKTRACE=full` for a verbose backtrace.
  172. 33.07 s gammaloop-nextest-docs>
  173. 33.07 s gammaloop-nextest-docs> ------------
  174. 33.07 s gammaloop-nextest-docs> Summary [ 0.108s] 85 tests run: 83 passed, 2 failed, 0 skipped
  175. 33.07 s gammaloop-nextest-docs> FAIL [ 0.035s] (27/85) alphal00p-docs-examples catalog_examples::python_catalog_examples_compile_without_importing_products
  176. 33.07 s gammaloop-nextest-docs> stdout ---
  177. 33.07 s gammaloop-nextest-docs>
  178. 33.07 s gammaloop-nextest-docs> running 1 test
  179. 33.07 s gammaloop-nextest-docs> test catalog_examples::python_catalog_examples_compile_without_importing_products ... FAILED
  180. 33.07 s gammaloop-nextest-docs>
  181. 33.07 s gammaloop-nextest-docs> failures:
  182. 33.07 s gammaloop-nextest-docs>
  183. 33.07 s gammaloop-nextest-docs> failures:
  184. 33.07 s gammaloop-nextest-docs> catalog_examples::python_catalog_examples_compile_without_importing_products
  185. 33.07 s gammaloop-nextest-docs>
  186. 33.07 s gammaloop-nextest-docs> test result: FAILED. 0 passed; 1 failed; 0 ignored; 0 measured; 84 filtered out; finished in 0.01s
  187. 33.07 s gammaloop-nextest-docs>
  188. 33.07 s gammaloop-nextest-docs> stderr ---
  189. 33.07 s gammaloop-nextest-docs>
  190. 33.07 s gammaloop-nextest-docs> thread 'catalog_examples::python_catalog_examples_compile_without_importing_products' (577) panicked at crates/alphal00p-docs-examples/src/lib.rs:39:17:
  191. 33.07 s gammaloop-nextest-docs> failed to start Python interpreter python3: No such file or directory (os error 2)
  192. 33.07 s gammaloop-nextest-docs> stack backtrace:
  193. 33.07 s gammaloop-nextest-docs> 0: __rustc::rust_begin_unwind
  194. 33.07 s gammaloop-nextest-docs> 1: core::panicking::panic_fmt
  195. 33.07 s gammaloop-nextest-docs> 2: alphal00p_docs_examples::catalog_examples::python_catalog_examples_compile_without_importing_products::{closure#0}
  196. 33.07 s gammaloop-nextest-docs> 3: alphal00p_docs_examples::catalog_examples::python_catalog_examples_compile_without_importing_products
  197. 33.07 s gammaloop-nextest-docs> 4: <alphal00p_docs_examples::catalog_examples::python_catalog_examples_compile_without_importing_products::{closure#0} as core::ops::function::FnOnce<()>>::call_once
  198. 33.07 s gammaloop-nextest-docs> note: Some details are omitted, run with `RUST_BACKTRACE=full` for a verbose backtrace.
  199. 33.07 s gammaloop-nextest-docs>
  200. 33.07 s gammaloop-nextest-docs> FAIL [ 0.019s] (85/85) alphal00p-docs-examples catalog_examples::shell_catalog_examples_parse_without_execution
  201. 33.07 s gammaloop-nextest-docs> stdout ---
  202. 33.07 s gammaloop-nextest-docs>
  203. 33.07 s gammaloop-nextest-docs> running 1 test
  204. 33.07 s gammaloop-nextest-docs> test catalog_examples::shell_catalog_examples_parse_without_execution ... FAILED
  205. 33.07 s gammaloop-nextest-docs>
  206. 33.07 s gammaloop-nextest-docs> failures:
  207. 33.07 s gammaloop-nextest-docs>
  208. 33.07 s gammaloop-nextest-docs> failures:
  209. 33.07 s gammaloop-nextest-docs> catalog_examples::shell_catalog_examples_parse_without_execution
  210. 33.07 s gammaloop-nextest-docs>
  211. 33.07 s gammaloop-nextest-docs> test result: FAILED. 0 passed; 1 failed; 0 ignored; 0 measured; 84 filtered out; finished in 0.01s
  212. 33.07 s gammaloop-nextest-docs>
  213. 33.07 s gammaloop-nextest-docs> stderr ---
  214. 33.07 s gammaloop-nextest-docs>
  215. 33.07 s gammaloop-nextest-docs> thread 'catalog_examples::shell_catalog_examples_parse_without_execution' (692) panicked at crates/alphal00p-docs-examples/src/lib.rs:25:9:
  216. 33.07 s gammaloop-nextest-docs> shell documentation example validation failed:
  217. 33.07 s gammaloop-nextest-docs> bash: /build/source/target/ci-optim/build/alphal00p-docs-examples-48b938e1dbf43715/out/shell_catalog_examples.sh: No such file or directory
  218. 33.07 s gammaloop-nextest-docs>
  219. 33.07 s gammaloop-nextest-docs> stack backtrace:
  220. 33.07 s gammaloop-nextest-docs> 0: __rustc::rust_begin_unwind
  221. 33.07 s gammaloop-nextest-docs> 1: core::panicking::panic_fmt
  222. 33.07 s gammaloop-nextest-docs> 2: alphal00p_docs_examples::catalog_examples::shell_catalog_examples_parse_without_execution
  223. 33.07 s gammaloop-nextest-docs> 3: <alphal00p_docs_examples::catalog_examples::shell_catalog_examples_parse_without_execution::{closure#0} as core::ops::function::FnOnce<()>>::call_once
  224. 33.07 s gammaloop-nextest-docs> note: Some details are omitted, run with `RUST_BACKTRACE=full` for a verbose backtrace.
  225. 33.07 s gammaloop-nextest-docs>
  226. 33.09 s gammaloop-nextest-docs> error: test run failed
  227. 33.13 s gammaloop-nextest-docs>
  228. 33.13 s gammaloop-nextest-docs> ========== nextest test summary ==========
  229. 33.13 s gammaloop-nextest-docs> report: target/nextest/ci_gammaloop/junit.xml
  230. 33.13 s gammaloop-nextest-docs> tests: 85, failures: 2, errors: 0
  231. 33.13 s gammaloop-nextest-docs>
  232. 33.13 s gammaloop-nextest-docs> 1. alphal00p-docs-examples::catalog_examples::python_catalog_examples_compile_without_importing_products
  233. 33.13 s gammaloop-nextest-docs> failure: test failure with exit code 101
  234. 33.13 s gammaloop-nextest-docs> thread 'catalog_examples::python_catalog_examples_compile_without_importing_products' (577) panicked at crates/alphal00p-docs-examples/src/lib.rs:39:17:
  235. 33.13 s gammaloop-nextest-docs> failed to start Python interpreter python3: No such file or directory (os error 2)
  236. 33.13 s gammaloop-nextest-docs> stack backtrace:
  237. 33.13 s gammaloop-nextest-docs> 0: __rustc::rust_begin_unwind
  238. 33.13 s gammaloop-nextest-docs> 1: core::panicking::panic_fmt
  239. 33.13 s gammaloop-nextest-docs> 2: alphal00p_docs_examples::catalog_examples::python_catalog_examples_compile_without_importing_products::{closure#0}
  240. 33.13 s gammaloop-nextest-docs> 3: alphal00p_docs_examples::catalog_examples::python_catalog_examples_compile_without_importing_products
  241. 33.13 s gammaloop-nextest-docs> 4: <alphal00p_docs_examples::catalog_examples::python_catalog_examples_compile_without_importing_products::{closure#0} as core::ops::function::FnOnce<()>>::call_once
  242. 33.13 s gammaloop-nextest-docs> note: Some details are omitted, run with `RUST_BACKTRACE=full` for a verbose backtrace.
  243. 33.13 s gammaloop-nextest-docs> system-out
  244. 33.13 s gammaloop-nextest-docs> running 1 test
  245. 33.13 s gammaloop-nextest-docs> test catalog_examples::python_catalog_examples_compile_without_importing_products ... FAILED
  246. 33.13 s gammaloop-nextest-docs>
  247. 33.13 s gammaloop-nextest-docs> failures:
  248. 33.13 s gammaloop-nextest-docs>
  249. 33.13 s gammaloop-nextest-docs> failures:
  250. 33.13 s gammaloop-nextest-docs> catalog_examples::python_catalog_examples_compile_without_importing_products
  251. 33.13 s gammaloop-nextest-docs>
  252. 33.13 s gammaloop-nextest-docs> test result: FAILED. 0 passed; 1 failed; 0 ignored; 0 measured; 84 filtered out; finished in 0.01s
  253. 33.13 s gammaloop-nextest-docs> system-err
  254. 33.13 s gammaloop-nextest-docs> thread 'catalog_examples::python_catalog_examples_compile_without_importing_products' (577) panicked at crates/alphal00p-docs-examples/src/lib.rs:39:17:
  255. 33.13 s gammaloop-nextest-docs> failed to start Python interpreter python3: No such file or directory (os error 2)
  256. 33.13 s gammaloop-nextest-docs> stack backtrace:
  257. 33.13 s gammaloop-nextest-docs> 0: __rustc::rust_begin_unwind
  258. 33.13 s gammaloop-nextest-docs> 1: core::panicking::panic_fmt
  259. 33.13 s gammaloop-nextest-docs> 2: alphal00p_docs_examples::catalog_examples::python_catalog_examples_compile_without_importing_products::{closure#0}
  260. 33.13 s gammaloop-nextest-docs> 3: alphal00p_docs_examples::catalog_examples::python_catalog_examples_compile_without_importing_products
  261. 33.13 s gammaloop-nextest-docs> 4: <alphal00p_docs_examples::catalog_examples::python_catalog_examples_compile_without_importing_products::{closure#0} as core::ops::function::FnOnce<()>>::call_once
  262. 33.13 s gammaloop-nextest-docs> note: Some details are omitted, run with `RUST_BACKTRACE=full` for a verbose backtrace.
  263. 33.13 s gammaloop-nextest-docs>
  264. 33.13 s gammaloop-nextest-docs> 2. alphal00p-docs-examples::catalog_examples::shell_catalog_examples_parse_without_execution
  265. 33.13 s gammaloop-nextest-docs> failure: test failure with exit code 101
  266. 33.13 s gammaloop-nextest-docs> thread 'catalog_examples::shell_catalog_examples_parse_without_execution' (692) panicked at crates/alphal00p-docs-examples/src/lib.rs:25:9:
  267. 33.13 s gammaloop-nextest-docs> shell documentation example validation failed:
  268. 33.13 s gammaloop-nextest-docs> bash: /build/source/target/ci-optim/build/alphal00p-docs-examples-48b938e1dbf43715/out/shell_catalog_examples.sh: No such file or directory
  269. 33.13 s gammaloop-nextest-docs>
  270. 33.13 s gammaloop-nextest-docs> stack backtrace:
  271. 33.13 s gammaloop-nextest-docs> 0: __rustc::rust_begin_unwind
  272. 33.13 s gammaloop-nextest-docs> 1: core::panicking::panic_fmt
  273. 33.13 s gammaloop-nextest-docs> 2: alphal00p_docs_examples::catalog_examples::shell_catalog_examples_parse_without_execution
  274. 33.13 s gammaloop-nextest-docs> 3: <alphal00p_docs_examples::catalog_examples::shell_catalog_examples_parse_without_execution::{closure#0} as core::ops::function::FnOnce<()>>::call_once
  275. 33.13 s gammaloop-nextest-docs> note: Some details are omitted, run with `RUST_BACKTRACE=full` for a verbose backtrace.
  276. 33.13 s gammaloop-nextest-docs> system-out
  277. 33.13 s gammaloop-nextest-docs> running 1 test
  278. 33.13 s gammaloop-nextest-docs> test catalog_examples::shell_catalog_examples_parse_without_execution ... FAILED
  279. 33.13 s gammaloop-nextest-docs>
  280. 33.13 s gammaloop-nextest-docs> failures:
  281. 33.13 s gammaloop-nextest-docs>
  282. 33.13 s gammaloop-nextest-docs> failures:
  283. 33.13 s gammaloop-nextest-docs> catalog_examples::shell_catalog_examples_parse_without_execution
  284. 33.13 s gammaloop-nextest-docs>
  285. 33.13 s gammaloop-nextest-docs> test result: FAILED. 0 passed; 1 failed; 0 ignored; 0 measured; 84 filtered out; finished in 0.01s
  286. 33.13 s gammaloop-nextest-docs> system-err
  287. 33.13 s gammaloop-nextest-docs> thread 'catalog_examples::shell_catalog_examples_parse_without_execution' (692) panicked at crates/alphal00p-docs-examples/src/lib.rs:25:9:
  288. 33.13 s gammaloop-nextest-docs> shell documentation example validation failed:
  289. 33.13 s gammaloop-nextest-docs> bash: /build/source/target/ci-optim/build/alphal00p-docs-examples-48b938e1dbf43715/out/shell_catalog_examples.sh: No such file or directory
  290. 33.13 s gammaloop-nextest-docs>
  291. 33.13 s gammaloop-nextest-docs> stack backtrace:
  292. 33.13 s gammaloop-nextest-docs> 0: __rustc::rust_begin_unwind
  293. 33.13 s gammaloop-nextest-docs> 1: core::panicking::panic_fmt
  294. 33.13 s gammaloop-nextest-docs> 2: alphal00p_docs_examples::catalog_examples::shell_catalog_examples_parse_without_execution
  295. 33.13 s gammaloop-nextest-docs> 3: <alphal00p_docs_examples::catalog_examples::shell_catalog_examples_parse_without_execution::{closure#0} as core::ops::function::FnOnce<()>>::call_once
  296. 33.13 s gammaloop-nextest-docs> note: Some details are omitted, run with `RUST_BACKTRACE=full` for a verbose backtrace.
  297. 33.13 s gammaloop-nextest-docs> =========================================
  298. 33.15 s gammaloop-nextest-docs> Extracting 2 binaries to /build/nextest-archive-rlgVhn
  299. 33.20 s gammaloop-nextest-docs> Extracted 5 files to /build/nextest-archive-rlgVhn in 0.06s
  300. 33.22 s gammaloop-nextest-docs> ------------
  301. 33.22 s gammaloop-nextest-docs> Nextest run ID c3bc22bc-b727-4484-99bb-8e850cbe8835 with nextest profile: ci_gammaloop
  302. 33.22 s gammaloop-nextest-docs> Starting 10 tests across 2 binaries
  303. 33.33 s gammaloop-nextest-docs> FAIL [ 0.113s] (10/10) alphal00p-docs-macros::trybuild documentation_attributes_compile_and_diagnose
  304. 33.33 s gammaloop-nextest-docs> stdout ---
  305. 33.33 s gammaloop-nextest-docs>
  306. 33.33 s gammaloop-nextest-docs> running 1 test
  307. 33.33 s gammaloop-nextest-docs> test documentation_attributes_compile_and_diagnose ... FAILED
  308. 33.33 s gammaloop-nextest-docs>
  309. 33.33 s gammaloop-nextest-docs> failures:
  310. 33.33 s gammaloop-nextest-docs>
  311. 33.33 s gammaloop-nextest-docs> failures:
  312. 33.33 s gammaloop-nextest-docs> documentation_attributes_compile_and_diagnose
  313. 33.33 s gammaloop-nextest-docs>
  314. 33.33 s gammaloop-nextest-docs> test result: FAILED. 0 passed; 1 failed; 0 ignored; 0 measured; 0 filtered out; finished in 0.11s
  315. 33.33 s gammaloop-nextest-docs>
  316. 33.33 s gammaloop-nextest-docs> stderr ---
  317. 33.33 s gammaloop-nextest-docs> error: failed to load source for dependency `graphica`
  318. 33.33 s gammaloop-nextest-docs>
  319. 33.33 s gammaloop-nextest-docs> Caused by:
  320. 33.33 s gammaloop-nextest-docs> unable to update https://github.com/symbolica-dev/symbolica?branch=dev#0441bd7a
  321. 33.33 s gammaloop-nextest-docs>
  322. 33.33 s gammaloop-nextest-docs> Caused by:
  323. 33.33 s gammaloop-nextest-docs> can't checkout from 'https://github.com/symbolica-dev/symbolica': you are in the offline mode (--offline)
  324. 33.33 s gammaloop-nextest-docs>
  325. 33.33 s gammaloop-nextest-docs> thread 'documentation_attributes_compile_and_diagnose' (747) panicked at /nix/store/xdy1vvhll2bijdplvl9fcc2b9plkxhaa-vendor-cargo-deps/c19b7c6f923b580ac259164a89f2577984ad5ab09ee9d583b888f934adbbe8d0/trybuild-1.0.120/src/run.rs:63:13:
  326. 33.33 s gammaloop-nextest-docs> tests failed
  327. 33.33 s gammaloop-nextest-docs> stack backtrace:
  328. 33.33 s gammaloop-nextest-docs> 0: __rustc::rust_begin_unwind
  329. 33.33 s gammaloop-nextest-docs> 1: core::panicking::panic_fmt
  330. 33.33 s gammaloop-nextest-docs> 2: <trybuild::Runner>::run::{closure#1}
  331. 33.33 s gammaloop-nextest-docs> 3: <trybuild::Runner>::run
  332. 33.33 s gammaloop-nextest-docs> 4: <trybuild::TestCases as core::ops::drop::Drop>::drop
  333. 33.33 s gammaloop-nextest-docs> 5: <trybuild::documentation_attributes_compile_and_diagnose::{closure#0} as core::ops::function::FnOnce<()>>::call_once
  334. 33.33 s gammaloop-nextest-docs> note: Some details are omitted, run with `RUST_BACKTRACE=full` for a verbose backtrace.
  335. 33.33 s gammaloop-nextest-docs>
  336. 33.33 s gammaloop-nextest-docs> ------------
  337. 33.33 s gammaloop-nextest-docs> Summary [ 0.115s] 10 tests run: 9 passed, 1 failed, 0 skipped
  338. 33.33 s gammaloop-nextest-docs> FAIL [ 0.113s] (10/10) alphal00p-docs-macros::trybuild documentation_attributes_compile_and_diagnose
  339. 33.33 s gammaloop-nextest-docs> stdout ---
  340. 33.33 s gammaloop-nextest-docs>
  341. 33.33 s gammaloop-nextest-docs> running 1 test
  342. 33.33 s gammaloop-nextest-docs> test documentation_attributes_compile_and_diagnose ... FAILED
  343. 33.33 s gammaloop-nextest-docs>
  344. 33.33 s gammaloop-nextest-docs> failures:
  345. 33.33 s gammaloop-nextest-docs>
  346. 33.33 s gammaloop-nextest-docs> failures:
  347. 33.33 s gammaloop-nextest-docs> documentation_attributes_compile_and_diagnose
  348. 33.33 s gammaloop-nextest-docs>
  349. 33.33 s gammaloop-nextest-docs> test result: FAILED. 0 passed; 1 failed; 0 ignored; 0 measured; 0 filtered out; finished in 0.11s
  350. 33.33 s gammaloop-nextest-docs>
  351. 33.33 s gammaloop-nextest-docs> stderr ---
  352. 33.33 s gammaloop-nextest-docs> error: failed to load source for dependency `graphica`
  353. 33.33 s gammaloop-nextest-docs>
  354. 33.33 s gammaloop-nextest-docs> Caused by:
  355. 33.33 s gammaloop-nextest-docs> unable to update https://github.com/symbolica-dev/symbolica?branch=dev#0441bd7a
  356. 33.33 s gammaloop-nextest-docs>
  357. 33.33 s gammaloop-nextest-docs> Caused by:
  358. 33.33 s gammaloop-nextest-docs> can't checkout from 'https://github.com/symbolica-dev/symbolica': you are in the offline mode (--offline)
  359. 33.33 s gammaloop-nextest-docs>
  360. 33.33 s gammaloop-nextest-docs> thread 'documentation_attributes_compile_and_diagnose' (747) panicked at /nix/store/xdy1vvhll2bijdplvl9fcc2b9plkxhaa-vendor-cargo-deps/c19b7c6f923b580ac259164a89f2577984ad5ab09ee9d583b888f934adbbe8d0/trybuild-1.0.120/src/run.rs:63:13:
  361. 33.33 s gammaloop-nextest-docs> tests failed
  362. 33.33 s gammaloop-nextest-docs> stack backtrace:
  363. 33.33 s gammaloop-nextest-docs> 0: __rustc::rust_begin_unwind
  364. 33.33 s gammaloop-nextest-docs> 1: core::panicking::panic_fmt
  365. 33.33 s gammaloop-nextest-docs> 2: <trybuild::Runner>::run::{closure#1}
  366. 33.33 s gammaloop-nextest-docs> 3: <trybuild::Runner>::run
  367. 33.33 s gammaloop-nextest-docs> 4: <trybuild::TestCases as core::ops::drop::Drop>::drop
  368. 33.33 s gammaloop-nextest-docs> 5: <trybuild::documentation_attributes_compile_and_diagnose::{closure#0} as core::ops::function::FnOnce<()>>::call_once
  369. 33.33 s gammaloop-nextest-docs> note: Some details are omitted, run with `RUST_BACKTRACE=full` for a verbose backtrace.
  370. 33.33 s gammaloop-nextest-docs>
  371. 33.35 s gammaloop-nextest-docs> error: test run failed
  372. 33.38 s gammaloop-nextest-docs>
  373. 33.38 s gammaloop-nextest-docs> ========== nextest test summary ==========
  374. 33.38 s gammaloop-nextest-docs> report: target/nextest/ci_gammaloop/junit.xml
  375. 33.38 s gammaloop-nextest-docs> tests: 10, failures: 1, errors: 0
  376. 33.38 s gammaloop-nextest-docs>
  377. 33.38 s gammaloop-nextest-docs> 1. alphal00p-docs-macros::trybuild::documentation_attributes_compile_and_diagnose
  378. 33.38 s gammaloop-nextest-docs> failure: test failure with exit code 101
  379. 33.38 s gammaloop-nextest-docs> thread 'documentation_attributes_compile_and_diagnose' (747) panicked at /nix/store/xdy1vvhll2bijdplvl9fcc2b9plkxhaa-vendor-cargo-deps/c19b7c6f923b580ac259164a89f2577984ad5ab09ee9d583b888f934adbbe8d0/trybuild-1.0.120/src/run.rs:63:13:
  380. 33.38 s gammaloop-nextest-docs> tests failed
  381. 33.38 s gammaloop-nextest-docs> stack backtrace:
  382. 33.38 s gammaloop-nextest-docs> 0: __rustc::rust_begin_unwind
  383. 33.38 s gammaloop-nextest-docs> 1: core::panicking::panic_fmt
  384. 33.38 s gammaloop-nextest-docs> 2: <trybuild::Runner>::run::{closure#1}
  385. 33.38 s gammaloop-nextest-docs> 3: <trybuild::Runner>::run
  386. 33.38 s gammaloop-nextest-docs> 4: <trybuild::TestCases as core::ops::drop::Drop>::drop
  387. 33.38 s gammaloop-nextest-docs> 5: <trybuild::documentation_attributes_compile_and_diagnose::{closure#0} as core::ops::function::FnOnce<()>>::call_once
  388. 33.38 s gammaloop-nextest-docs> note: Some details are omitted, run with `RUST_BACKTRACE=full` for a verbose backtrace.
  389. 33.38 s gammaloop-nextest-docs> system-out
  390. 33.38 s gammaloop-nextest-docs> running 1 test
  391. 33.38 s gammaloop-nextest-docs> test documentation_attributes_compile_and_diagnose ... FAILED
  392. 33.38 s gammaloop-nextest-docs>
  393. 33.38 s gammaloop-nextest-docs> failures:
  394. 33.38 s gammaloop-nextest-docs>
  395. 33.38 s gammaloop-nextest-docs> failures:
  396. 33.38 s gammaloop-nextest-docs> documentation_attributes_compile_and_diagnose
  397. 33.38 s gammaloop-nextest-docs>
  398. 33.38 s gammaloop-nextest-docs> test result: FAILED. 0 passed; 1 failed; 0 ignored; 0 measured; 0 filtered out; finished in 0.11s
  399. 33.38 s gammaloop-nextest-docs> system-err
  400. 33.38 s gammaloop-nextest-docs> error: failed to load source for dependency `graphica`
  401. 33.38 s gammaloop-nextest-docs>
  402. 33.38 s gammaloop-nextest-docs> Caused by:
  403. 33.38 s gammaloop-nextest-docs> unable to update https://github.com/symbolica-dev/symbolica?branch=dev#0441bd7a
  404. 33.38 s gammaloop-nextest-docs>
  405. 33.38 s gammaloop-nextest-docs> Caused by:
  406. 33.38 s gammaloop-nextest-docs> can't checkout from 'https://github.com/symbolica-dev/symbolica': you are in the offline mode (--offline)
  407. 33.38 s gammaloop-nextest-docs>
  408. 33.38 s gammaloop-nextest-docs> thread 'documentation_attributes_compile_and_diagnose' (747) panicked at /nix/store/xdy1vvhll2bijdplvl9fcc2b9plkxhaa-vendor-cargo-deps/c19b7c6f923b580ac259164a89f2577984ad5ab09ee9d583b888f934adbbe8d0/trybuild-1.0.120/src/run.rs:63:13:
  409. 33.38 s gammaloop-nextest-docs> tests failed
  410. 33.38 s gammaloop-nextest-docs> stack backtrace:
  411. 33.38 s gammaloop-nextest-docs> 0: __rustc::rust_begin_unwind
  412. 33.38 s gammaloop-nextest-docs> 1: core::panicking::panic_fmt
  413. 33.39 s gammaloop-nextest-docs> 2: <trybuild::Runner>::run::{closure#1}
  414. 33.39 s gammaloop-nextest-docs> 3: <trybuild::Runner>::run
  415. 33.39 s gammaloop-nextest-docs> 4: <trybuild::TestCases as core::ops::drop::Drop>::drop
  416. 33.39 s gammaloop-nextest-docs> 5: <trybuild::documentation_attributes_compile_and_diagnose::{closure#0} as core::ops::function::FnOnce<()>>::call_once
  417. 33.39 s gammaloop-nextest-docs> note: Some details are omitted, run with `RUST_BACKTRACE=full` for a verbose backtrace.
  418. 33.39 s gammaloop-nextest-docs> =========================================
  419. 33.41 s gammaloop-nextest-docs> Extracting 1 binary to /build/nextest-archive-PVF5If
  420. 33.45 s gammaloop-nextest-docs> Extracted 4 files to /build/nextest-archive-PVF5If in 0.04s
  421. 33.47 s gammaloop-nextest-docs> ------------
  422. 33.47 s gammaloop-nextest-docs> Nextest run ID fdcbaf28-fe2c-4813-9011-fabd1fe5d30d with nextest profile: ci_gammaloop
  423. 33.47 s gammaloop-nextest-docs> Starting 0 tests across 1 binary
  424. 33.47 s gammaloop-nextest-docs> ------------
  425. 33.47 s gammaloop-nextest-docs> Summary [ 0.000s] 0 tests run: 0 passed, 0 skipped
  426. 33.51 s gammaloop-nextest-docs>
  427. 33.51 s gammaloop-nextest-docs> ========== nextest test summary ==========
  428. 33.51 s gammaloop-nextest-docs> report: target/nextest/ci_gammaloop/junit.xml
  429. 33.51 s gammaloop-nextest-docs> tests: 0, failures: 0, errors: 0
  430. 33.51 s gammaloop-nextest-docs> No failing testcases found.
  431. 33.51 s gammaloop-nextest-docs> =========================================
  432. 33.54 s gammaloop-nextest-docs> Extracting 1 binary to /build/nextest-archive-MYZWSM
  433. 33.59 s gammaloop-nextest-docs> Extracted 4 files to /build/nextest-archive-MYZWSM in 0.05s
  434. 33.60 s gammaloop-nextest-docs> ------------
  435. 33.60 s gammaloop-nextest-docs> Nextest run ID f3ed05a7-5791-4435-ae79-9d6725bc9289 with nextest profile: ci_gammaloop
  436. 33.60 s gammaloop-nextest-docs> Starting 5 tests across 1 binary
  437. 33.61 s gammaloop-nextest-docs> ------------
  438. 33.61 s gammaloop-nextest-docs> Summary [ 0.013s] 5 tests run: 5 passed, 0 skipped
  439. 33.66 s gammaloop-nextest-docs>
  440. 33.66 s gammaloop-nextest-docs> ========== nextest test summary ==========
  441. 33.66 s gammaloop-nextest-docs> report: target/nextest/ci_gammaloop/junit.xml
  442. 33.66 s gammaloop-nextest-docs> tests: 5, failures: 0, errors: 0
  443. 33.66 s gammaloop-nextest-docs> No failing testcases found.
  444. 33.66 s gammaloop-nextest-docs> =========================================
  445. 33.73 s error: Cannot build '/nix/store/6r13pbqsnmyyicpdrz1zkw00g0gdh9dy-gammaloop-nextest-docs.drv'.
  446. 33.73 s Reason: builder failed with exit code 100.
  447. 33.73 s Output paths:
  448. 33.73 s /nix/store/l523ply1armrmcxql3hw9v282km7ir52-gammaloop-nextest-docs
  449. 33.73 s Last 2048 log lines:
  450. 33.73 s > failures:
  451. 33.73 s >
  452. 33.73 s > failures:
  453. 33.73 s > tests::generated_search_links_are_validated_without_rewriting_html
  454. 33.73 s >
  455. 33.73 s > test result: FAILED. 0 passed; 1 failed; 0 ignored; 0 measured; 101 filtered out; finished in 0.01s
  456. 33.73 s >
  457. 33.73 s > stderr ---
  458. 33.73 s >
  459. 33.73 s > thread 'tests::generated_search_links_are_validated_without_rewriting_html' (284) panicked at crates/alphal00p-docs-builder/src/lib.rs:10077:47:
  460. 33.73 s > called `Result::unwrap()` on an `Err` value: failed to read /build/source/docs/portal.toml
  461. 33.73 s >
  462. 33.73 s > Caused by:
  463. 33.73 s > No such file or directory (os error 2)
  464. 33.73 s >
  465. 33.73 s > Location:
  466. 33.73 s > crates/alphal00p-docs-builder/src/lib.rs:582:14
  467. 33.73 s > stack backtrace:
  468. 33.73 s > 0: __rustc::rust_begin_unwind
  469. 33.73 s > 1: core::panicking::panic_fmt
  470. 33.73 s > 2: core::result::unwrap_failed
  471. 33.73 s > 3: alphal00p_docs_builder::tests::generated_search_links_are_validated_without_rewriting_html
  472. 33.73 s > 4: <alphal00p_docs_builder::tests::generated_search_links_are_validated_without_rewriting_html::{closure#0} as core::ops::function::FnOnce<()>>::call_once
  473. 33.73 s > note: Some details are omitted, run with `RUST_BACKTRACE=full` for a verbose backtrace.
  474. 33.73 s >
  475. 33.73 s > FAIL [ 0.018s] ( 45/102) alphal00p-docs-builder tests::persistent_rustdoc_targets_reject_workspace_and_arbitrary_roots
  476. 33.73 s > stdout ---
  477. 33.73 s >
  478. 33.73 s > running 1 test
  479. 33.73 s > test tests::persistent_rustdoc_targets_reject_workspace_and_arbitrary_roots ... FAILED
  480. 33.73 s >
  481. 33.73 s > failures:
  482. 33.73 s >
  483. 33.73 s > failures:
  484. 33.73 s > tests::persistent_rustdoc_targets_reject_workspace_and_arbitrary_roots
  485. 33.73 s >
  486. 33.73 s > test result: FAILED. 0 passed; 1 failed; 0 ignored; 0 measured; 101 filtered out; finished in 0.00s
  487. 33.73 s >
  488. 33.73 s > stderr ---
  489. 33.73 s >
  490. 33.73 s > thread 'tests::persistent_rustdoc_targets_reject_workspace_and_arbitrary_roots' (296) panicked at crates/alphal00p-docs-builder/src/lib.rs:9855:9:
  491. 33.73 s > assertion failed: prepare_persistent_rustdoc_target(workspace, &arbitrary).is_err()
  492. 33.73 s > stack backtrace:
  493. 33.73 s > 0: __rustc::rust_begin_unwind
  494. 33.73 s > 1: core::panicking::panic_fmt
  495. 33.73 s > 2: core::panicking::panic
  496. 33.73 s > 3: alphal00p_docs_builder::tests::persistent_rustdoc_targets_reject_workspace_and_arbitrary_roots
  497. 33.73 s > 4: <alphal00p_docs_builder::tests::persistent_rustdoc_targets_reject_workspace_and_arbitrary_roots::{closure#0} as core::ops::function::FnOnce<()>>::call_once
  498. 33.73 s > note: Some details are omitted, run with `RUST_BACKTRACE=full` for a verbose backtrace.
  499. 33.73 s >
  500. 33.73 s > FAIL [ 0.025s] ( 46/102) alphal00p-docs-builder tests::persistent_rustdoc_target_rejects_symlink_escape
  501. 33.73 s > stdout ---
  502. 33.73 s >
  503. 33.73 s > running 1 test
  504. 33.73 s > test tests::persistent_rustdoc_target_rejects_symlink_escape ... FAILED
  505. 33.73 s >
  506. 33.73 s > failures:
  507. 33.73 s >
  508. 33.73 s > failures:
  509. 33.73 s > tests::persistent_rustdoc_target_rejects_symlink_escape
  510. 33.73 s >
  511. 33.73 s > test result: FAILED. 0 passed; 1 failed; 0 ignored; 0 measured; 101 filtered out; finished in 0.01s
  512. 33.73 s >
  513. 33.73 s > stderr ---
  514. 33.73 s >
  515. 33.73 s > thread 'tests::persistent_rustdoc_target_rejects_symlink_escape' (295) panicked at crates/alphal00p-docs-builder/src/lib.rs:9878:82:
  516. 33.73 s > called `Result::unwrap_err()` on an `Ok` value: "/build/.tmpEi8KGn/escape/cache/cargo-target-v1"
  517. 33.73 s > stack backtrace:
  518. 33.73 s > 0: __rustc::rust_begin_unwind
  519. 33.73 s > 1: core::panicking::panic_fmt
  520. 33.73 s > 2: core::result::unwrap_failed
  521. 33.73 s > 3: alphal00p_docs_builder::tests::persistent_rustdoc_target_rejects_symlink_escape
  522. 33.73 s > 4: <alphal00p_docs_builder::tests::persistent_rustdoc_target_rejects_symlink_escape::{closure#0} as core::ops::function::FnOnce<()>>::call_once
  523. 33.73 s > note: Some details are omitted, run with `RUST_BACKTRACE=full` for a verbose backtrace.
  524. 33.73 s >
  525. 33.73 s > FAIL [ 0.030s] ( 47/102) alphal00p-docs-builder tests::moved_manual_routes_redirect_without_entering_navigation
  526. 33.73 s > stdout ---
  527. 33.73 s >
  528. 33.73 s > running 1 test
  529. 33.73 s > test tests::moved_manual_routes_redirect_without_entering_navigation ... FAILED
  530. 33.73 s >
  531. 33.73 s > failures:
  532. 33.73 s >
  533. 33.73 s > failures:
  534. 33.73 s > tests::moved_manual_routes_redirect_without_entering_navigation
  535. 33.73 s >
  536. 33.73 s > test result: FAILED. 0 passed; 1 failed; 0 ignored; 0 measured; 101 filtered out; finished in 0.01s
  537. 33.73 s >
  538. 33.73 s > stderr ---
  539. 33.73 s >
  540. 33.73 s > thread 'tests::moved_manual_routes_redirect_without_entering_navigation' (289) panicked at crates/alphal00p-docs-builder/src/lib.rs:11944:47:
  541. 33.73 s > called `Result::unwrap()` on an `Err` value: failed to read /build/source/docs/portal.toml
  542. 33.73 s >
  543. 33.73 s > Caused by:
  544. 33.73 s > No such file or directory (os error 2)
  545. 33.73 s >
  546. 33.73 s > Location:
  547. 33.73 s > crates/alphal00p-docs-builder/src/lib.rs:582:14
  548. 33.73 s > stack backtrace:
  549. 33.73 s > 0: __rustc::rust_begin_unwind
  550. 33.73 s > 1: core::panicking::panic_fmt
  551. 33.73 s > 2: core::result::unwrap_failed
  552. 33.73 s > 3: alphal00p_docs_builder::tests::moved_manual_routes_redirect_without_entering_navigation
  553. 33.73 s > 4: <alphal00p_docs_builder::tests::moved_manual_routes_redirect_without_entering_navigation::{closure#0} as core::ops::function::FnOnce<()>>::call_once
  554. 33.73 s > note: Some details are omitted, run with `RUST_BACKTRACE=full` for a verbose backtrace.
  555. 33.73 s >
  556. 33.73 s > FAIL [ 0.016s] ( 48/102) alphal00p-docs-builder tests::portal_focuses_on_projects_and_keeps_dedicated_routes
  557. 33.73 s > stdout ---
  558. 33.73 s >
  559. 33.73 s > running 1 test
  560. 33.73 s > test tests::portal_focuses_on_projects_and_keeps_dedicated_routes ... FAILED
  561. 33.73 s >
  562. 33.73 s > failures:
  563. 33.73 s >
  564. 33.73 s > failures:
  565. 33.73 s > tests::portal_focuses_on_projects_and_keeps_dedicated_routes
  566. 33.73 s >
  567. 33.73 s > test result: FAILED. 0 passed; 1 failed; 0 ignored; 0 measured; 101 filtered out; finished in 0.00s
  568. 33.73 s >
  569. 33.73 s > stderr ---
  570. 33.73 s >
  571. 33.73 s > thread 'tests::portal_focuses_on_projects_and_keeps_dedicated_routes' (300) panicked at crates/alphal00p-docs-builder/src/lib.rs:11147:47:
  572. 33.73 s > called `Result::unwrap()` on an `Err` value: failed to read /build/source/docs/portal.toml
  573. 33.73 s >
  574. 33.73 s > Caused by:
  575. 33.73 s > No such file or directory (os error 2)
  576. 33.73 s >
  577. 33.73 s > Location:
  578. 33.73 s > crates/alphal00p-docs-builder/src/lib.rs:582:14
  579. 33.73 s > stack backtrace:
  580. 33.73 s > 0: __rustc::rust_begin_unwind
  581. 33.73 s > 1: core::panicking::panic_fmt
  582. 33.73 s > 2: core::result::unwrap_failed
  583. 33.73 s > 3: alphal00p_docs_builder::tests::portal_focuses_on_projects_and_keeps_dedicated_routes
  584. 33.73 s > 4: <alphal00p_docs_builder::tests::portal_focuses_on_projects_and_keeps_dedicated_routes::{closure#0} as core::ops::function::FnOnce<()>>::call_once
  585. 33.73 s > note: Some details are omitted, run with `RUST_BACKTRACE=full` for a verbose backtrace.
  586. 33.73 s >
  587. 33.73 s > FAIL [ 0.016s] ( 49/102) alphal00p-docs-builder tests::product_bundles_render_authored_typst_but_allow_package_assets
  588. 33.73 s > stdout ---
  589. 33.73 s >
  590. 33.73 s > running 1 test
  591. 33.73 s > test tests::product_bundles_render_authored_typst_but_allow_package_assets ... FAILED
  592. 33.73 s >
  593. 33.73 s > failures:
  594. 33.73 s >
  595. 33.73 s > failures:
  596. 33.73 s > tests::product_bundles_render_authored_typst_but_allow_package_assets
  597. 33.73 s >
  598. 33.73 s > test result: FAILED. 0 passed; 1 failed; 0 ignored; 0 measured; 101 filtered out; finished in 0.00s
  599. 33.73 s >
  600. 33.73 s > stderr ---
  601. 33.73 s >
  602. 33.73 s > thread 'tests::product_bundles_render_authored_typst_but_allow_package_assets' (297) panicked at crates/alphal00p-docs-builder/src/lib.rs:9202:47:
  603. 33.73 s > called `Result::unwrap()` on an `Err` value: failed to read /build/source/docs/portal.toml
  604. 33.73 s >
  605. 33.73 s > Caused by:
  606. 33.73 s > No such file or directory (os error 2)
  607. 33.73 s >
  608. 33.73 s > Location:
  609. 33.73 s > crates/alphal00p-docs-builder/src/lib.rs:582:14
  610. 33.73 s > stack backtrace:
  611. 33.73 s > 0: __rustc::rust_begin_unwind
  612. 33.73 s > 1: core::panicking::panic_fmt
  613. 33.73 s > 2: core::result::unwrap_failed
  614. 33.73 s > 3: alphal00p_docs_builder::tests::product_bundles_render_authored_typst_but_allow_package_assets
  615. 33.73 s > 4: <alphal00p_docs_builder::tests::product_bundles_render_authored_typst_but_allow_package_assets::{closure#0} as core::ops::function::FnOnce<()>>::call_once
  616. 33.73 s > note: Some details are omitted, run with `RUST_BACKTRACE=full` for a verbose backtrace.
  617. 33.73 s >
  618. 33.73 s > FAIL [ 0.017s] ( 50/102) alphal00p-docs-builder tests::portal_task_chooser_routes_each_goal_to_the_registered_tutorial
  619. 33.73 s > stdout ---
  620. 33.73 s >
  621. 33.73 s > running 1 test
  622. 33.73 s > test tests::portal_task_chooser_routes_each_goal_to_the_registered_tutorial ... FAILED
  623. 33.73 s >
  624. 33.73 s > failures:
  625. 33.73 s >
  626. 33.73 s > failures:
  627. 33.73 s > tests::portal_task_chooser_routes_each_goal_to_the_registered_tutorial
  628. 33.73 s >
  629. 33.73 s > test result: FAILED. 0 passed; 1 failed; 0 ignored; 0 measured; 101 filtered out; finished in 0.00s
  630. 33.73 s >
  631. 33.73 s > stderr ---
  632. 33.73 s >
  633. 33.73 s > thread 'tests::portal_task_chooser_routes_each_goal_to_the_registered_tutorial' (303) panicked at crates/alphal00p-docs-builder/src/lib.rs:11392:47:
  634. 33.73 s > called `Result::unwrap()` on an `Err` value: failed to read /build/source/docs/portal.toml
  635. 33.73 s >
  636. 33.73 s > Caused by:
  637. 33.73 s > No such file or directory (os error 2)
  638. 33.73 s >
  639. 33.73 s > Location:
  640. 33.73 s > crates/alphal00p-docs-builder/src/lib.rs:582:14
  641. 33.73 s > stack backtrace:
  642. 33.73 s > 0: __rustc::rust_begin_unwind
  643. 33.73 s > 1: core::panicking::panic_fmt
  644. 33.73 s > 2: core::result::unwrap_failed
  645. 33.73 s > 3: alphal00p_docs_builder::tests::portal_task_chooser_routes_each_goal_to_the_registered_tutorial
  646. 33.73 s > 4: <alphal00p_docs_builder::tests::portal_task_chooser_routes_each_goal_to_the_registered_tutorial::{closure#0} as core::ops::function::FnOnce<()>>::call_once
  647. 33.73 s > note: Some details are omitted, run with `RUST_BACKTRACE=full` for a verbose backtrace.
  648. 33.73 s >
  649. 33.73 s > FAIL [ 0.032s] ( 51/102) alphal00p-docs-builder tests::pagination_keeps_generated_reference_before_version_history
  650. 33.73 s > stdout ---
  651. 33.73 s >
  652. 33.73 s > running 1 test
  653. 33.73 s > test tests::pagination_keeps_generated_reference_before_version_history ... FAILED
  654. 33.73 s >
  655. 33.73 s > failures:
  656. 33.73 s >
  657. 33.73 s > failures:
  658. 33.73 s > tests::pagination_keeps_generated_reference_before_version_history
  659. 33.73 s >
  660. 33.73 s > test result: FAILED. 0 passed; 1 failed; 0 ignored; 0 measured; 101 filtered out; finished in 0.01s
  661. 33.73 s >
  662. 33.73 s > stderr ---
  663. 33.73 s >
  664. 33.73 s > thread 'tests::pagination_keeps_generated_reference_before_version_history' (293) panicked at crates/alphal00p-docs-builder/src/lib.rs:10257:47:
  665. 33.73 s > called `Result::unwrap()` on an `Err` value: failed to read /build/source/docs/portal.toml
  666. 33.73 s >
  667. 33.73 s > Caused by:
  668. 33.73 s > No such file or directory (os error 2)
  669. 33.73 s >
  670. 33.73 s > Location:
  671. 33.73 s > crates/alphal00p-docs-builder/src/lib.rs:582:14
  672. 33.73 s > stack backtrace:
  673. 33.73 s > 0: __rustc::rust_begin_unwind
  674. 33.73 s > 1: core::panicking::panic_fmt
  675. 33.73 s > 2: core::result::unwrap_failed
  676. 33.73 s > 3: alphal00p_docs_builder::tests::pagination_keeps_generated_reference_before_version_history
  677. 33.73 s > 4: <alphal00p_docs_builder::tests::pagination_keeps_generated_reference_before_version_history::{closure#0} as core::ops::function::FnOnce<()>>::call_once
  678. 33.73 s > note: Some details are omitted, run with `RUST_BACKTRACE=full` for a verbose backtrace.
  679. 33.73 s >
  680. 33.73 s > FAIL [ 0.026s] ( 53/102) alphal00p-docs-builder tests::portal_and_developer_pages_use_federated_search_and_feedback
  681. 33.73 s > stdout ---
  682. 33.73 s >
  683. 33.73 s > running 1 test
  684. 33.73 s > test tests::portal_and_developer_pages_use_federated_search_and_feedback ... FAILED
  685. 33.73 s >
  686. 33.73 s > failures:
  687. 33.73 s >
  688. 33.73 s > failures:
  689. 33.73 s > tests::portal_and_developer_pages_use_federated_search_and_feedback
  690. 33.73 s >
  691. 33.73 s > test result: FAILED. 0 passed; 1 failed; 0 ignored; 0 measured; 101 filtered out; finished in 0.01s
  692. 33.73 s >
  693. 33.73 s > stderr ---
  694. 33.73 s >
  695. 33.73 s > thread 'tests::portal_and_developer_pages_use_federated_search_and_feedback' (301) panicked at crates/alphal00p-docs-builder/src/lib.rs:12006:47:
  696. 33.73 s > called `Result::unwrap()` on an `Err` value: failed to read /build/source/docs/portal.toml
  697. 33.73 s >
  698. 33.73 s > Caused by:
  699. 33.73 s > No such file or directory (os error 2)
  700. 33.73 s >
  701. 33.73 s > Location:
  702. 33.73 s > crates/alphal00p-docs-builder/src/lib.rs:582:14
  703. 33.73 s > stack backtrace:
  704. 33.73 s > 0: __rustc::rust_begin_unwind
  705. 33.73 s > 1: core::panicking::panic_fmt
  706. 33.73 s > 2: core::result::unwrap_failed
  707. 33.73 s > 3: alphal00p_docs_builder::tests::portal_and_developer_pages_use_federated_search_and_feedback
  708. 33.73 s > 4: <alphal00p_docs_builder::tests::portal_and_developer_pages_use_federated_search_and_feedback::{closure#0} as core::ops::function::FnOnce<()>>::call_once
  709. 33.73 s > note: Some details are omitted, run with `RUST_BACKTRACE=full` for a verbose backtrace.
  710. 33.73 s >
  711. 33.73 s > FAIL [ 0.018s] ( 54/102) alphal00p-docs-builder tests::prose_source_gate_rejects_format_variants_and_readme_typ
  712. 33.73 s > stdout ---
  713. 33.73 s >
  714. 33.73 s > running 1 test
  715. 33.73 s > test tests::prose_source_gate_rejects_format_variants_and_readme_typ ... FAILED
  716. 33.73 s >
  717. 33.73 s > failures:
  718. 33.73 s >
  719. 33.73 s > failures:
  720. 33.73 s > tests::prose_source_gate_rejects_format_variants_and_readme_typ
  721. 33.73 s >
  722. 33.73 s > test result: FAILED. 0 passed; 1 failed; 0 ignored; 0 measured; 101 filtered out; finished in 0.01s
  723. 33.73 s >
  724. 33.73 s > stderr ---
  725. 33.73 s >
  726. 33.73 s > thread 'tests::prose_source_gate_rejects_format_variants_and_readme_typ' (302) panicked at crates/alphal00p-docs-builder/src/lib.rs:9698:51:
  727. 33.73 s > called `Result::unwrap()` on an `Err` value: failed to read /build/source/docs/portal.toml
  728. 33.73 s >
  729. 33.73 s > Caused by:
  730. 33.73 s > No such file or directory (os error 2)
  731. 33.73 s >
  732. 33.73 s > Location:
  733. 33.73 s > crates/alphal00p-docs-builder/src/lib.rs:582:14
  734. 33.73 s > stack backtrace:
  735. 33.73 s > 0: __rustc::rust_begin_unwind
  736. 33.73 s > 1: core::panicking::panic_fmt
  737. 33.73 s > 2: core::result::unwrap_failed
  738. 33.73 s > 3: alphal00p_docs_builder::tests::prose_source_gate_rejects_format_variants_and_readme_typ
  739. 33.73 s > 4: <alphal00p_docs_builder::tests::prose_source_gate_rejects_format_variants_and_readme_typ::{closure#0} as core::ops::function::FnOnce<()>>::call_once
  740. 33.73 s > note: Some details are omitted, run with `RUST_BACKTRACE=full` for a verbose backtrace.
  741. 33.73 s >
  742. 33.73 s > FAIL [ 0.019s] ( 55/102) alphal00p-docs-builder tests::product_preview_validation_rejects_a_broken_search_fragment
  743. 33.73 s > stdout ---
  744. 33.73 s >
  745. 33.73 s > running 1 test
  746. 33.73 s > test tests::product_preview_validation_rejects_a_broken_search_fragment ... FAILED
  747. 33.73 s >
  748. 33.73 s > failures:
  749. 33.73 s >
  750. 33.73 s > failures:
  751. 33.73 s > tests::product_preview_validation_rejects_a_broken_search_fragment
  752. 33.73 s >
  753. 33.73 s > test result: FAILED. 0 passed; 1 failed; 0 ignored; 0 measured; 101 filtered out; finished in 0.00s
  754. 33.73 s >
  755. 33.73 s > stderr ---
  756. 33.73 s >
  757. 33.73 s > thread 'tests::product_preview_validation_rejects_a_broken_search_fragment' (314) panicked at crates/alphal00p-docs-builder/src/lib.rs:10615:47:
  758. 33.73 s > called `Result::unwrap()` on an `Err` value: failed to read /build/source/docs/portal.toml
  759. 33.73 s >
  760. 33.73 s > Caused by:
  761. 33.73 s > No such file or directory (os error 2)
  762. 33.73 s >
  763. 33.73 s > Location:
  764. 33.73 s > crates/alphal00p-docs-builder/src/lib.rs:582:14
  765. 33.73 s > stack backtrace:
  766. 33.73 s > 0: __rustc::rust_begin_unwind
  767. 33.73 s > 1: core::panicking::panic_fmt
  768. 33.73 s > 2: core::result::unwrap_failed
  769. 33.73 s > 3: alphal00p_docs_builder::tests::product_preview_validation_rejects_a_broken_search_fragment
  770. 33.73 s > 4: <alphal00p_docs_builder::tests::product_preview_validation_rejects_a_broken_search_fragment::{closure#0} as core::ops::function::FnOnce<()>>::call_once
  771. 33.73 s > note: Some details are omitted, run with `RUST_BACKTRACE=full` for a verbose backtrace.
  772. 33.73 s >
  773. 33.73 s > FAIL [ 0.019s] ( 57/102) alphal00p-docs-builder tests::prose_source_gate_rejects_new_and_parallel_markdown
  774. 33.73 s > stdout ---
  775. 33.73 s >
  776. 33.73 s > running 1 test
  777. 33.73 s > test tests::prose_source_gate_rejects_new_and_parallel_markdown ... FAILED
  778. 33.73 s >
  779. 33.73 s > failures:
  780. 33.73 s >
  781. 33.73 s > failures:
  782. 33.73 s > tests::prose_source_gate_rejects_new_and_parallel_markdown
  783. 33.73 s >
  784. 33.73 s > test result: FAILED. 0 passed; 1 failed; 0 ignored; 0 measured; 101 filtered out; finished in 0.00s
  785. 33.73 s >
  786. 33.73 s > stderr ---
  787. 33.73 s >
  788. 33.73 s > thread 'tests::prose_source_gate_rejects_new_and_parallel_markdown' (317) panicked at crates/alphal00p-docs-builder/src/lib.rs:9679:51:
  789. 33.73 s > called `Result::unwrap()` on an `Err` value: failed to read /build/source/docs/portal.toml
  790. 33.73 s >
  791. 33.73 s > Caused by:
  792. 33.73 s > No such file or directory (os error 2)
  793. 33.73 s >
  794. 33.73 s > Location:
  795. 33.73 s > crates/alphal00p-docs-builder/src/lib.rs:582:14
  796. 33.73 s > stack backtrace:
  797. 33.73 s > 0: __rustc::rust_begin_unwind
  798. 33.73 s > 1: core::panicking::panic_fmt
  799. 33.73 s > 2: core::result::unwrap_failed
  800. 33.73 s > 3: alphal00p_docs_builder::tests::prose_source_gate_rejects_new_and_parallel_markdown
  801. 33.73 s > 4: <alphal00p_docs_builder::tests::prose_source_gate_rejects_new_and_parallel_markdown::{closure#0} as core::ops::function::FnOnce<()>>::call_once
  802. 33.73 s > note: Some details are omitted, run with `RUST_BACKTRACE=full` for a verbose backtrace.
  803. 33.73 s >
  804. 33.73 s > FAIL [ 0.031s] ( 59/102) alphal00p-docs-builder tests::portal_project_cards_use_accurate_ecosystem_roles
  805. 33.73 s > stdout ---
  806. 33.73 s >
  807. 33.73 s > running 1 test
  808. 33.73 s > test tests::portal_project_cards_use_accurate_ecosystem_roles ... FAILED
  809. 33.73 s >
  810. 33.73 s > failures:
  811. 33.73 s >
  812. 33.73 s > failures:
  813. 33.73 s > tests::portal_project_cards_use_accurate_ecosystem_roles
  814. 33.73 s >
  815. 33.73 s > test result: FAILED. 0 passed; 1 failed; 0 ignored; 0 measured; 101 filtered out; finished in 0.02s
  816. 33.73 s >
  817. 33.73 s > stderr ---
  818. 33.73 s >
  819. 33.73 s > thread 'tests::portal_project_cards_use_accurate_ecosystem_roles' (305) panicked at crates/alphal00p-docs-builder/src/lib.rs:11427:47:
  820. 33.73 s > called `Result::unwrap()` on an `Err` value: failed to read /build/source/docs/portal.toml
  821. 33.73 s >
  822. 33.73 s > Caused by:
  823. 33.73 s > No such file or directory (os error 2)
  824. 33.73 s >
  825. 33.73 s > Location:
  826. 33.73 s > crates/alphal00p-docs-builder/src/lib.rs:582:14
  827. 33.73 s > stack backtrace:
  828. 33.73 s > 0: __rustc::rust_begin_unwind
  829. 33.73 s > 1: core::panicking::panic_fmt
  830. 33.73 s > 2: core::result::unwrap_failed
  831. 33.73 s > 3: alphal00p_docs_builder::tests::portal_project_cards_use_accurate_ecosystem_roles
  832. 33.73 s > 4: <alphal00p_docs_builder::tests::portal_project_cards_use_accurate_ecosystem_roles::{closure#0} as core::ops::function::FnOnce<()>>::call_once
  833. 33.73 s > note: Some details are omitted, run with `RUST_BACKTRACE=full` for a verbose backtrace.
  834. 33.73 s >
  835. 33.73 s > FAIL [ 0.032s] ( 60/102) alphal00p-docs-builder tests::product_preview_developer_links_use_revision_pinned_sources
  836. 33.73 s > stdout ---
  837. 33.73 s >
  838. 33.73 s > running 1 test
  839. 33.73 s > test tests::product_preview_developer_links_use_revision_pinned_sources ... FAILED
  840. 33.73 s >
  841. 33.73 s > failures:
  842. 33.73 s >
  843. 33.73 s > failures:
  844. 33.73 s > tests::product_preview_developer_links_use_revision_pinned_sources
  845. 33.73 s >
  846. 33.73 s > test result: FAILED. 0 passed; 1 failed; 0 ignored; 0 measured; 101 filtered out; finished in 0.01s
  847. 33.73 s >
  848. 33.73 s > stderr ---
  849. 33.73 s >
  850. 33.73 s > thread 'tests::product_preview_developer_links_use_revision_pinned_sources' (309) panicked at crates/alphal00p-docs-builder/src/lib.rs:10469:47:
  851. 33.73 s > called `Result::unwrap()` on an `Err` value: failed to read /build/source/docs/portal.toml
  852. 33.73 s >
  853. 33.73 s > Caused by:
  854. 33.73 s > No such file or directory (os error 2)
  855. 33.73 s >
  856. 33.73 s > Location:
  857. 33.73 s > crates/alphal00p-docs-builder/src/lib.rs:582:14
  858. 33.73 s > stack backtrace:
  859. 33.73 s > 0: __rustc::rust_begin_unwind
  860. 33.73 s > 1: core::panicking::panic_fmt
  861. 33.73 s > 2: core::result::unwrap_failed
  862. 33.73 s > 3: alphal00p_docs_builder::tests::product_preview_developer_links_use_revision_pinned_sources
  863. 33.73 s > 4: <alphal00p_docs_builder::tests::product_preview_developer_links_use_revision_pinned_sources::{closure#0} as core::ops::function::FnOnce<()>>::call_once
  864. 33.73 s > note: Some details are omitted, run with `RUST_BACKTRACE=full` for a verbose backtrace.
  865. 33.73 s >
  866. 33.73 s > FAIL [ 0.026s] ( 65/102) alphal00p-docs-builder tests::python_module_indexes_use_the_public_module_name
  867. 33.73 s > stdout ---
  868. 33.73 s >
  869. 33.73 s > running 1 test
  870. 33.73 s > test tests::python_module_indexes_use_the_public_module_name ... FAILED
  871. 33.73 s >
  872. 33.73 s > failures:
  873. 33.73 s >
  874. 33.73 s > failures:
  875. 33.73 s > tests::python_module_indexes_use_the_public_module_name
  876. 33.73 s >
  877. 33.73 s > test result: FAILED. 0 passed; 1 failed; 0 ignored; 0 measured; 101 filtered out; finished in 0.00s
  878. 33.73 s >
  879. 33.73 s > stderr ---
  880. 33.73 s >
  881. 33.73 s > thread 'tests::python_module_indexes_use_the_public_module_name' (332) panicked at crates/alphal00p-docs-builder/src/lib.rs:9389:47:
  882. 33.73 s > called `Result::unwrap()` on an `Err` value: failed to read /build/source/docs/portal.toml
  883. 33.73 s >
  884. 33.73 s > Caused by:
  885. 33.73 s > No such file or directory (os error 2)
  886. 33.73 s >
  887. 33.73 s > Location:
  888. 33.73 s > crates/alphal00p-docs-builder/src/lib.rs:582:14
  889. 33.73 s > stack backtrace:
  890. 33.73 s > 0: __rustc::rust_begin_unwind
  891. 33.73 s > 1: core::panicking::panic_fmt
  892. 33.73 s > 2: core::result::unwrap_failed
  893. 33.73 s > 3: alphal00p_docs_builder::tests::python_module_indexes_use_the_public_module_name
  894. 33.73 s > 4: <alphal00p_docs_builder::tests::python_module_indexes_use_the_public_module_name::{closure#0} as core::ops::function::FnOnce<()>>::call_once
  895. 33.73 s > note: Some details are omitted, run with `RUST_BACKTRACE=full` for a verbose backtrace.
  896. 33.73 s >
  897. 33.73 s > FAIL [ 0.018s] ( 66/102) alphal00p-docs-builder tests::rendered_transitive_typst_headings_are_searchable
  898. 33.73 s > stdout ---
  899. 33.73 s >
  900. 33.73 s > running 1 test
  901. 33.73 s > test tests::rendered_transitive_typst_headings_are_searchable ... FAILED
  902. 33.73 s >
  903. 33.73 s > failures:
  904. 33.73 s >
  905. 33.73 s > failures:
  906. 33.73 s > tests::rendered_transitive_typst_headings_are_searchable
  907. 33.73 s >
  908. 33.73 s > test result: FAILED. 0 passed; 1 failed; 0 ignored; 0 measured; 101 filtered out; finished in 0.00s
  909. 33.73 s >
  910. 33.73 s > stderr ---
  911. 33.73 s >
  912. 33.73 s > thread 'tests::rendered_transitive_typst_headings_are_searchable' (334) panicked at crates/alphal00p-docs-builder/src/lib.rs:10331:47:
  913. 33.73 s > called `Result::unwrap()` on an `Err` value: failed to read /build/source/docs/portal.toml
  914. 33.73 s >
  915. 33.73 s > Caused by:
  916. 33.73 s > No such file or directory (os error 2)
  917. 33.73 s >
  918. 33.73 s > Location:
  919. 33.73 s > crates/alphal00p-docs-builder/src/lib.rs:582:14
  920. 33.73 s > stack backtrace:
  921. 33.73 s > 0: __rustc::rust_begin_unwind
  922. 33.73 s > 1: core::panicking::panic_fmt
  923. 33.73 s > 2: core::result::unwrap_failed
  924. 33.73 s > 3: alphal00p_docs_builder::tests::rendered_transitive_typst_headings_are_searchable
  925. 33.73 s > 4: <alphal00p_docs_builder::tests::rendered_transitive_typst_headings_are_searchable::{closure#0} as core::ops::function::FnOnce<()>>::call_once
  926. 33.73 s > note: Some details are omitted, run with `RUST_BACKTRACE=full` for a verbose backtrace.
  927. 33.73 s >
  928. 33.73 s > FAIL [ 0.016s] ( 68/102) alphal00p-docs-builder tests::repository_source_links_are_checked_against_the_workspace
  929. 33.73 s > stdout ---
  930. 33.73 s >
  931. 33.73 s > running 1 test
  932. 33.73 s > test tests::repository_source_links_are_checked_against_the_workspace ... FAILED
  933. 33.73 s >
  934. 33.73 s > failures:
  935. 33.73 s >
  936. 33.73 s > failures:
  937. 33.73 s > tests::repository_source_links_are_checked_against_the_workspace
  938. 33.73 s >
  939. 33.73 s > test result: FAILED. 0 passed; 1 failed; 0 ignored; 0 measured; 101 filtered out; finished in 0.00s
  940. 33.73 s >
  941. 33.73 s > stderr ---
  942. 33.73 s >
  943. 33.73 s > thread 'tests::repository_source_links_are_checked_against_the_workspace' (337) panicked at crates/alphal00p-docs-builder/src/lib.rs:10111:47:
  944. 33.73 s > called `Result::unwrap()` on an `Err` value: failed to read /build/source/docs/portal.toml
  945. 33.73 s >
  946. 33.73 s > Caused by:
  947. 33.73 s > No such file or directory (os error 2)
  948. 33.73 s >
  949. 33.73 s > Location:
  950. 33.73 s > crates/alphal00p-docs-builder/src/lib.rs:582:14
  951. 33.73 s > stack backtrace:
  952. 33.73 s > 0: __rustc::rust_begin_unwind
  953. 33.73 s > 1: core::panicking::panic_fmt
  954. 33.73 s > 2: core::result::unwrap_failed
  955. 33.73 s > 3: alphal00p_docs_builder::tests::repository_source_links_are_checked_against_the_workspace
  956. 33.73 s > 4: <alphal00p_docs_builder::tests::repository_source_links_are_checked_against_the_workspace::{closure#0} as core::ops::function::FnOnce<()>>::call_once
  957. 33.73 s > note: Some details are omitted, run with `RUST_BACKTRACE=full` for a verbose backtrace.
  958. 33.73 s >
  959. 33.73 s > FAIL [ 0.022s] ( 69/102) alphal00p-docs-builder tests::rendered_product_and_reference_pages_offer_revision_pinned_feedback
  960. 33.73 s > stdout ---
  961. 33.73 s >
  962. 33.73 s > running 1 test
  963. 33.73 s > test tests::rendered_product_and_reference_pages_offer_revision_pinned_feedback ... FAILED
  964. 33.73 s >
  965. 33.73 s > failures:
  966. 33.73 s >
  967. 33.73 s > failures:
  968. 33.73 s > tests::rendered_product_and_reference_pages_offer_revision_pinned_feedback
  969. 33.73 s >
  970. 33.73 s > test result: FAILED. 0 passed; 1 failed; 0 ignored; 0 measured; 101 filtered out; finished in 0.01s
  971. 33.73 s >
  972. 33.73 s > stderr ---
  973. 33.73 s >
  974. 33.73 s > thread 'tests::rendered_product_and_reference_pages_offer_revision_pinned_feedback' (336) panicked at crates/alphal00p-docs-builder/src/lib.rs:11780:47:
  975. 33.73 s > called `Result::unwrap()` on an `Err` value: failed to read /build/source/docs/portal.toml
  976. 33.73 s >
  977. 33.73 s > Caused by:
  978. 33.73 s > No such file or directory (os error 2)
  979. 33.73 s >
  980. 33.73 s > Location:
  981. 33.73 s > crates/alphal00p-docs-builder/src/lib.rs:582:14
  982. 33.73 s > stack backtrace:
  983. 33.73 s > 0: __rustc::rust_begin_unwind
  984. 33.73 s > 1: core::panicking::panic_fmt
  985. 33.73 s > 2: core::result::unwrap_failed
  986. 33.73 s > 3: alphal00p_docs_builder::tests::rendered_product_and_reference_pages_offer_revision_pinned_feedback
  987. 33.73 s > 4: <alphal00p_docs_builder::tests::rendered_product_and_reference_pages_offer_revision_pinned_feedback::{closure#0} as core::ops::function::FnOnce<()>>::call_once
  988. 33.73 s > note: Some details are omitted, run with `RUST_BACKTRACE=full` for a verbose backtrace.
  989. 33.73 s >
  990. 33.73 s > FAIL [ 0.013s] ( 71/102) alphal00p-docs-builder tests::rustdoc_links_are_validated_only_when_rustdoc_is_included
  991. 33.73 s > stdout ---
  992. 33.73 s >
  993. 33.73 s > running 1 test
  994. 33.73 s > test tests::rustdoc_links_are_validated_only_when_rustdoc_is_included ... FAILED
  995. 33.73 s >
  996. 33.73 s > failures:
  997. 33.73 s >
  998. 33.73 s > failures:
  999. 33.73 s > tests::rustdoc_links_are_validated_only_when_rustdoc_is_included
  1000. 33.73 s >
  1001. 33.73 s > test result: FAILED. 0 passed; 1 failed; 0 ignored; 0 measured; 101 filtered out; finished in 0.00s
  1002. 33.73 s >
  1003. 33.73 s > stderr ---
  1004. 33.73 s >
  1005. 33.73 s > thread 'tests::rustdoc_links_are_validated_only_when_rustdoc_is_included' (341) panicked at crates/alphal00p-docs-builder/src/lib.rs:9936:47:
  1006. 33.73 s > called `Result::unwrap()` on an `Err` value: failed to read /build/source/docs/portal.toml
  1007. 33.73 s >
  1008. 33.73 s > Caused by:
  1009. 33.73 s > No such file or directory (os error 2)
  1010. 33.73 s >
  1011. 33.73 s > Location:
  1012. 33.73 s > crates/alphal00p-docs-builder/src/lib.rs:582:14
  1013. 33.73 s > stack backtrace:
  1014. 33.73 s > 0: __rustc::rust_begin_unwind
  1015. 33.73 s > 1: core::panicking::panic_fmt
  1016. 33.73 s > 2: core::result::unwrap_failed
  1017. 33.73 s > 3: alphal00p_docs_builder::tests::rustdoc_links_are_validated_only_when_rustdoc_is_included
  1018. 33.73 s > 4: <alphal00p_docs_builder::tests::rustdoc_links_are_validated_only_when_rustdoc_is_included::{closure#0} as core::ops::function::FnOnce<()>>::call_once
  1019. 33.73 s > note: Some details are omitted, run with `RUST_BACKTRACE=full` for a verbose backtrace.
  1020. 33.73 s >
  1021. 33.73 s > FAIL [ 0.029s] ( 72/102) alphal00p-docs-builder tests::python_sidebar_lists_only_the_current_module_and_marks_one_page
  1022. 33.73 s > stdout ---
  1023. 33.73 s >
  1024. 33.73 s > running 1 test
  1025. 33.73 s > test tests::python_sidebar_lists_only_the_current_module_and_marks_one_page ... FAILED
  1026. 33.73 s >
  1027. 33.73 s > failures:
  1028. 33.73 s >
  1029. 33.73 s > failures:
  1030. 33.73 s > tests::python_sidebar_lists_only_the_current_module_and_marks_one_page
  1031. 33.73 s >
  1032. 33.73 s > test result: FAILED. 0 passed; 1 failed; 0 ignored; 0 measured; 101 filtered out; finished in 0.01s
  1033. 33.73 s >
  1034. 33.73 s > stderr ---
  1035. 33.73 s >
  1036. 33.73 s > thread 'tests::python_sidebar_lists_only_the_current_module_and_marks_one_page' (339) panicked at crates/alphal00p-docs-builder/src/lib.rs:9064:47:
  1037. 33.73 s > called `Result::unwrap()` on an `Err` value: failed to read /build/source/docs/portal.toml
  1038. 33.73 s >
  1039. 33.73 s > Caused by:
  1040. 33.73 s > No such file or directory (os error 2)
  1041. 33.73 s >
  1042. 33.73 s > Location:
  1043. 33.73 s > crates/alphal00p-docs-builder/src/lib.rs:582:14
  1044. 33.73 s > stack backtrace:
  1045. 33.73 s > 0: __rustc::rust_begin_unwind
  1046. 33.73 s > 1: core::panicking::panic_fmt
  1047. 33.73 s > 2: core::result::unwrap_failed
  1048. 33.73 s > 3: alphal00p_docs_builder::tests::python_sidebar_lists_only_the_current_module_and_marks_one_page
  1049. 33.73 s > 4: <alphal00p_docs_builder::tests::python_sidebar_lists_only_the_current_module_and_marks_one_page::{closure#0} as core::ops::function::FnOnce<()>>::call_once
  1050. 33.73 s > note: Some details are omitted, run with `RUST_BACKTRACE=full` for a verbose backtrace.
  1051. 33.73 s >
  1052. 33.73 s > FAIL [ 0.034s] ( 73/102) alphal00p-docs-builder tests::python_member_fragments_have_scroll_and_target_styles
  1053. 33.73 s > stdout ---
  1054. 33.73 s >
  1055. 33.73 s > running 1 test
  1056. 33.73 s > test tests::python_member_fragments_have_scroll_and_target_styles ... FAILED
  1057. 33.73 s >
  1058. 33.73 s > failures:
  1059. 33.73 s >
  1060. 33.73 s > failures:
  1061. 33.73 s > tests::python_member_fragments_have_scroll_and_target_styles
  1062. 33.73 s >
  1063. 33.73 s > test result: FAILED. 0 passed; 1 failed; 0 ignored; 0 measured; 101 filtered out; finished in 0.01s
  1064. 33.73 s >
  1065. 33.73 s > stderr ---
  1066. 33.73 s >
  1067. 33.73 s > thread 'tests::python_member_fragments_have_scroll_and_target_styles' (347) panicked at crates/alphal00p-docs-builder/src/lib.rs:11048:47:
  1068. 33.73 s > called `Result::unwrap()` on an `Err` value: failed to read /build/source/docs/portal.toml
  1069. 33.73 s >
  1070. 33.73 s > Caused by:
  1071. 33.73 s > No such file or directory (os error 2)
  1072. 33.73 s >
  1073. 33.73 s > Location:
  1074. 33.73 s > crates/alphal00p-docs-builder/src/lib.rs:582:14
  1075. 33.73 s > stack backtrace:
  1076. 33.73 s > 0: __rustc::rust_begin_unwind
  1077. 33.73 s > 1: core::panicking::panic_fmt
  1078. 33.73 s > 2: core::result::unwrap_failed
  1079. 33.73 s > 3: alphal00p_docs_builder::tests::python_member_fragments_have_scroll_and_target_styles
  1080. 33.73 s > 4: <alphal00p_docs_builder::tests::python_member_fragments_have_scroll_and_target_styles::{closure#0} as core::ops::function::FnOnce<()>>::call_once
  1081. 33.73 s > note: Some details are omitted, run with `RUST_BACKTRACE=full` for a verbose backtrace.
  1082. 33.73 s >
  1083. 33.73 s > FAIL [ 0.015s] ( 75/102) alphal00p-docs-builder tests::rustdoc_uses_the_derive_page_for_derive_macros
  1084. 33.73 s > stdout ---
  1085. 33.73 s >
  1086. 33.73 s > running 1 test
  1087. 33.73 s > test tests::rustdoc_uses_the_derive_page_for_derive_macros ... FAILED
  1088. 33.73 s >
  1089. 33.73 s > failures:
  1090. 33.73 s >
  1091. 33.73 s > failures:
  1092. 33.73 s > tests::rustdoc_uses_the_derive_page_for_derive_macros
  1093. 33.73 s >
  1094. 33.73 s > test result: FAILED. 0 passed; 1 failed; 0 ignored; 0 measured; 101 filtered out; finished in 0.01s
  1095. 33.73 s >
  1096. 33.73 s > stderr ---
  1097. 33.73 s >
  1098. 33.73 s > thread 'tests::rustdoc_uses_the_derive_page_for_derive_macros' (355) panicked at crates/alphal00p-docs-builder/src/lib.rs:9740:47:
  1099. 33.73 s > called `Result::unwrap()` on an `Err` value: failed to read /build/source/docs/portal.toml
  1100. 33.73 s >
  1101. 33.73 s > Caused by:
  1102. 33.73 s > No such file or directory (os error 2)
  1103. 33.73 s >
  1104. 33.73 s > Location:
  1105. 33.73 s > crates/alphal00p-docs-builder/src/lib.rs:582:14
  1106. 33.73 s > stack backtrace:
  1107. 33.73 s > 0: __rustc::rust_begin_unwind
  1108. 33.73 s > 1: core::panicking::panic_fmt
  1109. 33.73 s > 2: core::result::unwrap_failed
  1110. 33.73 s > 3: alphal00p_docs_builder::tests::rustdoc_uses_the_derive_page_for_derive_macros
  1111. 33.73 s > 4: <alphal00p_docs_builder::tests::rustdoc_uses_the_derive_page_for_derive_macros::{closure#0} as core::ops::function::FnOnce<()>>::call_once
  1112. 33.73 s > note: Some details are omitted, run with `RUST_BACKTRACE=full` for a verbose backtrace.
  1113. 33.73 s >
  1114. 33.73 s > FAIL [ 0.013s] ( 76/102) alphal00p-docs-builder tests::site_assets_replace_read_only_generated_files
  1115. 33.73 s > stdout ---
  1116. 33.73 s >
  1117. 33.73 s > running 1 test
  1118. 33.73 s > test tests::site_assets_replace_read_only_generated_files ... FAILED
  1119. 33.73 s >
  1120. 33.73 s > failures:
  1121. 33.73 s >
  1122. 33.73 s > failures:
  1123. 33.73 s > tests::site_assets_replace_read_only_generated_files
  1124. 33.73 s >
  1125. 33.73 s > test result: FAILED. 0 passed; 1 failed; 0 ignored; 0 measured; 101 filtered out; finished in 0.00s
  1126. 33.73 s >
  1127. 33.73 s > stderr ---
  1128. 33.73 s >
  1129. 33.73 s > thread 'tests::site_assets_replace_read_only_generated_files' (357) panicked at crates/alphal00p-docs-builder/src/lib.rs:11104:47:
  1130. 33.73 s > called `Result::unwrap()` on an `Err` value: failed to read /build/source/docs/portal.toml
  1131. 33.73 s >
  1132. 33.73 s > Caused by:
  1133. 33.73 s > No such file or directory (os error 2)
  1134. 33.73 s >
  1135. 33.73 s > Location:
  1136. 33.73 s > crates/alphal00p-docs-builder/src/lib.rs:582:14
  1137. 33.73 s > stack backtrace:
  1138. 33.73 s > 0: __rustc::rust_begin_unwind
  1139. 33.73 s > 1: core::panicking::panic_fmt
  1140. 33.73 s > 2: core::result::unwrap_failed
  1141. 33.73 s > 3: alphal00p_docs_builder::tests::site_assets_replace_read_only_generated_files
  1142. 33.73 s > 4: <alphal00p_docs_builder::tests::site_assets_replace_read_only_generated_files::{closure#0} as core::ops::function::FnOnce<()>>::call_once
  1143. 33.73 s > note: Some details are omitted, run with `RUST_BACKTRACE=full` for a verbose backtrace.
  1144. 33.73 s >
  1145. 33.73 s > FAIL [ 0.025s] ( 79/102) alphal00p-docs-builder tests::rustdoc_link_validation_uses_rendered_tags_and_source_line_ranges
  1146. 33.73 s > stdout ---
  1147. 33.73 s >
  1148. 33.73 s > running 1 test
  1149. 33.73 s > test tests::rustdoc_link_validation_uses_rendered_tags_and_source_line_ranges ... FAILED
  1150. 33.73 s >
  1151. 33.73 s > failures:
  1152. 33.73 s >
  1153. 33.73 s > failures:
  1154. 33.73 s > tests::rustdoc_link_validation_uses_rendered_tags_and_source_line_ranges
  1155. 33.73 s >
  1156. 33.73 s > test result: FAILED. 0 passed; 1 failed; 0 ignored; 0 measured; 101 filtered out; finished in 0.01s
  1157. 33.73 s >
  1158. 33.73 s > stderr ---
  1159. 33.73 s >
  1160. 33.73 s > thread 'tests::rustdoc_link_validation_uses_rendered_tags_and_source_line_ranges' (354) panicked at crates/alphal00p-docs-builder/src/lib.rs:9957:47:
  1161. 33.73 s > called `Result::unwrap()` on an `Err` value: failed to read /build/source/docs/portal.toml
  1162. 33.73 s >
  1163. 33.73 s > Caused by:
  1164. 33.73 s > No such file or directory (os error 2)
  1165. 33.73 s >
  1166. 33.73 s > Location:
  1167. 33.73 s > crates/alphal00p-docs-builder/src/lib.rs:582:14
  1168. 33.73 s > stack backtrace:
  1169. 33.73 s > 0: __rustc::rust_begin_unwind
  1170. 33.73 s > 1: core::panicking::panic_fmt
  1171. 33.73 s > 2: core::result::unwrap_failed
  1172. 33.73 s > 3: alphal00p_docs_builder::tests::rustdoc_link_validation_uses_rendered_tags_and_source_line_ranges
  1173. 33.73 s > 4: <alphal00p_docs_builder::tests::rustdoc_link_validation_uses_rendered_tags_and_source_line_ranges::{closure#0} as core::ops::function::FnOnce<()>>::call_once
  1174. 33.73 s > note: Some details are omitted, run with `RUST_BACKTRACE=full` for a verbose backtrace.
  1175. 33.73 s >
  1176. 33.73 s > FAIL [ 0.015s] ( 80/102) alphal00p-docs-builder tests::site_search_uses_body_text_and_de_ranks_non_current_developer_hits
  1177. 33.73 s > stdout ---
  1178. 33.73 s >
  1179. 33.73 s > running 1 test
  1180. 33.73 s > test tests::site_search_uses_body_text_and_de_ranks_non_current_developer_hits ... FAILED
  1181. 33.73 s >
  1182. 33.73 s > failures:
  1183. 33.73 s >
  1184. 33.73 s > failures:
  1185. 33.73 s > tests::site_search_uses_body_text_and_de_ranks_non_current_developer_hits
  1186. 33.73 s >
  1187. 33.73 s > test result: FAILED. 0 passed; 1 failed; 0 ignored; 0 measured; 101 filtered out; finished in 0.00s
  1188. 33.73 s >
  1189. 33.73 s > stderr ---
  1190. 33.73 s >
  1191. 33.73 s > thread 'tests::site_search_uses_body_text_and_de_ranks_non_current_developer_hits' (364) panicked at crates/alphal00p-docs-builder/src/lib.rs:10311:18:
  1192. 33.73 s > called `Result::unwrap()` on an `Err` value: failed to read /build/source/docs/portal.toml
  1193. 33.73 s >
  1194. 33.73 s > Caused by:
  1195. 33.73 s > No such file or directory (os error 2)
  1196. 33.73 s >
  1197. 33.73 s > Location:
  1198. 33.73 s > crates/alphal00p-docs-builder/src/lib.rs:582:14
  1199. 33.73 s > stack backtrace:
  1200. 33.73 s > 0: __rustc::rust_begin_unwind
  1201. 33.73 s > 1: core::panicking::panic_fmt
  1202. 33.73 s > 2: core::result::unwrap_failed
  1203. 33.73 s > 3: alphal00p_docs_builder::tests::site_search_uses_body_text_and_de_ranks_non_current_developer_hits
  1204. 33.73 s > 4: <alphal00p_docs_builder::tests::site_search_uses_body_text_and_de_ranks_non_current_developer_hits::{closure#0} as core::ops::function::FnOnce<()>>::call_once
  1205. 33.73 s > note: Some details are omitted, run with `RUST_BACKTRACE=full` for a verbose backtrace.
  1206. 33.73 s >
  1207. 33.73 s > FAIL [ 0.019s] ( 84/102) alphal00p-docs-builder tests::typst_module_symbol_anchors_are_qualified_without_qualifying_concepts
  1208. 33.73 s > stdout ---
  1209. 33.73 s >
  1210. 33.73 s > running 1 test
  1211. 33.73 s > test tests::typst_module_symbol_anchors_are_qualified_without_qualifying_concepts ... FAILED
  1212. 33.73 s >
  1213. 33.73 s > failures:
  1214. 33.73 s >
  1215. 33.73 s > failures:
  1216. 33.73 s > tests::typst_module_symbol_anchors_are_qualified_without_qualifying_concepts
  1217. 33.73 s >
  1218. 33.73 s > test result: FAILED. 0 passed; 1 failed; 0 ignored; 0 measured; 101 filtered out; finished in 0.00s
  1219. 33.73 s >
  1220. 33.73 s > stderr ---
  1221. 33.73 s >
  1222. 33.73 s > thread 'tests::typst_module_symbol_anchors_are_qualified_without_qualifying_concepts' (370) panicked at crates/alphal00p-docs-builder/src/lib.rs:10418:47:
  1223. 33.73 s > called `Result::unwrap()` on an `Err` value: failed to read /build/source/docs/portal.toml
  1224. 33.73 s >
  1225. 33.73 s > Caused by:
  1226. 33.73 s > No such file or directory (os error 2)
  1227. 33.73 s >
  1228. 33.73 s > Location:
  1229. 33.73 s > crates/alphal00p-docs-builder/src/lib.rs:582:14
  1230. 33.73 s > stack backtrace:
  1231. 33.73 s > 0: __rustc::rust_begin_unwind
  1232. 33.73 s > 1: core::panicking::panic_fmt
  1233. 33.73 s > 2: core::result::unwrap_failed
  1234. 33.73 s > 3: alphal00p_docs_builder::tests::typst_module_symbol_anchors_are_qualified_without_qualifying_concepts
  1235. 33.73 s > 4: <alphal00p_docs_builder::tests::typst_module_symbol_anchors_are_qualified_without_qualifying_concepts::{closure#0} as core::ops::function::FnOnce<()>>::call_once
  1236. 33.73 s > note: Some details are omitted, run with `RUST_BACKTRACE=full` for a verbose backtrace.
  1237. 33.73 s >
  1238. 33.73 s > FAIL [ 0.022s] ( 90/102) alphal00p-docs-builder tests::typst_reference_search_uses_qualified_symbols_without_parameter_noise
  1239. 33.73 s > stdout ---
  1240. 33.73 s >
  1241. 33.73 s > running 1 test
  1242. 33.73 s > test tests::typst_reference_search_uses_qualified_symbols_without_parameter_noise ... FAILED
  1243. 33.73 s >
  1244. 33.73 s > failures:
  1245. 33.73 s >
  1246. 33.73 s > failures:
  1247. 33.73 s > tests::typst_reference_search_uses_qualified_symbols_without_parameter_noise
  1248. 33.73 s >
  1249. 33.73 s > test result: FAILED. 0 passed; 1 failed; 0 ignored; 0 measured; 101 filtered out; finished in 0.01s
  1250. 33.73 s >
  1251. 33.73 s > stderr ---
  1252. 33.73 s >
  1253. 33.73 s > thread 'tests::typst_reference_search_uses_qualified_symbols_without_parameter_noise' (372) panicked at crates/alphal00p-docs-builder/src/lib.rs:10382:47:
  1254. 33.73 s > called `Result::unwrap()` on an `Err` value: failed to read /build/source/docs/portal.toml
  1255. 33.73 s >
  1256. 33.73 s > Caused by:
  1257. 33.73 s > No such file or directory (os error 2)
  1258. 33.73 s >
  1259. 33.73 s > Location:
  1260. 33.73 s > crates/alphal00p-docs-builder/src/lib.rs:582:14
  1261. 33.73 s > stack backtrace:
  1262. 33.73 s > 0: __rustc::rust_begin_unwind
  1263. 33.73 s > 1: core::panicking::panic_fmt
  1264. 33.73 s > 2: core::result::unwrap_failed
  1265. 33.73 s > 3: alphal00p_docs_builder::tests::typst_reference_search_uses_qualified_symbols_without_parameter_noise
  1266. 33.73 s > 4: <alphal00p_docs_builder::tests::typst_reference_search_uses_qualified_symbols_without_parameter_noise::{closure#0} as core::ops::function::FnOnce<()>>::call_once
  1267. 33.73 s > note: Some details are omitted, run with `RUST_BACKTRACE=full` for a verbose backtrace.
  1268. 33.73 s >
  1269. 33.73 s > error: test run failed
  1270. 33.73 s >
  1271. 33.73 s > ========== nextest test summary ==========
  1272. 33.73 s > report: target/nextest/ci_gammaloop/junit.xml
  1273. 33.73 s > tests: 102, failures: 46, errors: 0
  1274. 33.73 s >
  1275. 33.73 s > 1. alphal00p-docs-builder::tests::cli_manpages_preserve_value_and_global_parser_facts
  1276. 33.73 s > failure: test failure with exit code 101
  1277. 33.73 s > thread 'tests::cli_manpages_preserve_value_and_global_parser_facts' (177) panicked at crates/alphal00p-docs-builder/src/lib.rs:9305:47:
  1278. 33.73 s > called `Result::unwrap()` on an `Err` value: failed to read /build/source/docs/portal.toml
  1279. 33.73 s >
  1280. 33.73 s > Caused by:
  1281. 33.73 s > No such file or directory (os error 2)
  1282. 33.73 s >
  1283. 33.73 s > Location:
  1284. 33.73 s > crates/alphal00p-docs-builder/src/lib.rs:582:14
  1285. 33.73 s > stack backtrace:
  1286. 33.73 s > 0: __rustc::rust_begin_unwind
  1287. 33.73 s > 1: core::panicking::panic_fmt
  1288. 33.73 s > 2: core::result::unwrap_failed
  1289. 33.73 s > 3: alphal00p_docs_builder::tests::cli_manpages_preserve_value_and_global_parser_facts
  1290. 33.73 s > 4: <alphal00p_docs_builder::tests::cli_manpages_preserve_value_and_global_parser_facts::{closure#0} as core::ops::function::FnOnce<()>>::call_once
  1291. 33.73 s > note: Some details are omitted, run with `RUST_BACKTRACE=full` for a verbose backtrace.
  1292. 33.73 s > system-out
  1293. 33.73 s > running 1 test
  1294. 33.73 s > test tests::cli_manpages_preserve_value_and_global_parser_facts ... FAILED
  1295. 33.73 s >
  1296. 33.73 s > failures:
  1297. 33.73 s >
  1298. 33.73 s > failures:
  1299. 33.73 s > tests::cli_manpages_preserve_value_and_global_parser_facts
  1300. 33.73 s >
  1301. 33.73 s > test result: FAILED. 0 passed; 1 failed; 0 ignored; 0 measured; 101 filtered out; finished in 0.00s
  1302. 33.73 s > system-err
  1303. 33.73 s > thread 'tests::cli_manpages_preserve_value_and_global_parser_facts' (177) panicked at crates/alphal00p-docs-builder/src/lib.rs:9305:47:
  1304. 33.73 s > called `Result::unwrap()` on an `Err` value: failed to read /build/source/docs/portal.toml
  1305. 33.73 s >
  1306. 33.73 s > Caused by:
  1307. 33.73 s > No such file or directory (os error 2)
  1308. 33.73 s >
  1309. 33.73 s > Location:
  1310. 33.73 s > crates/alphal00p-docs-builder/src/lib.rs:582:14
  1311. 33.73 s > stack backtrace:
  1312. 33.73 s > 0: __rustc::rust_begin_unwind
  1313. 33.73 s > 1: core::panicking::panic_fmt
  1314. 33.73 s > 2: core::result::unwrap_failed
  1315. 33.73 s > 3: alphal00p_docs_builder::tests::cli_manpages_preserve_value_and_global_parser_facts
  1316. 33.73 s > 4: <alphal00p_docs_builder::tests::cli_manpages_preserve_value_and_global_parser_facts::{closure#0} as core::ops::function::FnOnce<()>>::call_once
  1317. 33.73 s > note: Some details are omitted, run with `RUST_BACKTRACE=full` for a verbose backtrace.
  1318. 33.73 s >
  1319. 33.73 s > 2. alphal00p-docs-builder::tests::checked_in_registry_is_valid
  1320. 33.73 s > failure: test failure with exit code 101
  1321. 33.73 s > thread 'tests::checked_in_registry_is_valid' (183) panicked at crates/alphal00p-docs-builder/src/lib.rs:11099:33:
  1322. 33.73 s > called `Result::unwrap()` on an `Err` value: failed to read /build/source/docs/portal.toml
  1323. 33.73 s >
  1324. 33.73 s > Caused by:
  1325. 33.73 s > No such file or directory (os error 2)
  1326. 33.73 s >
  1327. 33.73 s > Location:
  1328. 33.73 s > crates/alphal00p-docs-builder/src/lib.rs:582:14
  1329. 33.73 s > stack backtrace:
  1330. 33.73 s > 0: __rustc::rust_begin_unwind
  1331. 33.73 s > 1: core::panicking::panic_fmt
  1332. 33.73 s > 2: core::result::unwrap_failed
  1333. 33.73 s > 3: alphal00p_docs_builder::tests::checked_in_registry_is_valid
  1334. 33.73 s > 4: <alphal00p_docs_builder::tests::checked_in_registry_is_valid::{closure#0} as core::ops::function::FnOnce<()>>::call_once
  1335. 33.73 s > note: Some details are omitted, run with `RUST_BACKTRACE=full` for a verbose backtrace.
  1336. 33.73 s > system-out
  1337. 33.73 s > running 1 test
  1338. 33.73 s > test tests::checked_in_registry_is_valid ... FAILED
  1339. 33.73 s >
  1340. 33.73 s > failures:
  1341. 33.73 s >
  1342. 33.73 s > failures:
  1343. 33.73 s > tests::checked_in_registry_is_valid
  1344. 33.73 s >
  1345. 33.73 s > test result: FAILED. 0 passed; 1 failed; 0 ignored; 0 measured; 101 filtered out; finished in 0.01s
  1346. 33.73 s > system-err
  1347. 33.73 s > thread 'tests::checked_in_registry_is_valid' (183) panicked at crates/alphal00p-docs-builder/src/lib.rs:11099:33:
  1348. 33.73 s > called `Result::unwrap()` on an `Err` value: failed to read /build/source/docs/portal.toml
  1349. 33.73 s >
  1350. 33.73 s > Caused by:
  1351. 33.73 s > No such file or directory (os error 2)
  1352. 33.73 s >
  1353. 33.73 s > Location:
  1354. 33.73 s > crates/alphal00p-docs-builder/src/lib.rs:582:14
  1355. 33.73 s > stack backtrace:
  1356. 33.73 s > 0: __rustc::rust_begin_unwind
  1357. 33.73 s > 1: core::panicking::panic_fmt
  1358. 33.73 s > 2: core::result::unwrap_failed
  1359. 33.73 s > 3: alphal00p_docs_builder::tests::checked_in_registry_is_valid
  1360. 33.73 s > 4: <alphal00p_docs_builder::tests::checked_in_registry_is_valid::{closure#0} as core::ops::function::FnOnce<()>>::call_once
  1361. 33.73 s > note: Some details are omitted, run with `RUST_BACKTRACE=full` for a verbose backtrace.
  1362. 33.73 s >
  1363. 33.73 s > 3. alphal00p-docs-builder::tests::cli_settings_use_namespace_pages_and_canonical_fragments
  1364. 33.73 s > failure: test failure with exit code 101
  1365. 33.73 s > thread 'tests::cli_settings_use_namespace_pages_and_canonical_fragments' (187) panicked at crates/alphal00p-docs-builder/src/lib.rs:9356:47:
  1366. 33.73 s > called `Result::unwrap()` on an `Err` value: failed to read /build/source/docs/portal.toml
  1367. 33.73 s >
  1368. 33.73 s > Caused by:
  1369. 33.73 s > No such file or directory (os error 2)
  1370. 33.73 s >
  1371. 33.73 s > Location:
  1372. 33.73 s > crates/alphal00p-docs-builder/src/lib.rs:582:14
  1373. 33.73 s > stack backtrace:
  1374. 33.73 s > 0: __rustc::rust_begin_unwind
  1375. 33.73 s > 1: core::panicking::panic_fmt
  1376. 33.73 s > 2: core::result::unwrap_failed
  1377. 33.73 s > 3: alphal00p_docs_builder::tests::cli_settings_use_namespace_pages_and_canonical_fragments
  1378. 33.73 s > 4: <alphal00p_docs_builder::tests::cli_settings_use_namespace_pages_and_canonical_fragments::{closure#0} as core::ops::function::FnOnce<()>>::call_once
  1379. 33.73 s > note: Some details are omitted, run with `RUST_BACKTRACE=full` for a verbose backtrace.
  1380. 33.73 s > system-out
  1381. 33.73 s > running 1 test
  1382. 33.73 s > test tests::cli_settings_use_namespace_pages_and_canonical_fragments ... FAILED
  1383. 33.73 s >
  1384. 33.73 s > failures:
  1385. 33.73 s >
  1386. 33.73 s > failures:
  1387. 33.73 s > tests::cli_settings_use_namespace_pages_and_canonical_fragments
  1388. 33.73 s >
  1389. 33.73 s > test result: FAILED. 0 passed; 1 failed; 0 ignored; 0 measured; 101 filtered out; finished in 0.01s
  1390. 33.73 s > system-err
  1391. 33.73 s > thread 'tests::cli_settings_use_namespace_pages_and_canonical_fragments' (187) panicked at crates/alphal00p-docs-builder/src/lib.rs:9356:47:
  1392. 33.73 s > called `Result::unwrap()` on an `Err` value: failed to read /build/source/docs/portal.toml
  1393. 33.73 s >
  1394. 33.73 s > Caused by:
  1395. 33.73 s > No such file or directory (os error 2)
  1396. 33.73 s >
  1397. 33.73 s > Location:
  1398. 33.73 s > crates/alphal00p-docs-builder/src/lib.rs:582:14
  1399. 33.73 s > stack backtrace:
  1400. 33.73 s > 0: __rustc::rust_begin_unwind
  1401. 33.73 s > 1: core::panicking::panic_fmt
  1402. 33.73 s > 2: core::result::unwrap_failed
  1403. 33.73 s > 3: alphal00p_docs_builder::tests::cli_settings_use_namespace_pages_and_canonical_fragments
  1404. 33.73 s > 4: <alphal00p_docs_builder::tests::cli_settings_use_namespace_pages_and_canonical_fragments::{closure#0} as core::ops::function::FnOnce<()>>::call_once
  1405. 33.73 s > note: Some details are omitted, run with `RUST_BACKTRACE=full` for a verbose backtrace.
  1406. 33.73 s >
  1407. 33.73 s > 4. alphal00p-docs-builder::tests::cli_reference_index_and_manpages_preserve_parser_semantics
  1408. 33.73 s > failure: test failure with exit code 101
  1409. 33.73 s > thread 'tests::cli_reference_index_and_manpages_preserve_parser_semantics' (204) panicked at crates/alphal00p-docs-builder/src/lib.rs:9229:47:
  1410. 33.73 s > called `Result::unwrap()` on an `Err` value: failed to read /build/source/docs/portal.toml
  1411. 33.73 s >
  1412. 33.73 s > Caused by:
  1413. 33.73 s > No such file or directory (os error 2)
  1414. 33.73 s >
  1415. 33.73 s > Location:
  1416. 33.73 s > crates/alphal00p-docs-builder/src/lib.rs:582:14
  1417. 33.73 s > stack backtrace:
  1418. 33.73 s > 0: __rustc::rust_begin_unwind
  1419. 33.73 s > 1: core::panicking::panic_fmt
  1420. 33.73 s > 2: core::result::unwrap_failed
  1421. 33.73 s > 3: alphal00p_docs_builder::tests::cli_reference_index_and_manpages_preserve_parser_semantics
  1422. 33.73 s > 4: <alphal00p_docs_builder::tests::cli_reference_index_and_manpages_preserve_parser_semantics::{closure#0} as core::ops::function::FnOnce<()>>::call_once
  1423. 33.73 s > note: Some details are omitted, run with `RUST_BACKTRACE=full` for a verbose backtrace.
  1424. 33.73 s > system-out
  1425. 33.73 s > running 1 test
  1426. 33.73 s > test tests::cli_reference_index_and_manpages_preserve_parser_semantics ... FAILED
  1427. 33.73 s >
  1428. 33.73 s > failures:
  1429. 33.73 s >
  1430. 33.73 s > failures:
  1431. 33.73 s > tests::cli_reference_index_and_manpages_preserve_parser_semantics
  1432. 33.73 s >
  1433. 33.73 s > test result: FAILED. 0 passed; 1 failed; 0 ignored; 0 measured; 101 filtered out; finished in 0.01s
  1434. 33.73 s > system-err
  1435. 33.73 s > thread 'tests::cli_reference_index_and_manpages_preserve_parser_semantics' (204) panicked at crates/alphal00p-docs-builder/src/lib.rs:9229:47:
  1436. 33.73 s > called `Result::unwrap()` on an `Err` value: failed to read /build/source/docs/portal.toml
  1437. 33.73 s >
  1438. 33.73 s > Caused by:
  1439. 33.73 s > No such file or directory (os error 2)
  1440. 33.73 s >
  1441. 33.73 s > Location:
  1442. 33.73 s > crates/alphal00p-docs-builder/src/lib.rs:582:14
  1443. 33.73 s > stack backtrace:
  1444. 33.73 s > 0: __rustc::rust_begin_unwind
  1445. 33.73 s > 1: core::panicking::panic_fmt
  1446. 33.73 s > 2: core::result::unwrap_failed
  1447. 33.73 s > 3: alphal00p_docs_builder::tests::cli_reference_index_and_manpages_preserve_parser_semantics
  1448. 33.73 s > 4: <alphal00p_docs_builder::tests::cli_reference_index_and_manpages_preserve_parser_semantics::{closure#0} as core::ops::function::FnOnce<()>>::call_once
  1449. 33.73 s > note: Some details are omitted, run with `RUST_BACKTRACE=full` for a verbose backtrace.
  1450. 33.73 s >
  1451. 33.73 s > 5. alphal00p-docs-builder::tests::federated_search_covers_every_product_and_developer_notes
  1452. 33.73 s > failure: test failure with exit code 101
  1453. 33.73 s > thread 'tests::federated_search_covers_every_product_and_developer_notes' (244) panicked at crates/alphal00p-docs-builder/src/lib.rs:11713:47:
  1454. 33.73 s > called `Result::unwrap()` on an `Err` value: failed to read /build/source/docs/portal.toml
  1455. 33.73 s >
  1456. 33.73 s > Caused by:
  1457. 33.73 s > No such file or directory (os error 2)
  1458. 33.73 s >
  1459. 33.73 s > Location:
  1460. 33.73 s > crates/alphal00p-docs-builder/src/lib.rs:582:14
  1461. 33.73 s > stack backtrace:
  1462. 33.73 s > 0: __rustc::rust_begin_unwind
  1463. 33.73 s > 1: core::panicking::panic_fmt
  1464. 33.73 s > 2: core::result::unwrap_failed
  1465. 33.73 s > 3: alphal00p_docs_builder::tests::federated_search_covers_every_product_and_developer_notes
  1466. 33.73 s > 4: <alphal00p_docs_builder::tests::federated_search_covers_every_product_and_developer_notes::{closure#0} as core::ops::function::FnOnce<()>>::call_once
  1467. 33.73 s > note: Some details are omitted, run with `RUST_BACKTRACE=full` for a verbose backtrace.
  1468. 33.73 s > system-out
  1469. 33.73 s > running 1 test
  1470. 33.73 s > test tests::federated_search_covers_every_product_and_developer_notes ... FAILED
  1471. 33.73 s >
  1472. 33.73 s > failures:
  1473. 33.73 s >
  1474. 33.73 s > failures:
  1475. 33.73 s > tests::federated_search_covers_every_product_and_developer_notes
  1476. 33.73 s >
  1477. 33.73 s > test result: FAILED. 0 passed; 1 failed; 0 ignored; 0 measured; 101 filtered out; finished in 0.00s
  1478. 33.73 s > system-err
  1479. 33.73 s > thread 'tests::federated_search_covers_every_product_and_developer_notes' (244) panicked at crates/alphal00p-docs-builder/src/lib.rs:11713:47:
  1480. 33.73 s > called `Result::unwrap()` on an `Err` value: failed to read /build/source/docs/portal.toml
  1481. 33.73 s >
  1482. 33.73 s > Caused by:
  1483. 33.73 s > No such file or directory (os error 2)
  1484. 33.73 s >
  1485. 33.73 s > Location:
  1486. 33.73 s > crates/alphal00p-docs-builder/src/lib.rs:582:14
  1487. 33.73 s > stack backtrace:
  1488. 33.73 s > 0: __rustc::rust_begin_unwind
  1489. 33.73 s > 1: core::panicking::panic_fmt
  1490. 33.73 s > 2: core::result::unwrap_failed
  1491. 33.73 s > 3: alphal00p_docs_builder::tests::federated_search_covers_every_product_and_developer_notes
  1492. 33.73 s > 4: <alphal00p_docs_builder::tests::federated_search_covers_every_product_and_developer_notes::{closure#0} as core::ops::function::FnOnce<()>>::call_once
  1493. 33.73 s > note: Some details are omitted, run with `RUST_BACKTRACE=full` for a verbose backtrace.
  1494. 33.73 s >
  1495. 33.73 s > 6. alphal00p-docs-builder::tests::dense_reference_tocs_only_list_sections_and_omit_empty_pagination
  1496. 33.73 s > failure: test failure with exit code 101
  1497. 33.73 s > thread 'tests::dense_reference_tocs_only_list_sections_and_omit_empty_pagination' (243) panicked at crates/alphal00p-docs-builder/src/lib.rs:11843:47:
  1498. 33.73 s > called `Result::unwrap()` on an `Err` value: failed to read /build/source/docs/portal.toml
  1499. 33.73 s >
  1500. 33.73 s > Caused by:
  1501. 33.73 s > No such file or directory (os error 2)
  1502. 33.73 s >
  1503. 33.73 s > Location:
  1504. 33.73 s > crates/alphal00p-docs-builder/src/lib.rs:582:14
  1505. 33.73 s > stack backtrace:
  1506. 33.73 s > 0: __rustc::rust_begin_unwind
  1507. 33.73 s > 1: core::panicking::panic_fmt
  1508. 33.73 s > 2: core::result::unwrap_failed
  1509. 33.73 s > 3: alphal00p_docs_builder::tests::dense_reference_tocs_only_list_sections_and_omit_empty_pagination
  1510. 33.73 s > 4: <alphal00p_docs_builder::tests::dense_reference_tocs_only_list_sections_and_omit_empty_pagination::{closure#0} as core::ops::function::FnOnce<()>>::call_once
  1511. 33.73 s > note: Some details are omitted, run with `RUST_BACKTRACE=full` for a verbose backtrace.
  1512. 33.73 s > system-out
  1513. 33.73 s > running 1 test
  1514. 33.73 s > test tests::dense_reference_tocs_only_list_sections_and_omit_empty_pagination ... FAILED
  1515. 33.73 s >
  1516. 33.73 s > failures:
  1517. 33.73 s >
  1518. 33.73 s > failures:
  1519. 33.73 s > tests::dense_reference_tocs_only_list_sections_and_omit_empty_pagination
  1520. 33.73 s >
  1521. 33.73 s > test result: FAILED. 0 passed; 1 failed; 0 ignored; 0 measured; 101 filtered out; finished in 0.00s
  1522. 33.73 s > system-err
  1523. 33.73 s > thread 'tests::dense_reference_tocs_only_list_sections_and_omit_empty_pagination' (243) panicked at crates/alphal00p-docs-builder/src/lib.rs:11843:47:
  1524. 33.73 s > called `Result::unwrap()` on an `Err` value: failed to read /build/source/docs/portal.toml
  1525. 33.73 s >
  1526. 33.73 s > Caused by:
  1527. 33.73 s > No such file or directory (os error 2)
  1528. 33.73 s >
  1529. 33.73 s > Location:
  1530. 33.73 s > crates/alphal00p-docs-builder/src/lib.rs:582:14
  1531. 33.73 s > stack backtrace:
  1532. 33.73 s > 0: __rustc::rust_begin_unwind
  1533. 33.73 s > 1: core::panicking::panic_fmt
  1534. 33.73 s > 2: core::result::unwrap_failed
  1535. 33.73 s > 3: alphal00p_docs_builder::tests::dense_reference_tocs_only_list_sections_and_omit_empty_pagination
  1536. 33.73 s > 4: <alphal00p_docs_builder::tests::dense_reference_tocs_only_list_sections_and_omit_empty_pagination::{closure#0} as core::ops::function::FnOnce<()>>::call_once
  1537. 33.73 s > note: Some details are omitted, run with `RUST_BACKTRACE=full` for a verbose backtrace.
  1538. 33.73 s >
  1539. 33.73 s > 7. alphal00p-docs-builder::tests::developer_architecture_is_classified_searchable_and_source_backed
  1540. 33.73 s > failure: test failure with exit code 101
  1541. 33.73 s > thread 'tests::developer_architecture_is_classified_searchable_and_source_backed' (224) panicked at crates/alphal00p-docs-builder/src/lib.rs:11615:47:
  1542. 33.73 s > called `Result::unwrap()` on an `Err` value: failed to read /build/source/docs/portal.toml
  1543. 33.73 s >
  1544. 33.73 s > Caused by:
  1545. 33.73 s > No such file or directory (os error 2)
  1546. 33.73 s >
  1547. 33.73 s > Location:
  1548. 33.73 s > crates/alphal00p-docs-builder/src/lib.rs:582:14
  1549. 33.73 s > stack backtrace:
  1550. 33.73 s > 0: __rustc::rust_begin_unwind
  1551. 33.73 s > 1: core::panicking::panic_fmt
  1552. 33.73 s > 2: core::result::unwrap_failed
  1553. 33.73 s > 3: alphal00p_docs_builder::tests::developer_architecture_is_classified_searchable_and_source_backed
  1554. 33.73 s > 4: <alphal00p_docs_builder::tests::developer_architecture_is_classified_searchable_and_source_backed::{closure#0} as core::ops::function::FnOnce<()>>::call_once
  1555. 33.73 s > note: Some details are omitted, run with `RUST_BACKTRACE=full` for a verbose backtrace.
  1556. 33.73 s > system-out
  1557. 33.73 s > running 1 test
  1558. 33.73 s > test tests::developer_architecture_is_classified_searchable_and_source_backed ... FAILED
  1559. 33.73 s >
  1560. 33.73 s > failures:
  1561. 33.73 s >
  1562. 33.73 s > failures:
  1563. 33.73 s > tests::developer_architecture_is_classified_searchable_and_source_backed
  1564. 33.73 s >
  1565. 33.73 s > test result: FAILED. 0 passed; 1 failed; 0 ignored; 0 measured; 101 filtered out; finished in 0.01s
  1566. 33.73 s > system-err
  1567. 33.73 s > thread 'tests::developer_architecture_is_classified_searchable_and_source_backed' (224) panicked at crates/alphal00p-docs-builder/src/lib.rs:11615:47:
  1568. 33.73 s > called `Result::unwrap()` on an `Err` value: failed to read /build/source/docs/portal.toml
  1569. 33.73 s >
  1570. 33.73 s > Caused by:
  1571. 33.73 s > No such file or directory (os error 2)
  1572. 33.73 s >
  1573. 33.73 s > Location:
  1574. 33.73 s > crates/alphal00p-docs-builder/src/lib.rs:582:14
  1575. 33.73 s > stack backtrace:
  1576. 33.73 s > 0: __rustc::rust_begin_unwind
  1577. 33.73 s > 1: core::panicking::panic_fmt
  1578. 33.73 s > 2: core::result::unwrap_failed
  1579. 33.73 s > 3: alphal00p_docs_builder::tests::developer_architecture_is_classified_searchable_and_source_backed
  1580. 33.73 s > 4: <alphal00p_docs_builder::tests::developer_architecture_is_classified_searchable_and_source_backed::{closure#0} as core::ops::function::FnOnce<()>>::call_once
  1581. 33.73 s > note: Some details are omitted, run with `RUST_BACKTRACE=full` for a verbose backtrace.
  1582. 33.73 s >
  1583. 33.73 s > 8. alphal00p-docs-builder::tests::every_product_orients_rust_to_native_rustdoc_and_keeps_legacy_redirects
  1584. 33.73 s > failure: test failure with exit code 101
  1585. 33.73 s > thread 'tests::every_product_orients_rust_to_native_rustdoc_and_keeps_legacy_redirects' (247) panicked at crates/alphal00p-docs-builder/src/lib.rs:11445:47:
  1586. 33.73 s > called `Result::unwrap()` on an `Err` value: failed to read /build/source/docs/portal.toml
  1587. 33.73 s >
  1588. 33.73 s > Caused by:
  1589. 33.73 s > No such file or directory (os error 2)
  1590. 33.73 s >
  1591. 33.73 s > Location:
  1592. 33.73 s > crates/alphal00p-docs-builder/src/lib.rs:582:14
  1593. 33.73 s > stack backtrace:
  1594. 33.73 s > 0: __rustc::rust_begin_unwind
  1595. 33.73 s > 1: core::panicking::panic_fmt
  1596. 33.73 s > 2: core::result::unwrap_failed
  1597. 33.73 s > 3: alphal00p_docs_builder::tests::every_product_orients_rust_to_native_rustdoc_and_keeps_legacy_redirects
  1598. 33.73 s > 4: <alphal00p_docs_builder::tests::every_product_orients_rust_to_native_rustdoc_and_keeps_legacy_redirects::{closure#0} as core::ops::function::FnOnce<()>>::call_once
  1599. 33.73 s > note: Some details are omitted, run with `RUST_BACKTRACE=full` for a verbose backtrace.
  1600. 33.73 s > system-out
  1601. 33.73 s > running 1 test
  1602. 33.73 s > test tests::every_product_orients_rust_to_native_rustdoc_and_keeps_legacy_redirects ... FAILED
  1603. 33.73 s >
  1604. 33.73 s > failures:
  1605. 33.73 s >
  1606. 33.73 s > failures:
  1607. 33.73 s > tests::every_product_orients_rust_to_native_rustdoc_and_keeps_legacy_redirects
  1608. 33.73 s >
  1609. 33.73 s > test result: FAILED. 0 passed; 1 failed; 0 ignored; 0 measured; 101 filtered out; finished in 0.00s
  1610. 33.73 s > system-err
  1611. 33.73 s > thread 'tests::every_product_orients_rust_to_native_rustdoc_and_keeps_legacy_redirects' (247) panicked at crates/alphal00p-docs-builder/src/lib.rs:11445:47:
  1612. 33.73 s > called `Result::unwrap()` on an `Err` value: failed to read /build/source/docs/portal.toml
  1613. 33.73 s >
  1614. 33.73 s > Caused by:
  1615. 33.73 s > No such file or directory (os error 2)
  1616. 33.73 s >
  1617. 33.73 s > Location:
  1618. 33.73 s > crates/alphal00p-docs-builder/src/lib.rs:582:14
  1619. 33.73 s > stack backtrace:
  1620. 33.73 s > 0: __rustc::rust_begin_unwind
  1621. 33.73 s > 1: core::panicking::panic_fmt
  1622. 33.73 s > 2: core::result::unwrap_failed
  1623. 33.73 s > 3: alphal00p_docs_builder::tests::every_product_orients_rust_to_native_rustdoc_and_keeps_legacy_redirects
  1624. 33.73 s > 4: <alphal00p_docs_builder::tests::every_product_orients_rust_to_native_rustdoc_and_keeps_legacy_redirects::{closure#0} as core::ops::function::FnOnce<()>>::call_once
  1625. 33.73 s > note: Some details are omitted, run with `RUST_BACKTRACE=full` for a verbose backtrace.
  1626. 33.73 s >
  1627. 33.73 s > 9. alphal00p-docs-builder::tests::current_developer_notes_require_a_verified_code_scope
  1628. 33.73 s > failure: test failure with exit code 101
  1629. 33.73 s > thread 'tests::current_developer_notes_require_a_verified_code_scope' (236) panicked at crates/alphal00p-docs-builder/src/lib.rs:11131:51:
  1630. 33.73 s > called `Result::unwrap()` on an `Err` value: failed to read /build/source/docs/portal.toml
  1631. 33.73 s >
  1632. 33.73 s > Caused by:
  1633. 33.73 s > No such file or directory (os error 2)
  1634. 33.73 s >
  1635. 33.73 s > Location:
  1636. 33.73 s > crates/alphal00p-docs-builder/src/lib.rs:582:14
  1637. 33.73 s > stack backtrace:
  1638. 33.73 s > 0: __rustc::rust_begin_unwind
  1639. 33.73 s > 1: core::panicking::panic_fmt
  1640. 33.73 s > 2: core::result::unwrap_failed
  1641. 33.73 s > 3: alphal00p_docs_builder::tests::current_developer_notes_require_a_verified_code_scope
  1642. 33.73 s > 4: <alphal00p_docs_builder::tests::current_developer_notes_require_a_verified_code_scope::{closure#0} as core::ops::function::FnOnce<()>>::call_once
  1643. 33.73 s > note: Some details are omitted, run with `RUST_BACKTRACE=full` for a verbose backtrace.
  1644. 33.73 s > system-out
  1645. 33.73 s > running 1 test
  1646. 33.73 s > test tests::current_developer_notes_require_a_verified_code_scope ... FAILED
  1647. 33.73 s >
  1648. 33.73 s > failures:
  1649. 33.73 s >
  1650. 33.73 s > failures:
  1651. 33.73 s > tests::current_developer_notes_require_a_verified_code_scope
  1652. 33.73 s >
  1653. 33.73 s > test result: FAILED. 0 passed; 1 failed; 0 ignored; 0 measured; 101 filtered out; finished in 0.02s
  1654. 33.73 s > system-err
  1655. 33.73 s > thread 'tests::current_developer_notes_require_a_verified_code_scope' (236) panicked at crates/alphal00p-docs-builder/src/lib.rs:11131:51:
  1656. 33.73 s > called `Result::unwrap()` on an `Err` value: failed to read /build/source/docs/portal.toml
  1657. 33.73 s >
  1658. 33.73 s > Caused by:
  1659. 33.73 s > No such file or directory (os error 2)
  1660. 33.73 s >
  1661. 33.73 s > Location:
  1662. 33.73 s > crates/alphal00p-docs-builder/src/lib.rs:582:14
  1663. 33.73 s > stack backtrace:
  1664. 33.73 s > 0: __rustc::rust_begin_unwind
  1665. 33.73 s > 1: core::panicking::panic_fmt
  1666. 33.73 s > 2: core::result::unwrap_failed
  1667. 33.73 s > 3: alphal00p_docs_builder::tests::current_developer_notes_require_a_verified_code_scope
  1668. 33.73 s > 4: <alphal00p_docs_builder::tests::current_developer_notes_require_a_verified_code_scope::{closure#0} as core::ops::function::FnOnce<()>>::call_once
  1669. 33.73 s > note: Some details are omitted, run with `RUST_BACKTRACE=full` for a verbose backtrace.
  1670. 33.73 s >
  1671. 33.73 s > 10. alphal00p-docs-builder::tests::every_product_preview_entrypoint_validates_from_an_empty_output
  1672. 33.73 s > failure: test failure with exit code 101
  1673. 33.73 s > thread 'tests::every_product_preview_entrypoint_validates_from_an_empty_output' (250) panicked at crates/alphal00p-docs-builder/src/lib.rs:10563:47:
  1674. 33.73 s > called `Result::unwrap()` on an `Err` value: failed to read /build/source/docs/portal.toml
  1675. 33.74 s >
  1676. 33.74 s > Caused by:
  1677. 33.74 s > No such file or directory (os error 2)
  1678. 33.74 s >
  1679. 33.74 s > Location:
  1680. 33.74 s > crates/alphal00p-docs-builder/src/lib.rs:582:14
  1681. 33.74 s > stack backtrace:
  1682. 33.74 s > 0: __rustc::rust_begin_unwind
  1683. 33.74 s > 1: core::panicking::panic_fmt
  1684. 33.74 s > 2: core::result::unwrap_failed
  1685. 33.74 s > 3: alphal00p_docs_builder::tests::every_product_preview_entrypoint_validates_from_an_empty_output
  1686. 33.74 s > 4: <alphal00p_docs_builder::tests::every_product_preview_entrypoint_validates_from_an_empty_output::{closure#0} as core::ops::function::FnOnce<()>>::call_once
  1687. 33.74 s > note: Some details are omitted, run with `RUST_BACKTRACE=full` for a verbose backtrace.
  1688. 33.74 s > system-out
  1689. 33.74 s > running 1 test
  1690. 33.74 s > test tests::every_product_preview_entrypoint_validates_from_an_empty_output ... FAILED
  1691. 33.74 s >
  1692. 33.74 s > failures:
  1693. 33.74 s >
  1694. 33.74 s > failures:
  1695. 33.74 s > tests::every_product_preview_entrypoint_validates_from_an_empty_output
  1696. 33.74 s >
  1697. 33.74 s > test result: FAILED. 0 passed; 1 failed; 0 ignored; 0 measured; 101 filtered out; finished in 0.01s
  1698. 33.74 s > system-err
  1699. 33.74 s > thread 'tests::every_product_preview_entrypoint_validates_from_an_empty_output' (250) panicked at crates/alphal00p-docs-builder/src/lib.rs:10563:47:
  1700. 33.74 s > called `Result::unwrap()` on an `Err` value: failed to read /build/source/docs/portal.toml
  1701. 33.74 s >
  1702. 33.74 s > Caused by:
  1703. 33.74 s > No such file or directory (os error 2)
  1704. 33.74 s >
  1705. 33.74 s > Location:
  1706. 33.74 s > crates/alphal00p-docs-builder/src/lib.rs:582:14
  1707. 33.74 s > stack backtrace:
  1708. 33.74 s > 0: __rustc::rust_begin_unwind
  1709. 33.74 s > 1: core::panicking::panic_fmt
  1710. 33.74 s > 2: core::result::unwrap_failed
  1711. 33.74 s > 3: alphal00p_docs_builder::tests::every_product_preview_entrypoint_validates_from_an_empty_output
  1712. 33.74 s > 4: <alphal00p_docs_builder::tests::every_product_preview_entrypoint_validates_from_an_empty_output::{closure#0} as core::ops::function::FnOnce<()>>::call_once
  1713. 33.74 s > note: Some details are omitted, run with `RUST_BACKTRACE=full` for a verbose backtrace.
  1714. 33.74 s >
  1715. 33.74 s > 11. alphal00p-docs-builder::tests::complex_reference_pages_keep_an_inline_outline_below_the_right_rail
  1716. 33.74 s > failure: test failure with exit code 101
  1717. 33.74 s > thread 'tests::complex_reference_pages_keep_an_inline_outline_below_the_right_rail' (251) panicked at crates/alphal00p-docs-builder/src/lib.rs:11898:47:
  1718. 33.74 s > called `Result::unwrap()` on an `Err` value: failed to read /build/source/docs/portal.toml
  1719. 33.74 s >
  1720. 33.74 s > Caused by:
  1721. 33.74 s > No such file or directory (os error 2)
  1722. 33.74 s >
  1723. 33.74 s > Location:
  1724. 33.74 s > crates/alphal00p-docs-builder/src/lib.rs:582:14
  1725. 33.74 s > stack backtrace:
  1726. 33.74 s > 0: __rustc::rust_begin_unwind
  1727. 33.74 s > 1: core::panicking::panic_fmt
  1728. 33.74 s > 2: core::result::unwrap_failed
  1729. 33.74 s > 3: alphal00p_docs_builder::tests::complex_reference_pages_keep_an_inline_outline_below_the_right_rail
  1730. 33.74 s > 4: <alphal00p_docs_builder::tests::complex_reference_pages_keep_an_inline_outline_below_the_right_rail::{closure#0} as core::ops::function::FnOnce<()>>::call_once
  1731. 33.74 s > note: Some details are omitted, run with `RUST_BACKTRACE=full` for a verbose backtrace.
  1732. 33.74 s > system-out
  1733. 33.74 s > running 1 test
  1734. 33.74 s > test tests::complex_reference_pages_keep_an_inline_outline_below_the_right_rail ... FAILED
  1735. 33.74 s >
  1736. 33.74 s > failures:
  1737. 33.74 s >
  1738. 33.74 s > failures:
  1739. 33.74 s > tests::complex_reference_pages_keep_an_inline_outline_below_the_right_rail
  1740. 33.74 s >
  1741. 33.74 s > test result: FAILED. 0 passed; 1 failed; 0 ignored; 0 measured; 101 filtered out; finished in 0.01s
  1742. 33.74 s > system-err
  1743. 33.74 s > thread 'tests::complex_reference_pages_keep_an_inline_outline_below_the_right_rail' (251) panicked at crates/alphal00p-docs-builder/src/lib.rs:11898:47:
  1744. 33.74 s > called `Result::unwrap()` on an `Err` value: failed to read /build/source/docs/portal.toml
  1745. 33.74 s >
  1746. 33.74 s > Caused by:
  1747. 33.74 s > No such file or directory (os error 2)
  1748. 33.74 s >
  1749. 33.74 s > Location:
  1750. 33.74 s > crates/alphal00p-docs-builder/src/lib.rs:582:14
  1751. 33.74 s > stack backtrace:
  1752. 33.74 s > 0: __rustc::rust_begin_unwind
  1753. 33.74 s > 1: core::panicking::panic_fmt
  1754. 33.74 s > 2: core::result::unwrap_failed
  1755. 33.74 s > 3: alphal00p_docs_builder::tests::complex_reference_pages_keep_an_inline_outline_below_the_right_rail
  1756. 33.74 s > 4: <alphal00p_docs_builder::tests::complex_reference_pages_keep_an_inline_outline_below_the_right_rail::{closure#0} as core::ops::function::FnOnce<()>>::call_once
  1757. 33.74 s > note: Some details are omitted, run with `RUST_BACKTRACE=full` for a verbose backtrace.
  1758. 33.74 s >
  1759. 33.74 s > 12. alphal00p-docs-builder::tests::generated_link_validation_accepts_named_anchors
  1760. 33.74 s > failure: test failure with exit code 101
  1761. 33.74 s > thread 'tests::generated_link_validation_accepts_named_anchors' (265) panicked at crates/alphal00p-docs-builder/src/lib.rs:10036:47:
  1762. 33.74 s > called `Result::unwrap()` on an `Err` value: failed to read /build/source/docs/portal.toml
  1763. 33.74 s >
  1764. 33.74 s > Caused by:
  1765. 33.74 s > No such file or directory (os error 2)
  1766. 33.74 s >
  1767. 33.74 s > Location:
  1768. 33.74 s > crates/alphal00p-docs-builder/src/lib.rs:582:14
  1769. 33.74 s > stack backtrace:
  1770. 33.74 s > 0: __rustc::rust_begin_unwind
  1771. 33.74 s > 1: core::panicking::panic_fmt
  1772. 33.74 s > 2: core::result::unwrap_failed
  1773. 33.74 s > 3: alphal00p_docs_builder::tests::generated_link_validation_accepts_named_anchors
  1774. 33.74 s > 4: <alphal00p_docs_builder::tests::generated_link_validation_accepts_named_anchors::{closure#0} as core::ops::function::FnOnce<()>>::call_once
  1775. 33.74 s > note: Some details are omitted, run with `RUST_BACKTRACE=full` for a verbose backtrace.
  1776. 33.74 s > system-out
  1777. 33.74 s > running 1 test
  1778. 33.74 s > test tests::generated_link_validation_accepts_named_anchors ... FAILED
  1779. 33.74 s >
  1780. 33.74 s > failures:
  1781. 33.74 s >
  1782. 33.74 s > failures:
  1783. 33.74 s > tests::generated_link_validation_accepts_named_anchors
  1784. 33.74 s >
  1785. 33.74 s > test result: FAILED. 0 passed; 1 failed; 0 ignored; 0 measured; 101 filtered out; finished in 0.00s
  1786. 33.74 s > system-err
  1787. 33.74 s > thread 'tests::generated_link_validation_accepts_named_anchors' (265) panicked at crates/alphal00p-docs-builder/src/lib.rs:10036:47:
  1788. 33.74 s > called `Result::unwrap()` on an `Err` value: failed to read /build/source/docs/portal.toml
  1789. 33.74 s >
  1790. 33.74 s > Caused by:
  1791. 33.74 s > No such file or directory (os error 2)
  1792. 33.74 s >
  1793. 33.74 s > Location:
  1794. 33.74 s > crates/alphal00p-docs-builder/src/lib.rs:582:14
  1795. 33.74 s > stack backtrace:
  1796. 33.74 s > 0: __rustc::rust_begin_unwind
  1797. 33.74 s > 1: core::panicking::panic_fmt
  1798. 33.74 s > 2: core::result::unwrap_failed
  1799. 33.74 s > 3: alphal00p_docs_builder::tests::generated_link_validation_accepts_named_anchors
  1800. 33.74 s > 4: <alphal00p_docs_builder::tests::generated_link_validation_accepts_named_anchors::{closure#0} as core::ops::function::FnOnce<()>>::call_once
  1801. 33.74 s > note: Some details are omitted, run with `RUST_BACKTRACE=full` for a verbose backtrace.
  1802. 33.74 s >
  1803. 33.74 s > 13. alphal00p-docs-builder::tests::generated_links_cannot_escape_the_output_root
  1804. 33.74 s > failure: test failure with exit code 101
  1805. 33.74 s > thread 'tests::generated_links_cannot_escape_the_output_root' (274) panicked at crates/alphal00p-docs-builder/src/lib.rs:9917:47:
  1806. 33.74 s > called `Result::unwrap()` on an `Err` value: failed to read /build/source/docs/portal.toml
  1807. 33.74 s >
  1808. 33.74 s > Caused by:
  1809. 33.74 s > No such file or directory (os error 2)
  1810. 33.74 s >
  1811. 33.74 s > Location:
  1812. 33.74 s > crates/alphal00p-docs-builder/src/lib.rs:582:14
  1813. 33.74 s > stack backtrace:
  1814. 33.74 s > 0: __rustc::rust_begin_unwind
  1815. 33.74 s > 1: core::panicking::panic_fmt
  1816. 33.74 s > 2: core::result::unwrap_failed
  1817. 33.74 s > 3: alphal00p_docs_builder::tests::generated_links_cannot_escape_the_output_root
  1818. 33.74 s > 4: <alphal00p_docs_builder::tests::generated_links_cannot_escape_the_output_root::{closure#0} as core::ops::function::FnOnce<()>>::call_once
  1819. 33.74 s > note: Some details are omitted, run with `RUST_BACKTRACE=full` for a verbose backtrace.
  1820. 33.74 s > system-out
  1821. 33.74 s > running 1 test
  1822. 33.74 s > test tests::generated_links_cannot_escape_the_output_root ... FAILED
  1823. 33.74 s >
  1824. 33.74 s > failures:
  1825. 33.74 s >
  1826. 33.74 s > failures:
  1827. 33.74 s > tests::generated_links_cannot_escape_the_output_root
  1828. 33.74 s >
  1829. 33.74 s > test result: FAILED. 0 passed; 1 failed; 0 ignored; 0 measured; 101 filtered out; finished in 0.01s
  1830. 33.74 s > system-err
  1831. 33.74 s > thread 'tests::generated_links_cannot_escape_the_output_root' (274) panicked at crates/alphal00p-docs-builder/src/lib.rs:9917:47:
  1832. 33.74 s > called `Result::unwrap()` on an `Err` value: failed to read /build/source/docs/portal.toml
  1833. 33.74 s >
  1834. 33.74 s > Caused by:
  1835. 33.74 s > No such file or directory (os error 2)
  1836. 33.74 s >
  1837. 33.74 s > Location:
  1838. 33.74 s > crates/alphal00p-docs-builder/src/lib.rs:582:14
  1839. 33.74 s > stack backtrace:
  1840. 33.74 s > 0: __rustc::rust_begin_unwind
  1841. 33.74 s > 1: core::panicking::panic_fmt
  1842. 33.74 s > 2: core::result::unwrap_failed
  1843. 33.74 s > 3: alphal00p_docs_builder::tests::generated_links_cannot_escape_the_output_root
  1844. 33.74 s > 4: <alphal00p_docs_builder::tests::generated_links_cannot_escape_the_output_root::{closure#0} as core::ops::function::FnOnce<()>>::call_once
  1845. 33.74 s > note: Some details are omitted, run with `RUST_BACKTRACE=full` for a verbose backtrace.
  1846. 33.74 s >
  1847. 33.74 s > 14. alphal00p-docs-builder::tests::generated_link_validation_rejects_source_ranges_on_ordinary_pages
  1848. 33.74 s > failure: test failure with exit code 101
  1849. 33.74 s > thread 'tests::generated_link_validation_rejects_source_ranges_on_ordinary_pages' (270) panicked at crates/alphal00p-docs-builder/src/lib.rs:10056:47:
  1850. 33.74 s > called `Result::unwrap()` on an `Err` value: failed to read /build/source/docs/portal.toml
  1851. 33.74 s >
  1852. 33.74 s > Caused by:
  1853. 33.74 s > No such file or directory (os error 2)
  1854. 33.74 s >
  1855. 33.74 s > Location:
  1856. 33.74 s > crates/alphal00p-docs-builder/src/lib.rs:582:14
  1857. 33.74 s > stack backtrace:
  1858. 33.74 s > 0: __rustc::rust_begin_unwind
  1859. 33.74 s > 1: core::panicking::panic_fmt
  1860. 33.74 s > 2: core::result::unwrap_failed
  1861. 33.74 s > 3: alphal00p_docs_builder::tests::generated_link_validation_rejects_source_ranges_on_ordinary_pages
  1862. 33.74 s > 4: <alphal00p_docs_builder::tests::generated_link_validation_rejects_source_ranges_on_ordinary_pages::{closure#0} as core::ops::function::FnOnce<()>>::call_once
  1863. 33.74 s > note: Some details are omitted, run with `RUST_BACKTRACE=full` for a verbose backtrace.
  1864. 33.74 s > system-out
  1865. 33.74 s > running 1 test
  1866. 33.74 s > test tests::generated_link_validation_rejects_source_ranges_on_ordinary_pages ... FAILED
  1867. 33.74 s >
  1868. 33.74 s > failures:
  1869. 33.74 s >
  1870. 33.74 s > failures:
  1871. 33.74 s > tests::generated_link_validation_rejects_source_ranges_on_ordinary_pages
  1872. 33.74 s >
  1873. 33.74 s > test result: FAILED. 0 passed; 1 failed; 0 ignored; 0 measured; 101 filtered out; finished in 0.01s
  1874. 33.74 s > system-err
  1875. 33.74 s > thread 'tests::generated_link_validation_rejects_source_ranges_on_ordinary_pages' (270) panicked at crates/alphal00p-docs-builder/src/lib.rs:10056:47:
  1876. 33.74 s > called `Result::unwrap()` on an `Err` value: failed to read /build/source/docs/portal.toml
  1877. 33.74 s >
  1878. 33.74 s > Caused by:
  1879. 33.74 s > No such file or directory (os error 2)
  1880. 33.74 s >
  1881. 33.74 s > Location:
  1882. 33.74 s > crates/alphal00p-docs-builder/src/lib.rs:582:14
  1883. 33.74 s > stack backtrace:
  1884. 33.74 s > 0: __rustc::rust_begin_unwind
  1885. 33.74 s > 1: core::panicking::panic_fmt
  1886. 33.74 s > 2: core::result::unwrap_failed
  1887. 33.74 s > 3: alphal00p_docs_builder::tests::generated_link_validation_rejects_source_ranges_on_ordinary_pages
  1888. 33.74 s > 4: <alphal00p_docs_builder::tests::generated_link_validation_rejects_source_ranges_on_ordinary_pages::{closure#0} as core::ops::function::FnOnce<()>>::call_once
  1889. 33.74 s > note: Some details are omitted, run with `RUST_BACKTRACE=full` for a verbose backtrace.
  1890. 33.74 s >
  1891. 33.74 s > 15. alphal00p-docs-builder::tests::every_registered_component_tag_family_matches_its_manifest_version
  1892. 33.74 s > failure: test failure with exit code 101
  1893. 33.74 s > thread 'tests::every_registered_component_tag_family_matches_its_manifest_version' (262) panicked at crates/alphal00p-docs-builder/src/lib.rs:9152:47:
  1894. 33.74 s > called `Result::unwrap()` on an `Err` value: failed to read /build/source/docs/portal.toml
  1895. 33.74 s >
  1896. 33.74 s > Caused by:
  1897. 33.74 s > No such file or directory (os error 2)
  1898. 33.74 s >
  1899. 33.74 s > Location:
  1900. 33.74 s > crates/alphal00p-docs-builder/src/lib.rs:582:14
  1901. 33.74 s > stack backtrace:
  1902. 33.74 s > 0: __rustc::rust_begin_unwind
  1903. 33.74 s > 1: core::panicking::panic_fmt
  1904. 33.74 s > 2: core::result::unwrap_failed
  1905. 33.74 s > 3: alphal00p_docs_builder::tests::every_registered_component_tag_family_matches_its_manifest_version
  1906. 33.74 s > 4: <alphal00p_docs_builder::tests::every_registered_component_tag_family_matches_its_manifest_version::{closure#0} as core::ops::function::FnOnce<()>>::call_once
  1907. 33.74 s > note: Some details are omitted, run with `RUST_BACKTRACE=full` for a verbose backtrace.
  1908. 33.74 s > system-out
  1909. 33.74 s > running 1 test
  1910. 33.74 s > test tests::every_registered_component_tag_family_matches_its_manifest_version ... FAILED
  1911. 33.74 s >
  1912. 33.74 s > failures:
  1913. 33.74 s >
  1914. 33.74 s > failures:
  1915. 33.74 s > tests::every_registered_component_tag_family_matches_its_manifest_version
  1916. 33.74 s >
  1917. 33.74 s > test result: FAILED. 0 passed; 1 failed; 0 ignored; 0 measured; 101 filtered out; finished in 0.01s
  1918. 33.74 s > system-err
  1919. 33.74 s > thread 'tests::every_registered_component_tag_family_matches_its_manifest_version' (262) panicked at crates/alphal00p-docs-builder/src/lib.rs:9152:47:
  1920. 33.74 s > called `Result::unwrap()` on an `Err` value: failed to read /build/source/docs/portal.toml
  1921. 33.74 s >
  1922. 33.74 s > Caused by:
  1923. 33.74 s > No such file or directory (os error 2)
  1924. 33.74 s >
  1925. 33.74 s > Location:
  1926. 33.74 s > crates/alphal00p-docs-builder/src/lib.rs:582:14
  1927. 33.74 s > stack backtrace:
  1928. 33.74 s > 0: __rustc::rust_begin_unwind
  1929. 33.74 s > 1: core::panicking::panic_fmt
  1930. 33.74 s > 2: core::result::unwrap_failed
  1931. 33.74 s > 3: alphal00p_docs_builder::tests::every_registered_component_tag_family_matches_its_manifest_version
  1932. 33.74 s > 4: <alphal00p_docs_builder::tests::every_registered_component_tag_family_matches_its_manifest_version::{closure#0} as core::ops::function::FnOnce<()>>::call_once
  1933. 33.74 s > note: Some details are omitted, run with `RUST_BACKTRACE=full` for a verbose backtrace.
  1934. 33.74 s >
  1935. 33.74 s > 16. alphal00p-docs-builder::tests::pdf_manual_chapter_order_must_match_the_page_registry
  1936. 33.74 s > failure: test failure with exit code 101
  1937. 33.74 s > thread 'tests::pdf_manual_chapter_order_must_match_the_page_registry' (278) panicked at crates/alphal00p-docs-builder/src/lib.rs:11122:51:
  1938. 33.74 s > called `Result::unwrap()` on an `Err` value: failed to read /build/source/docs/portal.toml
  1939. 33.74 s >
  1940. 33.74 s > Caused by:
  1941. 33.74 s > No such file or directory (os error 2)
  1942. 33.74 s >
  1943. 33.74 s > Location:
  1944. 33.74 s > crates/alphal00p-docs-builder/src/lib.rs:582:14
  1945. 33.74 s > stack backtrace:
  1946. 33.74 s > 0: __rustc::rust_begin_unwind
  1947. 33.74 s > 1: core::panicking::panic_fmt
  1948. 33.74 s > 2: core::result::unwrap_failed
  1949. 33.74 s > 3: alphal00p_docs_builder::tests::pdf_manual_chapter_order_must_match_the_page_registry
  1950. 33.74 s > 4: <alphal00p_docs_builder::tests::pdf_manual_chapter_order_must_match_the_page_registry::{closure#0} as core::ops::function::FnOnce<()>>::call_once
  1951. 33.74 s > note: Some details are omitted, run with `RUST_BACKTRACE=full` for a verbose backtrace.
  1952. 33.74 s > system-out
  1953. 33.74 s > running 1 test
  1954. 33.74 s > test tests::pdf_manual_chapter_order_must_match_the_page_registry ... FAILED
  1955. 33.74 s >
  1956. 33.74 s > failures:
  1957. 33.74 s >
  1958. 33.74 s > failures:
  1959. 33.74 s > tests::pdf_manual_chapter_order_must_match_the_page_registry
  1960. 33.74 s >
  1961. 33.74 s > test result: FAILED. 0 passed; 1 failed; 0 ignored; 0 measured; 101 filtered out; finished in 0.00s
  1962. 33.74 s > system-err
  1963. 33.74 s > thread 'tests::pdf_manual_chapter_order_must_match_the_page_registry' (278) panicked at crates/alphal00p-docs-builder/src/lib.rs:11122:51:
  1964. 33.74 s > called `Result::unwrap()` on an `Err` value: failed to read /build/source/docs/portal.toml
  1965. 33.74 s >
  1966. 33.74 s > Caused by:
  1967. 33.74 s > No such file or directory (os error 2)
  1968. 33.74 s >
  1969. 33.74 s > Location:
  1970. 33.74 s > crates/alphal00p-docs-builder/src/lib.rs:582:14
  1971. 33.74 s > stack backtrace:
  1972. 33.74 s > 0: __rustc::rust_begin_unwind
  1973. 33.74 s > 1: core::panicking::panic_fmt
  1974. 33.74 s > 2: core::result::unwrap_failed
  1975. 33.74 s > 3: alphal00p_docs_builder::tests::pdf_manual_chapter_order_must_match_the_page_registry
  1976. 33.74 s > 4: <alphal00p_docs_builder::tests::pdf_manual_chapter_order_must_match_the_page_registry::{closure#0} as core::ops::function::FnOnce<()>>::call_once
  1977. 33.74 s > note: Some details are omitted, run with `RUST_BACKTRACE=full` for a verbose backtrace.
  1978. 33.74 s >
  1979. 33.74 s > 17. alphal00p-docs-builder::tests::generated_search_uses_cli_leaf_routes_and_setting_namespaces
  1980. 33.74 s > failure: test failure with exit code 101
  1981. 33.74 s > thread 'tests::generated_search_uses_cli_leaf_routes_and_setting_namespaces' (267) panicked at crates/alphal00p-docs-builder/src/lib.rs:11570:47:
  1982. 33.74 s > called `Result::unwrap()` on an `Err` value: failed to read /build/source/docs/portal.toml
  1983. 33.74 s >
  1984. 33.74 s > Caused by:
  1985. 33.74 s > No such file or directory (os error 2)
  1986. 33.74 s >
  1987. 33.74 s > Location:
  1988. 33.74 s > crates/alphal00p-docs-builder/src/lib.rs:582:14
  1989. 33.74 s > stack backtrace:
  1990. 33.74 s > 0: __rustc::rust_begin_unwind
  1991. 33.74 s > 1: core::panicking::panic_fmt
  1992. 33.74 s > 2: core::result::unwrap_failed
  1993. 33.74 s > 3: alphal00p_docs_builder::tests::generated_search_uses_cli_leaf_routes_and_setting_namespaces
  1994. 33.74 s > 4: <alphal00p_docs_builder::tests::generated_search_uses_cli_leaf_routes_and_setting_namespaces::{closure#0} as core::ops::function::FnOnce<()>>::call_once
  1995. 33.74 s > note: Some details are omitted, run with `RUST_BACKTRACE=full` for a verbose backtrace.
  1996. 33.74 s > system-out
  1997. 33.74 s > running 1 test
  1998. 33.74 s > test tests::generated_search_uses_cli_leaf_routes_and_setting_namespaces ... FAILED
  1999. 33.74 s >
  2000. 33.74 s > failures:
  2001. 33.74 s >
  2002. 33.74 s > failures:
  2003. 33.74 s > tests::generated_search_uses_cli_leaf_routes_and_setting_namespaces
  2004. 33.74 s >
  2005. 33.74 s > test result: FAILED. 0 passed; 1 failed; 0 ignored; 0 measured; 101 filtered out; finished in 0.02s
  2006. 33.74 s > system-err
  2007. 33.74 s > thread 'tests::generated_search_uses_cli_leaf_routes_and_setting_namespaces' (267) panicked at crates/alphal00p-docs-builder/src/lib.rs:11570:47:
  2008. 33.74 s > called `Result::unwrap()` on an `Err` value: failed to read /build/source/docs/portal.toml
  2009. 33.74 s >
  2010. 33.74 s > Caused by:
  2011. 33.74 s > No such file or directory (os error 2)
  2012. 33.74 s >
  2013. 33.74 s > Location:
  2014. 33.74 s > crates/alphal00p-docs-builder/src/lib.rs:582:14
  2015. 33.74 s > stack backtrace:
  2016. 33.74 s > 0: __rustc::rust_begin_unwind
  2017. 33.74 s > 1: core::panicking::panic_fmt
  2018. 33.74 s > 2: core::result::unwrap_failed
  2019. 33.74 s > 3: alphal00p_docs_builder::tests::generated_search_uses_cli_leaf_routes_and_setting_namespaces
  2020. 33.74 s > 4: <alphal00p_docs_builder::tests::generated_search_uses_cli_leaf_routes_and_setting_namespaces::{closure#0} as core::ops::function::FnOnce<()>>::call_once
  2021. 33.74 s > note: Some details are omitted, run with `RUST_BACKTRACE=full` for a verbose backtrace.
  2022. 33.74 s >
  2023. 33.74 s > 18. alphal00p-docs-builder::tests::generated_link_validation_rejects_phantom_anchors
  2024. 33.74 s > failure: test failure with exit code 101
  2025. 33.74 s > thread 'tests::generated_link_validation_rejects_phantom_anchors' (282) panicked at crates/alphal00p-docs-builder/src/lib.rs:10015:47:
  2026. 33.74 s > called `Result::unwrap()` on an `Err` value: failed to read /build/source/docs/portal.toml
  2027. 33.74 s >
  2028. 33.74 s > Caused by:
  2029. 33.74 s > No such file or directory (os error 2)
  2030. 33.74 s >
  2031. 33.74 s > Location:
  2032. 33.74 s > crates/alphal00p-docs-builder/src/lib.rs:582:14
  2033. 33.74 s > stack backtrace:
  2034. 33.74 s > 0: __rustc::rust_begin_unwind
  2035. 33.74 s > 1: core::panicking::panic_fmt
  2036. 33.74 s > 2: core::result::unwrap_failed
  2037. 33.74 s > 3: alphal00p_docs_builder::tests::generated_link_validation_rejects_phantom_anchors
  2038. 33.74 s > 4: <alphal00p_docs_builder::tests::generated_link_validation_rejects_phantom_anchors::{closure#0} as core::ops::function::FnOnce<()>>::call_once
  2039. 33.74 s > note: Some details are omitted, run with `RUST_BACKTRACE=full` for a verbose backtrace.
  2040. 33.74 s > system-out
  2041. 33.74 s > running 1 test
  2042. 33.74 s > test tests::generated_link_validation_rejects_phantom_anchors ... FAILED
  2043. 33.74 s >
  2044. 33.74 s > failures:
  2045. 33.74 s >
  2046. 33.74 s > failures:
  2047. 33.74 s > tests::generated_link_validation_rejects_phantom_anchors
  2048. 33.74 s >
  2049. 33.74 s > test result: FAILED. 0 passed; 1 failed; 0 ignored; 0 measured; 101 filtered out; finished in 0.01s
  2050. 33.74 s > system-err
  2051. 33.74 s > thread 'tests::generated_link_validation_rejects_phantom_anchors' (282) panicked at crates/alphal00p-docs-builder/src/lib.rs:10015:47:
  2052. 33.74 s > called `Result::unwrap()` on an `Err` value: failed to read /build/source/docs/portal.toml
  2053. 33.74 s >
  2054. 33.74 s > Caused by:
  2055. 33.74 s > No such file or directory (os error 2)
  2056. 33.74 s >
  2057. 33.74 s > Location:
  2058. 33.74 s > crates/alphal00p-docs-builder/src/lib.rs:582:14
  2059. 33.74 s > stack backtrace:
  2060. 33.74 s > 0: __rustc::rust_begin_unwind
  2061. 33.74 s > 1: core::panicking::panic_fmt
  2062. 33.74 s > 2: core::result::unwrap_failed
  2063. 33.74 s > 3: alphal00p_docs_builder::tests::generated_link_validation_rejects_phantom_anchors
  2064. 33.74 s > 4: <alphal00p_docs_builder::tests::generated_link_validation_rejects_phantom_anchors::{closure#0} as core::ops::function::FnOnce<()>>::call_once
  2065. 33.74 s > note: Some details are omitted, run with `RUST_BACKTRACE=full` for a verbose backtrace.
  2066. 33.74 s >
  2067. 33.74 s > 19. alphal00p-docs-builder::tests::immutable_snapshot_navigation_does_not_link_mutable_developer_notes
  2068. 33.74 s > failure: test failure with exit code 101
  2069. 33.74 s > thread 'tests::immutable_snapshot_navigation_does_not_link_mutable_developer_notes' (291) panicked at crates/alphal00p-docs-builder/src/lib.rs:9041:47:
  2070. 33.74 s > called `Result::unwrap()` on an `Err` value: failed to read /build/source/docs/portal.toml
  2071. 33.74 s >
  2072. 33.74 s > Caused by:
  2073. 33.74 s > No such file or directory (os error 2)
  2074. 33.74 s >
  2075. 33.74 s > Location:
  2076. 33.74 s > crates/alphal00p-docs-builder/src/lib.rs:582:14
  2077. 33.74 s > stack backtrace:
  2078. 33.74 s > 0: __rustc::rust_begin_unwind
  2079. 33.74 s > 1: core::panicking::panic_fmt
  2080. 33.74 s > 2: core::result::unwrap_failed
  2081. 33.74 s > 3: alphal00p_docs_builder::tests::immutable_snapshot_navigation_does_not_link_mutable_developer_notes
  2082. 33.74 s > 4: <alphal00p_docs_builder::tests::immutable_snapshot_navigation_does_not_link_mutable_developer_notes::{closure#0} as core::ops::function::FnOnce<()>>::call_once
  2083. 33.74 s > note: Some details are omitted, run with `RUST_BACKTRACE=full` for a verbose backtrace.
  2084. 33.74 s > system-out
  2085. 33.74 s > running 1 test
  2086. 33.74 s > test tests::immutable_snapshot_navigation_does_not_link_mutable_developer_notes ... FAILED
  2087. 33.74 s >
  2088. 33.74 s > failures:
  2089. 33.74 s >
  2090. 33.74 s > failures:
  2091. 33.74 s > tests::immutable_snapshot_navigation_does_not_link_mutable_developer_notes
  2092. 33.74 s >
  2093. 33.74 s > test result: FAILED. 0 passed; 1 failed; 0 ignored; 0 measured; 101 filtered out; finished in 0.00s
  2094. 33.74 s > system-err
  2095. 33.74 s > thread 'tests::immutable_snapshot_navigation_does_not_link_mutable_developer_notes' (291) panicked at crates/alphal00p-docs-builder/src/lib.rs:9041:47:
  2096. 33.74 s > called `Result::unwrap()` on an `Err` value: failed to read /build/source/docs/portal.toml
  2097. 33.74 s >
  2098. 33.74 s > Caused by:
  2099. 33.74 s > No such file or directory (os error 2)
  2100. 33.74 s >
  2101. 33.74 s > Location:
  2102. 33.74 s > crates/alphal00p-docs-builder/src/lib.rs:582:14
  2103. 33.74 s > stack backtrace:
  2104. 33.74 s > 0: __rustc::rust_begin_unwind
  2105. 33.74 s > 1: core::panicking::panic_fmt
  2106. 33.74 s > 2: core::result::unwrap_failed
  2107. 33.74 s > 3: alphal00p_docs_builder::tests::immutable_snapshot_navigation_does_not_link_mutable_developer_notes
  2108. 33.74 s > 4: <alphal00p_docs_builder::tests::immutable_snapshot_navigation_does_not_link_mutable_developer_notes::{closure#0} as core::ops::function::FnOnce<()>>::call_once
  2109. 33.74 s > note: Some details are omitted, run with `RUST_BACKTRACE=full` for a verbose backtrace.
  2110. 33.74 s >
  2111. 33.74 s > 20. alphal00p-docs-builder::tests::generated_search_links_are_validated_without_rewriting_html
  2112. 33.74 s > failure: test failure with exit code 101
  2113. 33.74 s > thread 'tests::generated_search_links_are_validated_without_rewriting_html' (284) panicked at crates/alphal00p-docs-builder/src/lib.rs:10077:47:
  2114. 33.74 s > called `Result::unwrap()` on an `Err` value: failed to read /build/source/docs/portal.toml
  2115. 33.74 s >
  2116. 33.74 s > Caused by:
  2117. 33.74 s > No such file or directory (os error 2)
  2118. 33.74 s >
  2119. 33.74 s > Location:
  2120. 33.74 s > crates/alphal00p-docs-builder/src/lib.rs:582:14
  2121. 33.74 s > stack backtrace:
  2122. 33.74 s > 0: __rustc::rust_begin_unwind
  2123. 33.74 s > 1: core::panicking::panic_fmt
  2124. 33.74 s > 2: core::result::unwrap_failed
  2125. 33.74 s > 3: alphal00p_docs_builder::tests::generated_search_links_are_validated_without_rewriting_html
  2126. 33.74 s > 4: <alphal00p_docs_builder::tests::generated_search_links_are_validated_without_rewriting_html::{closure#0} as core::ops::function::FnOnce<()>>::call_once
  2127. 33.74 s > note: Some details are omitted, run with `RUST_BACKTRACE=full` for a verbose backtrace.
  2128. 33.74 s > system-out
  2129. 33.74 s > running 1 test
  2130. 33.74 s > test tests::generated_search_links_are_validated_without_rewriting_html ... FAILED
  2131. 33.74 s >
  2132. 33.74 s > failures:
  2133. 33.74 s >
  2134. 33.74 s > failures:
  2135. 33.74 s > tests::generated_search_links_are_validated_without_rewriting_html
  2136. 33.74 s >
  2137. 33.74 s > test result: FAILED. 0 passed; 1 failed; 0 ignored; 0 measured; 101 filtered out; finished in 0.01s
  2138. 33.74 s > system-err
  2139. 33.74 s > thread 'tests::generated_search_links_are_validated_without_rewriting_html' (284) panicked at crates/alphal00p-docs-builder/src/lib.rs:10077:47:
  2140. 33.74 s > called `Result::unwrap()` on an `Err` value: failed to read /build/source/docs/portal.toml
  2141. 33.74 s >
  2142. 33.74 s > Caused by:
  2143. 33.74 s > No such file or directory (os error 2)
  2144. 33.74 s >
  2145. 33.74 s > Location:
  2146. 33.74 s > crates/alphal00p-docs-builder/src/lib.rs:582:14
  2147. 33.74 s > stack backtrace:
  2148. 33.74 s > 0: __rustc::rust_begin_unwind
  2149. 33.74 s > 1: core::panicking::panic_fmt
  2150. 33.74 s > 2: core::result::unwrap_failed
  2151. 33.74 s > 3: alphal00p_docs_builder::tests::generated_search_links_are_validated_without_rewriting_html
  2152. 33.74 s > 4: <alphal00p_docs_builder::tests::generated_search_links_are_validated_without_rewriting_html::{closure#0} as core::ops::function::FnOnce<()>>::call_once
  2153. 33.74 s > note: Some details are omitted, run with `RUST_BACKTRACE=full` for a verbose backtrace.
  2154. 33.74 s >
  2155. 33.74 s > ... omitted 26 more failing tests
  2156. 33.74 s > =========================================
  2157. 33.74 s > Extracting 2 binaries to /build/nextest-archive-k4JG5X
  2158. 33.74 s > Extracted 5 files to /build/nextest-archive-k4JG5X in 0.05s
  2159. 33.74 s > ------------
  2160. 33.74 s > Nextest run ID 62a8b5cf-3144-4e48-8f00-adbe4b77cc45 with nextest profile: ci_gammaloop
  2161. 33.74 s > Starting 22 tests across 2 binaries
  2162. 33.74 s > ------------
  2163. 33.74 s > Summary [ 0.026s] 22 tests run: 22 passed, 0 skipped
  2164. 33.74 s >
  2165. 33.74 s > ========== nextest test summary ==========
  2166. 33.74 s > report: target/nextest/ci_gammaloop/junit.xml
  2167. 33.74 s > tests: 22, failures: 0, errors: 0
  2168. 33.74 s > No failing testcases found.
  2169. 33.74 s > =========================================
  2170. 33.74 s > Extracting 1 binary, 1 build script output directory, and 2 linked paths to /build/nextest-archive-AtunNQ
  2171. 33.74 s > Extracted 18 files to /build/nextest-archive-AtunNQ in 0.11s
  2172. 33.74 s > ------------
  2173. 33.74 s > Nextest run ID 917b8e37-1bb1-4425-bb29-74b1abf09b1f with nextest profile: ci_gammaloop
  2174. 33.74 s > Starting 85 tests across 1 binary
  2175. 33.74 s > FAIL [ 0.035s] (27/85) alphal00p-docs-examples catalog_examples::python_catalog_examples_compile_without_importing_products
  2176. 33.74 s > stdout ---
  2177. 33.74 s >
  2178. 33.74 s > running 1 test
  2179. 33.74 s > test catalog_examples::python_catalog_examples_compile_without_importing_products ... FAILED
  2180. 33.74 s >
  2181. 33.74 s > failures:
  2182. 33.74 s >
  2183. 33.74 s > failures:
  2184. 33.74 s > catalog_examples::python_catalog_examples_compile_without_importing_products
  2185. 33.74 s >
  2186. 33.74 s > test result: FAILED. 0 passed; 1 failed; 0 ignored; 0 measured; 84 filtered out; finished in 0.01s
  2187. 33.74 s >
  2188. 33.74 s > stderr ---
  2189. 33.74 s >
  2190. 33.74 s > thread 'catalog_examples::python_catalog_examples_compile_without_importing_products' (577) panicked at crates/alphal00p-docs-examples/src/lib.rs:39:17:
  2191. 33.74 s > failed to start Python interpreter python3: No such file or directory (os error 2)
  2192. 33.74 s > stack backtrace:
  2193. 33.74 s > 0: __rustc::rust_begin_unwind
  2194. 33.74 s > 1: core::panicking::panic_fmt
  2195. 33.74 s > 2: alphal00p_docs_examples::catalog_examples::python_catalog_examples_compile_without_importing_products::{closure#0}
  2196. 33.74 s > 3: alphal00p_docs_examples::catalog_examples::python_catalog_examples_compile_without_importing_products
  2197. 33.74 s > 4: <alphal00p_docs_examples::catalog_examples::python_catalog_examples_compile_without_importing_products::{closure#0} as core::ops::function::FnOnce<()>>::call_once
  2198. 33.74 s > note: Some details are omitted, run with `RUST_BACKTRACE=full` for a verbose backtrace.
  2199. 33.74 s >
  2200. 33.74 s > FAIL [ 0.019s] (85/85) alphal00p-docs-examples catalog_examples::shell_catalog_examples_parse_without_execution
  2201. 33.74 s > stdout ---
  2202. 33.74 s >
  2203. 33.74 s > running 1 test
  2204. 33.74 s > test catalog_examples::shell_catalog_examples_parse_without_execution ... FAILED
  2205. 33.74 s >
  2206. 33.74 s > failures:
  2207. 33.74 s >
  2208. 33.74 s > failures:
  2209. 33.74 s > catalog_examples::shell_catalog_examples_parse_without_execution
  2210. 33.74 s >
  2211. 33.74 s > test result: FAILED. 0 passed; 1 failed; 0 ignored; 0 measured; 84 filtered out; finished in 0.01s
  2212. 33.74 s >
  2213. 33.74 s > stderr ---
  2214. 33.74 s >
  2215. 33.74 s > thread 'catalog_examples::shell_catalog_examples_parse_without_execution' (692) panicked at crates/alphal00p-docs-examples/src/lib.rs:25:9:
  2216. 33.74 s > shell documentation example validation failed:
  2217. 33.74 s > bash: /build/source/target/ci-optim/build/alphal00p-docs-examples-48b938e1dbf43715/out/shell_catalog_examples.sh: No such file or directory
  2218. 33.74 s >
  2219. 33.74 s > stack backtrace:
  2220. 33.74 s > 0: __rustc::rust_begin_unwind
  2221. 33.74 s > 1: core::panicking::panic_fmt
  2222. 33.74 s > 2: alphal00p_docs_examples::catalog_examples::shell_catalog_examples_parse_without_execution
  2223. 33.74 s > 3: <alphal00p_docs_examples::catalog_examples::shell_catalog_examples_parse_without_execution::{closure#0} as core::ops::function::FnOnce<()>>::call_once
  2224. 33.74 s > note: Some details are omitted, run with `RUST_BACKTRACE=full` for a verbose backtrace.
  2225. 33.74 s >
  2226. 33.74 s > ------------
  2227. 33.74 s > Summary [ 0.108s] 85 tests run: 83 passed, 2 failed, 0 skipped
  2228. 33.74 s > FAIL [ 0.035s] (27/85) alphal00p-docs-examples catalog_examples::python_catalog_examples_compile_without_importing_products
  2229. 33.74 s > stdout ---
  2230. 33.74 s >
  2231. 33.74 s > running 1 test
  2232. 33.74 s > test catalog_examples::python_catalog_examples_compile_without_importing_products ... FAILED
  2233. 33.74 s >
  2234. 33.74 s > failures:
  2235. 33.74 s >
  2236. 33.74 s > failures:
  2237. 33.74 s > catalog_examples::python_catalog_examples_compile_without_importing_products
  2238. 33.74 s >
  2239. 33.74 s > test result: FAILED. 0 passed; 1 failed; 0 ignored; 0 measured; 84 filtered out; finished in 0.01s
  2240. 33.74 s >
  2241. 33.74 s > stderr ---
  2242. 33.74 s >
  2243. 33.74 s > thread 'catalog_examples::python_catalog_examples_compile_without_importing_products' (577) panicked at crates/alphal00p-docs-examples/src/lib.rs:39:17:
  2244. 33.74 s > failed to start Python interpreter python3: No such file or directory (os error 2)
  2245. 33.74 s > stack backtrace:
  2246. 33.74 s > 0: __rustc::rust_begin_unwind
  2247. 33.74 s > 1: core::panicking::panic_fmt
  2248. 33.74 s > 2: alphal00p_docs_examples::catalog_examples::python_catalog_examples_compile_without_importing_products::{closure#0}
  2249. 33.74 s > 3: alphal00p_docs_examples::catalog_examples::python_catalog_examples_compile_without_importing_products
  2250. 33.74 s > 4: <alphal00p_docs_examples::catalog_examples::python_catalog_examples_compile_without_importing_products::{closure#0} as core::ops::function::FnOnce<()>>::call_once
  2251. 33.74 s > note: Some details are omitted, run with `RUST_BACKTRACE=full` for a verbose backtrace.
  2252. 33.74 s >
  2253. 33.74 s > FAIL [ 0.019s] (85/85) alphal00p-docs-examples catalog_examples::shell_catalog_examples_parse_without_execution
  2254. 33.74 s > stdout ---
  2255. 33.74 s >
  2256. 33.74 s > running 1 test
  2257. 33.74 s > test catalog_examples::shell_catalog_examples_parse_without_execution ... FAILED
  2258. 33.74 s >
  2259. 33.74 s > failures:
  2260. 33.74 s >
  2261. 33.74 s > failures:
  2262. 33.74 s > catalog_examples::shell_catalog_examples_parse_without_execution
  2263. 33.74 s >
  2264. 33.74 s > test result: FAILED. 0 passed; 1 failed; 0 ignored; 0 measured; 84 filtered out; finished in 0.01s
  2265. 33.74 s >
  2266. 33.74 s > stderr ---
  2267. 33.74 s >
  2268. 33.74 s > thread 'catalog_examples::shell_catalog_examples_parse_without_execution' (692) panicked at crates/alphal00p-docs-examples/src/lib.rs:25:9:
  2269. 33.74 s > shell documentation example validation failed:
  2270. 33.74 s > bash: /build/source/target/ci-optim/build/alphal00p-docs-examples-48b938e1dbf43715/out/shell_catalog_examples.sh: No such file or directory
  2271. 33.74 s >
  2272. 33.74 s > stack backtrace:
  2273. 33.74 s > 0: __rustc::rust_begin_unwind
  2274. 33.74 s > 1: core::panicking::panic_fmt
  2275. 33.74 s > 2: alphal00p_docs_examples::catalog_examples::shell_catalog_examples_parse_without_execution
  2276. 33.74 s > 3: <alphal00p_docs_examples::catalog_examples::shell_catalog_examples_parse_without_execution::{closure#0} as core::ops::function::FnOnce<()>>::call_once
  2277. 33.74 s > note: Some details are omitted, run with `RUST_BACKTRACE=full` for a verbose backtrace.
  2278. 33.74 s >
  2279. 33.74 s > error: test run failed
  2280. 33.74 s >
  2281. 33.74 s > ========== nextest test summary ==========
  2282. 33.74 s > report: target/nextest/ci_gammaloop/junit.xml
  2283. 33.74 s > tests: 85, failures: 2, errors: 0
  2284. 33.74 s >
  2285. 33.74 s > 1. alphal00p-docs-examples::catalog_examples::python_catalog_examples_compile_without_importing_products
  2286. 33.74 s > failure: test failure with exit code 101
  2287. 33.74 s > thread 'catalog_examples::python_catalog_examples_compile_without_importing_products' (577) panicked at crates/alphal00p-docs-examples/src/lib.rs:39:17:
  2288. 33.74 s > failed to start Python interpreter python3: No such file or directory (os error 2)
  2289. 33.74 s > stack backtrace:
  2290. 33.74 s > 0: __rustc::rust_begin_unwind
  2291. 33.74 s > 1: core::panicking::panic_fmt
  2292. 33.74 s > 2: alphal00p_docs_examples::catalog_examples::python_catalog_examples_compile_without_importing_products::{closure#0}
  2293. 33.74 s > 3: alphal00p_docs_examples::catalog_examples::python_catalog_examples_compile_without_importing_products
  2294. 33.74 s > 4: <alphal00p_docs_examples::catalog_examples::python_catalog_examples_compile_without_importing_products::{closure#0} as core::ops::function::FnOnce<()>>::call_once
  2295. 33.74 s > note: Some details are omitted, run with `RUST_BACKTRACE=full` for a verbose backtrace.
  2296. 33.74 s > system-out
  2297. 33.74 s > running 1 test
  2298. 33.74 s > test catalog_examples::python_catalog_examples_compile_without_importing_products ... FAILED
  2299. 33.74 s >
  2300. 33.74 s > failures:
  2301. 33.74 s >
  2302. 33.74 s > failures:
  2303. 33.74 s > catalog_examples::python_catalog_examples_compile_without_importing_products
  2304. 33.74 s >
  2305. 33.74 s > test result: FAILED. 0 passed; 1 failed; 0 ignored; 0 measured; 84 filtered out; finished in 0.01s
  2306. 33.74 s > system-err
  2307. 33.74 s > thread 'catalog_examples::python_catalog_examples_compile_without_importing_products' (577) panicked at crates/alphal00p-docs-examples/src/lib.rs:39:17:
  2308. 33.74 s > failed to start Python interpreter python3: No such file or directory (os error 2)
  2309. 33.74 s > stack backtrace:
  2310. 33.74 s > 0: __rustc::rust_begin_unwind
  2311. 33.74 s > 1: core::panicking::panic_fmt
  2312. 33.74 s > 2: alphal00p_docs_examples::catalog_examples::python_catalog_examples_compile_without_importing_products::{closure#0}
  2313. 33.74 s > 3: alphal00p_docs_examples::catalog_examples::python_catalog_examples_compile_without_importing_products
  2314. 33.74 s > 4: <alphal00p_docs_examples::catalog_examples::python_catalog_examples_compile_without_importing_products::{closure#0} as core::ops::function::FnOnce<()>>::call_once
  2315. 33.74 s > note: Some details are omitted, run with `RUST_BACKTRACE=full` for a verbose backtrace.
  2316. 33.74 s >
  2317. 33.74 s > 2. alphal00p-docs-examples::catalog_examples::shell_catalog_examples_parse_without_execution
  2318. 33.74 s > failure: test failure with exit code 101
  2319. 33.74 s > thread 'catalog_examples::shell_catalog_examples_parse_without_execution' (692) panicked at crates/alphal00p-docs-examples/src/lib.rs:25:9:
  2320. 33.74 s > shell documentation example validation failed:
  2321. 33.74 s > bash: /build/source/target/ci-optim/build/alphal00p-docs-examples-48b938e1dbf43715/out/shell_catalog_examples.sh: No such file or directory
  2322. 33.74 s >
  2323. 33.74 s > stack backtrace:
  2324. 33.74 s > 0: __rustc::rust_begin_unwind
  2325. 33.74 s > 1: core::panicking::panic_fmt
  2326. 33.74 s > 2: alphal00p_docs_examples::catalog_examples::shell_catalog_examples_parse_without_execution
  2327. 33.74 s > 3: <alphal00p_docs_examples::catalog_examples::shell_catalog_examples_parse_without_execution::{closure#0} as core::ops::function::FnOnce<()>>::call_once
  2328. 33.74 s > note: Some details are omitted, run with `RUST_BACKTRACE=full` for a verbose backtrace.
  2329. 33.74 s > system-out
  2330. 33.74 s > running 1 test
  2331. 33.74 s > test catalog_examples::shell_catalog_examples_parse_without_execution ... FAILED
  2332. 33.74 s >
  2333. 33.74 s > failures:
  2334. 33.74 s >
  2335. 33.74 s > failures:
  2336. 33.74 s > catalog_examples::shell_catalog_examples_parse_without_execution
  2337. 33.74 s >
  2338. 33.74 s > test result: FAILED. 0 passed; 1 failed; 0 ignored; 0 measured; 84 filtered out; finished in 0.01s
  2339. 33.74 s > system-err
  2340. 33.74 s > thread 'catalog_examples::shell_catalog_examples_parse_without_execution' (692) panicked at crates/alphal00p-docs-examples/src/lib.rs:25:9:
  2341. 33.74 s > shell documentation example validation failed:
  2342. 33.74 s > bash: /build/source/target/ci-optim/build/alphal00p-docs-examples-48b938e1dbf43715/out/shell_catalog_examples.sh: No such file or directory
  2343. 33.74 s >
  2344. 33.74 s > stack backtrace:
  2345. 33.74 s > 0: __rustc::rust_begin_unwind
  2346. 33.74 s > 1: core::panicking::panic_fmt
  2347. 33.74 s > 2: alphal00p_docs_examples::catalog_examples::shell_catalog_examples_parse_without_execution
  2348. 33.74 s > 3: <alphal00p_docs_examples::catalog_examples::shell_catalog_examples_parse_without_execution::{closure#0} as core::ops::function::FnOnce<()>>::call_once
  2349. 33.74 s > note: Some details are omitted, run with `RUST_BACKTRACE=full` for a verbose backtrace.
  2350. 33.74 s > =========================================
  2351. 33.74 s > Extracting 2 binaries to /build/nextest-archive-rlgVhn
  2352. 33.74 s > Extracted 5 files to /build/nextest-archive-rlgVhn in 0.06s
  2353. 33.74 s > ------------
  2354. 33.74 s > Nextest run ID c3bc22bc-b727-4484-99bb-8e850cbe8835 with nextest profile: ci_gammaloop
  2355. 33.74 s > Starting 10 tests across 2 binaries
  2356. 33.74 s > FAIL [ 0.113s] (10/10) alphal00p-docs-macros::trybuild documentation_attributes_compile_and_diagnose
  2357. 33.74 s > stdout ---
  2358. 33.74 s >
  2359. 33.74 s > running 1 test
  2360. 33.74 s > test documentation_attributes_compile_and_diagnose ... FAILED
  2361. 33.74 s >
  2362. 33.74 s > failures:
  2363. 33.74 s >
  2364. 33.74 s > failures:
  2365. 33.74 s > documentation_attributes_compile_and_diagnose
  2366. 33.74 s >
  2367. 33.74 s > test result: FAILED. 0 passed; 1 failed; 0 ignored; 0 measured; 0 filtered out; finished in 0.11s
  2368. 33.74 s >
  2369. 33.74 s > stderr ---
  2370. 33.74 s > error: failed to load source for dependency `graphica`
  2371. 33.74 s >
  2372. 33.74 s > Caused by:
  2373. 33.74 s > unable to update https://github.com/symbolica-dev/symbolica?branch=dev#0441bd7a
  2374. 33.74 s >
  2375. 33.74 s > Caused by:
  2376. 33.74 s > can't checkout from 'https://github.com/symbolica-dev/symbolica': you are in the offline mode (--offline)
  2377. 33.74 s >
  2378. 33.74 s > thread 'documentation_attributes_compile_and_diagnose' (747) panicked at /nix/store/xdy1vvhll2bijdplvl9fcc2b9plkxhaa-vendor-cargo-deps/c19b7c6f923b580ac259164a89f2577984ad5ab09ee9d583b888f934adbbe8d0/trybuild-1.0.120/src/run.rs:63:13:
  2379. 33.74 s > tests failed
  2380. 33.74 s > stack backtrace:
  2381. 33.74 s > 0: __rustc::rust_begin_unwind
  2382. 33.74 s > 1: core::panicking::panic_fmt
  2383. 33.74 s > 2: <trybuild::Runner>::run::{closure#1}
  2384. 33.74 s > 3: <trybuild::Runner>::run
  2385. 33.74 s > 4: <trybuild::TestCases as core::ops::drop::Drop>::drop
  2386. 33.74 s > 5: <trybuild::documentation_attributes_compile_and_diagnose::{closure#0} as core::ops::function::FnOnce<()>>::call_once
  2387. 33.74 s > note: Some details are omitted, run with `RUST_BACKTRACE=full` for a verbose backtrace.
  2388. 33.74 s >
  2389. 33.74 s > ------------
  2390. 33.74 s > Summary [ 0.115s] 10 tests run: 9 passed, 1 failed, 0 skipped
  2391. 33.74 s > FAIL [ 0.113s] (10/10) alphal00p-docs-macros::trybuild documentation_attributes_compile_and_diagnose
  2392. 33.74 s > stdout ---
  2393. 33.74 s >
  2394. 33.74 s > running 1 test
  2395. 33.74 s > test documentation_attributes_compile_and_diagnose ... FAILED
  2396. 33.74 s >
  2397. 33.74 s > failures:
  2398. 33.74 s >
  2399. 33.74 s > failures:
  2400. 33.74 s > documentation_attributes_compile_and_diagnose
  2401. 33.74 s >
  2402. 33.74 s > test result: FAILED. 0 passed; 1 failed; 0 ignored; 0 measured; 0 filtered out; finished in 0.11s
  2403. 33.74 s >
  2404. 33.74 s > stderr ---
  2405. 33.74 s > error: failed to load source for dependency `graphica`
  2406. 33.74 s >
  2407. 33.74 s > Caused by:
  2408. 33.74 s > unable to update https://github.com/symbolica-dev/symbolica?branch=dev#0441bd7a
  2409. 33.74 s >
  2410. 33.74 s > Caused by:
  2411. 33.74 s > can't checkout from 'https://github.com/symbolica-dev/symbolica': you are in the offline mode (--offline)
  2412. 33.74 s >
  2413. 33.74 s > thread 'documentation_attributes_compile_and_diagnose' (747) panicked at /nix/store/xdy1vvhll2bijdplvl9fcc2b9plkxhaa-vendor-cargo-deps/c19b7c6f923b580ac259164a89f2577984ad5ab09ee9d583b888f934adbbe8d0/trybuild-1.0.120/src/run.rs:63:13:
  2414. 33.74 s > tests failed
  2415. 33.74 s > stack backtrace:
  2416. 33.74 s > 0: __rustc::rust_begin_unwind
  2417. 33.74 s > 1: core::panicking::panic_fmt
  2418. 33.74 s > 2: <trybuild::Runner>::run::{closure#1}
  2419. 33.74 s > 3: <trybuild::Runner>::run
  2420. 33.74 s > 4: <trybuild::TestCases as core::ops::drop::Drop>::drop
  2421. 33.74 s > 5: <trybuild::documentation_attributes_compile_and_diagnose::{closure#0} as core::ops::function::FnOnce<()>>::call_once
  2422. 33.74 s > note: Some details are omitted, run with `RUST_BACKTRACE=full` for a verbose backtrace.
  2423. 33.74 s >
  2424. 33.74 s > error: test run failed
  2425. 33.74 s >
  2426. 33.74 s > ========== nextest test summary ==========
  2427. 33.74 s > report: target/nextest/ci_gammaloop/junit.xml
  2428. 33.74 s > tests: 10, failures: 1, errors: 0
  2429. 33.74 s >
  2430. 33.74 s > 1. alphal00p-docs-macros::trybuild::documentation_attributes_compile_and_diagnose
  2431. 33.74 s > failure: test failure with exit code 101
  2432. 33.74 s > thread 'documentation_attributes_compile_and_diagnose' (747) panicked at /nix/store/xdy1vvhll2bijdplvl9fcc2b9plkxhaa-vendor-cargo-deps/c19b7c6f923b580ac259164a89f2577984ad5ab09ee9d583b888f934adbbe8d0/trybuild-1.0.120/src/run.rs:63:13:
  2433. 33.74 s > tests failed
  2434. 33.74 s > stack backtrace:
  2435. 33.74 s > 0: __rustc::rust_begin_unwind
  2436. 33.74 s > 1: core::panicking::panic_fmt
  2437. 33.74 s > 2: <trybuild::Runner>::run::{closure#1}
  2438. 33.74 s > 3: <trybuild::Runner>::run
  2439. 33.74 s > 4: <trybuild::TestCases as core::ops::drop::Drop>::drop
  2440. 33.74 s > 5: <trybuild::documentation_attributes_compile_and_diagnose::{closure#0} as core::ops::function::FnOnce<()>>::call_once
  2441. 33.74 s > note: Some details are omitted, run with `RUST_BACKTRACE=full` for a verbose backtrace.
  2442. 33.74 s > system-out
  2443. 33.74 s > running 1 test
  2444. 33.74 s > test documentation_attributes_compile_and_diagnose ... FAILED
  2445. 33.74 s >
  2446. 33.74 s > failures:
  2447. 33.74 s >
  2448. 33.74 s > failures:
  2449. 33.74 s > documentation_attributes_compile_and_diagnose
  2450. 33.74 s >
  2451. 33.74 s > test result: FAILED. 0 passed; 1 failed; 0 ignored; 0 measured; 0 filtered out; finished in 0.11s
  2452. 33.74 s > system-err
  2453. 33.74 s > error: failed to load source for dependency `graphica`
  2454. 33.74 s >
  2455. 33.74 s > Caused by:
  2456. 33.74 s > unable to update https://github.com/symbolica-dev/symbolica?branch=dev#0441bd7a
  2457. 33.74 s >
  2458. 33.74 s > Caused by:
  2459. 33.74 s > can't checkout from 'https://github.com/symbolica-dev/symbolica': you are in the offline mode (--offline)
  2460. 33.74 s >
  2461. 33.74 s > thread 'documentation_attributes_compile_and_diagnose' (747) panicked at /nix/store/xdy1vvhll2bijdplvl9fcc2b9plkxhaa-vendor-cargo-deps/c19b7c6f923b580ac259164a89f2577984ad5ab09ee9d583b888f934adbbe8d0/trybuild-1.0.120/src/run.rs:63:13:
  2462. 33.74 s > tests failed
  2463. 33.74 s > stack backtrace:
  2464. 33.74 s > 0: __rustc::rust_begin_unwind
  2465. 33.74 s > 1: core::panicking::panic_fmt
  2466. 33.74 s > 2: <trybuild::Runner>::run::{closure#1}
  2467. 33.74 s > 3: <trybuild::Runner>::run
  2468. 33.74 s > 4: <trybuild::TestCases as core::ops::drop::Drop>::drop
  2469. 33.74 s > 5: <trybuild::documentation_attributes_compile_and_diagnose::{closure#0} as core::ops::function::FnOnce<()>>::call_once
  2470. 33.74 s > note: Some details are omitted, run with `RUST_BACKTRACE=full` for a verbose backtrace.
  2471. 33.74 s > =========================================
  2472. 33.74 s > Extracting 1 binary to /build/nextest-archive-PVF5If
  2473. 33.74 s > Extracted 4 files to /build/nextest-archive-PVF5If in 0.04s
  2474. 33.74 s > ------------
  2475. 33.74 s > Nextest run ID fdcbaf28-fe2c-4813-9011-fabd1fe5d30d with nextest profile: ci_gammaloop
  2476. 33.74 s > Starting 0 tests across 1 binary
  2477. 33.74 s > ------------
  2478. 33.74 s > Summary [ 0.000s] 0 tests run: 0 passed, 0 skipped
  2479. 33.74 s >
  2480. 33.74 s > ========== nextest test summary ==========
  2481. 33.74 s > report: target/nextest/ci_gammaloop/junit.xml
  2482. 33.74 s > tests: 0, failures: 0, errors: 0
  2483. 33.74 s > No failing testcases found.
  2484. 33.74 s > =========================================
  2485. 33.74 s > Extracting 1 binary to /build/nextest-archive-MYZWSM
  2486. 33.74 s > Extracted 4 files to /build/nextest-archive-MYZWSM in 0.05s
  2487. 33.74 s > ------------
  2488. 33.74 s > Nextest run ID f3ed05a7-5791-4435-ae79-9d6725bc9289 with nextest profile: ci_gammaloop
  2489. 33.74 s > Starting 5 tests across 1 binary
  2490. 33.74 s > ------------
  2491. 33.74 s > Summary [ 0.013s] 5 tests run: 5 passed, 0 skipped
  2492. 33.74 s >
  2493. 33.74 s > ========== nextest test summary ==========
  2494. 33.74 s > report: target/nextest/ci_gammaloop/junit.xml
  2495. 33.74 s > tests: 5, failures: 0, errors: 0
  2496. 33.74 s > No failing testcases found.
  2497. 33.74 s > =========================================
  2498. 33.74 s For full logs, run:
  2499. 33.74 s nix log /nix/store/6r13pbqsnmyyicpdrz1zkw00g0gdh9dy-gammaloop-nextest-docs.drv
  2500. 33.90 s [0 built (1 failed), 0.0Run failed.