test packages.x86_64-linux.nix-ci-check-gammaloop-nextest-docs

Reproduce this run
Retry Run
  1. 41.52 s gammaloop-nextest-docs> Caused by:
  2. 41.52 s gammaloop-nextest-docs> No such file or directory (os error 2)
  3. 41.52 s gammaloop-nextest-docs>
  4. 41.52 s gammaloop-nextest-docs> Location:
  5. 41.52 s gammaloop-nextest-docs> crates/alphal00p-docs-builder/src/lib.rs:582:14
  6. 41.52 s gammaloop-nextest-docs> stack backtrace:
  7. 41.52 s gammaloop-nextest-docs> 0: __rustc::rust_begin_unwind
  8. 41.52 s gammaloop-nextest-docs> 1: core::panicking::panic_fmt
  9. 41.52 s gammaloop-nextest-docs> 2: core::result::unwrap_failed
  10. 41.52 s gammaloop-nextest-docs> 3: alphal00p_docs_builder::tests::generated_search_links_are_validated_without_rewriting_html
  11. 41.52 s gammaloop-nextest-docs> 4: <alphal00p_docs_builder::tests::generated_search_links_are_validated_without_rewriting_html::{closure#0} as core::ops::function::FnOnce<()>>::call_once
  12. 41.52 s gammaloop-nextest-docs> note: Some details are omitted, run with `RUST_BACKTRACE=full` for a verbose backtrace.
  13. 41.52 s gammaloop-nextest-docs>
  14. 41.52 s gammaloop-nextest-docs> 19. alphal00p-docs-builder::tests::moved_manual_routes_redirect_without_entering_navigation
  15. 41.52 s gammaloop-nextest-docs> failure: test failure with exit code 101
  16. 41.52 s gammaloop-nextest-docs> thread 'tests::moved_manual_routes_redirect_without_entering_navigation' (294) panicked at crates/alphal00p-docs-builder/src/lib.rs:11944:47:
  17. 41.52 s gammaloop-nextest-docs> called `Result::unwrap()` on an `Err` value: failed to read /build/source/docs/portal.toml
  18. 41.52 s gammaloop-nextest-docs>
  19. 41.52 s gammaloop-nextest-docs> Caused by:
  20. 41.52 s gammaloop-nextest-docs> No such file or directory (os error 2)
  21. 41.52 s gammaloop-nextest-docs>
  22. 41.52 s gammaloop-nextest-docs> Location:
  23. 41.52 s gammaloop-nextest-docs> crates/alphal00p-docs-builder/src/lib.rs:582:14
  24. 41.52 s gammaloop-nextest-docs> stack backtrace:
  25. 41.52 s gammaloop-nextest-docs> 0: __rustc::rust_begin_unwind
  26. 41.52 s gammaloop-nextest-docs> 1: core::panicking::panic_fmt
  27. 41.52 s gammaloop-nextest-docs> 2: core::result::unwrap_failed
  28. 41.52 s gammaloop-nextest-docs> 3: alphal00p_docs_builder::tests::moved_manual_routes_redirect_without_entering_navigation
  29. 41.52 s gammaloop-nextest-docs> 4: <alphal00p_docs_builder::tests::moved_manual_routes_redirect_without_entering_navigation::{closure#0} as core::ops::function::FnOnce<()>>::call_once
  30. 41.52 s gammaloop-nextest-docs> note: Some details are omitted, run with `RUST_BACKTRACE=full` for a verbose backtrace.
  31. 41.52 s gammaloop-nextest-docs> system-out
  32. 41.52 s gammaloop-nextest-docs> running 1 test
  33. 41.52 s gammaloop-nextest-docs> test tests::moved_manual_routes_redirect_without_entering_navigation ... FAILED
  34. 41.52 s gammaloop-nextest-docs>
  35. 41.52 s gammaloop-nextest-docs> failures:
  36. 41.52 s gammaloop-nextest-docs>
  37. 41.52 s gammaloop-nextest-docs> failures:
  38. 41.52 s gammaloop-nextest-docs> tests::moved_manual_routes_redirect_without_entering_navigation
  39. 41.52 s gammaloop-nextest-docs>
  40. 41.52 s gammaloop-nextest-docs> test result: FAILED. 0 passed; 1 failed; 0 ignored; 0 measured; 101 filtered out; finished in 0.00s
  41. 41.52 s gammaloop-nextest-docs> system-err
  42. 41.52 s gammaloop-nextest-docs> thread 'tests::moved_manual_routes_redirect_without_entering_navigation' (294) panicked at crates/alphal00p-docs-builder/src/lib.rs:11944:47:
  43. 41.52 s gammaloop-nextest-docs> called `Result::unwrap()` on an `Err` value: failed to read /build/source/docs/portal.toml
  44. 41.52 s gammaloop-nextest-docs>
  45. 41.52 s gammaloop-nextest-docs> Caused by:
  46. 41.52 s gammaloop-nextest-docs> No such file or directory (os error 2)
  47. 41.52 s gammaloop-nextest-docs>
  48. 41.52 s gammaloop-nextest-docs> Location:
  49. 41.52 s gammaloop-nextest-docs> crates/alphal00p-docs-builder/src/lib.rs:582:14
  50. 41.52 s gammaloop-nextest-docs> stack backtrace:
  51. 41.52 s gammaloop-nextest-docs> 0: __rustc::rust_begin_unwind
  52. 41.52 s gammaloop-nextest-docs> 1: core::panicking::panic_fmt
  53. 41.52 s gammaloop-nextest-docs> 2: core::result::unwrap_failed
  54. 41.52 s gammaloop-nextest-docs> 3: alphal00p_docs_builder::tests::moved_manual_routes_redirect_without_entering_navigation
  55. 41.52 s gammaloop-nextest-docs> 4: <alphal00p_docs_builder::tests::moved_manual_routes_redirect_without_entering_navigation::{closure#0} as core::ops::function::FnOnce<()>>::call_once
  56. 41.52 s gammaloop-nextest-docs> note: Some details are omitted, run with `RUST_BACKTRACE=full` for a verbose backtrace.
  57. 41.52 s gammaloop-nextest-docs>
  58. 41.52 s gammaloop-nextest-docs> 20. alphal00p-docs-builder::tests::pdf_manual_chapter_order_must_match_the_page_registry
  59. 41.52 s gammaloop-nextest-docs> failure: test failure with exit code 101
  60. 41.52 s gammaloop-nextest-docs> thread 'tests::pdf_manual_chapter_order_must_match_the_page_registry' (300) panicked at crates/alphal00p-docs-builder/src/lib.rs:11122:51:
  61. 41.52 s gammaloop-nextest-docs> called `Result::unwrap()` on an `Err` value: failed to read /build/source/docs/portal.toml
  62. 41.52 s gammaloop-nextest-docs>
  63. 41.52 s gammaloop-nextest-docs> Caused by:
  64. 41.52 s gammaloop-nextest-docs> No such file or directory (os error 2)
  65. 41.52 s gammaloop-nextest-docs>
  66. 41.52 s gammaloop-nextest-docs> Location:
  67. 41.52 s gammaloop-nextest-docs> crates/alphal00p-docs-builder/src/lib.rs:582:14
  68. 41.52 s gammaloop-nextest-docs> stack backtrace:
  69. 41.52 s gammaloop-nextest-docs> 0: __rustc::rust_begin_unwind
  70. 41.52 s gammaloop-nextest-docs> 1: core::panicking::panic_fmt
  71. 41.52 s gammaloop-nextest-docs> 2: core::result::unwrap_failed
  72. 41.52 s gammaloop-nextest-docs> 3: alphal00p_docs_builder::tests::pdf_manual_chapter_order_must_match_the_page_registry
  73. 41.52 s gammaloop-nextest-docs> 4: <alphal00p_docs_builder::tests::pdf_manual_chapter_order_must_match_the_page_registry::{closure#0} as core::ops::function::FnOnce<()>>::call_once
  74. 41.52 s gammaloop-nextest-docs> note: Some details are omitted, run with `RUST_BACKTRACE=full` for a verbose backtrace.
  75. 41.52 s gammaloop-nextest-docs> system-out
  76. 41.52 s gammaloop-nextest-docs> running 1 test
  77. 41.52 s gammaloop-nextest-docs> test tests::pdf_manual_chapter_order_must_match_the_page_registry ... FAILED
  78. 41.52 s gammaloop-nextest-docs>
  79. 41.52 s gammaloop-nextest-docs> failures:
  80. 41.52 s gammaloop-nextest-docs>
  81. 41.52 s gammaloop-nextest-docs> failures:
  82. 41.52 s gammaloop-nextest-docs> tests::pdf_manual_chapter_order_must_match_the_page_registry
  83. 41.52 s gammaloop-nextest-docs>
  84. 41.52 s gammaloop-nextest-docs> test result: FAILED. 0 passed; 1 failed; 0 ignored; 0 measured; 101 filtered out; finished in 0.00s
  85. 41.52 s gammaloop-nextest-docs> system-err
  86. 41.52 s gammaloop-nextest-docs> thread 'tests::pdf_manual_chapter_order_must_match_the_page_registry' (300) panicked at crates/alphal00p-docs-builder/src/lib.rs:11122:51:
  87. 41.52 s gammaloop-nextest-docs> called `Result::unwrap()` on an `Err` value: failed to read /build/source/docs/portal.toml
  88. 41.52 s gammaloop-nextest-docs>
  89. 41.52 s gammaloop-nextest-docs> Caused by:
  90. 41.52 s gammaloop-nextest-docs> No such file or directory (os error 2)
  91. 41.52 s gammaloop-nextest-docs>
  92. 41.52 s gammaloop-nextest-docs> Location:
  93. 41.52 s gammaloop-nextest-docs> crates/alphal00p-docs-builder/src/lib.rs:582:14
  94. 41.52 s gammaloop-nextest-docs> stack backtrace:
  95. 41.52 s gammaloop-nextest-docs> 0: __rustc::rust_begin_unwind
  96. 41.52 s gammaloop-nextest-docs> 1: core::panicking::panic_fmt
  97. 41.52 s gammaloop-nextest-docs> 2: core::result::unwrap_failed
  98. 41.52 s gammaloop-nextest-docs> 3: alphal00p_docs_builder::tests::pdf_manual_chapter_order_must_match_the_page_registry
  99. 41.52 s gammaloop-nextest-docs> 4: <alphal00p_docs_builder::tests::pdf_manual_chapter_order_must_match_the_page_registry::{closure#0} as core::ops::function::FnOnce<()>>::call_once
  100. 41.52 s gammaloop-nextest-docs> note: Some details are omitted, run with `RUST_BACKTRACE=full` for a verbose backtrace.
  101. 41.52 s gammaloop-nextest-docs>
  102. 41.52 s gammaloop-nextest-docs> ... omitted 26 more failing tests
  103. 41.52 s gammaloop-nextest-docs> =========================================
  104. 41.54 s gammaloop-nextest-docs> Extracting 2 binaries to /build/nextest-archive-14rApM
  105. 41.59 s gammaloop-nextest-docs> Extracted 5 files to /build/nextest-archive-14rApM in 0.05s
  106. 41.61 s gammaloop-nextest-docs> ------------
  107. 41.61 s gammaloop-nextest-docs> Nextest run ID 40e86c73-b612-44d7-a296-2529ce99f5e6 with nextest profile: ci_gammaloop
  108. 41.61 s gammaloop-nextest-docs> Starting 22 tests across 2 binaries
  109. 41.65 s gammaloop-nextest-docs> ------------
  110. 41.65 s gammaloop-nextest-docs> Summary [ 0.035s] 22 tests run: 22 passed, 0 skipped
  111. 41.71 s gammaloop-nextest-docs>
  112. 41.71 s gammaloop-nextest-docs> ========== nextest test summary ==========
  113. 41.71 s gammaloop-nextest-docs> report: target/nextest/ci_gammaloop/junit.xml
  114. 41.71 s gammaloop-nextest-docs> tests: 22, failures: 0, errors: 0
  115. 41.71 s gammaloop-nextest-docs> No failing testcases found.
  116. 41.71 s gammaloop-nextest-docs> =========================================
  117. 41.73 s gammaloop-nextest-docs> Extracting 1 binary, 1 build script output directory, and 2 linked paths to /build/nextest-archive-DYpVHr
  118. 41.81 s gammaloop-nextest-docs> Extracted 18 files to /build/nextest-archive-DYpVHr in 0.09s
  119. 41.83 s gammaloop-nextest-docs> ------------
  120. 41.83 s gammaloop-nextest-docs> Nextest run ID dea2b538-c087-4a58-b4de-81e9efc3ee8c with nextest profile: ci_gammaloop
  121. 41.83 s gammaloop-nextest-docs> Starting 85 tests across 1 binary
  122. 41.85 s gammaloop-nextest-docs> FAIL [ 0.018s] ( 6/85) alphal00p-docs-examples catalog_examples::python_catalog_examples_compile_without_importing_products
  123. 41.85 s gammaloop-nextest-docs> stdout ---
  124. 41.85 s gammaloop-nextest-docs>
  125. 41.85 s gammaloop-nextest-docs> running 1 test
  126. 41.85 s gammaloop-nextest-docs> test catalog_examples::python_catalog_examples_compile_without_importing_products ... FAILED
  127. 41.85 s gammaloop-nextest-docs>
  128. 41.85 s gammaloop-nextest-docs> failures:
  129. 41.85 s gammaloop-nextest-docs>
  130. 41.85 s gammaloop-nextest-docs> failures:
  131. 41.85 s gammaloop-nextest-docs> catalog_examples::python_catalog_examples_compile_without_importing_products
  132. 41.85 s gammaloop-nextest-docs>
  133. 41.85 s gammaloop-nextest-docs> test result: FAILED. 0 passed; 1 failed; 0 ignored; 0 measured; 84 filtered out; finished in 0.01s
  134. 41.85 s gammaloop-nextest-docs>
  135. 41.85 s gammaloop-nextest-docs> stderr ---
  136. 41.85 s gammaloop-nextest-docs>
  137. 41.85 s gammaloop-nextest-docs> thread 'catalog_examples::python_catalog_examples_compile_without_importing_products' (542) panicked at crates/alphal00p-docs-examples/src/lib.rs:39:17:
  138. 41.85 s gammaloop-nextest-docs> failed to start Python interpreter python3: No such file or directory (os error 2)
  139. 41.85 s gammaloop-nextest-docs> stack backtrace:
  140. 41.85 s gammaloop-nextest-docs> 0: __rustc::rust_begin_unwind
  141. 41.85 s gammaloop-nextest-docs> 1: core::panicking::panic_fmt
  142. 41.85 s gammaloop-nextest-docs> 2: alphal00p_docs_examples::catalog_examples::python_catalog_examples_compile_without_importing_products::{closure#0}
  143. 41.85 s gammaloop-nextest-docs> 3: alphal00p_docs_examples::catalog_examples::python_catalog_examples_compile_without_importing_products
  144. 41.85 s gammaloop-nextest-docs> 4: <alphal00p_docs_examples::catalog_examples::python_catalog_examples_compile_without_importing_products::{closure#0} as core::ops::function::FnOnce<()>>::call_once
  145. 41.85 s gammaloop-nextest-docs> note: Some details are omitted, run with `RUST_BACKTRACE=full` for a verbose backtrace.
  146. 41.85 s gammaloop-nextest-docs>
  147. 41.92 s gammaloop-nextest-docs> FAIL [ 0.018s] (85/85) alphal00p-docs-examples catalog_examples::shell_catalog_examples_parse_without_execution
  148. 41.92 s gammaloop-nextest-docs> stdout ---
  149. 41.92 s gammaloop-nextest-docs>
  150. 41.92 s gammaloop-nextest-docs> running 1 test
  151. 41.92 s gammaloop-nextest-docs> test catalog_examples::shell_catalog_examples_parse_without_execution ... FAILED
  152. 41.92 s gammaloop-nextest-docs>
  153. 41.92 s gammaloop-nextest-docs> failures:
  154. 41.92 s gammaloop-nextest-docs>
  155. 41.92 s gammaloop-nextest-docs> failures:
  156. 41.92 s gammaloop-nextest-docs> catalog_examples::shell_catalog_examples_parse_without_execution
  157. 41.92 s gammaloop-nextest-docs>
  158. 41.92 s gammaloop-nextest-docs> test result: FAILED. 0 passed; 1 failed; 0 ignored; 0 measured; 84 filtered out; finished in 0.01s
  159. 41.92 s gammaloop-nextest-docs>
  160. 41.92 s gammaloop-nextest-docs> stderr ---
  161. 41.92 s gammaloop-nextest-docs>
  162. 41.92 s gammaloop-nextest-docs> thread 'catalog_examples::shell_catalog_examples_parse_without_execution' (694) panicked at crates/alphal00p-docs-examples/src/lib.rs:25:9:
  163. 41.92 s gammaloop-nextest-docs> shell documentation example validation failed:
  164. 41.92 s gammaloop-nextest-docs> bash: /build/source/target/ci-optim/build/alphal00p-docs-examples-48b938e1dbf43715/out/shell_catalog_examples.sh: No such file or directory
  165. 41.92 s gammaloop-nextest-docs>
  166. 41.92 s gammaloop-nextest-docs> stack backtrace:
  167. 41.92 s gammaloop-nextest-docs> 0: __rustc::rust_begin_unwind
  168. 41.92 s gammaloop-nextest-docs> 1: core::panicking::panic_fmt
  169. 41.92 s gammaloop-nextest-docs> 2: alphal00p_docs_examples::catalog_examples::shell_catalog_examples_parse_without_execution
  170. 41.92 s gammaloop-nextest-docs> 3: <alphal00p_docs_examples::catalog_examples::shell_catalog_examples_parse_without_execution::{closure#0} as core::ops::function::FnOnce<()>>::call_once
  171. 41.92 s gammaloop-nextest-docs> note: Some details are omitted, run with `RUST_BACKTRACE=full` for a verbose backtrace.
  172. 41.92 s gammaloop-nextest-docs>
  173. 41.92 s gammaloop-nextest-docs> ------------
  174. 41.92 s gammaloop-nextest-docs> Summary [ 0.091s] 85 tests run: 83 passed, 2 failed, 0 skipped
  175. 41.92 s gammaloop-nextest-docs> FAIL [ 0.018s] ( 6/85) alphal00p-docs-examples catalog_examples::python_catalog_examples_compile_without_importing_products
  176. 41.92 s gammaloop-nextest-docs> stdout ---
  177. 41.92 s gammaloop-nextest-docs>
  178. 41.92 s gammaloop-nextest-docs> running 1 test
  179. 41.92 s gammaloop-nextest-docs> test catalog_examples::python_catalog_examples_compile_without_importing_products ... FAILED
  180. 41.92 s gammaloop-nextest-docs>
  181. 41.92 s gammaloop-nextest-docs> failures:
  182. 41.92 s gammaloop-nextest-docs>
  183. 41.92 s gammaloop-nextest-docs> failures:
  184. 41.92 s gammaloop-nextest-docs> catalog_examples::python_catalog_examples_compile_without_importing_products
  185. 41.92 s gammaloop-nextest-docs>
  186. 41.92 s gammaloop-nextest-docs> test result: FAILED. 0 passed; 1 failed; 0 ignored; 0 measured; 84 filtered out; finished in 0.01s
  187. 41.92 s gammaloop-nextest-docs>
  188. 41.92 s gammaloop-nextest-docs> stderr ---
  189. 41.92 s gammaloop-nextest-docs>
  190. 41.92 s gammaloop-nextest-docs> thread 'catalog_examples::python_catalog_examples_compile_without_importing_products' (542) panicked at crates/alphal00p-docs-examples/src/lib.rs:39:17:
  191. 41.92 s gammaloop-nextest-docs> failed to start Python interpreter python3: No such file or directory (os error 2)
  192. 41.92 s gammaloop-nextest-docs> stack backtrace:
  193. 41.92 s gammaloop-nextest-docs> 0: __rustc::rust_begin_unwind
  194. 41.92 s gammaloop-nextest-docs> 1: core::panicking::panic_fmt
  195. 41.92 s gammaloop-nextest-docs> 2: alphal00p_docs_examples::catalog_examples::python_catalog_examples_compile_without_importing_products::{closure#0}
  196. 41.93 s gammaloop-nextest-docs> 3: alphal00p_docs_examples::catalog_examples::python_catalog_examples_compile_without_importing_products
  197. 41.93 s gammaloop-nextest-docs> 4: <alphal00p_docs_examples::catalog_examples::python_catalog_examples_compile_without_importing_products::{closure#0} as core::ops::function::FnOnce<()>>::call_once
  198. 41.93 s gammaloop-nextest-docs> note: Some details are omitted, run with `RUST_BACKTRACE=full` for a verbose backtrace.
  199. 41.93 s gammaloop-nextest-docs>
  200. 41.93 s gammaloop-nextest-docs> FAIL [ 0.018s] (85/85) alphal00p-docs-examples catalog_examples::shell_catalog_examples_parse_without_execution
  201. 41.93 s gammaloop-nextest-docs> stdout ---
  202. 41.93 s gammaloop-nextest-docs>
  203. 41.93 s gammaloop-nextest-docs> running 1 test
  204. 41.93 s gammaloop-nextest-docs> test catalog_examples::shell_catalog_examples_parse_without_execution ... FAILED
  205. 41.93 s gammaloop-nextest-docs>
  206. 41.93 s gammaloop-nextest-docs> failures:
  207. 41.93 s gammaloop-nextest-docs>
  208. 41.93 s gammaloop-nextest-docs> failures:
  209. 41.93 s gammaloop-nextest-docs> catalog_examples::shell_catalog_examples_parse_without_execution
  210. 41.93 s gammaloop-nextest-docs>
  211. 41.93 s gammaloop-nextest-docs> test result: FAILED. 0 passed; 1 failed; 0 ignored; 0 measured; 84 filtered out; finished in 0.01s
  212. 41.93 s gammaloop-nextest-docs>
  213. 41.93 s gammaloop-nextest-docs> stderr ---
  214. 41.93 s gammaloop-nextest-docs>
  215. 41.93 s gammaloop-nextest-docs> thread 'catalog_examples::shell_catalog_examples_parse_without_execution' (694) panicked at crates/alphal00p-docs-examples/src/lib.rs:25:9:
  216. 41.93 s gammaloop-nextest-docs> shell documentation example validation failed:
  217. 41.93 s gammaloop-nextest-docs> bash: /build/source/target/ci-optim/build/alphal00p-docs-examples-48b938e1dbf43715/out/shell_catalog_examples.sh: No such file or directory
  218. 41.93 s gammaloop-nextest-docs>
  219. 41.93 s gammaloop-nextest-docs> stack backtrace:
  220. 41.93 s gammaloop-nextest-docs> 0: __rustc::rust_begin_unwind
  221. 41.93 s gammaloop-nextest-docs> 1: core::panicking::panic_fmt
  222. 41.93 s gammaloop-nextest-docs> 2: alphal00p_docs_examples::catalog_examples::shell_catalog_examples_parse_without_execution
  223. 41.93 s gammaloop-nextest-docs> 3: <alphal00p_docs_examples::catalog_examples::shell_catalog_examples_parse_without_execution::{closure#0} as core::ops::function::FnOnce<()>>::call_once
  224. 41.93 s gammaloop-nextest-docs> note: Some details are omitted, run with `RUST_BACKTRACE=full` for a verbose backtrace.
  225. 41.93 s gammaloop-nextest-docs>
  226. 41.95 s gammaloop-nextest-docs> error: test run failed
  227. 41.99 s gammaloop-nextest-docs>
  228. 41.99 s gammaloop-nextest-docs> ========== nextest test summary ==========
  229. 41.99 s gammaloop-nextest-docs> report: target/nextest/ci_gammaloop/junit.xml
  230. 41.99 s gammaloop-nextest-docs> tests: 85, failures: 2, errors: 0
  231. 41.99 s gammaloop-nextest-docs>
  232. 41.99 s gammaloop-nextest-docs> 1. alphal00p-docs-examples::catalog_examples::python_catalog_examples_compile_without_importing_products
  233. 41.99 s gammaloop-nextest-docs> failure: test failure with exit code 101
  234. 41.99 s gammaloop-nextest-docs> thread 'catalog_examples::python_catalog_examples_compile_without_importing_products' (542) panicked at crates/alphal00p-docs-examples/src/lib.rs:39:17:
  235. 41.99 s gammaloop-nextest-docs> failed to start Python interpreter python3: No such file or directory (os error 2)
  236. 41.99 s gammaloop-nextest-docs> stack backtrace:
  237. 41.99 s gammaloop-nextest-docs> 0: __rustc::rust_begin_unwind
  238. 41.99 s gammaloop-nextest-docs> 1: core::panicking::panic_fmt
  239. 41.99 s gammaloop-nextest-docs> 2: alphal00p_docs_examples::catalog_examples::python_catalog_examples_compile_without_importing_products::{closure#0}
  240. 41.99 s gammaloop-nextest-docs> 3: alphal00p_docs_examples::catalog_examples::python_catalog_examples_compile_without_importing_products
  241. 41.99 s gammaloop-nextest-docs> 4: <alphal00p_docs_examples::catalog_examples::python_catalog_examples_compile_without_importing_products::{closure#0} as core::ops::function::FnOnce<()>>::call_once
  242. 41.99 s gammaloop-nextest-docs> note: Some details are omitted, run with `RUST_BACKTRACE=full` for a verbose backtrace.
  243. 41.99 s gammaloop-nextest-docs> system-out
  244. 41.99 s gammaloop-nextest-docs> running 1 test
  245. 41.99 s gammaloop-nextest-docs> test catalog_examples::python_catalog_examples_compile_without_importing_products ... FAILED
  246. 41.99 s gammaloop-nextest-docs>
  247. 41.99 s gammaloop-nextest-docs> failures:
  248. 41.99 s gammaloop-nextest-docs>
  249. 41.99 s gammaloop-nextest-docs> failures:
  250. 41.99 s gammaloop-nextest-docs> catalog_examples::python_catalog_examples_compile_without_importing_products
  251. 41.99 s gammaloop-nextest-docs>
  252. 41.99 s gammaloop-nextest-docs> test result: FAILED. 0 passed; 1 failed; 0 ignored; 0 measured; 84 filtered out; finished in 0.01s
  253. 41.99 s gammaloop-nextest-docs> system-err
  254. 41.99 s gammaloop-nextest-docs> thread 'catalog_examples::python_catalog_examples_compile_without_importing_products' (542) panicked at crates/alphal00p-docs-examples/src/lib.rs:39:17:
  255. 41.99 s gammaloop-nextest-docs> failed to start Python interpreter python3: No such file or directory (os error 2)
  256. 41.99 s gammaloop-nextest-docs> stack backtrace:
  257. 41.99 s gammaloop-nextest-docs> 0: __rustc::rust_begin_unwind
  258. 41.99 s gammaloop-nextest-docs> 1: core::panicking::panic_fmt
  259. 41.99 s gammaloop-nextest-docs> 2: alphal00p_docs_examples::catalog_examples::python_catalog_examples_compile_without_importing_products::{closure#0}
  260. 41.99 s gammaloop-nextest-docs> 3: alphal00p_docs_examples::catalog_examples::python_catalog_examples_compile_without_importing_products
  261. 41.99 s gammaloop-nextest-docs> 4: <alphal00p_docs_examples::catalog_examples::python_catalog_examples_compile_without_importing_products::{closure#0} as core::ops::function::FnOnce<()>>::call_once
  262. 41.99 s gammaloop-nextest-docs> note: Some details are omitted, run with `RUST_BACKTRACE=full` for a verbose backtrace.
  263. 41.99 s gammaloop-nextest-docs>
  264. 41.99 s gammaloop-nextest-docs> 2. alphal00p-docs-examples::catalog_examples::shell_catalog_examples_parse_without_execution
  265. 41.99 s gammaloop-nextest-docs> failure: test failure with exit code 101
  266. 41.99 s gammaloop-nextest-docs> thread 'catalog_examples::shell_catalog_examples_parse_without_execution' (694) panicked at crates/alphal00p-docs-examples/src/lib.rs:25:9:
  267. 41.99 s gammaloop-nextest-docs> shell documentation example validation failed:
  268. 41.99 s gammaloop-nextest-docs> bash: /build/source/target/ci-optim/build/alphal00p-docs-examples-48b938e1dbf43715/out/shell_catalog_examples.sh: No such file or directory
  269. 41.99 s gammaloop-nextest-docs>
  270. 41.99 s gammaloop-nextest-docs> stack backtrace:
  271. 41.99 s gammaloop-nextest-docs> 0: __rustc::rust_begin_unwind
  272. 41.99 s gammaloop-nextest-docs> 1: core::panicking::panic_fmt
  273. 41.99 s gammaloop-nextest-docs> 2: alphal00p_docs_examples::catalog_examples::shell_catalog_examples_parse_without_execution
  274. 41.99 s gammaloop-nextest-docs> 3: <alphal00p_docs_examples::catalog_examples::shell_catalog_examples_parse_without_execution::{closure#0} as core::ops::function::FnOnce<()>>::call_once
  275. 41.99 s gammaloop-nextest-docs> note: Some details are omitted, run with `RUST_BACKTRACE=full` for a verbose backtrace.
  276. 41.99 s gammaloop-nextest-docs> system-out
  277. 41.99 s gammaloop-nextest-docs> running 1 test
  278. 41.99 s gammaloop-nextest-docs> test catalog_examples::shell_catalog_examples_parse_without_execution ... FAILED
  279. 41.99 s gammaloop-nextest-docs>
  280. 41.99 s gammaloop-nextest-docs> failures:
  281. 41.99 s gammaloop-nextest-docs>
  282. 41.99 s gammaloop-nextest-docs> failures:
  283. 41.99 s gammaloop-nextest-docs> catalog_examples::shell_catalog_examples_parse_without_execution
  284. 41.99 s gammaloop-nextest-docs>
  285. 41.99 s gammaloop-nextest-docs> test result: FAILED. 0 passed; 1 failed; 0 ignored; 0 measured; 84 filtered out; finished in 0.01s
  286. 41.99 s gammaloop-nextest-docs> system-err
  287. 41.99 s gammaloop-nextest-docs> thread 'catalog_examples::shell_catalog_examples_parse_without_execution' (694) panicked at crates/alphal00p-docs-examples/src/lib.rs:25:9:
  288. 41.99 s gammaloop-nextest-docs> shell documentation example validation failed:
  289. 41.99 s gammaloop-nextest-docs> bash: /build/source/target/ci-optim/build/alphal00p-docs-examples-48b938e1dbf43715/out/shell_catalog_examples.sh: No such file or directory
  290. 41.99 s gammaloop-nextest-docs>
  291. 41.99 s gammaloop-nextest-docs> stack backtrace:
  292. 41.99 s gammaloop-nextest-docs> 0: __rustc::rust_begin_unwind
  293. 41.99 s gammaloop-nextest-docs> 1: core::panicking::panic_fmt
  294. 41.99 s gammaloop-nextest-docs> 2: alphal00p_docs_examples::catalog_examples::shell_catalog_examples_parse_without_execution
  295. 41.99 s gammaloop-nextest-docs> 3: <alphal00p_docs_examples::catalog_examples::shell_catalog_examples_parse_without_execution::{closure#0} as core::ops::function::FnOnce<()>>::call_once
  296. 41.99 s gammaloop-nextest-docs> note: Some details are omitted, run with `RUST_BACKTRACE=full` for a verbose backtrace.
  297. 41.99 s gammaloop-nextest-docs> =========================================
  298. 42.02 s gammaloop-nextest-docs> Extracting 2 binaries to /build/nextest-archive-OaoCXl
  299. 42.08 s gammaloop-nextest-docs> Extracted 5 files to /build/nextest-archive-OaoCXl in 0.06s
  300. 42.11 s gammaloop-nextest-docs> ------------
  301. 42.11 s gammaloop-nextest-docs> Nextest run ID 194ec25e-0dde-442d-b0b6-4d52c91c84cf with nextest profile: ci_gammaloop
  302. 42.11 s gammaloop-nextest-docs> Starting 10 tests across 2 binaries
  303. 42.23 s gammaloop-nextest-docs> FAIL [ 0.113s] (10/10) alphal00p-docs-macros::trybuild documentation_attributes_compile_and_diagnose
  304. 42.23 s gammaloop-nextest-docs> stdout ---
  305. 42.23 s gammaloop-nextest-docs>
  306. 42.23 s gammaloop-nextest-docs> running 1 test
  307. 42.23 s gammaloop-nextest-docs> test documentation_attributes_compile_and_diagnose ... FAILED
  308. 42.23 s gammaloop-nextest-docs>
  309. 42.23 s gammaloop-nextest-docs> failures:
  310. 42.23 s gammaloop-nextest-docs>
  311. 42.23 s gammaloop-nextest-docs> failures:
  312. 42.23 s gammaloop-nextest-docs> documentation_attributes_compile_and_diagnose
  313. 42.23 s gammaloop-nextest-docs>
  314. 42.23 s gammaloop-nextest-docs> test result: FAILED. 0 passed; 1 failed; 0 ignored; 0 measured; 0 filtered out; finished in 0.10s
  315. 42.23 s gammaloop-nextest-docs>
  316. 42.23 s gammaloop-nextest-docs> stderr ---
  317. 42.23 s gammaloop-nextest-docs> error: failed to load source for dependency `graphica`
  318. 42.23 s gammaloop-nextest-docs>
  319. 42.23 s gammaloop-nextest-docs> Caused by:
  320. 42.23 s gammaloop-nextest-docs> unable to update https://github.com/symbolica-dev/symbolica?branch=dev#0441bd7a
  321. 42.23 s gammaloop-nextest-docs>
  322. 42.23 s gammaloop-nextest-docs> Caused by:
  323. 42.23 s gammaloop-nextest-docs> can't checkout from 'https://github.com/symbolica-dev/symbolica': you are in the offline mode (--offline)
  324. 42.23 s gammaloop-nextest-docs>
  325. 42.23 s gammaloop-nextest-docs> thread 'documentation_attributes_compile_and_diagnose' (757) panicked at /nix/store/xdy1vvhll2bijdplvl9fcc2b9plkxhaa-vendor-cargo-deps/c19b7c6f923b580ac259164a89f2577984ad5ab09ee9d583b888f934adbbe8d0/trybuild-1.0.120/src/run.rs:63:13:
  326. 42.23 s gammaloop-nextest-docs> tests failed
  327. 42.23 s gammaloop-nextest-docs> stack backtrace:
  328. 42.23 s gammaloop-nextest-docs> 0: __rustc::rust_begin_unwind
  329. 42.23 s gammaloop-nextest-docs> 1: core::panicking::panic_fmt
  330. 42.23 s gammaloop-nextest-docs> 2: <trybuild::Runner>::run::{closure#1}
  331. 42.23 s gammaloop-nextest-docs> 3: <trybuild::Runner>::run
  332. 42.23 s gammaloop-nextest-docs> 4: <trybuild::TestCases as core::ops::drop::Drop>::drop
  333. 42.23 s gammaloop-nextest-docs> 5: <trybuild::documentation_attributes_compile_and_diagnose::{closure#0} as core::ops::function::FnOnce<()>>::call_once
  334. 42.23 s gammaloop-nextest-docs> note: Some details are omitted, run with `RUST_BACKTRACE=full` for a verbose backtrace.
  335. 42.23 s gammaloop-nextest-docs>
  336. 42.23 s gammaloop-nextest-docs> ------------
  337. 42.23 s gammaloop-nextest-docs> Summary [ 0.118s] 10 tests run: 9 passed, 1 failed, 0 skipped
  338. 42.23 s gammaloop-nextest-docs> FAIL [ 0.113s] (10/10) alphal00p-docs-macros::trybuild documentation_attributes_compile_and_diagnose
  339. 42.23 s gammaloop-nextest-docs> stdout ---
  340. 42.23 s gammaloop-nextest-docs>
  341. 42.23 s gammaloop-nextest-docs> running 1 test
  342. 42.23 s gammaloop-nextest-docs> test documentation_attributes_compile_and_diagnose ... FAILED
  343. 42.23 s gammaloop-nextest-docs>
  344. 42.23 s gammaloop-nextest-docs> failures:
  345. 42.23 s gammaloop-nextest-docs>
  346. 42.23 s gammaloop-nextest-docs> failures:
  347. 42.23 s gammaloop-nextest-docs> documentation_attributes_compile_and_diagnose
  348. 42.23 s gammaloop-nextest-docs>
  349. 42.23 s gammaloop-nextest-docs> test result: FAILED. 0 passed; 1 failed; 0 ignored; 0 measured; 0 filtered out; finished in 0.10s
  350. 42.23 s gammaloop-nextest-docs>
  351. 42.23 s gammaloop-nextest-docs> stderr ---
  352. 42.23 s gammaloop-nextest-docs> error: failed to load source for dependency `graphica`
  353. 42.23 s gammaloop-nextest-docs>
  354. 42.23 s gammaloop-nextest-docs> Caused by:
  355. 42.23 s gammaloop-nextest-docs> unable to update https://github.com/symbolica-dev/symbolica?branch=dev#0441bd7a
  356. 42.23 s gammaloop-nextest-docs>
  357. 42.23 s gammaloop-nextest-docs> Caused by:
  358. 42.23 s gammaloop-nextest-docs> can't checkout from 'https://github.com/symbolica-dev/symbolica': you are in the offline mode (--offline)
  359. 42.23 s gammaloop-nextest-docs>
  360. 42.23 s gammaloop-nextest-docs> thread 'documentation_attributes_compile_and_diagnose' (757) panicked at /nix/store/xdy1vvhll2bijdplvl9fcc2b9plkxhaa-vendor-cargo-deps/c19b7c6f923b580ac259164a89f2577984ad5ab09ee9d583b888f934adbbe8d0/trybuild-1.0.120/src/run.rs:63:13:
  361. 42.23 s gammaloop-nextest-docs> tests failed
  362. 42.23 s gammaloop-nextest-docs> stack backtrace:
  363. 42.23 s gammaloop-nextest-docs> 0: __rustc::rust_begin_unwind
  364. 42.23 s gammaloop-nextest-docs> 1: core::panicking::panic_fmt
  365. 42.23 s gammaloop-nextest-docs> 2: <trybuild::Runner>::run::{closure#1}
  366. 42.23 s gammaloop-nextest-docs> 3: <trybuild::Runner>::run
  367. 42.23 s gammaloop-nextest-docs> 4: <trybuild::TestCases as core::ops::drop::Drop>::drop
  368. 42.23 s gammaloop-nextest-docs> 5: <trybuild::documentation_attributes_compile_and_diagnose::{closure#0} as core::ops::function::FnOnce<()>>::call_once
  369. 42.23 s gammaloop-nextest-docs> note: Some details are omitted, run with `RUST_BACKTRACE=full` for a verbose backtrace.
  370. 42.23 s gammaloop-nextest-docs>
  371. 42.24 s gammaloop-nextest-docs> error: test run failed
  372. 42.27 s gammaloop-nextest-docs>
  373. 42.27 s gammaloop-nextest-docs> ========== nextest test summary ==========
  374. 42.27 s gammaloop-nextest-docs> report: target/nextest/ci_gammaloop/junit.xml
  375. 42.27 s gammaloop-nextest-docs> tests: 10, failures: 1, errors: 0
  376. 42.27 s gammaloop-nextest-docs>
  377. 42.27 s gammaloop-nextest-docs> 1. alphal00p-docs-macros::trybuild::documentation_attributes_compile_and_diagnose
  378. 42.27 s gammaloop-nextest-docs> failure: test failure with exit code 101
  379. 42.27 s gammaloop-nextest-docs> thread 'documentation_attributes_compile_and_diagnose' (757) panicked at /nix/store/xdy1vvhll2bijdplvl9fcc2b9plkxhaa-vendor-cargo-deps/c19b7c6f923b580ac259164a89f2577984ad5ab09ee9d583b888f934adbbe8d0/trybuild-1.0.120/src/run.rs:63:13:
  380. 42.27 s gammaloop-nextest-docs> tests failed
  381. 42.27 s gammaloop-nextest-docs> stack backtrace:
  382. 42.27 s gammaloop-nextest-docs> 0: __rustc::rust_begin_unwind
  383. 42.27 s gammaloop-nextest-docs> 1: core::panicking::panic_fmt
  384. 42.27 s gammaloop-nextest-docs> 2: <trybuild::Runner>::run::{closure#1}
  385. 42.27 s gammaloop-nextest-docs> 3: <trybuild::Runner>::run
  386. 42.27 s gammaloop-nextest-docs> 4: <trybuild::TestCases as core::ops::drop::Drop>::drop
  387. 42.27 s gammaloop-nextest-docs> 5: <trybuild::documentation_attributes_compile_and_diagnose::{closure#0} as core::ops::function::FnOnce<()>>::call_once
  388. 42.27 s gammaloop-nextest-docs> note: Some details are omitted, run with `RUST_BACKTRACE=full` for a verbose backtrace.
  389. 42.27 s gammaloop-nextest-docs> system-out
  390. 42.27 s gammaloop-nextest-docs> running 1 test
  391. 42.27 s gammaloop-nextest-docs> test documentation_attributes_compile_and_diagnose ... FAILED
  392. 42.27 s gammaloop-nextest-docs>
  393. 42.27 s gammaloop-nextest-docs> failures:
  394. 42.27 s gammaloop-nextest-docs>
  395. 42.27 s gammaloop-nextest-docs> failures:
  396. 42.27 s gammaloop-nextest-docs> documentation_attributes_compile_and_diagnose
  397. 42.27 s gammaloop-nextest-docs>
  398. 42.27 s gammaloop-nextest-docs> test result: FAILED. 0 passed; 1 failed; 0 ignored; 0 measured; 0 filtered out; finished in 0.10s
  399. 42.27 s gammaloop-nextest-docs> system-err
  400. 42.27 s gammaloop-nextest-docs> error: failed to load source for dependency `graphica`
  401. 42.27 s gammaloop-nextest-docs>
  402. 42.27 s gammaloop-nextest-docs> Caused by:
  403. 42.27 s gammaloop-nextest-docs> unable to update https://github.com/symbolica-dev/symbolica?branch=dev#0441bd7a
  404. 42.27 s gammaloop-nextest-docs>
  405. 42.27 s gammaloop-nextest-docs> Caused by:
  406. 42.27 s gammaloop-nextest-docs> can't checkout from 'https://github.com/symbolica-dev/symbolica': you are in the offline mode (--offline)
  407. 42.27 s gammaloop-nextest-docs>
  408. 42.27 s gammaloop-nextest-docs> thread 'documentation_attributes_compile_and_diagnose' (757) panicked at /nix/store/xdy1vvhll2bijdplvl9fcc2b9plkxhaa-vendor-cargo-deps/c19b7c6f923b580ac259164a89f2577984ad5ab09ee9d583b888f934adbbe8d0/trybuild-1.0.120/src/run.rs:63:13:
  409. 42.27 s gammaloop-nextest-docs> tests failed
  410. 42.27 s gammaloop-nextest-docs> stack backtrace:
  411. 42.27 s gammaloop-nextest-docs> 0: __rustc::rust_begin_unwind
  412. 42.27 s gammaloop-nextest-docs> 1: core::panicking::panic_fmt
  413. 42.27 s gammaloop-nextest-docs> 2: <trybuild::Runner>::run::{closure#1}
  414. 42.27 s gammaloop-nextest-docs> 3: <trybuild::Runner>::run
  415. 42.27 s gammaloop-nextest-docs> 4: <trybuild::TestCases as core::ops::drop::Drop>::drop
  416. 42.27 s gammaloop-nextest-docs> 5: <trybuild::documentation_attributes_compile_and_diagnose::{closure#0} as core::ops::function::FnOnce<()>>::call_once
  417. 42.27 s gammaloop-nextest-docs> note: Some details are omitted, run with `RUST_BACKTRACE=full` for a verbose backtrace.
  418. 42.27 s gammaloop-nextest-docs> =========================================
  419. 42.29 s gammaloop-nextest-docs> Extracting 1 binary to /build/nextest-archive-9ODtcx
  420. 42.33 s gammaloop-nextest-docs> Extracted 4 files to /build/nextest-archive-9ODtcx in 0.04s
  421. 42.34 s gammaloop-nextest-docs> ------------
  422. 42.34 s gammaloop-nextest-docs> Nextest run ID 50ae3872-29b4-466d-ba33-6ca35cb4cf4e with nextest profile: ci_gammaloop
  423. 42.34 s gammaloop-nextest-docs> Starting 0 tests across 1 binary
  424. 42.34 s gammaloop-nextest-docs> ------------
  425. 42.34 s gammaloop-nextest-docs> Summary [ 0.000s] 0 tests run: 0 passed, 0 skipped
  426. 42.39 s gammaloop-nextest-docs>
  427. 42.39 s gammaloop-nextest-docs> ========== nextest test summary ==========
  428. 42.39 s gammaloop-nextest-docs> report: target/nextest/ci_gammaloop/junit.xml
  429. 42.39 s gammaloop-nextest-docs> tests: 0, failures: 0, errors: 0
  430. 42.39 s gammaloop-nextest-docs> No failing testcases found.
  431. 42.39 s gammaloop-nextest-docs> =========================================
  432. 42.41 s gammaloop-nextest-docs> Extracting 1 binary to /build/nextest-archive-neEkXa
  433. 42.44 s gammaloop-nextest-docs> Extracted 4 files to /build/nextest-archive-neEkXa in 0.04s
  434. 42.46 s gammaloop-nextest-docs> ------------
  435. 42.46 s gammaloop-nextest-docs> Nextest run ID 7aec2270-60e9-422c-91dc-f4f244db31f8 with nextest profile: ci_gammaloop
  436. 42.46 s gammaloop-nextest-docs> Starting 5 tests across 1 binary
  437. 42.49 s gammaloop-nextest-docs> ------------
  438. 42.49 s gammaloop-nextest-docs> Summary [ 0.026s] 5 tests run: 5 passed, 0 skipped
  439. 42.53 s gammaloop-nextest-docs>
  440. 42.53 s gammaloop-nextest-docs> ========== nextest test summary ==========
  441. 42.53 s gammaloop-nextest-docs> report: target/nextest/ci_gammaloop/junit.xml
  442. 42.53 s gammaloop-nextest-docs> tests: 5, failures: 0, errors: 0
  443. 42.53 s gammaloop-nextest-docs> No failing testcases found.
  444. 42.53 s gammaloop-nextest-docs> =========================================
  445. 42.59 s error: Cannot build '/nix/store/6r13pbqsnmyyicpdrz1zkw00g0gdh9dy-gammaloop-nextest-docs.drv'.
  446. 42.59 s Reason: builder failed with exit code 100.
  447. 42.59 s Output paths:
  448. 42.59 s /nix/store/l523ply1armrmcxql3hw9v282km7ir52-gammaloop-nextest-docs
  449. 42.59 s Last 2048 log lines:
  450. 42.59 s > failures:
  451. 42.59 s >
  452. 42.59 s > failures:
  453. 42.59 s > tests::pdf_manual_chapter_order_must_match_the_page_registry
  454. 42.59 s >
  455. 42.59 s > test result: FAILED. 0 passed; 1 failed; 0 ignored; 0 measured; 101 filtered out; finished in 0.00s
  456. 42.59 s >
  457. 42.59 s > stderr ---
  458. 42.59 s >
  459. 42.59 s > thread 'tests::pdf_manual_chapter_order_must_match_the_page_registry' (300) panicked at crates/alphal00p-docs-builder/src/lib.rs:11122:51:
  460. 42.59 s > called `Result::unwrap()` on an `Err` value: failed to read /build/source/docs/portal.toml
  461. 42.59 s >
  462. 42.59 s > Caused by:
  463. 42.59 s > No such file or directory (os error 2)
  464. 42.59 s >
  465. 42.59 s > Location:
  466. 42.59 s > crates/alphal00p-docs-builder/src/lib.rs:582:14
  467. 42.59 s > stack backtrace:
  468. 42.59 s > 0: __rustc::rust_begin_unwind
  469. 42.59 s > 1: core::panicking::panic_fmt
  470. 42.59 s > 2: core::result::unwrap_failed
  471. 42.59 s > 3: alphal00p_docs_builder::tests::pdf_manual_chapter_order_must_match_the_page_registry
  472. 42.59 s > 4: <alphal00p_docs_builder::tests::pdf_manual_chapter_order_must_match_the_page_registry::{closure#0} as core::ops::function::FnOnce<()>>::call_once
  473. 42.59 s > note: Some details are omitted, run with `RUST_BACKTRACE=full` for a verbose backtrace.
  474. 42.59 s >
  475. 42.59 s > FAIL [ 0.017s] ( 45/102) alphal00p-docs-builder tests::pagination_keeps_generated_reference_before_version_history
  476. 42.59 s > stdout ---
  477. 42.59 s >
  478. 42.59 s > running 1 test
  479. 42.59 s > test tests::pagination_keeps_generated_reference_before_version_history ... FAILED
  480. 42.59 s >
  481. 42.59 s > failures:
  482. 42.59 s >
  483. 42.59 s > failures:
  484. 42.59 s > tests::pagination_keeps_generated_reference_before_version_history
  485. 42.59 s >
  486. 42.59 s > test result: FAILED. 0 passed; 1 failed; 0 ignored; 0 measured; 101 filtered out; finished in 0.01s
  487. 42.59 s >
  488. 42.59 s > stderr ---
  489. 42.59 s >
  490. 42.59 s > thread 'tests::pagination_keeps_generated_reference_before_version_history' (288) panicked at crates/alphal00p-docs-builder/src/lib.rs:10257:47:
  491. 42.59 s > called `Result::unwrap()` on an `Err` value: failed to read /build/source/docs/portal.toml
  492. 42.59 s >
  493. 42.59 s > Caused by:
  494. 42.59 s > No such file or directory (os error 2)
  495. 42.59 s >
  496. 42.59 s > Location:
  497. 42.59 s > crates/alphal00p-docs-builder/src/lib.rs:582:14
  498. 42.59 s > stack backtrace:
  499. 42.59 s > 0: __rustc::rust_begin_unwind
  500. 42.59 s > 1: core::panicking::panic_fmt
  501. 42.59 s > 2: core::result::unwrap_failed
  502. 42.59 s > 3: alphal00p_docs_builder::tests::pagination_keeps_generated_reference_before_version_history
  503. 42.59 s > 4: <alphal00p_docs_builder::tests::pagination_keeps_generated_reference_before_version_history::{closure#0} as core::ops::function::FnOnce<()>>::call_once
  504. 42.59 s > note: Some details are omitted, run with `RUST_BACKTRACE=full` for a verbose backtrace.
  505. 42.59 s >
  506. 42.59 s > FAIL [ 0.015s] ( 47/102) alphal00p-docs-builder tests::persistent_rustdoc_target_rejects_symlink_escape
  507. 42.59 s > stdout ---
  508. 42.59 s >
  509. 42.59 s > running 1 test
  510. 42.59 s > test tests::persistent_rustdoc_target_rejects_symlink_escape ... FAILED
  511. 42.59 s >
  512. 42.59 s > failures:
  513. 42.59 s >
  514. 42.59 s > failures:
  515. 42.59 s > tests::persistent_rustdoc_target_rejects_symlink_escape
  516. 42.59 s >
  517. 42.59 s > test result: FAILED. 0 passed; 1 failed; 0 ignored; 0 measured; 101 filtered out; finished in 0.00s
  518. 42.59 s >
  519. 42.59 s > stderr ---
  520. 42.59 s >
  521. 42.59 s > thread 'tests::persistent_rustdoc_target_rejects_symlink_escape' (298) panicked at crates/alphal00p-docs-builder/src/lib.rs:9878:82:
  522. 42.59 s > called `Result::unwrap_err()` on an `Ok` value: "/build/.tmpc3jyqB/escape/cache/cargo-target-v1"
  523. 42.59 s > stack backtrace:
  524. 42.59 s > 0: __rustc::rust_begin_unwind
  525. 42.59 s > 1: core::panicking::panic_fmt
  526. 42.59 s > 2: core::result::unwrap_failed
  527. 42.59 s > 3: alphal00p_docs_builder::tests::persistent_rustdoc_target_rejects_symlink_escape
  528. 42.59 s > 4: <alphal00p_docs_builder::tests::persistent_rustdoc_target_rejects_symlink_escape::{closure#0} as core::ops::function::FnOnce<()>>::call_once
  529. 42.59 s > note: Some details are omitted, run with `RUST_BACKTRACE=full` for a verbose backtrace.
  530. 42.59 s >
  531. 42.59 s > FAIL [ 0.025s] ( 48/102) alphal00p-docs-builder tests::generated_search_uses_cli_leaf_routes_and_setting_namespaces
  532. 42.59 s > stdout ---
  533. 42.59 s >
  534. 42.59 s > running 1 test
  535. 42.59 s > test tests::generated_search_uses_cli_leaf_routes_and_setting_namespaces ... FAILED
  536. 42.59 s >
  537. 42.59 s > failures:
  538. 42.59 s >
  539. 42.59 s > failures:
  540. 42.59 s > tests::generated_search_uses_cli_leaf_routes_and_setting_namespaces
  541. 42.59 s >
  542. 42.59 s > test result: FAILED. 0 passed; 1 failed; 0 ignored; 0 measured; 101 filtered out; finished in 0.01s
  543. 42.59 s >
  544. 42.59 s > stderr ---
  545. 42.59 s >
  546. 42.59 s > thread 'tests::generated_search_uses_cli_leaf_routes_and_setting_namespaces' (284) panicked at crates/alphal00p-docs-builder/src/lib.rs:11570:47:
  547. 42.59 s > called `Result::unwrap()` on an `Err` value: failed to read /build/source/docs/portal.toml
  548. 42.59 s >
  549. 42.59 s > Caused by:
  550. 42.59 s > No such file or directory (os error 2)
  551. 42.59 s >
  552. 42.59 s > Location:
  553. 42.59 s > crates/alphal00p-docs-builder/src/lib.rs:582:14
  554. 42.59 s > stack backtrace:
  555. 42.59 s > 0: __rustc::rust_begin_unwind
  556. 42.59 s > 1: core::panicking::panic_fmt
  557. 42.59 s > 2: core::result::unwrap_failed
  558. 42.59 s > 3: alphal00p_docs_builder::tests::generated_search_uses_cli_leaf_routes_and_setting_namespaces
  559. 42.59 s > 4: <alphal00p_docs_builder::tests::generated_search_uses_cli_leaf_routes_and_setting_namespaces::{closure#0} as core::ops::function::FnOnce<()>>::call_once
  560. 42.59 s > note: Some details are omitted, run with `RUST_BACKTRACE=full` for a verbose backtrace.
  561. 42.59 s >
  562. 42.59 s > FAIL [ 0.009s] ( 49/102) alphal00p-docs-builder tests::product_preview_validation_rejects_a_broken_search_fragment
  563. 42.59 s > stdout ---
  564. 42.59 s >
  565. 42.59 s > running 1 test
  566. 42.59 s > test tests::product_preview_validation_rejects_a_broken_search_fragment ... FAILED
  567. 42.59 s >
  568. 42.59 s > failures:
  569. 42.59 s >
  570. 42.59 s > failures:
  571. 42.59 s > tests::product_preview_validation_rejects_a_broken_search_fragment
  572. 42.59 s >
  573. 42.59 s > test result: FAILED. 0 passed; 1 failed; 0 ignored; 0 measured; 101 filtered out; finished in 0.00s
  574. 42.59 s >
  575. 42.59 s > stderr ---
  576. 42.59 s >
  577. 42.59 s > thread 'tests::product_preview_validation_rejects_a_broken_search_fragment' (304) panicked at crates/alphal00p-docs-builder/src/lib.rs:10615:47:
  578. 42.59 s > called `Result::unwrap()` on an `Err` value: failed to read /build/source/docs/portal.toml
  579. 42.59 s >
  580. 42.59 s > Caused by:
  581. 42.59 s > No such file or directory (os error 2)
  582. 42.59 s >
  583. 42.59 s > Location:
  584. 42.59 s > crates/alphal00p-docs-builder/src/lib.rs:582:14
  585. 42.59 s > stack backtrace:
  586. 42.59 s > 0: __rustc::rust_begin_unwind
  587. 42.59 s > 1: core::panicking::panic_fmt
  588. 42.59 s > 2: core::result::unwrap_failed
  589. 42.59 s > 3: alphal00p_docs_builder::tests::product_preview_validation_rejects_a_broken_search_fragment
  590. 42.59 s > 4: <alphal00p_docs_builder::tests::product_preview_validation_rejects_a_broken_search_fragment::{closure#0} as core::ops::function::FnOnce<()>>::call_once
  591. 42.59 s > note: Some details are omitted, run with `RUST_BACKTRACE=full` for a verbose backtrace.
  592. 42.59 s >
  593. 42.59 s > FAIL [ 0.011s] ( 50/102) alphal00p-docs-builder tests::portal_project_cards_use_accurate_ecosystem_roles
  594. 42.59 s > stdout ---
  595. 42.59 s >
  596. 42.59 s > running 1 test
  597. 42.59 s > test tests::portal_project_cards_use_accurate_ecosystem_roles ... FAILED
  598. 42.59 s >
  599. 42.59 s > failures:
  600. 42.59 s >
  601. 42.59 s > failures:
  602. 42.59 s > tests::portal_project_cards_use_accurate_ecosystem_roles
  603. 42.59 s >
  604. 42.59 s > test result: FAILED. 0 passed; 1 failed; 0 ignored; 0 measured; 101 filtered out; finished in 0.00s
  605. 42.59 s >
  606. 42.59 s > stderr ---
  607. 42.59 s >
  608. 42.59 s > thread 'tests::portal_project_cards_use_accurate_ecosystem_roles' (302) panicked at crates/alphal00p-docs-builder/src/lib.rs:11427:47:
  609. 42.59 s > called `Result::unwrap()` on an `Err` value: failed to read /build/source/docs/portal.toml
  610. 42.59 s >
  611. 42.59 s > Caused by:
  612. 42.59 s > No such file or directory (os error 2)
  613. 42.59 s >
  614. 42.59 s > Location:
  615. 42.59 s > crates/alphal00p-docs-builder/src/lib.rs:582:14
  616. 42.59 s > stack backtrace:
  617. 42.59 s > 0: __rustc::rust_begin_unwind
  618. 42.59 s > 1: core::panicking::panic_fmt
  619. 42.59 s > 2: core::result::unwrap_failed
  620. 42.59 s > 3: alphal00p_docs_builder::tests::portal_project_cards_use_accurate_ecosystem_roles
  621. 42.59 s > 4: <alphal00p_docs_builder::tests::portal_project_cards_use_accurate_ecosystem_roles::{closure#0} as core::ops::function::FnOnce<()>>::call_once
  622. 42.59 s > note: Some details are omitted, run with `RUST_BACKTRACE=full` for a verbose backtrace.
  623. 42.59 s >
  624. 42.59 s > FAIL [ 0.016s] ( 51/102) alphal00p-docs-builder tests::portal_and_developer_pages_use_federated_search_and_feedback
  625. 42.59 s > stdout ---
  626. 42.59 s >
  627. 42.59 s > running 1 test
  628. 42.59 s > test tests::portal_and_developer_pages_use_federated_search_and_feedback ... FAILED
  629. 42.59 s >
  630. 42.59 s > failures:
  631. 42.59 s >
  632. 42.59 s > failures:
  633. 42.59 s > tests::portal_and_developer_pages_use_federated_search_and_feedback
  634. 42.59 s >
  635. 42.59 s > test result: FAILED. 0 passed; 1 failed; 0 ignored; 0 measured; 101 filtered out; finished in 0.01s
  636. 42.59 s >
  637. 42.59 s > stderr ---
  638. 42.59 s >
  639. 42.59 s > thread 'tests::portal_and_developer_pages_use_federated_search_and_feedback' (297) panicked at crates/alphal00p-docs-builder/src/lib.rs:12006:47:
  640. 42.59 s > called `Result::unwrap()` on an `Err` value: failed to read /build/source/docs/portal.toml
  641. 42.59 s >
  642. 42.59 s > Caused by:
  643. 42.59 s > No such file or directory (os error 2)
  644. 42.59 s >
  645. 42.59 s > Location:
  646. 42.59 s > crates/alphal00p-docs-builder/src/lib.rs:582:14
  647. 42.59 s > stack backtrace:
  648. 42.59 s > 0: __rustc::rust_begin_unwind
  649. 42.59 s > 1: core::panicking::panic_fmt
  650. 42.59 s > 2: core::result::unwrap_failed
  651. 42.59 s > 3: alphal00p_docs_builder::tests::portal_and_developer_pages_use_federated_search_and_feedback
  652. 42.59 s > 4: <alphal00p_docs_builder::tests::portal_and_developer_pages_use_federated_search_and_feedback::{closure#0} as core::ops::function::FnOnce<()>>::call_once
  653. 42.59 s > note: Some details are omitted, run with `RUST_BACKTRACE=full` for a verbose backtrace.
  654. 42.59 s >
  655. 42.59 s > FAIL [ 0.011s] ( 52/102) alphal00p-docs-builder tests::portal_task_chooser_routes_each_goal_to_the_registered_tutorial
  656. 42.59 s > stdout ---
  657. 42.59 s >
  658. 42.59 s > running 1 test
  659. 42.59 s > test tests::portal_task_chooser_routes_each_goal_to_the_registered_tutorial ... FAILED
  660. 42.59 s >
  661. 42.59 s > failures:
  662. 42.59 s >
  663. 42.59 s > failures:
  664. 42.59 s > tests::portal_task_chooser_routes_each_goal_to_the_registered_tutorial
  665. 42.59 s >
  666. 42.59 s > test result: FAILED. 0 passed; 1 failed; 0 ignored; 0 measured; 101 filtered out; finished in 0.01s
  667. 42.59 s >
  668. 42.59 s > stderr ---
  669. 42.59 s >
  670. 42.59 s > thread 'tests::portal_task_chooser_routes_each_goal_to_the_registered_tutorial' (303) panicked at crates/alphal00p-docs-builder/src/lib.rs:11392:47:
  671. 42.59 s > called `Result::unwrap()` on an `Err` value: failed to read /build/source/docs/portal.toml
  672. 42.59 s >
  673. 42.59 s > Caused by:
  674. 42.59 s > No such file or directory (os error 2)
  675. 42.59 s >
  676. 42.59 s > Location:
  677. 42.59 s > crates/alphal00p-docs-builder/src/lib.rs:582:14
  678. 42.59 s > stack backtrace:
  679. 42.59 s > 0: __rustc::rust_begin_unwind
  680. 42.59 s > 1: core::panicking::panic_fmt
  681. 42.59 s > 2: core::result::unwrap_failed
  682. 42.59 s > 3: alphal00p_docs_builder::tests::portal_task_chooser_routes_each_goal_to_the_registered_tutorial
  683. 42.59 s > 4: <alphal00p_docs_builder::tests::portal_task_chooser_routes_each_goal_to_the_registered_tutorial::{closure#0} as core::ops::function::FnOnce<()>>::call_once
  684. 42.59 s > note: Some details are omitted, run with `RUST_BACKTRACE=full` for a verbose backtrace.
  685. 42.59 s >
  686. 42.59 s > FAIL [ 0.019s] ( 53/102) alphal00p-docs-builder tests::persistent_rustdoc_targets_reject_workspace_and_arbitrary_roots
  687. 42.59 s > stdout ---
  688. 42.59 s >
  689. 42.59 s > running 1 test
  690. 42.59 s > test tests::persistent_rustdoc_targets_reject_workspace_and_arbitrary_roots ... FAILED
  691. 42.59 s >
  692. 42.59 s > failures:
  693. 42.59 s >
  694. 42.59 s > failures:
  695. 42.59 s > tests::persistent_rustdoc_targets_reject_workspace_and_arbitrary_roots
  696. 42.59 s >
  697. 42.59 s > test result: FAILED. 0 passed; 1 failed; 0 ignored; 0 measured; 101 filtered out; finished in 0.01s
  698. 42.59 s >
  699. 42.59 s > stderr ---
  700. 42.59 s >
  701. 42.59 s > thread 'tests::persistent_rustdoc_targets_reject_workspace_and_arbitrary_roots' (289) panicked at crates/alphal00p-docs-builder/src/lib.rs:9855:9:
  702. 42.59 s > assertion failed: prepare_persistent_rustdoc_target(workspace, &arbitrary).is_err()
  703. 42.59 s > stack backtrace:
  704. 42.59 s > 0: __rustc::rust_begin_unwind
  705. 42.59 s > 1: core::panicking::panic_fmt
  706. 42.59 s > 2: core::panicking::panic
  707. 42.59 s > 3: alphal00p_docs_builder::tests::persistent_rustdoc_targets_reject_workspace_and_arbitrary_roots
  708. 42.59 s > 4: <alphal00p_docs_builder::tests::persistent_rustdoc_targets_reject_workspace_and_arbitrary_roots::{closure#0} as core::ops::function::FnOnce<()>>::call_once
  709. 42.59 s > note: Some details are omitted, run with `RUST_BACKTRACE=full` for a verbose backtrace.
  710. 42.59 s >
  711. 42.59 s > FAIL [ 0.013s] ( 54/102) alphal00p-docs-builder tests::product_preview_developer_links_use_revision_pinned_sources
  712. 42.59 s > stdout ---
  713. 42.59 s >
  714. 42.59 s > running 1 test
  715. 42.59 s > test tests::product_preview_developer_links_use_revision_pinned_sources ... FAILED
  716. 42.59 s >
  717. 42.59 s > failures:
  718. 42.59 s >
  719. 42.59 s > failures:
  720. 42.59 s > tests::product_preview_developer_links_use_revision_pinned_sources
  721. 42.59 s >
  722. 42.59 s > test result: FAILED. 0 passed; 1 failed; 0 ignored; 0 measured; 101 filtered out; finished in 0.00s
  723. 42.59 s >
  724. 42.59 s > stderr ---
  725. 42.59 s >
  726. 42.59 s > thread 'tests::product_preview_developer_links_use_revision_pinned_sources' (305) panicked at crates/alphal00p-docs-builder/src/lib.rs:10469:47:
  727. 42.59 s > called `Result::unwrap()` on an `Err` value: failed to read /build/source/docs/portal.toml
  728. 42.59 s >
  729. 42.59 s > Caused by:
  730. 42.59 s > No such file or directory (os error 2)
  731. 42.59 s >
  732. 42.59 s > Location:
  733. 42.59 s > crates/alphal00p-docs-builder/src/lib.rs:582:14
  734. 42.59 s > stack backtrace:
  735. 42.59 s > 0: __rustc::rust_begin_unwind
  736. 42.59 s > 1: core::panicking::panic_fmt
  737. 42.59 s > 2: core::result::unwrap_failed
  738. 42.59 s > 3: alphal00p_docs_builder::tests::product_preview_developer_links_use_revision_pinned_sources
  739. 42.59 s > 4: <alphal00p_docs_builder::tests::product_preview_developer_links_use_revision_pinned_sources::{closure#0} as core::ops::function::FnOnce<()>>::call_once
  740. 42.59 s > note: Some details are omitted, run with `RUST_BACKTRACE=full` for a verbose backtrace.
  741. 42.59 s >
  742. 42.59 s > FAIL [ 0.017s] ( 57/102) alphal00p-docs-builder tests::portal_focuses_on_projects_and_keeps_dedicated_routes
  743. 42.59 s > stdout ---
  744. 42.59 s >
  745. 42.59 s > running 1 test
  746. 42.59 s > test tests::portal_focuses_on_projects_and_keeps_dedicated_routes ... FAILED
  747. 42.59 s >
  748. 42.59 s > failures:
  749. 42.59 s >
  750. 42.59 s > failures:
  751. 42.59 s > tests::portal_focuses_on_projects_and_keeps_dedicated_routes
  752. 42.59 s >
  753. 42.59 s > test result: FAILED. 0 passed; 1 failed; 0 ignored; 0 measured; 101 filtered out; finished in 0.00s
  754. 42.59 s >
  755. 42.59 s > stderr ---
  756. 42.59 s >
  757. 42.59 s > thread 'tests::portal_focuses_on_projects_and_keeps_dedicated_routes' (313) panicked at crates/alphal00p-docs-builder/src/lib.rs:11147:47:
  758. 42.59 s > called `Result::unwrap()` on an `Err` value: failed to read /build/source/docs/portal.toml
  759. 42.59 s >
  760. 42.59 s > Caused by:
  761. 42.59 s > No such file or directory (os error 2)
  762. 42.59 s >
  763. 42.59 s > Location:
  764. 42.59 s > crates/alphal00p-docs-builder/src/lib.rs:582:14
  765. 42.59 s > stack backtrace:
  766. 42.59 s > 0: __rustc::rust_begin_unwind
  767. 42.59 s > 1: core::panicking::panic_fmt
  768. 42.59 s > 2: core::result::unwrap_failed
  769. 42.59 s > 3: alphal00p_docs_builder::tests::portal_focuses_on_projects_and_keeps_dedicated_routes
  770. 42.59 s > 4: <alphal00p_docs_builder::tests::portal_focuses_on_projects_and_keeps_dedicated_routes::{closure#0} as core::ops::function::FnOnce<()>>::call_once
  771. 42.59 s > note: Some details are omitted, run with `RUST_BACKTRACE=full` for a verbose backtrace.
  772. 42.59 s >
  773. 42.59 s > FAIL [ 0.014s] ( 58/102) alphal00p-docs-builder tests::prose_source_gate_rejects_format_variants_and_readme_typ
  774. 42.59 s > stdout ---
  775. 42.59 s >
  776. 42.59 s > running 1 test
  777. 42.59 s > test tests::prose_source_gate_rejects_format_variants_and_readme_typ ... FAILED
  778. 42.59 s >
  779. 42.59 s > failures:
  780. 42.59 s >
  781. 42.59 s > failures:
  782. 42.59 s > tests::prose_source_gate_rejects_format_variants_and_readme_typ
  783. 42.59 s >
  784. 42.59 s > test result: FAILED. 0 passed; 1 failed; 0 ignored; 0 measured; 101 filtered out; finished in 0.00s
  785. 42.59 s >
  786. 42.59 s > stderr ---
  787. 42.59 s >
  788. 42.59 s > thread 'tests::prose_source_gate_rejects_format_variants_and_readme_typ' (312) panicked at crates/alphal00p-docs-builder/src/lib.rs:9698:51:
  789. 42.59 s > called `Result::unwrap()` on an `Err` value: failed to read /build/source/docs/portal.toml
  790. 42.59 s >
  791. 42.59 s > Caused by:
  792. 42.59 s > No such file or directory (os error 2)
  793. 42.59 s >
  794. 42.59 s > Location:
  795. 42.59 s > crates/alphal00p-docs-builder/src/lib.rs:582:14
  796. 42.59 s > stack backtrace:
  797. 42.59 s > 0: __rustc::rust_begin_unwind
  798. 42.59 s > 1: core::panicking::panic_fmt
  799. 42.59 s > 2: core::result::unwrap_failed
  800. 42.59 s > 3: alphal00p_docs_builder::tests::prose_source_gate_rejects_format_variants_and_readme_typ
  801. 42.59 s > 4: <alphal00p_docs_builder::tests::prose_source_gate_rejects_format_variants_and_readme_typ::{closure#0} as core::ops::function::FnOnce<()>>::call_once
  802. 42.59 s > note: Some details are omitted, run with `RUST_BACKTRACE=full` for a verbose backtrace.
  803. 42.59 s >
  804. 42.59 s > FAIL [ 0.017s] ( 59/102) alphal00p-docs-builder tests::product_bundles_render_authored_typst_but_allow_package_assets
  805. 42.59 s > stdout ---
  806. 42.59 s >
  807. 42.59 s > running 1 test
  808. 42.59 s > test tests::product_bundles_render_authored_typst_but_allow_package_assets ... FAILED
  809. 42.59 s >
  810. 42.59 s > failures:
  811. 42.59 s >
  812. 42.59 s > failures:
  813. 42.59 s > tests::product_bundles_render_authored_typst_but_allow_package_assets
  814. 42.59 s >
  815. 42.59 s > test result: FAILED. 0 passed; 1 failed; 0 ignored; 0 measured; 101 filtered out; finished in 0.00s
  816. 42.59 s >
  817. 42.59 s > stderr ---
  818. 42.59 s >
  819. 42.59 s > thread 'tests::product_bundles_render_authored_typst_but_allow_package_assets' (318) panicked at crates/alphal00p-docs-builder/src/lib.rs:9202:47:
  820. 42.59 s > called `Result::unwrap()` on an `Err` value: failed to read /build/source/docs/portal.toml
  821. 42.59 s >
  822. 42.59 s > Caused by:
  823. 42.59 s > No such file or directory (os error 2)
  824. 42.59 s >
  825. 42.59 s > Location:
  826. 42.59 s > crates/alphal00p-docs-builder/src/lib.rs:582:14
  827. 42.59 s > stack backtrace:
  828. 42.59 s > 0: __rustc::rust_begin_unwind
  829. 42.59 s > 1: core::panicking::panic_fmt
  830. 42.59 s > 2: core::result::unwrap_failed
  831. 42.59 s > 3: alphal00p_docs_builder::tests::product_bundles_render_authored_typst_but_allow_package_assets
  832. 42.59 s > 4: <alphal00p_docs_builder::tests::product_bundles_render_authored_typst_but_allow_package_assets::{closure#0} as core::ops::function::FnOnce<()>>::call_once
  833. 42.59 s > note: Some details are omitted, run with `RUST_BACKTRACE=full` for a verbose backtrace.
  834. 42.59 s >
  835. 42.59 s > FAIL [ 0.012s] ( 60/102) alphal00p-docs-builder tests::prose_source_gate_rejects_new_and_parallel_markdown
  836. 42.59 s > stdout ---
  837. 42.59 s >
  838. 42.59 s > running 1 test
  839. 42.59 s > test tests::prose_source_gate_rejects_new_and_parallel_markdown ... FAILED
  840. 42.59 s >
  841. 42.59 s > failures:
  842. 42.59 s >
  843. 42.59 s > failures:
  844. 42.59 s > tests::prose_source_gate_rejects_new_and_parallel_markdown
  845. 42.59 s >
  846. 42.59 s > test result: FAILED. 0 passed; 1 failed; 0 ignored; 0 measured; 101 filtered out; finished in 0.00s
  847. 42.59 s >
  848. 42.59 s > stderr ---
  849. 42.59 s >
  850. 42.59 s > thread 'tests::prose_source_gate_rejects_new_and_parallel_markdown' (323) panicked at crates/alphal00p-docs-builder/src/lib.rs:9679:51:
  851. 42.59 s > called `Result::unwrap()` on an `Err` value: failed to read /build/source/docs/portal.toml
  852. 42.59 s >
  853. 42.59 s > Caused by:
  854. 42.59 s > No such file or directory (os error 2)
  855. 42.59 s >
  856. 42.59 s > Location:
  857. 42.59 s > crates/alphal00p-docs-builder/src/lib.rs:582:14
  858. 42.59 s > stack backtrace:
  859. 42.59 s > 0: __rustc::rust_begin_unwind
  860. 42.59 s > 1: core::panicking::panic_fmt
  861. 42.59 s > 2: core::result::unwrap_failed
  862. 42.59 s > 3: alphal00p_docs_builder::tests::prose_source_gate_rejects_new_and_parallel_markdown
  863. 42.59 s > 4: <alphal00p_docs_builder::tests::prose_source_gate_rejects_new_and_parallel_markdown::{closure#0} as core::ops::function::FnOnce<()>>::call_once
  864. 42.59 s > note: Some details are omitted, run with `RUST_BACKTRACE=full` for a verbose backtrace.
  865. 42.59 s >
  866. 42.59 s > FAIL [ 0.009s] ( 62/102) alphal00p-docs-builder tests::python_module_indexes_use_the_public_module_name
  867. 42.59 s > stdout ---
  868. 42.59 s >
  869. 42.59 s > running 1 test
  870. 42.59 s > test tests::python_module_indexes_use_the_public_module_name ... FAILED
  871. 42.59 s >
  872. 42.59 s > failures:
  873. 42.59 s >
  874. 42.59 s > failures:
  875. 42.59 s > tests::python_module_indexes_use_the_public_module_name
  876. 42.59 s >
  877. 42.59 s > test result: FAILED. 0 passed; 1 failed; 0 ignored; 0 measured; 101 filtered out; finished in 0.00s
  878. 42.59 s >
  879. 42.59 s > stderr ---
  880. 42.59 s >
  881. 42.59 s > thread 'tests::python_module_indexes_use_the_public_module_name' (327) panicked at crates/alphal00p-docs-builder/src/lib.rs:9389:47:
  882. 42.59 s > called `Result::unwrap()` on an `Err` value: failed to read /build/source/docs/portal.toml
  883. 42.59 s >
  884. 42.59 s > Caused by:
  885. 42.59 s > No such file or directory (os error 2)
  886. 42.59 s >
  887. 42.59 s > Location:
  888. 42.59 s > crates/alphal00p-docs-builder/src/lib.rs:582:14
  889. 42.59 s > stack backtrace:
  890. 42.59 s > 0: __rustc::rust_begin_unwind
  891. 42.59 s > 1: core::panicking::panic_fmt
  892. 42.59 s > 2: core::result::unwrap_failed
  893. 42.59 s > 3: alphal00p_docs_builder::tests::python_module_indexes_use_the_public_module_name
  894. 42.59 s > 4: <alphal00p_docs_builder::tests::python_module_indexes_use_the_public_module_name::{closure#0} as core::ops::function::FnOnce<()>>::call_once
  895. 42.59 s > note: Some details are omitted, run with `RUST_BACKTRACE=full` for a verbose backtrace.
  896. 42.59 s >
  897. 42.59 s > FAIL [ 0.012s] ( 64/102) alphal00p-docs-builder tests::rendered_product_and_reference_pages_offer_revision_pinned_feedback
  898. 42.59 s > stdout ---
  899. 42.59 s >
  900. 42.59 s > running 1 test
  901. 42.59 s > test tests::rendered_product_and_reference_pages_offer_revision_pinned_feedback ... FAILED
  902. 42.59 s >
  903. 42.59 s > failures:
  904. 42.59 s >
  905. 42.59 s > failures:
  906. 42.59 s > tests::rendered_product_and_reference_pages_offer_revision_pinned_feedback
  907. 42.59 s >
  908. 42.59 s > test result: FAILED. 0 passed; 1 failed; 0 ignored; 0 measured; 101 filtered out; finished in 0.00s
  909. 42.59 s >
  910. 42.59 s > stderr ---
  911. 42.59 s >
  912. 42.59 s > thread 'tests::rendered_product_and_reference_pages_offer_revision_pinned_feedback' (328) panicked at crates/alphal00p-docs-builder/src/lib.rs:11780:47:
  913. 42.59 s > called `Result::unwrap()` on an `Err` value: failed to read /build/source/docs/portal.toml
  914. 42.59 s >
  915. 42.59 s > Caused by:
  916. 42.59 s > No such file or directory (os error 2)
  917. 42.59 s >
  918. 42.59 s > Location:
  919. 42.59 s > crates/alphal00p-docs-builder/src/lib.rs:582:14
  920. 42.59 s > stack backtrace:
  921. 42.59 s > 0: __rustc::rust_begin_unwind
  922. 42.59 s > 1: core::panicking::panic_fmt
  923. 42.59 s > 2: core::result::unwrap_failed
  924. 42.59 s > 3: alphal00p_docs_builder::tests::rendered_product_and_reference_pages_offer_revision_pinned_feedback
  925. 42.59 s > 4: <alphal00p_docs_builder::tests::rendered_product_and_reference_pages_offer_revision_pinned_feedback::{closure#0} as core::ops::function::FnOnce<()>>::call_once
  926. 42.59 s > note: Some details are omitted, run with `RUST_BACKTRACE=full` for a verbose backtrace.
  927. 42.59 s >
  928. 42.59 s > FAIL [ 0.013s] ( 70/102) alphal00p-docs-builder tests::rustdoc_link_validation_uses_rendered_tags_and_source_line_ranges
  929. 42.59 s > stdout ---
  930. 42.59 s >
  931. 42.59 s > running 1 test
  932. 42.59 s > test tests::rustdoc_link_validation_uses_rendered_tags_and_source_line_ranges ... FAILED
  933. 42.59 s >
  934. 42.59 s > failures:
  935. 42.59 s >
  936. 42.59 s > failures:
  937. 42.59 s > tests::rustdoc_link_validation_uses_rendered_tags_and_source_line_ranges
  938. 42.59 s >
  939. 42.59 s > test result: FAILED. 0 passed; 1 failed; 0 ignored; 0 measured; 101 filtered out; finished in 0.00s
  940. 42.59 s >
  941. 42.59 s > stderr ---
  942. 42.59 s >
  943. 42.59 s > thread 'tests::rustdoc_link_validation_uses_rendered_tags_and_source_line_ranges' (346) panicked at crates/alphal00p-docs-builder/src/lib.rs:9957:47:
  944. 42.59 s > called `Result::unwrap()` on an `Err` value: failed to read /build/source/docs/portal.toml
  945. 42.59 s >
  946. 42.59 s > Caused by:
  947. 42.59 s > No such file or directory (os error 2)
  948. 42.59 s >
  949. 42.59 s > Location:
  950. 42.59 s > crates/alphal00p-docs-builder/src/lib.rs:582:14
  951. 42.59 s > stack backtrace:
  952. 42.59 s > 0: __rustc::rust_begin_unwind
  953. 42.59 s > 1: core::panicking::panic_fmt
  954. 42.59 s > 2: core::result::unwrap_failed
  955. 42.59 s > 3: alphal00p_docs_builder::tests::rustdoc_link_validation_uses_rendered_tags_and_source_line_ranges
  956. 42.59 s > 4: <alphal00p_docs_builder::tests::rustdoc_link_validation_uses_rendered_tags_and_source_line_ranges::{closure#0} as core::ops::function::FnOnce<()>>::call_once
  957. 42.59 s > note: Some details are omitted, run with `RUST_BACKTRACE=full` for a verbose backtrace.
  958. 42.59 s >
  959. 42.59 s > FAIL [ 0.023s] ( 71/102) alphal00p-docs-builder tests::python_member_fragments_have_scroll_and_target_styles
  960. 42.59 s > stdout ---
  961. 42.59 s >
  962. 42.59 s > running 1 test
  963. 42.59 s > test tests::python_member_fragments_have_scroll_and_target_styles ... FAILED
  964. 42.59 s >
  965. 42.59 s > failures:
  966. 42.59 s >
  967. 42.59 s > failures:
  968. 42.59 s > tests::python_member_fragments_have_scroll_and_target_styles
  969. 42.59 s >
  970. 42.59 s > test result: FAILED. 0 passed; 1 failed; 0 ignored; 0 measured; 101 filtered out; finished in 0.01s
  971. 42.59 s >
  972. 42.59 s > stderr ---
  973. 42.59 s >
  974. 42.59 s > thread 'tests::python_member_fragments_have_scroll_and_target_styles' (338) panicked at crates/alphal00p-docs-builder/src/lib.rs:11048:47:
  975. 42.59 s > called `Result::unwrap()` on an `Err` value: failed to read /build/source/docs/portal.toml
  976. 42.59 s >
  977. 42.59 s > Caused by:
  978. 42.59 s > No such file or directory (os error 2)
  979. 42.59 s >
  980. 42.59 s > Location:
  981. 42.59 s > crates/alphal00p-docs-builder/src/lib.rs:582:14
  982. 42.59 s > stack backtrace:
  983. 42.59 s > 0: __rustc::rust_begin_unwind
  984. 42.59 s > 1: core::panicking::panic_fmt
  985. 42.59 s > 2: core::result::unwrap_failed
  986. 42.59 s > 3: alphal00p_docs_builder::tests::python_member_fragments_have_scroll_and_target_styles
  987. 42.59 s > 4: <alphal00p_docs_builder::tests::python_member_fragments_have_scroll_and_target_styles::{closure#0} as core::ops::function::FnOnce<()>>::call_once
  988. 42.59 s > note: Some details are omitted, run with `RUST_BACKTRACE=full` for a verbose backtrace.
  989. 42.59 s >
  990. 42.59 s > FAIL [ 0.020s] ( 72/102) alphal00p-docs-builder tests::python_sidebar_lists_only_the_current_module_and_marks_one_page
  991. 42.59 s > stdout ---
  992. 42.59 s >
  993. 42.59 s > running 1 test
  994. 42.59 s > test tests::python_sidebar_lists_only_the_current_module_and_marks_one_page ... FAILED
  995. 42.59 s >
  996. 42.59 s > failures:
  997. 42.59 s >
  998. 42.59 s > failures:
  999. 42.59 s > tests::python_sidebar_lists_only_the_current_module_and_marks_one_page
  1000. 42.59 s >
  1001. 42.59 s > test result: FAILED. 0 passed; 1 failed; 0 ignored; 0 measured; 101 filtered out; finished in 0.01s
  1002. 42.59 s >
  1003. 42.59 s > stderr ---
  1004. 42.59 s >
  1005. 42.59 s > thread 'tests::python_sidebar_lists_only_the_current_module_and_marks_one_page' (341) panicked at crates/alphal00p-docs-builder/src/lib.rs:9064:47:
  1006. 42.59 s > called `Result::unwrap()` on an `Err` value: failed to read /build/source/docs/portal.toml
  1007. 42.59 s >
  1008. 42.59 s > Caused by:
  1009. 42.59 s > No such file or directory (os error 2)
  1010. 42.59 s >
  1011. 42.59 s > Location:
  1012. 42.59 s > crates/alphal00p-docs-builder/src/lib.rs:582:14
  1013. 42.59 s > stack backtrace:
  1014. 42.59 s > 0: __rustc::rust_begin_unwind
  1015. 42.59 s > 1: core::panicking::panic_fmt
  1016. 42.59 s > 2: core::result::unwrap_failed
  1017. 42.59 s > 3: alphal00p_docs_builder::tests::python_sidebar_lists_only_the_current_module_and_marks_one_page
  1018. 42.59 s > 4: <alphal00p_docs_builder::tests::python_sidebar_lists_only_the_current_module_and_marks_one_page::{closure#0} as core::ops::function::FnOnce<()>>::call_once
  1019. 42.59 s > note: Some details are omitted, run with `RUST_BACKTRACE=full` for a verbose backtrace.
  1020. 42.59 s >
  1021. 42.59 s > FAIL [ 0.018s] ( 73/102) alphal00p-docs-builder tests::rendered_transitive_typst_headings_are_searchable
  1022. 42.59 s > stdout ---
  1023. 42.59 s >
  1024. 42.59 s > running 1 test
  1025. 42.59 s > test tests::rendered_transitive_typst_headings_are_searchable ... FAILED
  1026. 42.59 s >
  1027. 42.59 s > failures:
  1028. 42.59 s >
  1029. 42.59 s > failures:
  1030. 42.59 s > tests::rendered_transitive_typst_headings_are_searchable
  1031. 42.59 s >
  1032. 42.59 s > test result: FAILED. 0 passed; 1 failed; 0 ignored; 0 measured; 101 filtered out; finished in 0.01s
  1033. 42.59 s >
  1034. 42.59 s > stderr ---
  1035. 42.59 s >
  1036. 42.59 s > thread 'tests::rendered_transitive_typst_headings_are_searchable' (347) panicked at crates/alphal00p-docs-builder/src/lib.rs:10331:47:
  1037. 42.59 s > called `Result::unwrap()` on an `Err` value: failed to read /build/source/docs/portal.toml
  1038. 42.59 s >
  1039. 42.59 s > Caused by:
  1040. 42.59 s > No such file or directory (os error 2)
  1041. 42.59 s >
  1042. 42.59 s > Location:
  1043. 42.59 s > crates/alphal00p-docs-builder/src/lib.rs:582:14
  1044. 42.59 s > stack backtrace:
  1045. 42.59 s > 0: __rustc::rust_begin_unwind
  1046. 42.59 s > 1: core::panicking::panic_fmt
  1047. 42.59 s > 2: core::result::unwrap_failed
  1048. 42.59 s > 3: alphal00p_docs_builder::tests::rendered_transitive_typst_headings_are_searchable
  1049. 42.59 s > 4: <alphal00p_docs_builder::tests::rendered_transitive_typst_headings_are_searchable::{closure#0} as core::ops::function::FnOnce<()>>::call_once
  1050. 42.59 s > note: Some details are omitted, run with `RUST_BACKTRACE=full` for a verbose backtrace.
  1051. 42.59 s >
  1052. 42.59 s > FAIL [ 0.017s] ( 74/102) alphal00p-docs-builder tests::repository_source_links_are_checked_against_the_workspace
  1053. 42.59 s > stdout ---
  1054. 42.59 s >
  1055. 42.59 s > running 1 test
  1056. 42.59 s > test tests::repository_source_links_are_checked_against_the_workspace ... FAILED
  1057. 42.59 s >
  1058. 42.59 s > failures:
  1059. 42.59 s >
  1060. 42.59 s > failures:
  1061. 42.59 s > tests::repository_source_links_are_checked_against_the_workspace
  1062. 42.59 s >
  1063. 42.59 s > test result: FAILED. 0 passed; 1 failed; 0 ignored; 0 measured; 101 filtered out; finished in 0.00s
  1064. 42.59 s >
  1065. 42.59 s > stderr ---
  1066. 42.59 s >
  1067. 42.59 s > thread 'tests::repository_source_links_are_checked_against_the_workspace' (348) panicked at crates/alphal00p-docs-builder/src/lib.rs:10111:47:
  1068. 42.59 s > called `Result::unwrap()` on an `Err` value: failed to read /build/source/docs/portal.toml
  1069. 42.59 s >
  1070. 42.59 s > Caused by:
  1071. 42.59 s > No such file or directory (os error 2)
  1072. 42.59 s >
  1073. 42.59 s > Location:
  1074. 42.59 s > crates/alphal00p-docs-builder/src/lib.rs:582:14
  1075. 42.59 s > stack backtrace:
  1076. 42.59 s > 0: __rustc::rust_begin_unwind
  1077. 42.59 s > 1: core::panicking::panic_fmt
  1078. 42.59 s > 2: core::result::unwrap_failed
  1079. 42.59 s > 3: alphal00p_docs_builder::tests::repository_source_links_are_checked_against_the_workspace
  1080. 42.59 s > 4: <alphal00p_docs_builder::tests::repository_source_links_are_checked_against_the_workspace::{closure#0} as core::ops::function::FnOnce<()>>::call_once
  1081. 42.59 s > note: Some details are omitted, run with `RUST_BACKTRACE=full` for a verbose backtrace.
  1082. 42.59 s >
  1083. 42.59 s > FAIL [ 0.012s] ( 76/102) alphal00p-docs-builder tests::site_search_uses_body_text_and_de_ranks_non_current_developer_hits
  1084. 42.59 s > stdout ---
  1085. 42.59 s >
  1086. 42.59 s > running 1 test
  1087. 42.59 s > test tests::site_search_uses_body_text_and_de_ranks_non_current_developer_hits ... FAILED
  1088. 42.59 s >
  1089. 42.59 s > failures:
  1090. 42.59 s >
  1091. 42.59 s > failures:
  1092. 42.59 s > tests::site_search_uses_body_text_and_de_ranks_non_current_developer_hits
  1093. 42.59 s >
  1094. 42.59 s > test result: FAILED. 0 passed; 1 failed; 0 ignored; 0 measured; 101 filtered out; finished in 0.00s
  1095. 42.59 s >
  1096. 42.59 s > stderr ---
  1097. 42.59 s >
  1098. 42.59 s > thread 'tests::site_search_uses_body_text_and_de_ranks_non_current_developer_hits' (352) panicked at crates/alphal00p-docs-builder/src/lib.rs:10311:18:
  1099. 42.59 s > called `Result::unwrap()` on an `Err` value: failed to read /build/source/docs/portal.toml
  1100. 42.59 s >
  1101. 42.59 s > Caused by:
  1102. 42.59 s > No such file or directory (os error 2)
  1103. 42.59 s >
  1104. 42.59 s > Location:
  1105. 42.59 s > crates/alphal00p-docs-builder/src/lib.rs:582:14
  1106. 42.59 s > stack backtrace:
  1107. 42.59 s > 0: __rustc::rust_begin_unwind
  1108. 42.59 s > 1: core::panicking::panic_fmt
  1109. 42.59 s > 2: core::result::unwrap_failed
  1110. 42.59 s > 3: alphal00p_docs_builder::tests::site_search_uses_body_text_and_de_ranks_non_current_developer_hits
  1111. 42.59 s > 4: <alphal00p_docs_builder::tests::site_search_uses_body_text_and_de_ranks_non_current_developer_hits::{closure#0} as core::ops::function::FnOnce<()>>::call_once
  1112. 42.59 s > note: Some details are omitted, run with `RUST_BACKTRACE=full` for a verbose backtrace.
  1113. 42.59 s >
  1114. 42.59 s > FAIL [ 0.019s] ( 78/102) alphal00p-docs-builder tests::rustdoc_links_are_validated_only_when_rustdoc_is_included
  1115. 42.59 s > stdout ---
  1116. 42.59 s >
  1117. 42.59 s > running 1 test
  1118. 42.59 s > test tests::rustdoc_links_are_validated_only_when_rustdoc_is_included ... FAILED
  1119. 42.59 s >
  1120. 42.59 s > failures:
  1121. 42.59 s >
  1122. 42.59 s > failures:
  1123. 42.59 s > tests::rustdoc_links_are_validated_only_when_rustdoc_is_included
  1124. 42.59 s >
  1125. 42.59 s > test result: FAILED. 0 passed; 1 failed; 0 ignored; 0 measured; 101 filtered out; finished in 0.01s
  1126. 42.59 s >
  1127. 42.59 s > stderr ---
  1128. 42.59 s >
  1129. 42.59 s > thread 'tests::rustdoc_links_are_validated_only_when_rustdoc_is_included' (351) panicked at crates/alphal00p-docs-builder/src/lib.rs:9936:47:
  1130. 42.59 s > called `Result::unwrap()` on an `Err` value: failed to read /build/source/docs/portal.toml
  1131. 42.59 s >
  1132. 42.59 s > Caused by:
  1133. 42.59 s > No such file or directory (os error 2)
  1134. 42.59 s >
  1135. 42.59 s > Location:
  1136. 42.59 s > crates/alphal00p-docs-builder/src/lib.rs:582:14
  1137. 42.59 s > stack backtrace:
  1138. 42.59 s > 0: __rustc::rust_begin_unwind
  1139. 42.59 s > 1: core::panicking::panic_fmt
  1140. 42.59 s > 2: core::result::unwrap_failed
  1141. 42.59 s > 3: alphal00p_docs_builder::tests::rustdoc_links_are_validated_only_when_rustdoc_is_included
  1142. 42.59 s > 4: <alphal00p_docs_builder::tests::rustdoc_links_are_validated_only_when_rustdoc_is_included::{closure#0} as core::ops::function::FnOnce<()>>::call_once
  1143. 42.59 s > note: Some details are omitted, run with `RUST_BACKTRACE=full` for a verbose backtrace.
  1144. 42.59 s >
  1145. 42.59 s > FAIL [ 0.017s] ( 79/102) alphal00p-docs-builder tests::site_assets_replace_read_only_generated_files
  1146. 42.59 s > stdout ---
  1147. 42.59 s >
  1148. 42.59 s > running 1 test
  1149. 42.59 s > test tests::site_assets_replace_read_only_generated_files ... FAILED
  1150. 42.59 s >
  1151. 42.59 s > failures:
  1152. 42.59 s >
  1153. 42.59 s > failures:
  1154. 42.59 s > tests::site_assets_replace_read_only_generated_files
  1155. 42.59 s >
  1156. 42.59 s > test result: FAILED. 0 passed; 1 failed; 0 ignored; 0 measured; 101 filtered out; finished in 0.00s
  1157. 42.59 s >
  1158. 42.59 s > stderr ---
  1159. 42.59 s >
  1160. 42.59 s > thread 'tests::site_assets_replace_read_only_generated_files' (366) panicked at crates/alphal00p-docs-builder/src/lib.rs:11104:47:
  1161. 42.59 s > called `Result::unwrap()` on an `Err` value: failed to read /build/source/docs/portal.toml
  1162. 42.59 s >
  1163. 42.59 s > Caused by:
  1164. 42.59 s > No such file or directory (os error 2)
  1165. 42.59 s >
  1166. 42.59 s > Location:
  1167. 42.59 s > crates/alphal00p-docs-builder/src/lib.rs:582:14
  1168. 42.59 s > stack backtrace:
  1169. 42.59 s > 0: __rustc::rust_begin_unwind
  1170. 42.59 s > 1: core::panicking::panic_fmt
  1171. 42.59 s > 2: core::result::unwrap_failed
  1172. 42.59 s > 3: alphal00p_docs_builder::tests::site_assets_replace_read_only_generated_files
  1173. 42.59 s > 4: <alphal00p_docs_builder::tests::site_assets_replace_read_only_generated_files::{closure#0} as core::ops::function::FnOnce<()>>::call_once
  1174. 42.59 s > note: Some details are omitted, run with `RUST_BACKTRACE=full` for a verbose backtrace.
  1175. 42.59 s >
  1176. 42.59 s > FAIL [ 0.024s] ( 80/102) alphal00p-docs-builder tests::rustdoc_uses_the_derive_page_for_derive_macros
  1177. 42.59 s > stdout ---
  1178. 42.59 s >
  1179. 42.59 s > running 1 test
  1180. 42.59 s > test tests::rustdoc_uses_the_derive_page_for_derive_macros ... FAILED
  1181. 42.59 s >
  1182. 42.59 s > failures:
  1183. 42.59 s >
  1184. 42.59 s > failures:
  1185. 42.59 s > tests::rustdoc_uses_the_derive_page_for_derive_macros
  1186. 42.59 s >
  1187. 42.59 s > test result: FAILED. 0 passed; 1 failed; 0 ignored; 0 measured; 101 filtered out; finished in 0.01s
  1188. 42.59 s >
  1189. 42.59 s > stderr ---
  1190. 42.59 s >
  1191. 42.59 s > thread 'tests::rustdoc_uses_the_derive_page_for_derive_macros' (355) panicked at crates/alphal00p-docs-builder/src/lib.rs:9740:47:
  1192. 42.59 s > called `Result::unwrap()` on an `Err` value: failed to read /build/source/docs/portal.toml
  1193. 42.59 s >
  1194. 42.59 s > Caused by:
  1195. 42.59 s > No such file or directory (os error 2)
  1196. 42.59 s >
  1197. 42.59 s > Location:
  1198. 42.59 s > crates/alphal00p-docs-builder/src/lib.rs:582:14
  1199. 42.59 s > stack backtrace:
  1200. 42.59 s > 0: __rustc::rust_begin_unwind
  1201. 42.59 s > 1: core::panicking::panic_fmt
  1202. 42.59 s > 2: core::result::unwrap_failed
  1203. 42.59 s > 3: alphal00p_docs_builder::tests::rustdoc_uses_the_derive_page_for_derive_macros
  1204. 42.59 s > 4: <alphal00p_docs_builder::tests::rustdoc_uses_the_derive_page_for_derive_macros::{closure#0} as core::ops::function::FnOnce<()>>::call_once
  1205. 42.59 s > note: Some details are omitted, run with `RUST_BACKTRACE=full` for a verbose backtrace.
  1206. 42.59 s >
  1207. 42.59 s > FAIL [ 0.013s] ( 84/102) alphal00p-docs-builder tests::typst_module_symbol_anchors_are_qualified_without_qualifying_concepts
  1208. 42.59 s > stdout ---
  1209. 42.59 s >
  1210. 42.59 s > running 1 test
  1211. 42.59 s > test tests::typst_module_symbol_anchors_are_qualified_without_qualifying_concepts ... FAILED
  1212. 42.59 s >
  1213. 42.59 s > failures:
  1214. 42.59 s >
  1215. 42.59 s > failures:
  1216. 42.59 s > tests::typst_module_symbol_anchors_are_qualified_without_qualifying_concepts
  1217. 42.59 s >
  1218. 42.59 s > test result: FAILED. 0 passed; 1 failed; 0 ignored; 0 measured; 101 filtered out; finished in 0.00s
  1219. 42.59 s >
  1220. 42.59 s > stderr ---
  1221. 42.59 s >
  1222. 42.59 s > thread 'tests::typst_module_symbol_anchors_are_qualified_without_qualifying_concepts' (371) panicked at crates/alphal00p-docs-builder/src/lib.rs:10418:47:
  1223. 42.59 s > called `Result::unwrap()` on an `Err` value: failed to read /build/source/docs/portal.toml
  1224. 42.59 s >
  1225. 42.59 s > Caused by:
  1226. 42.59 s > No such file or directory (os error 2)
  1227. 42.59 s >
  1228. 42.59 s > Location:
  1229. 42.59 s > crates/alphal00p-docs-builder/src/lib.rs:582:14
  1230. 42.59 s > stack backtrace:
  1231. 42.59 s > 0: __rustc::rust_begin_unwind
  1232. 42.59 s > 1: core::panicking::panic_fmt
  1233. 42.59 s > 2: core::result::unwrap_failed
  1234. 42.59 s > 3: alphal00p_docs_builder::tests::typst_module_symbol_anchors_are_qualified_without_qualifying_concepts
  1235. 42.59 s > 4: <alphal00p_docs_builder::tests::typst_module_symbol_anchors_are_qualified_without_qualifying_concepts::{closure#0} as core::ops::function::FnOnce<()>>::call_once
  1236. 42.59 s > note: Some details are omitted, run with `RUST_BACKTRACE=full` for a verbose backtrace.
  1237. 42.59 s >
  1238. 42.59 s > FAIL [ 0.021s] ( 90/102) alphal00p-docs-builder tests::typst_reference_search_uses_qualified_symbols_without_parameter_noise
  1239. 42.59 s > stdout ---
  1240. 42.59 s >
  1241. 42.59 s > running 1 test
  1242. 42.59 s > test tests::typst_reference_search_uses_qualified_symbols_without_parameter_noise ... FAILED
  1243. 42.59 s >
  1244. 42.59 s > failures:
  1245. 42.59 s >
  1246. 42.59 s > failures:
  1247. 42.59 s > tests::typst_reference_search_uses_qualified_symbols_without_parameter_noise
  1248. 42.59 s >
  1249. 42.59 s > test result: FAILED. 0 passed; 1 failed; 0 ignored; 0 measured; 101 filtered out; finished in 0.00s
  1250. 42.59 s >
  1251. 42.59 s > stderr ---
  1252. 42.59 s >
  1253. 42.59 s > thread 'tests::typst_reference_search_uses_qualified_symbols_without_parameter_noise' (388) panicked at crates/alphal00p-docs-builder/src/lib.rs:10382:47:
  1254. 42.59 s > called `Result::unwrap()` on an `Err` value: failed to read /build/source/docs/portal.toml
  1255. 42.59 s >
  1256. 42.59 s > Caused by:
  1257. 42.59 s > No such file or directory (os error 2)
  1258. 42.59 s >
  1259. 42.59 s > Location:
  1260. 42.59 s > crates/alphal00p-docs-builder/src/lib.rs:582:14
  1261. 42.59 s > stack backtrace:
  1262. 42.59 s > 0: __rustc::rust_begin_unwind
  1263. 42.59 s > 1: core::panicking::panic_fmt
  1264. 42.59 s > 2: core::result::unwrap_failed
  1265. 42.59 s > 3: alphal00p_docs_builder::tests::typst_reference_search_uses_qualified_symbols_without_parameter_noise
  1266. 42.59 s > 4: <alphal00p_docs_builder::tests::typst_reference_search_uses_qualified_symbols_without_parameter_noise::{closure#0} as core::ops::function::FnOnce<()>>::call_once
  1267. 42.59 s > note: Some details are omitted, run with `RUST_BACKTRACE=full` for a verbose backtrace.
  1268. 42.59 s >
  1269. 42.59 s > error: test run failed
  1270. 42.59 s >
  1271. 42.59 s > ========== nextest test summary ==========
  1272. 42.59 s > report: target/nextest/ci_gammaloop/junit.xml
  1273. 42.59 s > tests: 102, failures: 46, errors: 0
  1274. 42.59 s >
  1275. 42.59 s > 1. alphal00p-docs-builder::tests::cli_settings_use_namespace_pages_and_canonical_fragments
  1276. 42.59 s > failure: test failure with exit code 101
  1277. 42.59 s > thread 'tests::cli_settings_use_namespace_pages_and_canonical_fragments' (160) panicked at crates/alphal00p-docs-builder/src/lib.rs:9356:47:
  1278. 42.59 s > called `Result::unwrap()` on an `Err` value: failed to read /build/source/docs/portal.toml
  1279. 42.59 s >
  1280. 42.59 s > Caused by:
  1281. 42.59 s > No such file or directory (os error 2)
  1282. 42.59 s >
  1283. 42.59 s > Location:
  1284. 42.59 s > crates/alphal00p-docs-builder/src/lib.rs:582:14
  1285. 42.59 s > stack backtrace:
  1286. 42.59 s > 0: __rustc::rust_begin_unwind
  1287. 42.59 s > 1: core::panicking::panic_fmt
  1288. 42.59 s > 2: core::result::unwrap_failed
  1289. 42.59 s > 3: alphal00p_docs_builder::tests::cli_settings_use_namespace_pages_and_canonical_fragments
  1290. 42.59 s > 4: <alphal00p_docs_builder::tests::cli_settings_use_namespace_pages_and_canonical_fragments::{closure#0} as core::ops::function::FnOnce<()>>::call_once
  1291. 42.59 s > note: Some details are omitted, run with `RUST_BACKTRACE=full` for a verbose backtrace.
  1292. 42.59 s > system-out
  1293. 42.59 s > running 1 test
  1294. 42.59 s > test tests::cli_settings_use_namespace_pages_and_canonical_fragments ... FAILED
  1295. 42.59 s >
  1296. 42.59 s > failures:
  1297. 42.59 s >
  1298. 42.59 s > failures:
  1299. 42.59 s > tests::cli_settings_use_namespace_pages_and_canonical_fragments
  1300. 42.59 s >
  1301. 42.59 s > test result: FAILED. 0 passed; 1 failed; 0 ignored; 0 measured; 101 filtered out; finished in 0.00s
  1302. 42.59 s > system-err
  1303. 42.59 s > thread 'tests::cli_settings_use_namespace_pages_and_canonical_fragments' (160) panicked at crates/alphal00p-docs-builder/src/lib.rs:9356:47:
  1304. 42.59 s > called `Result::unwrap()` on an `Err` value: failed to read /build/source/docs/portal.toml
  1305. 42.59 s >
  1306. 42.59 s > Caused by:
  1307. 42.59 s > No such file or directory (os error 2)
  1308. 42.59 s >
  1309. 42.59 s > Location:
  1310. 42.59 s > crates/alphal00p-docs-builder/src/lib.rs:582:14
  1311. 42.59 s > stack backtrace:
  1312. 42.59 s > 0: __rustc::rust_begin_unwind
  1313. 42.59 s > 1: core::panicking::panic_fmt
  1314. 42.59 s > 2: core::result::unwrap_failed
  1315. 42.59 s > 3: alphal00p_docs_builder::tests::cli_settings_use_namespace_pages_and_canonical_fragments
  1316. 42.59 s > 4: <alphal00p_docs_builder::tests::cli_settings_use_namespace_pages_and_canonical_fragments::{closure#0} as core::ops::function::FnOnce<()>>::call_once
  1317. 42.59 s > note: Some details are omitted, run with `RUST_BACKTRACE=full` for a verbose backtrace.
  1318. 42.59 s >
  1319. 42.59 s > 2. alphal00p-docs-builder::tests::cli_manpages_preserve_value_and_global_parser_facts
  1320. 42.59 s > failure: test failure with exit code 101
  1321. 42.59 s > thread 'tests::cli_manpages_preserve_value_and_global_parser_facts' (162) panicked at crates/alphal00p-docs-builder/src/lib.rs:9305:47:
  1322. 42.59 s > called `Result::unwrap()` on an `Err` value: failed to read /build/source/docs/portal.toml
  1323. 42.59 s >
  1324. 42.59 s > Caused by:
  1325. 42.59 s > No such file or directory (os error 2)
  1326. 42.59 s >
  1327. 42.59 s > Location:
  1328. 42.59 s > crates/alphal00p-docs-builder/src/lib.rs:582:14
  1329. 42.59 s > stack backtrace:
  1330. 42.59 s > 0: __rustc::rust_begin_unwind
  1331. 42.59 s > 1: core::panicking::panic_fmt
  1332. 42.59 s > 2: core::result::unwrap_failed
  1333. 42.59 s > 3: alphal00p_docs_builder::tests::cli_manpages_preserve_value_and_global_parser_facts
  1334. 42.59 s > 4: <alphal00p_docs_builder::tests::cli_manpages_preserve_value_and_global_parser_facts::{closure#0} as core::ops::function::FnOnce<()>>::call_once
  1335. 42.59 s > note: Some details are omitted, run with `RUST_BACKTRACE=full` for a verbose backtrace.
  1336. 42.59 s > system-out
  1337. 42.59 s > running 1 test
  1338. 42.59 s > test tests::cli_manpages_preserve_value_and_global_parser_facts ... FAILED
  1339. 42.59 s >
  1340. 42.59 s > failures:
  1341. 42.59 s >
  1342. 42.59 s > failures:
  1343. 42.59 s > tests::cli_manpages_preserve_value_and_global_parser_facts
  1344. 42.59 s >
  1345. 42.59 s > test result: FAILED. 0 passed; 1 failed; 0 ignored; 0 measured; 101 filtered out; finished in 0.01s
  1346. 42.59 s > system-err
  1347. 42.59 s > thread 'tests::cli_manpages_preserve_value_and_global_parser_facts' (162) panicked at crates/alphal00p-docs-builder/src/lib.rs:9305:47:
  1348. 42.59 s > called `Result::unwrap()` on an `Err` value: failed to read /build/source/docs/portal.toml
  1349. 42.59 s >
  1350. 42.59 s > Caused by:
  1351. 42.59 s > No such file or directory (os error 2)
  1352. 42.59 s >
  1353. 42.59 s > Location:
  1354. 42.59 s > crates/alphal00p-docs-builder/src/lib.rs:582:14
  1355. 42.59 s > stack backtrace:
  1356. 42.59 s > 0: __rustc::rust_begin_unwind
  1357. 42.59 s > 1: core::panicking::panic_fmt
  1358. 42.59 s > 2: core::result::unwrap_failed
  1359. 42.59 s > 3: alphal00p_docs_builder::tests::cli_manpages_preserve_value_and_global_parser_facts
  1360. 42.59 s > 4: <alphal00p_docs_builder::tests::cli_manpages_preserve_value_and_global_parser_facts::{closure#0} as core::ops::function::FnOnce<()>>::call_once
  1361. 42.59 s > note: Some details are omitted, run with `RUST_BACKTRACE=full` for a verbose backtrace.
  1362. 42.59 s >
  1363. 42.59 s > 3. alphal00p-docs-builder::tests::checked_in_registry_is_valid
  1364. 42.59 s > failure: test failure with exit code 101
  1365. 42.59 s > thread 'tests::checked_in_registry_is_valid' (176) panicked at crates/alphal00p-docs-builder/src/lib.rs:11099:33:
  1366. 42.59 s > called `Result::unwrap()` on an `Err` value: failed to read /build/source/docs/portal.toml
  1367. 42.59 s >
  1368. 42.59 s > Caused by:
  1369. 42.59 s > No such file or directory (os error 2)
  1370. 42.59 s >
  1371. 42.59 s > Location:
  1372. 42.59 s > crates/alphal00p-docs-builder/src/lib.rs:582:14
  1373. 42.59 s > stack backtrace:
  1374. 42.59 s > 0: __rustc::rust_begin_unwind
  1375. 42.59 s > 1: core::panicking::panic_fmt
  1376. 42.59 s > 2: core::result::unwrap_failed
  1377. 42.59 s > 3: alphal00p_docs_builder::tests::checked_in_registry_is_valid
  1378. 42.59 s > 4: <alphal00p_docs_builder::tests::checked_in_registry_is_valid::{closure#0} as core::ops::function::FnOnce<()>>::call_once
  1379. 42.59 s > note: Some details are omitted, run with `RUST_BACKTRACE=full` for a verbose backtrace.
  1380. 42.59 s > system-out
  1381. 42.59 s > running 1 test
  1382. 42.59 s > test tests::checked_in_registry_is_valid ... FAILED
  1383. 42.59 s >
  1384. 42.59 s > failures:
  1385. 42.59 s >
  1386. 42.59 s > failures:
  1387. 42.59 s > tests::checked_in_registry_is_valid
  1388. 42.59 s >
  1389. 42.59 s > test result: FAILED. 0 passed; 1 failed; 0 ignored; 0 measured; 101 filtered out; finished in 0.01s
  1390. 42.59 s > system-err
  1391. 42.59 s > thread 'tests::checked_in_registry_is_valid' (176) panicked at crates/alphal00p-docs-builder/src/lib.rs:11099:33:
  1392. 42.59 s > called `Result::unwrap()` on an `Err` value: failed to read /build/source/docs/portal.toml
  1393. 42.59 s >
  1394. 42.59 s > Caused by:
  1395. 42.59 s > No such file or directory (os error 2)
  1396. 42.59 s >
  1397. 42.59 s > Location:
  1398. 42.59 s > crates/alphal00p-docs-builder/src/lib.rs:582:14
  1399. 42.59 s > stack backtrace:
  1400. 42.59 s > 0: __rustc::rust_begin_unwind
  1401. 42.59 s > 1: core::panicking::panic_fmt
  1402. 42.59 s > 2: core::result::unwrap_failed
  1403. 42.59 s > 3: alphal00p_docs_builder::tests::checked_in_registry_is_valid
  1404. 42.59 s > 4: <alphal00p_docs_builder::tests::checked_in_registry_is_valid::{closure#0} as core::ops::function::FnOnce<()>>::call_once
  1405. 42.59 s > note: Some details are omitted, run with `RUST_BACKTRACE=full` for a verbose backtrace.
  1406. 42.59 s >
  1407. 42.59 s > 4. alphal00p-docs-builder::tests::complex_reference_pages_keep_an_inline_outline_below_the_right_rail
  1408. 42.59 s > failure: test failure with exit code 101
  1409. 42.59 s > thread 'tests::complex_reference_pages_keep_an_inline_outline_below_the_right_rail' (218) panicked at crates/alphal00p-docs-builder/src/lib.rs:11898:47:
  1410. 42.59 s > called `Result::unwrap()` on an `Err` value: failed to read /build/source/docs/portal.toml
  1411. 42.59 s >
  1412. 42.59 s > Caused by:
  1413. 42.59 s > No such file or directory (os error 2)
  1414. 42.59 s >
  1415. 42.59 s > Location:
  1416. 42.59 s > crates/alphal00p-docs-builder/src/lib.rs:582:14
  1417. 42.59 s > stack backtrace:
  1418. 42.59 s > 0: __rustc::rust_begin_unwind
  1419. 42.59 s > 1: core::panicking::panic_fmt
  1420. 42.59 s > 2: core::result::unwrap_failed
  1421. 42.59 s > 3: alphal00p_docs_builder::tests::complex_reference_pages_keep_an_inline_outline_below_the_right_rail
  1422. 42.59 s > 4: <alphal00p_docs_builder::tests::complex_reference_pages_keep_an_inline_outline_below_the_right_rail::{closure#0} as core::ops::function::FnOnce<()>>::call_once
  1423. 42.59 s > note: Some details are omitted, run with `RUST_BACKTRACE=full` for a verbose backtrace.
  1424. 42.59 s > system-out
  1425. 42.59 s > running 1 test
  1426. 42.59 s > test tests::complex_reference_pages_keep_an_inline_outline_below_the_right_rail ... FAILED
  1427. 42.59 s >
  1428. 42.59 s > failures:
  1429. 42.59 s >
  1430. 42.59 s > failures:
  1431. 42.59 s > tests::complex_reference_pages_keep_an_inline_outline_below_the_right_rail
  1432. 42.59 s >
  1433. 42.59 s > test result: FAILED. 0 passed; 1 failed; 0 ignored; 0 measured; 101 filtered out; finished in 0.00s
  1434. 42.59 s > system-err
  1435. 42.59 s > thread 'tests::complex_reference_pages_keep_an_inline_outline_below_the_right_rail' (218) panicked at crates/alphal00p-docs-builder/src/lib.rs:11898:47:
  1436. 42.59 s > called `Result::unwrap()` on an `Err` value: failed to read /build/source/docs/portal.toml
  1437. 42.59 s >
  1438. 42.59 s > Caused by:
  1439. 42.59 s > No such file or directory (os error 2)
  1440. 42.59 s >
  1441. 42.59 s > Location:
  1442. 42.59 s > crates/alphal00p-docs-builder/src/lib.rs:582:14
  1443. 42.59 s > stack backtrace:
  1444. 42.59 s > 0: __rustc::rust_begin_unwind
  1445. 42.59 s > 1: core::panicking::panic_fmt
  1446. 42.59 s > 2: core::result::unwrap_failed
  1447. 42.59 s > 3: alphal00p_docs_builder::tests::complex_reference_pages_keep_an_inline_outline_below_the_right_rail
  1448. 42.59 s > 4: <alphal00p_docs_builder::tests::complex_reference_pages_keep_an_inline_outline_below_the_right_rail::{closure#0} as core::ops::function::FnOnce<()>>::call_once
  1449. 42.59 s > note: Some details are omitted, run with `RUST_BACKTRACE=full` for a verbose backtrace.
  1450. 42.59 s >
  1451. 42.59 s > 5. alphal00p-docs-builder::tests::current_developer_notes_require_a_verified_code_scope
  1452. 42.59 s > failure: test failure with exit code 101
  1453. 42.59 s > thread 'tests::current_developer_notes_require_a_verified_code_scope' (219) panicked at crates/alphal00p-docs-builder/src/lib.rs:11131:51:
  1454. 42.59 s > called `Result::unwrap()` on an `Err` value: failed to read /build/source/docs/portal.toml
  1455. 42.59 s >
  1456. 42.59 s > Caused by:
  1457. 42.59 s > No such file or directory (os error 2)
  1458. 42.59 s >
  1459. 42.59 s > Location:
  1460. 42.59 s > crates/alphal00p-docs-builder/src/lib.rs:582:14
  1461. 42.59 s > stack backtrace:
  1462. 42.59 s > 0: __rustc::rust_begin_unwind
  1463. 42.59 s > 1: core::panicking::panic_fmt
  1464. 42.59 s > 2: core::result::unwrap_failed
  1465. 42.59 s > 3: alphal00p_docs_builder::tests::current_developer_notes_require_a_verified_code_scope
  1466. 42.59 s > 4: <alphal00p_docs_builder::tests::current_developer_notes_require_a_verified_code_scope::{closure#0} as core::ops::function::FnOnce<()>>::call_once
  1467. 42.59 s > note: Some details are omitted, run with `RUST_BACKTRACE=full` for a verbose backtrace.
  1468. 42.59 s > system-out
  1469. 42.59 s > running 1 test
  1470. 42.59 s > test tests::current_developer_notes_require_a_verified_code_scope ... FAILED
  1471. 42.59 s >
  1472. 42.59 s > failures:
  1473. 42.59 s >
  1474. 42.59 s > failures:
  1475. 42.59 s > tests::current_developer_notes_require_a_verified_code_scope
  1476. 42.59 s >
  1477. 42.59 s > test result: FAILED. 0 passed; 1 failed; 0 ignored; 0 measured; 101 filtered out; finished in 0.01s
  1478. 42.59 s > system-err
  1479. 42.59 s > thread 'tests::current_developer_notes_require_a_verified_code_scope' (219) panicked at crates/alphal00p-docs-builder/src/lib.rs:11131:51:
  1480. 42.59 s > called `Result::unwrap()` on an `Err` value: failed to read /build/source/docs/portal.toml
  1481. 42.59 s >
  1482. 42.59 s > Caused by:
  1483. 42.59 s > No such file or directory (os error 2)
  1484. 42.59 s >
  1485. 42.59 s > Location:
  1486. 42.59 s > crates/alphal00p-docs-builder/src/lib.rs:582:14
  1487. 42.59 s > stack backtrace:
  1488. 42.59 s > 0: __rustc::rust_begin_unwind
  1489. 42.59 s > 1: core::panicking::panic_fmt
  1490. 42.59 s > 2: core::result::unwrap_failed
  1491. 42.59 s > 3: alphal00p_docs_builder::tests::current_developer_notes_require_a_verified_code_scope
  1492. 42.59 s > 4: <alphal00p_docs_builder::tests::current_developer_notes_require_a_verified_code_scope::{closure#0} as core::ops::function::FnOnce<()>>::call_once
  1493. 42.59 s > note: Some details are omitted, run with `RUST_BACKTRACE=full` for a verbose backtrace.
  1494. 42.59 s >
  1495. 42.59 s > 6. alphal00p-docs-builder::tests::cli_reference_index_and_manpages_preserve_parser_semantics
  1496. 42.59 s > failure: test failure with exit code 101
  1497. 42.59 s > thread 'tests::cli_reference_index_and_manpages_preserve_parser_semantics' (217) panicked at crates/alphal00p-docs-builder/src/lib.rs:9229:47:
  1498. 42.59 s > called `Result::unwrap()` on an `Err` value: failed to read /build/source/docs/portal.toml
  1499. 42.59 s >
  1500. 42.59 s > Caused by:
  1501. 42.59 s > No such file or directory (os error 2)
  1502. 42.59 s >
  1503. 42.59 s > Location:
  1504. 42.59 s > crates/alphal00p-docs-builder/src/lib.rs:582:14
  1505. 42.59 s > stack backtrace:
  1506. 42.59 s > 0: __rustc::rust_begin_unwind
  1507. 42.59 s > 1: core::panicking::panic_fmt
  1508. 42.59 s > 2: core::result::unwrap_failed
  1509. 42.59 s > 3: alphal00p_docs_builder::tests::cli_reference_index_and_manpages_preserve_parser_semantics
  1510. 42.59 s > 4: <alphal00p_docs_builder::tests::cli_reference_index_and_manpages_preserve_parser_semantics::{closure#0} as core::ops::function::FnOnce<()>>::call_once
  1511. 42.59 s > note: Some details are omitted, run with `RUST_BACKTRACE=full` for a verbose backtrace.
  1512. 42.59 s > system-out
  1513. 42.59 s > running 1 test
  1514. 42.59 s > test tests::cli_reference_index_and_manpages_preserve_parser_semantics ... FAILED
  1515. 42.59 s >
  1516. 42.59 s > failures:
  1517. 42.59 s >
  1518. 42.59 s > failures:
  1519. 42.59 s > tests::cli_reference_index_and_manpages_preserve_parser_semantics
  1520. 42.59 s >
  1521. 42.59 s > test result: FAILED. 0 passed; 1 failed; 0 ignored; 0 measured; 101 filtered out; finished in 0.01s
  1522. 42.59 s > system-err
  1523. 42.59 s > thread 'tests::cli_reference_index_and_manpages_preserve_parser_semantics' (217) panicked at crates/alphal00p-docs-builder/src/lib.rs:9229:47:
  1524. 42.59 s > called `Result::unwrap()` on an `Err` value: failed to read /build/source/docs/portal.toml
  1525. 42.59 s >
  1526. 42.59 s > Caused by:
  1527. 42.59 s > No such file or directory (os error 2)
  1528. 42.59 s >
  1529. 42.59 s > Location:
  1530. 42.59 s > crates/alphal00p-docs-builder/src/lib.rs:582:14
  1531. 42.59 s > stack backtrace:
  1532. 42.59 s > 0: __rustc::rust_begin_unwind
  1533. 42.59 s > 1: core::panicking::panic_fmt
  1534. 42.59 s > 2: core::result::unwrap_failed
  1535. 42.59 s > 3: alphal00p_docs_builder::tests::cli_reference_index_and_manpages_preserve_parser_semantics
  1536. 42.59 s > 4: <alphal00p_docs_builder::tests::cli_reference_index_and_manpages_preserve_parser_semantics::{closure#0} as core::ops::function::FnOnce<()>>::call_once
  1537. 42.59 s > note: Some details are omitted, run with `RUST_BACKTRACE=full` for a verbose backtrace.
  1538. 42.59 s >
  1539. 42.59 s > 7. alphal00p-docs-builder::tests::developer_architecture_is_classified_searchable_and_source_backed
  1540. 42.59 s > failure: test failure with exit code 101
  1541. 42.59 s > thread 'tests::developer_architecture_is_classified_searchable_and_source_backed' (243) panicked at crates/alphal00p-docs-builder/src/lib.rs:11615:47:
  1542. 42.59 s > called `Result::unwrap()` on an `Err` value: failed to read /build/source/docs/portal.toml
  1543. 42.59 s >
  1544. 42.59 s > Caused by:
  1545. 42.59 s > No such file or directory (os error 2)
  1546. 42.59 s >
  1547. 42.59 s > Location:
  1548. 42.59 s > crates/alphal00p-docs-builder/src/lib.rs:582:14
  1549. 42.59 s > stack backtrace:
  1550. 42.59 s > 0: __rustc::rust_begin_unwind
  1551. 42.59 s > 1: core::panicking::panic_fmt
  1552. 42.59 s > 2: core::result::unwrap_failed
  1553. 42.59 s > 3: alphal00p_docs_builder::tests::developer_architecture_is_classified_searchable_and_source_backed
  1554. 42.59 s > 4: <alphal00p_docs_builder::tests::developer_architecture_is_classified_searchable_and_source_backed::{closure#0} as core::ops::function::FnOnce<()>>::call_once
  1555. 42.59 s > note: Some details are omitted, run with `RUST_BACKTRACE=full` for a verbose backtrace.
  1556. 42.59 s > system-out
  1557. 42.59 s > running 1 test
  1558. 42.59 s > test tests::developer_architecture_is_classified_searchable_and_source_backed ... FAILED
  1559. 42.59 s >
  1560. 42.59 s > failures:
  1561. 42.59 s >
  1562. 42.59 s > failures:
  1563. 42.59 s > tests::developer_architecture_is_classified_searchable_and_source_backed
  1564. 42.59 s >
  1565. 42.59 s > test result: FAILED. 0 passed; 1 failed; 0 ignored; 0 measured; 101 filtered out; finished in 0.00s
  1566. 42.59 s > system-err
  1567. 42.59 s > thread 'tests::developer_architecture_is_classified_searchable_and_source_backed' (243) panicked at crates/alphal00p-docs-builder/src/lib.rs:11615:47:
  1568. 42.59 s > called `Result::unwrap()` on an `Err` value: failed to read /build/source/docs/portal.toml
  1569. 42.59 s >
  1570. 42.59 s > Caused by:
  1571. 42.59 s > No such file or directory (os error 2)
  1572. 42.59 s >
  1573. 42.59 s > Location:
  1574. 42.59 s > crates/alphal00p-docs-builder/src/lib.rs:582:14
  1575. 42.59 s > stack backtrace:
  1576. 42.59 s > 0: __rustc::rust_begin_unwind
  1577. 42.59 s > 1: core::panicking::panic_fmt
  1578. 42.59 s > 2: core::result::unwrap_failed
  1579. 42.59 s > 3: alphal00p_docs_builder::tests::developer_architecture_is_classified_searchable_and_source_backed
  1580. 42.59 s > 4: <alphal00p_docs_builder::tests::developer_architecture_is_classified_searchable_and_source_backed::{closure#0} as core::ops::function::FnOnce<()>>::call_once
  1581. 42.59 s > note: Some details are omitted, run with `RUST_BACKTRACE=full` for a verbose backtrace.
  1582. 42.59 s >
  1583. 42.59 s > 8. alphal00p-docs-builder::tests::every_product_orients_rust_to_native_rustdoc_and_keeps_legacy_redirects
  1584. 42.59 s > failure: test failure with exit code 101
  1585. 42.59 s > thread 'tests::every_product_orients_rust_to_native_rustdoc_and_keeps_legacy_redirects' (258) panicked at crates/alphal00p-docs-builder/src/lib.rs:11445:47:
  1586. 42.59 s > called `Result::unwrap()` on an `Err` value: failed to read /build/source/docs/portal.toml
  1587. 42.59 s >
  1588. 42.59 s > Caused by:
  1589. 42.59 s > No such file or directory (os error 2)
  1590. 42.59 s >
  1591. 42.59 s > Location:
  1592. 42.59 s > crates/alphal00p-docs-builder/src/lib.rs:582:14
  1593. 42.59 s > stack backtrace:
  1594. 42.59 s > 0: __rustc::rust_begin_unwind
  1595. 42.59 s > 1: core::panicking::panic_fmt
  1596. 42.59 s > 2: core::result::unwrap_failed
  1597. 42.59 s > 3: alphal00p_docs_builder::tests::every_product_orients_rust_to_native_rustdoc_and_keeps_legacy_redirects
  1598. 42.59 s > 4: <alphal00p_docs_builder::tests::every_product_orients_rust_to_native_rustdoc_and_keeps_legacy_redirects::{closure#0} as core::ops::function::FnOnce<()>>::call_once
  1599. 42.59 s > note: Some details are omitted, run with `RUST_BACKTRACE=full` for a verbose backtrace.
  1600. 42.59 s > system-out
  1601. 42.59 s > running 1 test
  1602. 42.59 s > test tests::every_product_orients_rust_to_native_rustdoc_and_keeps_legacy_redirects ... FAILED
  1603. 42.59 s >
  1604. 42.59 s > failures:
  1605. 42.59 s >
  1606. 42.59 s > failures:
  1607. 42.59 s > tests::every_product_orients_rust_to_native_rustdoc_and_keeps_legacy_redirects
  1608. 42.59 s >
  1609. 42.59 s > test result: FAILED. 0 passed; 1 failed; 0 ignored; 0 measured; 101 filtered out; finished in 0.00s
  1610. 42.59 s > system-err
  1611. 42.59 s > thread 'tests::every_product_orients_rust_to_native_rustdoc_and_keeps_legacy_redirects' (258) panicked at crates/alphal00p-docs-builder/src/lib.rs:11445:47:
  1612. 42.59 s > called `Result::unwrap()` on an `Err` value: failed to read /build/source/docs/portal.toml
  1613. 42.59 s >
  1614. 42.59 s > Caused by:
  1615. 42.59 s > No such file or directory (os error 2)
  1616. 42.59 s >
  1617. 42.59 s > Location:
  1618. 42.59 s > crates/alphal00p-docs-builder/src/lib.rs:582:14
  1619. 42.59 s > stack backtrace:
  1620. 42.59 s > 0: __rustc::rust_begin_unwind
  1621. 42.59 s > 1: core::panicking::panic_fmt
  1622. 42.59 s > 2: core::result::unwrap_failed
  1623. 42.59 s > 3: alphal00p_docs_builder::tests::every_product_orients_rust_to_native_rustdoc_and_keeps_legacy_redirects
  1624. 42.59 s > 4: <alphal00p_docs_builder::tests::every_product_orients_rust_to_native_rustdoc_and_keeps_legacy_redirects::{closure#0} as core::ops::function::FnOnce<()>>::call_once
  1625. 42.59 s > note: Some details are omitted, run with `RUST_BACKTRACE=full` for a verbose backtrace.
  1626. 42.59 s >
  1627. 42.59 s > 9. alphal00p-docs-builder::tests::every_product_preview_entrypoint_validates_from_an_empty_output
  1628. 42.59 s > failure: test failure with exit code 101
  1629. 42.59 s > thread 'tests::every_product_preview_entrypoint_validates_from_an_empty_output' (260) panicked at crates/alphal00p-docs-builder/src/lib.rs:10563:47:
  1630. 42.59 s > called `Result::unwrap()` on an `Err` value: failed to read /build/source/docs/portal.toml
  1631. 42.59 s >
  1632. 42.59 s > Caused by:
  1633. 42.59 s > No such file or directory (os error 2)
  1634. 42.59 s >
  1635. 42.59 s > Location:
  1636. 42.59 s > crates/alphal00p-docs-builder/src/lib.rs:582:14
  1637. 42.59 s > stack backtrace:
  1638. 42.59 s > 0: __rustc::rust_begin_unwind
  1639. 42.59 s > 1: core::panicking::panic_fmt
  1640. 42.59 s > 2: core::result::unwrap_failed
  1641. 42.59 s > 3: alphal00p_docs_builder::tests::every_product_preview_entrypoint_validates_from_an_empty_output
  1642. 42.59 s > 4: <alphal00p_docs_builder::tests::every_product_preview_entrypoint_validates_from_an_empty_output::{closure#0} as core::ops::function::FnOnce<()>>::call_once
  1643. 42.59 s > note: Some details are omitted, run with `RUST_BACKTRACE=full` for a verbose backtrace.
  1644. 42.59 s > system-out
  1645. 42.59 s > running 1 test
  1646. 42.59 s > test tests::every_product_preview_entrypoint_validates_from_an_empty_output ... FAILED
  1647. 42.59 s >
  1648. 42.59 s > failures:
  1649. 42.59 s >
  1650. 42.59 s > failures:
  1651. 42.59 s > tests::every_product_preview_entrypoint_validates_from_an_empty_output
  1652. 42.59 s >
  1653. 42.59 s > test result: FAILED. 0 passed; 1 failed; 0 ignored; 0 measured; 101 filtered out; finished in 0.00s
  1654. 42.60 s > system-err
  1655. 42.60 s > thread 'tests::every_product_preview_entrypoint_validates_from_an_empty_output' (260) panicked at crates/alphal00p-docs-builder/src/lib.rs:10563:47:
  1656. 42.60 s > called `Result::unwrap()` on an `Err` value: failed to read /build/source/docs/portal.toml
  1657. 42.60 s >
  1658. 42.60 s > Caused by:
  1659. 42.60 s > No such file or directory (os error 2)
  1660. 42.60 s >
  1661. 42.60 s > Location:
  1662. 42.60 s > crates/alphal00p-docs-builder/src/lib.rs:582:14
  1663. 42.60 s > stack backtrace:
  1664. 42.60 s > 0: __rustc::rust_begin_unwind
  1665. 42.60 s > 1: core::panicking::panic_fmt
  1666. 42.60 s > 2: core::result::unwrap_failed
  1667. 42.60 s > 3: alphal00p_docs_builder::tests::every_product_preview_entrypoint_validates_from_an_empty_output
  1668. 42.60 s > 4: <alphal00p_docs_builder::tests::every_product_preview_entrypoint_validates_from_an_empty_output::{closure#0} as core::ops::function::FnOnce<()>>::call_once
  1669. 42.60 s > note: Some details are omitted, run with `RUST_BACKTRACE=full` for a verbose backtrace.
  1670. 42.60 s >
  1671. 42.60 s > 10. alphal00p-docs-builder::tests::federated_search_covers_every_product_and_developer_notes
  1672. 42.60 s > failure: test failure with exit code 101
  1673. 42.60 s > thread 'tests::federated_search_covers_every_product_and_developer_notes' (257) panicked at crates/alphal00p-docs-builder/src/lib.rs:11713:47:
  1674. 42.60 s > called `Result::unwrap()` on an `Err` value: failed to read /build/source/docs/portal.toml
  1675. 42.60 s >
  1676. 42.60 s > Caused by:
  1677. 42.60 s > No such file or directory (os error 2)
  1678. 42.60 s >
  1679. 42.60 s > Location:
  1680. 42.60 s > crates/alphal00p-docs-builder/src/lib.rs:582:14
  1681. 42.60 s > stack backtrace:
  1682. 42.60 s > 0: __rustc::rust_begin_unwind
  1683. 42.60 s > 1: core::panicking::panic_fmt
  1684. 42.60 s > 2: core::result::unwrap_failed
  1685. 42.60 s > 3: alphal00p_docs_builder::tests::federated_search_covers_every_product_and_developer_notes
  1686. 42.60 s > 4: <alphal00p_docs_builder::tests::federated_search_covers_every_product_and_developer_notes::{closure#0} as core::ops::function::FnOnce<()>>::call_once
  1687. 42.60 s > note: Some details are omitted, run with `RUST_BACKTRACE=full` for a verbose backtrace.
  1688. 42.60 s > system-out
  1689. 42.60 s > running 1 test
  1690. 42.60 s > test tests::federated_search_covers_every_product_and_developer_notes ... FAILED
  1691. 42.60 s >
  1692. 42.60 s > failures:
  1693. 42.60 s >
  1694. 42.60 s > failures:
  1695. 42.60 s > tests::federated_search_covers_every_product_and_developer_notes
  1696. 42.60 s >
  1697. 42.60 s > test result: FAILED. 0 passed; 1 failed; 0 ignored; 0 measured; 101 filtered out; finished in 0.01s
  1698. 42.60 s > system-err
  1699. 42.60 s > thread 'tests::federated_search_covers_every_product_and_developer_notes' (257) panicked at crates/alphal00p-docs-builder/src/lib.rs:11713:47:
  1700. 42.60 s > called `Result::unwrap()` on an `Err` value: failed to read /build/source/docs/portal.toml
  1701. 42.60 s >
  1702. 42.60 s > Caused by:
  1703. 42.60 s > No such file or directory (os error 2)
  1704. 42.60 s >
  1705. 42.60 s > Location:
  1706. 42.60 s > crates/alphal00p-docs-builder/src/lib.rs:582:14
  1707. 42.60 s > stack backtrace:
  1708. 42.60 s > 0: __rustc::rust_begin_unwind
  1709. 42.60 s > 1: core::panicking::panic_fmt
  1710. 42.60 s > 2: core::result::unwrap_failed
  1711. 42.60 s > 3: alphal00p_docs_builder::tests::federated_search_covers_every_product_and_developer_notes
  1712. 42.60 s > 4: <alphal00p_docs_builder::tests::federated_search_covers_every_product_and_developer_notes::{closure#0} as core::ops::function::FnOnce<()>>::call_once
  1713. 42.60 s > note: Some details are omitted, run with `RUST_BACKTRACE=full` for a verbose backtrace.
  1714. 42.60 s >
  1715. 42.60 s > 11. alphal00p-docs-builder::tests::dense_reference_tocs_only_list_sections_and_omit_empty_pagination
  1716. 42.60 s > failure: test failure with exit code 101
  1717. 42.60 s > thread 'tests::dense_reference_tocs_only_list_sections_and_omit_empty_pagination' (250) panicked at crates/alphal00p-docs-builder/src/lib.rs:11843:47:
  1718. 42.60 s > called `Result::unwrap()` on an `Err` value: failed to read /build/source/docs/portal.toml
  1719. 42.60 s >
  1720. 42.60 s > Caused by:
  1721. 42.60 s > No such file or directory (os error 2)
  1722. 42.60 s >
  1723. 42.60 s > Location:
  1724. 42.60 s > crates/alphal00p-docs-builder/src/lib.rs:582:14
  1725. 42.60 s > stack backtrace:
  1726. 42.60 s > 0: __rustc::rust_begin_unwind
  1727. 42.60 s > 1: core::panicking::panic_fmt
  1728. 42.60 s > 2: core::result::unwrap_failed
  1729. 42.60 s > 3: alphal00p_docs_builder::tests::dense_reference_tocs_only_list_sections_and_omit_empty_pagination
  1730. 42.60 s > 4: <alphal00p_docs_builder::tests::dense_reference_tocs_only_list_sections_and_omit_empty_pagination::{closure#0} as core::ops::function::FnOnce<()>>::call_once
  1731. 42.60 s > note: Some details are omitted, run with `RUST_BACKTRACE=full` for a verbose backtrace.
  1732. 42.60 s > system-out
  1733. 42.60 s > running 1 test
  1734. 42.60 s > test tests::dense_reference_tocs_only_list_sections_and_omit_empty_pagination ... FAILED
  1735. 42.60 s >
  1736. 42.60 s > failures:
  1737. 42.60 s >
  1738. 42.60 s > failures:
  1739. 42.60 s > tests::dense_reference_tocs_only_list_sections_and_omit_empty_pagination
  1740. 42.60 s >
  1741. 42.60 s > test result: FAILED. 0 passed; 1 failed; 0 ignored; 0 measured; 101 filtered out; finished in 0.01s
  1742. 42.60 s > system-err
  1743. 42.60 s > thread 'tests::dense_reference_tocs_only_list_sections_and_omit_empty_pagination' (250) panicked at crates/alphal00p-docs-builder/src/lib.rs:11843:47:
  1744. 42.60 s > called `Result::unwrap()` on an `Err` value: failed to read /build/source/docs/portal.toml
  1745. 42.60 s >
  1746. 42.60 s > Caused by:
  1747. 42.60 s > No such file or directory (os error 2)
  1748. 42.60 s >
  1749. 42.60 s > Location:
  1750. 42.60 s > crates/alphal00p-docs-builder/src/lib.rs:582:14
  1751. 42.60 s > stack backtrace:
  1752. 42.60 s > 0: __rustc::rust_begin_unwind
  1753. 42.60 s > 1: core::panicking::panic_fmt
  1754. 42.60 s > 2: core::result::unwrap_failed
  1755. 42.60 s > 3: alphal00p_docs_builder::tests::dense_reference_tocs_only_list_sections_and_omit_empty_pagination
  1756. 42.60 s > 4: <alphal00p_docs_builder::tests::dense_reference_tocs_only_list_sections_and_omit_empty_pagination::{closure#0} as core::ops::function::FnOnce<()>>::call_once
  1757. 42.60 s > note: Some details are omitted, run with `RUST_BACKTRACE=full` for a verbose backtrace.
  1758. 42.60 s >
  1759. 42.60 s > 12. alphal00p-docs-builder::tests::every_registered_component_tag_family_matches_its_manifest_version
  1760. 42.60 s > failure: test failure with exit code 101
  1761. 42.60 s > thread 'tests::every_registered_component_tag_family_matches_its_manifest_version' (261) panicked at crates/alphal00p-docs-builder/src/lib.rs:9152:47:
  1762. 42.60 s > called `Result::unwrap()` on an `Err` value: failed to read /build/source/docs/portal.toml
  1763. 42.60 s >
  1764. 42.60 s > Caused by:
  1765. 42.60 s > No such file or directory (os error 2)
  1766. 42.60 s >
  1767. 42.60 s > Location:
  1768. 42.60 s > crates/alphal00p-docs-builder/src/lib.rs:582:14
  1769. 42.60 s > stack backtrace:
  1770. 42.60 s > 0: __rustc::rust_begin_unwind
  1771. 42.60 s > 1: core::panicking::panic_fmt
  1772. 42.60 s > 2: core::result::unwrap_failed
  1773. 42.60 s > 3: alphal00p_docs_builder::tests::every_registered_component_tag_family_matches_its_manifest_version
  1774. 42.60 s > 4: <alphal00p_docs_builder::tests::every_registered_component_tag_family_matches_its_manifest_version::{closure#0} as core::ops::function::FnOnce<()>>::call_once
  1775. 42.60 s > note: Some details are omitted, run with `RUST_BACKTRACE=full` for a verbose backtrace.
  1776. 42.60 s > system-out
  1777. 42.60 s > running 1 test
  1778. 42.60 s > test tests::every_registered_component_tag_family_matches_its_manifest_version ... FAILED
  1779. 42.60 s >
  1780. 42.60 s > failures:
  1781. 42.60 s >
  1782. 42.60 s > failures:
  1783. 42.60 s > tests::every_registered_component_tag_family_matches_its_manifest_version
  1784. 42.60 s >
  1785. 42.60 s > test result: FAILED. 0 passed; 1 failed; 0 ignored; 0 measured; 101 filtered out; finished in 0.00s
  1786. 42.60 s > system-err
  1787. 42.60 s > thread 'tests::every_registered_component_tag_family_matches_its_manifest_version' (261) panicked at crates/alphal00p-docs-builder/src/lib.rs:9152:47:
  1788. 42.60 s > called `Result::unwrap()` on an `Err` value: failed to read /build/source/docs/portal.toml
  1789. 42.60 s >
  1790. 42.60 s > Caused by:
  1791. 42.60 s > No such file or directory (os error 2)
  1792. 42.60 s >
  1793. 42.60 s > Location:
  1794. 42.60 s > crates/alphal00p-docs-builder/src/lib.rs:582:14
  1795. 42.60 s > stack backtrace:
  1796. 42.60 s > 0: __rustc::rust_begin_unwind
  1797. 42.60 s > 1: core::panicking::panic_fmt
  1798. 42.60 s > 2: core::result::unwrap_failed
  1799. 42.60 s > 3: alphal00p_docs_builder::tests::every_registered_component_tag_family_matches_its_manifest_version
  1800. 42.60 s > 4: <alphal00p_docs_builder::tests::every_registered_component_tag_family_matches_its_manifest_version::{closure#0} as core::ops::function::FnOnce<()>>::call_once
  1801. 42.60 s > note: Some details are omitted, run with `RUST_BACKTRACE=full` for a verbose backtrace.
  1802. 42.60 s >
  1803. 42.60 s > 13. alphal00p-docs-builder::tests::generated_link_validation_accepts_named_anchors
  1804. 42.60 s > failure: test failure with exit code 101
  1805. 42.60 s > thread 'tests::generated_link_validation_accepts_named_anchors' (264) panicked at crates/alphal00p-docs-builder/src/lib.rs:10036:47:
  1806. 42.60 s > called `Result::unwrap()` on an `Err` value: failed to read /build/source/docs/portal.toml
  1807. 42.60 s >
  1808. 42.60 s > Caused by:
  1809. 42.60 s > No such file or directory (os error 2)
  1810. 42.60 s >
  1811. 42.60 s > Location:
  1812. 42.60 s > crates/alphal00p-docs-builder/src/lib.rs:582:14
  1813. 42.60 s > stack backtrace:
  1814. 42.60 s > 0: __rustc::rust_begin_unwind
  1815. 42.60 s > 1: core::panicking::panic_fmt
  1816. 42.60 s > 2: core::result::unwrap_failed
  1817. 42.60 s > 3: alphal00p_docs_builder::tests::generated_link_validation_accepts_named_anchors
  1818. 42.60 s > 4: <alphal00p_docs_builder::tests::generated_link_validation_accepts_named_anchors::{closure#0} as core::ops::function::FnOnce<()>>::call_once
  1819. 42.60 s > note: Some details are omitted, run with `RUST_BACKTRACE=full` for a verbose backtrace.
  1820. 42.60 s > system-out
  1821. 42.60 s > running 1 test
  1822. 42.60 s > test tests::generated_link_validation_accepts_named_anchors ... FAILED
  1823. 42.60 s >
  1824. 42.60 s > failures:
  1825. 42.60 s >
  1826. 42.60 s > failures:
  1827. 42.60 s > tests::generated_link_validation_accepts_named_anchors
  1828. 42.60 s >
  1829. 42.60 s > test result: FAILED. 0 passed; 1 failed; 0 ignored; 0 measured; 101 filtered out; finished in 0.00s
  1830. 42.60 s > system-err
  1831. 42.60 s > thread 'tests::generated_link_validation_accepts_named_anchors' (264) panicked at crates/alphal00p-docs-builder/src/lib.rs:10036:47:
  1832. 42.60 s > called `Result::unwrap()` on an `Err` value: failed to read /build/source/docs/portal.toml
  1833. 42.60 s >
  1834. 42.60 s > Caused by:
  1835. 42.60 s > No such file or directory (os error 2)
  1836. 42.60 s >
  1837. 42.60 s > Location:
  1838. 42.60 s > crates/alphal00p-docs-builder/src/lib.rs:582:14
  1839. 42.60 s > stack backtrace:
  1840. 42.60 s > 0: __rustc::rust_begin_unwind
  1841. 42.60 s > 1: core::panicking::panic_fmt
  1842. 42.60 s > 2: core::result::unwrap_failed
  1843. 42.60 s > 3: alphal00p_docs_builder::tests::generated_link_validation_accepts_named_anchors
  1844. 42.60 s > 4: <alphal00p_docs_builder::tests::generated_link_validation_accepts_named_anchors::{closure#0} as core::ops::function::FnOnce<()>>::call_once
  1845. 42.60 s > note: Some details are omitted, run with `RUST_BACKTRACE=full` for a verbose backtrace.
  1846. 42.60 s >
  1847. 42.60 s > 14. alphal00p-docs-builder::tests::generated_links_cannot_escape_the_output_root
  1848. 42.60 s > failure: test failure with exit code 101
  1849. 42.60 s > thread 'tests::generated_links_cannot_escape_the_output_root' (267) panicked at crates/alphal00p-docs-builder/src/lib.rs:9917:47:
  1850. 42.60 s > called `Result::unwrap()` on an `Err` value: failed to read /build/source/docs/portal.toml
  1851. 42.60 s >
  1852. 42.60 s > Caused by:
  1853. 42.60 s > No such file or directory (os error 2)
  1854. 42.60 s >
  1855. 42.60 s > Location:
  1856. 42.60 s > crates/alphal00p-docs-builder/src/lib.rs:582:14
  1857. 42.60 s > stack backtrace:
  1858. 42.60 s > 0: __rustc::rust_begin_unwind
  1859. 42.60 s > 1: core::panicking::panic_fmt
  1860. 42.60 s > 2: core::result::unwrap_failed
  1861. 42.60 s > 3: alphal00p_docs_builder::tests::generated_links_cannot_escape_the_output_root
  1862. 42.60 s > 4: <alphal00p_docs_builder::tests::generated_links_cannot_escape_the_output_root::{closure#0} as core::ops::function::FnOnce<()>>::call_once
  1863. 42.60 s > note: Some details are omitted, run with `RUST_BACKTRACE=full` for a verbose backtrace.
  1864. 42.60 s > system-out
  1865. 42.60 s > running 1 test
  1866. 42.60 s > test tests::generated_links_cannot_escape_the_output_root ... FAILED
  1867. 42.60 s >
  1868. 42.60 s > failures:
  1869. 42.60 s >
  1870. 42.60 s > failures:
  1871. 42.60 s > tests::generated_links_cannot_escape_the_output_root
  1872. 42.60 s >
  1873. 42.60 s > test result: FAILED. 0 passed; 1 failed; 0 ignored; 0 measured; 101 filtered out; finished in 0.00s
  1874. 42.60 s > system-err
  1875. 42.60 s > thread 'tests::generated_links_cannot_escape_the_output_root' (267) panicked at crates/alphal00p-docs-builder/src/lib.rs:9917:47:
  1876. 42.60 s > called `Result::unwrap()` on an `Err` value: failed to read /build/source/docs/portal.toml
  1877. 42.60 s >
  1878. 42.60 s > Caused by:
  1879. 42.60 s > No such file or directory (os error 2)
  1880. 42.60 s >
  1881. 42.60 s > Location:
  1882. 42.60 s > crates/alphal00p-docs-builder/src/lib.rs:582:14
  1883. 42.60 s > stack backtrace:
  1884. 42.60 s > 0: __rustc::rust_begin_unwind
  1885. 42.60 s > 1: core::panicking::panic_fmt
  1886. 42.60 s > 2: core::result::unwrap_failed
  1887. 42.60 s > 3: alphal00p_docs_builder::tests::generated_links_cannot_escape_the_output_root
  1888. 42.60 s > 4: <alphal00p_docs_builder::tests::generated_links_cannot_escape_the_output_root::{closure#0} as core::ops::function::FnOnce<()>>::call_once
  1889. 42.60 s > note: Some details are omitted, run with `RUST_BACKTRACE=full` for a verbose backtrace.
  1890. 42.60 s >
  1891. 42.60 s > 15. alphal00p-docs-builder::tests::generated_link_validation_rejects_source_ranges_on_ordinary_pages
  1892. 42.60 s > failure: test failure with exit code 101
  1893. 42.60 s > thread 'tests::generated_link_validation_rejects_source_ranges_on_ordinary_pages' (268) panicked at crates/alphal00p-docs-builder/src/lib.rs:10056:47:
  1894. 42.60 s > called `Result::unwrap()` on an `Err` value: failed to read /build/source/docs/portal.toml
  1895. 42.60 s >
  1896. 42.60 s > Caused by:
  1897. 42.60 s > No such file or directory (os error 2)
  1898. 42.60 s >
  1899. 42.60 s > Location:
  1900. 42.60 s > crates/alphal00p-docs-builder/src/lib.rs:582:14
  1901. 42.60 s > stack backtrace:
  1902. 42.60 s > 0: __rustc::rust_begin_unwind
  1903. 42.60 s > 1: core::panicking::panic_fmt
  1904. 42.60 s > 2: core::result::unwrap_failed
  1905. 42.60 s > 3: alphal00p_docs_builder::tests::generated_link_validation_rejects_source_ranges_on_ordinary_pages
  1906. 42.60 s > 4: <alphal00p_docs_builder::tests::generated_link_validation_rejects_source_ranges_on_ordinary_pages::{closure#0} as core::ops::function::FnOnce<()>>::call_once
  1907. 42.60 s > note: Some details are omitted, run with `RUST_BACKTRACE=full` for a verbose backtrace.
  1908. 42.60 s > system-out
  1909. 42.60 s > running 1 test
  1910. 42.60 s > test tests::generated_link_validation_rejects_source_ranges_on_ordinary_pages ... FAILED
  1911. 42.60 s >
  1912. 42.60 s > failures:
  1913. 42.60 s >
  1914. 42.60 s > failures:
  1915. 42.60 s > tests::generated_link_validation_rejects_source_ranges_on_ordinary_pages
  1916. 42.60 s >
  1917. 42.60 s > test result: FAILED. 0 passed; 1 failed; 0 ignored; 0 measured; 101 filtered out; finished in 0.00s
  1918. 42.60 s > system-err
  1919. 42.60 s > thread 'tests::generated_link_validation_rejects_source_ranges_on_ordinary_pages' (268) panicked at crates/alphal00p-docs-builder/src/lib.rs:10056:47:
  1920. 42.60 s > called `Result::unwrap()` on an `Err` value: failed to read /build/source/docs/portal.toml
  1921. 42.60 s >
  1922. 42.60 s > Caused by:
  1923. 42.60 s > No such file or directory (os error 2)
  1924. 42.60 s >
  1925. 42.60 s > Location:
  1926. 42.60 s > crates/alphal00p-docs-builder/src/lib.rs:582:14
  1927. 42.60 s > stack backtrace:
  1928. 42.60 s > 0: __rustc::rust_begin_unwind
  1929. 42.60 s > 1: core::panicking::panic_fmt
  1930. 42.60 s > 2: core::result::unwrap_failed
  1931. 42.60 s > 3: alphal00p_docs_builder::tests::generated_link_validation_rejects_source_ranges_on_ordinary_pages
  1932. 42.60 s > 4: <alphal00p_docs_builder::tests::generated_link_validation_rejects_source_ranges_on_ordinary_pages::{closure#0} as core::ops::function::FnOnce<()>>::call_once
  1933. 42.60 s > note: Some details are omitted, run with `RUST_BACKTRACE=full` for a verbose backtrace.
  1934. 42.60 s >
  1935. 42.60 s > 16. alphal00p-docs-builder::tests::generated_link_validation_rejects_phantom_anchors
  1936. 42.60 s > failure: test failure with exit code 101
  1937. 42.60 s > thread 'tests::generated_link_validation_rejects_phantom_anchors' (275) panicked at crates/alphal00p-docs-builder/src/lib.rs:10015:47:
  1938. 42.60 s > called `Result::unwrap()` on an `Err` value: failed to read /build/source/docs/portal.toml
  1939. 42.60 s >
  1940. 42.60 s > Caused by:
  1941. 42.60 s > No such file or directory (os error 2)
  1942. 42.60 s >
  1943. 42.60 s > Location:
  1944. 42.60 s > crates/alphal00p-docs-builder/src/lib.rs:582:14
  1945. 42.60 s > stack backtrace:
  1946. 42.60 s > 0: __rustc::rust_begin_unwind
  1947. 42.60 s > 1: core::panicking::panic_fmt
  1948. 42.60 s > 2: core::result::unwrap_failed
  1949. 42.60 s > 3: alphal00p_docs_builder::tests::generated_link_validation_rejects_phantom_anchors
  1950. 42.60 s > 4: <alphal00p_docs_builder::tests::generated_link_validation_rejects_phantom_anchors::{closure#0} as core::ops::function::FnOnce<()>>::call_once
  1951. 42.60 s > note: Some details are omitted, run with `RUST_BACKTRACE=full` for a verbose backtrace.
  1952. 42.60 s > system-out
  1953. 42.60 s > running 1 test
  1954. 42.60 s > test tests::generated_link_validation_rejects_phantom_anchors ... FAILED
  1955. 42.60 s >
  1956. 42.60 s > failures:
  1957. 42.60 s >
  1958. 42.60 s > failures:
  1959. 42.60 s > tests::generated_link_validation_rejects_phantom_anchors
  1960. 42.60 s >
  1961. 42.60 s > test result: FAILED. 0 passed; 1 failed; 0 ignored; 0 measured; 101 filtered out; finished in 0.01s
  1962. 42.60 s > system-err
  1963. 42.60 s > thread 'tests::generated_link_validation_rejects_phantom_anchors' (275) panicked at crates/alphal00p-docs-builder/src/lib.rs:10015:47:
  1964. 42.60 s > called `Result::unwrap()` on an `Err` value: failed to read /build/source/docs/portal.toml
  1965. 42.60 s >
  1966. 42.60 s > Caused by:
  1967. 42.60 s > No such file or directory (os error 2)
  1968. 42.60 s >
  1969. 42.60 s > Location:
  1970. 42.60 s > crates/alphal00p-docs-builder/src/lib.rs:582:14
  1971. 42.60 s > stack backtrace:
  1972. 42.60 s > 0: __rustc::rust_begin_unwind
  1973. 42.60 s > 1: core::panicking::panic_fmt
  1974. 42.60 s > 2: core::result::unwrap_failed
  1975. 42.60 s > 3: alphal00p_docs_builder::tests::generated_link_validation_rejects_phantom_anchors
  1976. 42.60 s > 4: <alphal00p_docs_builder::tests::generated_link_validation_rejects_phantom_anchors::{closure#0} as core::ops::function::FnOnce<()>>::call_once
  1977. 42.60 s > note: Some details are omitted, run with `RUST_BACKTRACE=full` for a verbose backtrace.
  1978. 42.60 s >
  1979. 42.60 s > 17. alphal00p-docs-builder::tests::immutable_snapshot_navigation_does_not_link_mutable_developer_notes
  1980. 42.60 s > failure: test failure with exit code 101
  1981. 42.60 s > thread 'tests::immutable_snapshot_navigation_does_not_link_mutable_developer_notes' (280) panicked at crates/alphal00p-docs-builder/src/lib.rs:9041:47:
  1982. 42.60 s > called `Result::unwrap()` on an `Err` value: failed to read /build/source/docs/portal.toml
  1983. 42.60 s >
  1984. 42.60 s > Caused by:
  1985. 42.60 s > No such file or directory (os error 2)
  1986. 42.60 s >
  1987. 42.60 s > Location:
  1988. 42.60 s > crates/alphal00p-docs-builder/src/lib.rs:582:14
  1989. 42.60 s > stack backtrace:
  1990. 42.60 s > 0: __rustc::rust_begin_unwind
  1991. 42.60 s > 1: core::panicking::panic_fmt
  1992. 42.60 s > 2: core::result::unwrap_failed
  1993. 42.60 s > 3: alphal00p_docs_builder::tests::immutable_snapshot_navigation_does_not_link_mutable_developer_notes
  1994. 42.60 s > 4: <alphal00p_docs_builder::tests::immutable_snapshot_navigation_does_not_link_mutable_developer_notes::{closure#0} as core::ops::function::FnOnce<()>>::call_once
  1995. 42.60 s > note: Some details are omitted, run with `RUST_BACKTRACE=full` for a verbose backtrace.
  1996. 42.60 s > system-out
  1997. 42.60 s > running 1 test
  1998. 42.60 s > test tests::immutable_snapshot_navigation_does_not_link_mutable_developer_notes ... FAILED
  1999. 42.60 s >
  2000. 42.60 s > failures:
  2001. 42.60 s >
  2002. 42.60 s > failures:
  2003. 42.60 s > tests::immutable_snapshot_navigation_does_not_link_mutable_developer_notes
  2004. 42.60 s >
  2005. 42.60 s > test result: FAILED. 0 passed; 1 failed; 0 ignored; 0 measured; 101 filtered out; finished in 0.00s
  2006. 42.60 s > system-err
  2007. 42.60 s > thread 'tests::immutable_snapshot_navigation_does_not_link_mutable_developer_notes' (280) panicked at crates/alphal00p-docs-builder/src/lib.rs:9041:47:
  2008. 42.60 s > called `Result::unwrap()` on an `Err` value: failed to read /build/source/docs/portal.toml
  2009. 42.60 s >
  2010. 42.60 s > Caused by:
  2011. 42.60 s > No such file or directory (os error 2)
  2012. 42.60 s >
  2013. 42.60 s > Location:
  2014. 42.60 s > crates/alphal00p-docs-builder/src/lib.rs:582:14
  2015. 42.60 s > stack backtrace:
  2016. 42.60 s > 0: __rustc::rust_begin_unwind
  2017. 42.60 s > 1: core::panicking::panic_fmt
  2018. 42.60 s > 2: core::result::unwrap_failed
  2019. 42.60 s > 3: alphal00p_docs_builder::tests::immutable_snapshot_navigation_does_not_link_mutable_developer_notes
  2020. 42.60 s > 4: <alphal00p_docs_builder::tests::immutable_snapshot_navigation_does_not_link_mutable_developer_notes::{closure#0} as core::ops::function::FnOnce<()>>::call_once
  2021. 42.60 s > note: Some details are omitted, run with `RUST_BACKTRACE=full` for a verbose backtrace.
  2022. 42.60 s >
  2023. 42.60 s > 18. alphal00p-docs-builder::tests::generated_search_links_are_validated_without_rewriting_html
  2024. 42.60 s > failure: test failure with exit code 101
  2025. 42.60 s > thread 'tests::generated_search_links_are_validated_without_rewriting_html' (285) panicked at crates/alphal00p-docs-builder/src/lib.rs:10077:47:
  2026. 42.60 s > called `Result::unwrap()` on an `Err` value: failed to read /build/source/docs/portal.toml
  2027. 42.60 s >
  2028. 42.60 s > Caused by:
  2029. 42.60 s > No such file or directory (os error 2)
  2030. 42.60 s >
  2031. 42.60 s > Location:
  2032. 42.60 s > crates/alphal00p-docs-builder/src/lib.rs:582:14
  2033. 42.60 s > stack backtrace:
  2034. 42.60 s > 0: __rustc::rust_begin_unwind
  2035. 42.60 s > 1: core::panicking::panic_fmt
  2036. 42.60 s > 2: core::result::unwrap_failed
  2037. 42.60 s > 3: alphal00p_docs_builder::tests::generated_search_links_are_validated_without_rewriting_html
  2038. 42.60 s > 4: <alphal00p_docs_builder::tests::generated_search_links_are_validated_without_rewriting_html::{closure#0} as core::ops::function::FnOnce<()>>::call_once
  2039. 42.60 s > note: Some details are omitted, run with `RUST_BACKTRACE=full` for a verbose backtrace.
  2040. 42.60 s > system-out
  2041. 42.60 s > running 1 test
  2042. 42.60 s > test tests::generated_search_links_are_validated_without_rewriting_html ... FAILED
  2043. 42.60 s >
  2044. 42.60 s > failures:
  2045. 42.60 s >
  2046. 42.60 s > failures:
  2047. 42.60 s > tests::generated_search_links_are_validated_without_rewriting_html
  2048. 42.60 s >
  2049. 42.60 s > test result: FAILED. 0 passed; 1 failed; 0 ignored; 0 measured; 101 filtered out; finished in 0.01s
  2050. 42.60 s > system-err
  2051. 42.60 s > thread 'tests::generated_search_links_are_validated_without_rewriting_html' (285) panicked at crates/alphal00p-docs-builder/src/lib.rs:10077:47:
  2052. 42.60 s > called `Result::unwrap()` on an `Err` value: failed to read /build/source/docs/portal.toml
  2053. 42.60 s >
  2054. 42.60 s > Caused by:
  2055. 42.60 s > No such file or directory (os error 2)
  2056. 42.60 s >
  2057. 42.60 s > Location:
  2058. 42.60 s > crates/alphal00p-docs-builder/src/lib.rs:582:14
  2059. 42.60 s > stack backtrace:
  2060. 42.60 s > 0: __rustc::rust_begin_unwind
  2061. 42.60 s > 1: core::panicking::panic_fmt
  2062. 42.60 s > 2: core::result::unwrap_failed
  2063. 42.60 s > 3: alphal00p_docs_builder::tests::generated_search_links_are_validated_without_rewriting_html
  2064. 42.60 s > 4: <alphal00p_docs_builder::tests::generated_search_links_are_validated_without_rewriting_html::{closure#0} as core::ops::function::FnOnce<()>>::call_once
  2065. 42.60 s > note: Some details are omitted, run with `RUST_BACKTRACE=full` for a verbose backtrace.
  2066. 42.60 s >
  2067. 42.60 s > 19. alphal00p-docs-builder::tests::moved_manual_routes_redirect_without_entering_navigation
  2068. 42.60 s > failure: test failure with exit code 101
  2069. 42.60 s > thread 'tests::moved_manual_routes_redirect_without_entering_navigation' (294) panicked at crates/alphal00p-docs-builder/src/lib.rs:11944:47:
  2070. 42.60 s > called `Result::unwrap()` on an `Err` value: failed to read /build/source/docs/portal.toml
  2071. 42.60 s >
  2072. 42.60 s > Caused by:
  2073. 42.60 s > No such file or directory (os error 2)
  2074. 42.60 s >
  2075. 42.60 s > Location:
  2076. 42.60 s > crates/alphal00p-docs-builder/src/lib.rs:582:14
  2077. 42.60 s > stack backtrace:
  2078. 42.60 s > 0: __rustc::rust_begin_unwind
  2079. 42.60 s > 1: core::panicking::panic_fmt
  2080. 42.60 s > 2: core::result::unwrap_failed
  2081. 42.60 s > 3: alphal00p_docs_builder::tests::moved_manual_routes_redirect_without_entering_navigation
  2082. 42.60 s > 4: <alphal00p_docs_builder::tests::moved_manual_routes_redirect_without_entering_navigation::{closure#0} as core::ops::function::FnOnce<()>>::call_once
  2083. 42.60 s > note: Some details are omitted, run with `RUST_BACKTRACE=full` for a verbose backtrace.
  2084. 42.60 s > system-out
  2085. 42.60 s > running 1 test
  2086. 42.60 s > test tests::moved_manual_routes_redirect_without_entering_navigation ... FAILED
  2087. 42.60 s >
  2088. 42.60 s > failures:
  2089. 42.60 s >
  2090. 42.60 s > failures:
  2091. 42.60 s > tests::moved_manual_routes_redirect_without_entering_navigation
  2092. 42.60 s >
  2093. 42.60 s > test result: FAILED. 0 passed; 1 failed; 0 ignored; 0 measured; 101 filtered out; finished in 0.00s
  2094. 42.60 s > system-err
  2095. 42.60 s > thread 'tests::moved_manual_routes_redirect_without_entering_navigation' (294) panicked at crates/alphal00p-docs-builder/src/lib.rs:11944:47:
  2096. 42.60 s > called `Result::unwrap()` on an `Err` value: failed to read /build/source/docs/portal.toml
  2097. 42.60 s >
  2098. 42.60 s > Caused by:
  2099. 42.60 s > No such file or directory (os error 2)
  2100. 42.60 s >
  2101. 42.60 s > Location:
  2102. 42.60 s > crates/alphal00p-docs-builder/src/lib.rs:582:14
  2103. 42.60 s > stack backtrace:
  2104. 42.60 s > 0: __rustc::rust_begin_unwind
  2105. 42.60 s > 1: core::panicking::panic_fmt
  2106. 42.60 s > 2: core::result::unwrap_failed
  2107. 42.60 s > 3: alphal00p_docs_builder::tests::moved_manual_routes_redirect_without_entering_navigation
  2108. 42.60 s > 4: <alphal00p_docs_builder::tests::moved_manual_routes_redirect_without_entering_navigation::{closure#0} as core::ops::function::FnOnce<()>>::call_once
  2109. 42.60 s > note: Some details are omitted, run with `RUST_BACKTRACE=full` for a verbose backtrace.
  2110. 42.60 s >
  2111. 42.60 s > 20. alphal00p-docs-builder::tests::pdf_manual_chapter_order_must_match_the_page_registry
  2112. 42.60 s > failure: test failure with exit code 101
  2113. 42.60 s > thread 'tests::pdf_manual_chapter_order_must_match_the_page_registry' (300) panicked at crates/alphal00p-docs-builder/src/lib.rs:11122:51:
  2114. 42.60 s > called `Result::unwrap()` on an `Err` value: failed to read /build/source/docs/portal.toml
  2115. 42.60 s >
  2116. 42.60 s > Caused by:
  2117. 42.60 s > No such file or directory (os error 2)
  2118. 42.60 s >
  2119. 42.60 s > Location:
  2120. 42.60 s > crates/alphal00p-docs-builder/src/lib.rs:582:14
  2121. 42.60 s > stack backtrace:
  2122. 42.60 s > 0: __rustc::rust_begin_unwind
  2123. 42.60 s > 1: core::panicking::panic_fmt
  2124. 42.60 s > 2: core::result::unwrap_failed
  2125. 42.60 s > 3: alphal00p_docs_builder::tests::pdf_manual_chapter_order_must_match_the_page_registry
  2126. 42.60 s > 4: <alphal00p_docs_builder::tests::pdf_manual_chapter_order_must_match_the_page_registry::{closure#0} as core::ops::function::FnOnce<()>>::call_once
  2127. 42.60 s > note: Some details are omitted, run with `RUST_BACKTRACE=full` for a verbose backtrace.
  2128. 42.60 s > system-out
  2129. 42.60 s > running 1 test
  2130. 42.60 s > test tests::pdf_manual_chapter_order_must_match_the_page_registry ... FAILED
  2131. 42.60 s >
  2132. 42.60 s > failures:
  2133. 42.60 s >
  2134. 42.60 s > failures:
  2135. 42.60 s > tests::pdf_manual_chapter_order_must_match_the_page_registry
  2136. 42.60 s >
  2137. 42.60 s > test result: FAILED. 0 passed; 1 failed; 0 ignored; 0 measured; 101 filtered out; finished in 0.00s
  2138. 42.60 s > system-err
  2139. 42.60 s > thread 'tests::pdf_manual_chapter_order_must_match_the_page_registry' (300) panicked at crates/alphal00p-docs-builder/src/lib.rs:11122:51:
  2140. 42.60 s > called `Result::unwrap()` on an `Err` value: failed to read /build/source/docs/portal.toml
  2141. 42.60 s >
  2142. 42.60 s > Caused by:
  2143. 42.60 s > No such file or directory (os error 2)
  2144. 42.60 s >
  2145. 42.60 s > Location:
  2146. 42.60 s > crates/alphal00p-docs-builder/src/lib.rs:582:14
  2147. 42.60 s > stack backtrace:
  2148. 42.60 s > 0: __rustc::rust_begin_unwind
  2149. 42.60 s > 1: core::panicking::panic_fmt
  2150. 42.60 s > 2: core::result::unwrap_failed
  2151. 42.60 s > 3: alphal00p_docs_builder::tests::pdf_manual_chapter_order_must_match_the_page_registry
  2152. 42.60 s > 4: <alphal00p_docs_builder::tests::pdf_manual_chapter_order_must_match_the_page_registry::{closure#0} as core::ops::function::FnOnce<()>>::call_once
  2153. 42.60 s > note: Some details are omitted, run with `RUST_BACKTRACE=full` for a verbose backtrace.
  2154. 42.60 s >
  2155. 42.60 s > ... omitted 26 more failing tests
  2156. 42.60 s > =========================================
  2157. 42.60 s > Extracting 2 binaries to /build/nextest-archive-14rApM
  2158. 42.60 s > Extracted 5 files to /build/nextest-archive-14rApM in 0.05s
  2159. 42.60 s > ------------
  2160. 42.60 s > Nextest run ID 40e86c73-b612-44d7-a296-2529ce99f5e6 with nextest profile: ci_gammaloop
  2161. 42.60 s > Starting 22 tests across 2 binaries
  2162. 42.60 s > ------------
  2163. 42.60 s > Summary [ 0.035s] 22 tests run: 22 passed, 0 skipped
  2164. 42.60 s >
  2165. 42.60 s > ========== nextest test summary ==========
  2166. 42.60 s > report: target/nextest/ci_gammaloop/junit.xml
  2167. 42.60 s > tests: 22, failures: 0, errors: 0
  2168. 42.60 s > No failing testcases found.
  2169. 42.60 s > =========================================
  2170. 42.60 s > Extracting 1 binary, 1 build script output directory, and 2 linked paths to /build/nextest-archive-DYpVHr
  2171. 42.60 s > Extracted 18 files to /build/nextest-archive-DYpVHr in 0.09s
  2172. 42.60 s > ------------
  2173. 42.60 s > Nextest run ID dea2b538-c087-4a58-b4de-81e9efc3ee8c with nextest profile: ci_gammaloop
  2174. 42.60 s > Starting 85 tests across 1 binary
  2175. 42.60 s > FAIL [ 0.018s] ( 6/85) alphal00p-docs-examples catalog_examples::python_catalog_examples_compile_without_importing_products
  2176. 42.60 s > stdout ---
  2177. 42.60 s >
  2178. 42.60 s > running 1 test
  2179. 42.60 s > test catalog_examples::python_catalog_examples_compile_without_importing_products ... FAILED
  2180. 42.60 s >
  2181. 42.60 s > failures:
  2182. 42.60 s >
  2183. 42.60 s > failures:
  2184. 42.60 s > catalog_examples::python_catalog_examples_compile_without_importing_products
  2185. 42.60 s >
  2186. 42.60 s > test result: FAILED. 0 passed; 1 failed; 0 ignored; 0 measured; 84 filtered out; finished in 0.01s
  2187. 42.60 s >
  2188. 42.60 s > stderr ---
  2189. 42.60 s >
  2190. 42.60 s > thread 'catalog_examples::python_catalog_examples_compile_without_importing_products' (542) panicked at crates/alphal00p-docs-examples/src/lib.rs:39:17:
  2191. 42.60 s > failed to start Python interpreter python3: No such file or directory (os error 2)
  2192. 42.60 s > stack backtrace:
  2193. 42.60 s > 0: __rustc::rust_begin_unwind
  2194. 42.60 s > 1: core::panicking::panic_fmt
  2195. 42.60 s > 2: alphal00p_docs_examples::catalog_examples::python_catalog_examples_compile_without_importing_products::{closure#0}
  2196. 42.60 s > 3: alphal00p_docs_examples::catalog_examples::python_catalog_examples_compile_without_importing_products
  2197. 42.60 s > 4: <alphal00p_docs_examples::catalog_examples::python_catalog_examples_compile_without_importing_products::{closure#0} as core::ops::function::FnOnce<()>>::call_once
  2198. 42.60 s > note: Some details are omitted, run with `RUST_BACKTRACE=full` for a verbose backtrace.
  2199. 42.60 s >
  2200. 42.60 s > FAIL [ 0.018s] (85/85) alphal00p-docs-examples catalog_examples::shell_catalog_examples_parse_without_execution
  2201. 42.60 s > stdout ---
  2202. 42.60 s >
  2203. 42.60 s > running 1 test
  2204. 42.60 s > test catalog_examples::shell_catalog_examples_parse_without_execution ... FAILED
  2205. 42.60 s >
  2206. 42.60 s > failures:
  2207. 42.60 s >
  2208. 42.60 s > failures:
  2209. 42.60 s > catalog_examples::shell_catalog_examples_parse_without_execution
  2210. 42.60 s >
  2211. 42.60 s > test result: FAILED. 0 passed; 1 failed; 0 ignored; 0 measured; 84 filtered out; finished in 0.01s
  2212. 42.60 s >
  2213. 42.60 s > stderr ---
  2214. 42.60 s >
  2215. 42.60 s > thread 'catalog_examples::shell_catalog_examples_parse_without_execution' (694) panicked at crates/alphal00p-docs-examples/src/lib.rs:25:9:
  2216. 42.60 s > shell documentation example validation failed:
  2217. 42.60 s > bash: /build/source/target/ci-optim/build/alphal00p-docs-examples-48b938e1dbf43715/out/shell_catalog_examples.sh: No such file or directory
  2218. 42.60 s >
  2219. 42.60 s > stack backtrace:
  2220. 42.60 s > 0: __rustc::rust_begin_unwind
  2221. 42.60 s > 1: core::panicking::panic_fmt
  2222. 42.60 s > 2: alphal00p_docs_examples::catalog_examples::shell_catalog_examples_parse_without_execution
  2223. 42.60 s > 3: <alphal00p_docs_examples::catalog_examples::shell_catalog_examples_parse_without_execution::{closure#0} as core::ops::function::FnOnce<()>>::call_once
  2224. 42.60 s > note: Some details are omitted, run with `RUST_BACKTRACE=full` for a verbose backtrace.
  2225. 42.60 s >
  2226. 42.60 s > ------------
  2227. 42.60 s > Summary [ 0.091s] 85 tests run: 83 passed, 2 failed, 0 skipped
  2228. 42.60 s > FAIL [ 0.018s] ( 6/85) alphal00p-docs-examples catalog_examples::python_catalog_examples_compile_without_importing_products
  2229. 42.60 s > stdout ---
  2230. 42.60 s >
  2231. 42.60 s > running 1 test
  2232. 42.60 s > test catalog_examples::python_catalog_examples_compile_without_importing_products ... FAILED
  2233. 42.60 s >
  2234. 42.60 s > failures:
  2235. 42.60 s >
  2236. 42.60 s > failures:
  2237. 42.60 s > catalog_examples::python_catalog_examples_compile_without_importing_products
  2238. 42.60 s >
  2239. 42.60 s > test result: FAILED. 0 passed; 1 failed; 0 ignored; 0 measured; 84 filtered out; finished in 0.01s
  2240. 42.60 s >
  2241. 42.60 s > stderr ---
  2242. 42.60 s >
  2243. 42.60 s > thread 'catalog_examples::python_catalog_examples_compile_without_importing_products' (542) panicked at crates/alphal00p-docs-examples/src/lib.rs:39:17:
  2244. 42.60 s > failed to start Python interpreter python3: No such file or directory (os error 2)
  2245. 42.60 s > stack backtrace:
  2246. 42.60 s > 0: __rustc::rust_begin_unwind
  2247. 42.60 s > 1: core::panicking::panic_fmt
  2248. 42.60 s > 2: alphal00p_docs_examples::catalog_examples::python_catalog_examples_compile_without_importing_products::{closure#0}
  2249. 42.60 s > 3: alphal00p_docs_examples::catalog_examples::python_catalog_examples_compile_without_importing_products
  2250. 42.60 s > 4: <alphal00p_docs_examples::catalog_examples::python_catalog_examples_compile_without_importing_products::{closure#0} as core::ops::function::FnOnce<()>>::call_once
  2251. 42.60 s > note: Some details are omitted, run with `RUST_BACKTRACE=full` for a verbose backtrace.
  2252. 42.60 s >
  2253. 42.60 s > FAIL [ 0.018s] (85/85) alphal00p-docs-examples catalog_examples::shell_catalog_examples_parse_without_execution
  2254. 42.60 s > stdout ---
  2255. 42.60 s >
  2256. 42.60 s > running 1 test
  2257. 42.60 s > test catalog_examples::shell_catalog_examples_parse_without_execution ... FAILED
  2258. 42.60 s >
  2259. 42.60 s > failures:
  2260. 42.60 s >
  2261. 42.60 s > failures:
  2262. 42.60 s > catalog_examples::shell_catalog_examples_parse_without_execution
  2263. 42.60 s >
  2264. 42.60 s > test result: FAILED. 0 passed; 1 failed; 0 ignored; 0 measured; 84 filtered out; finished in 0.01s
  2265. 42.60 s >
  2266. 42.60 s > stderr ---
  2267. 42.60 s >
  2268. 42.60 s > thread 'catalog_examples::shell_catalog_examples_parse_without_execution' (694) panicked at crates/alphal00p-docs-examples/src/lib.rs:25:9:
  2269. 42.60 s > shell documentation example validation failed:
  2270. 42.60 s > bash: /build/source/target/ci-optim/build/alphal00p-docs-examples-48b938e1dbf43715/out/shell_catalog_examples.sh: No such file or directory
  2271. 42.60 s >
  2272. 42.60 s > stack backtrace:
  2273. 42.60 s > 0: __rustc::rust_begin_unwind
  2274. 42.60 s > 1: core::panicking::panic_fmt
  2275. 42.60 s > 2: alphal00p_docs_examples::catalog_examples::shell_catalog_examples_parse_without_execution
  2276. 42.60 s > 3: <alphal00p_docs_examples::catalog_examples::shell_catalog_examples_parse_without_execution::{closure#0} as core::ops::function::FnOnce<()>>::call_once
  2277. 42.60 s > note: Some details are omitted, run with `RUST_BACKTRACE=full` for a verbose backtrace.
  2278. 42.60 s >
  2279. 42.60 s > error: test run failed
  2280. 42.60 s >
  2281. 42.60 s > ========== nextest test summary ==========
  2282. 42.60 s > report: target/nextest/ci_gammaloop/junit.xml
  2283. 42.60 s > tests: 85, failures: 2, errors: 0
  2284. 42.60 s >
  2285. 42.60 s > 1. alphal00p-docs-examples::catalog_examples::python_catalog_examples_compile_without_importing_products
  2286. 42.60 s > failure: test failure with exit code 101
  2287. 42.60 s > thread 'catalog_examples::python_catalog_examples_compile_without_importing_products' (542) panicked at crates/alphal00p-docs-examples/src/lib.rs:39:17:
  2288. 42.60 s > failed to start Python interpreter python3: No such file or directory (os error 2)
  2289. 42.60 s > stack backtrace:
  2290. 42.60 s > 0: __rustc::rust_begin_unwind
  2291. 42.60 s > 1: core::panicking::panic_fmt
  2292. 42.60 s > 2: alphal00p_docs_examples::catalog_examples::python_catalog_examples_compile_without_importing_products::{closure#0}
  2293. 42.60 s > 3: alphal00p_docs_examples::catalog_examples::python_catalog_examples_compile_without_importing_products
  2294. 42.60 s > 4: <alphal00p_docs_examples::catalog_examples::python_catalog_examples_compile_without_importing_products::{closure#0} as core::ops::function::FnOnce<()>>::call_once
  2295. 42.60 s > note: Some details are omitted, run with `RUST_BACKTRACE=full` for a verbose backtrace.
  2296. 42.60 s > system-out
  2297. 42.60 s > running 1 test
  2298. 42.60 s > test catalog_examples::python_catalog_examples_compile_without_importing_products ... FAILED
  2299. 42.60 s >
  2300. 42.60 s > failures:
  2301. 42.60 s >
  2302. 42.60 s > failures:
  2303. 42.60 s > catalog_examples::python_catalog_examples_compile_without_importing_products
  2304. 42.60 s >
  2305. 42.60 s > test result: FAILED. 0 passed; 1 failed; 0 ignored; 0 measured; 84 filtered out; finished in 0.01s
  2306. 42.60 s > system-err
  2307. 42.60 s > thread 'catalog_examples::python_catalog_examples_compile_without_importing_products' (542) panicked at crates/alphal00p-docs-examples/src/lib.rs:39:17:
  2308. 42.60 s > failed to start Python interpreter python3: No such file or directory (os error 2)
  2309. 42.60 s > stack backtrace:
  2310. 42.60 s > 0: __rustc::rust_begin_unwind
  2311. 42.60 s > 1: core::panicking::panic_fmt
  2312. 42.60 s > 2: alphal00p_docs_examples::catalog_examples::python_catalog_examples_compile_without_importing_products::{closure#0}
  2313. 42.60 s > 3: alphal00p_docs_examples::catalog_examples::python_catalog_examples_compile_without_importing_products
  2314. 42.60 s > 4: <alphal00p_docs_examples::catalog_examples::python_catalog_examples_compile_without_importing_products::{closure#0} as core::ops::function::FnOnce<()>>::call_once
  2315. 42.60 s > note: Some details are omitted, run with `RUST_BACKTRACE=full` for a verbose backtrace.
  2316. 42.60 s >
  2317. 42.60 s > 2. alphal00p-docs-examples::catalog_examples::shell_catalog_examples_parse_without_execution
  2318. 42.60 s > failure: test failure with exit code 101
  2319. 42.60 s > thread 'catalog_examples::shell_catalog_examples_parse_without_execution' (694) panicked at crates/alphal00p-docs-examples/src/lib.rs:25:9:
  2320. 42.60 s > shell documentation example validation failed:
  2321. 42.60 s > bash: /build/source/target/ci-optim/build/alphal00p-docs-examples-48b938e1dbf43715/out/shell_catalog_examples.sh: No such file or directory
  2322. 42.60 s >
  2323. 42.60 s > stack backtrace:
  2324. 42.60 s > 0: __rustc::rust_begin_unwind
  2325. 42.60 s > 1: core::panicking::panic_fmt
  2326. 42.60 s > 2: alphal00p_docs_examples::catalog_examples::shell_catalog_examples_parse_without_execution
  2327. 42.60 s > 3: <alphal00p_docs_examples::catalog_examples::shell_catalog_examples_parse_without_execution::{closure#0} as core::ops::function::FnOnce<()>>::call_once
  2328. 42.60 s > note: Some details are omitted, run with `RUST_BACKTRACE=full` for a verbose backtrace.
  2329. 42.60 s > system-out
  2330. 42.60 s > running 1 test
  2331. 42.60 s > test catalog_examples::shell_catalog_examples_parse_without_execution ... FAILED
  2332. 42.60 s >
  2333. 42.60 s > failures:
  2334. 42.60 s >
  2335. 42.60 s > failures:
  2336. 42.60 s > catalog_examples::shell_catalog_examples_parse_without_execution
  2337. 42.60 s >
  2338. 42.60 s > test result: FAILED. 0 passed; 1 failed; 0 ignored; 0 measured; 84 filtered out; finished in 0.01s
  2339. 42.60 s > system-err
  2340. 42.60 s > thread 'catalog_examples::shell_catalog_examples_parse_without_execution' (694) panicked at crates/alphal00p-docs-examples/src/lib.rs:25:9:
  2341. 42.60 s > shell documentation example validation failed:
  2342. 42.60 s > bash: /build/source/target/ci-optim/build/alphal00p-docs-examples-48b938e1dbf43715/out/shell_catalog_examples.sh: No such file or directory
  2343. 42.60 s >
  2344. 42.60 s > stack backtrace:
  2345. 42.60 s > 0: __rustc::rust_begin_unwind
  2346. 42.60 s > 1: core::panicking::panic_fmt
  2347. 42.60 s > 2: alphal00p_docs_examples::catalog_examples::shell_catalog_examples_parse_without_execution
  2348. 42.60 s > 3: <alphal00p_docs_examples::catalog_examples::shell_catalog_examples_parse_without_execution::{closure#0} as core::ops::function::FnOnce<()>>::call_once
  2349. 42.60 s > note: Some details are omitted, run with `RUST_BACKTRACE=full` for a verbose backtrace.
  2350. 42.60 s > =========================================
  2351. 42.60 s > Extracting 2 binaries to /build/nextest-archive-OaoCXl
  2352. 42.60 s > Extracted 5 files to /build/nextest-archive-OaoCXl in 0.06s
  2353. 42.60 s > ------------
  2354. 42.60 s > Nextest run ID 194ec25e-0dde-442d-b0b6-4d52c91c84cf with nextest profile: ci_gammaloop
  2355. 42.60 s > Starting 10 tests across 2 binaries
  2356. 42.60 s > FAIL [ 0.113s] (10/10) alphal00p-docs-macros::trybuild documentation_attributes_compile_and_diagnose
  2357. 42.60 s > stdout ---
  2358. 42.60 s >
  2359. 42.60 s > running 1 test
  2360. 42.60 s > test documentation_attributes_compile_and_diagnose ... FAILED
  2361. 42.60 s >
  2362. 42.60 s > failures:
  2363. 42.60 s >
  2364. 42.60 s > failures:
  2365. 42.60 s > documentation_attributes_compile_and_diagnose
  2366. 42.60 s >
  2367. 42.60 s > test result: FAILED. 0 passed; 1 failed; 0 ignored; 0 measured; 0 filtered out; finished in 0.10s
  2368. 42.60 s >
  2369. 42.60 s > stderr ---
  2370. 42.60 s > error: failed to load source for dependency `graphica`
  2371. 42.60 s >
  2372. 42.60 s > Caused by:
  2373. 42.60 s > unable to update https://github.com/symbolica-dev/symbolica?branch=dev#0441bd7a
  2374. 42.60 s >
  2375. 42.60 s > Caused by:
  2376. 42.60 s > can't checkout from 'https://github.com/symbolica-dev/symbolica': you are in the offline mode (--offline)
  2377. 42.60 s >
  2378. 42.60 s > thread 'documentation_attributes_compile_and_diagnose' (757) panicked at /nix/store/xdy1vvhll2bijdplvl9fcc2b9plkxhaa-vendor-cargo-deps/c19b7c6f923b580ac259164a89f2577984ad5ab09ee9d583b888f934adbbe8d0/trybuild-1.0.120/src/run.rs:63:13:
  2379. 42.60 s > tests failed
  2380. 42.60 s > stack backtrace:
  2381. 42.60 s > 0: __rustc::rust_begin_unwind
  2382. 42.60 s > 1: core::panicking::panic_fmt
  2383. 42.60 s > 2: <trybuild::Runner>::run::{closure#1}
  2384. 42.60 s > 3: <trybuild::Runner>::run
  2385. 42.60 s > 4: <trybuild::TestCases as core::ops::drop::Drop>::drop
  2386. 42.60 s > 5: <trybuild::documentation_attributes_compile_and_diagnose::{closure#0} as core::ops::function::FnOnce<()>>::call_once
  2387. 42.60 s > note: Some details are omitted, run with `RUST_BACKTRACE=full` for a verbose backtrace.
  2388. 42.60 s >
  2389. 42.60 s > ------------
  2390. 42.60 s > Summary [ 0.118s] 10 tests run: 9 passed, 1 failed, 0 skipped
  2391. 42.60 s > FAIL [ 0.113s] (10/10) alphal00p-docs-macros::trybuild documentation_attributes_compile_and_diagnose
  2392. 42.60 s > stdout ---
  2393. 42.60 s >
  2394. 42.60 s > running 1 test
  2395. 42.60 s > test documentation_attributes_compile_and_diagnose ... FAILED
  2396. 42.60 s >
  2397. 42.60 s > failures:
  2398. 42.60 s >
  2399. 42.60 s > failures:
  2400. 42.60 s > documentation_attributes_compile_and_diagnose
  2401. 42.60 s >
  2402. 42.60 s > test result: FAILED. 0 passed; 1 failed; 0 ignored; 0 measured; 0 filtered out; finished in 0.10s
  2403. 42.60 s >
  2404. 42.60 s > stderr ---
  2405. 42.60 s > error: failed to load source for dependency `graphica`
  2406. 42.60 s >
  2407. 42.60 s > Caused by:
  2408. 42.60 s > unable to update https://github.com/symbolica-dev/symbolica?branch=dev#0441bd7a
  2409. 42.60 s >
  2410. 42.60 s > Caused by:
  2411. 42.60 s > can't checkout from 'https://github.com/symbolica-dev/symbolica': you are in the offline mode (--offline)
  2412. 42.60 s >
  2413. 42.60 s > thread 'documentation_attributes_compile_and_diagnose' (757) panicked at /nix/store/xdy1vvhll2bijdplvl9fcc2b9plkxhaa-vendor-cargo-deps/c19b7c6f923b580ac259164a89f2577984ad5ab09ee9d583b888f934adbbe8d0/trybuild-1.0.120/src/run.rs:63:13:
  2414. 42.60 s > tests failed
  2415. 42.60 s > stack backtrace:
  2416. 42.60 s > 0: __rustc::rust_begin_unwind
  2417. 42.60 s > 1: core::panicking::panic_fmt
  2418. 42.60 s > 2: <trybuild::Runner>::run::{closure#1}
  2419. 42.60 s > 3: <trybuild::Runner>::run
  2420. 42.60 s > 4: <trybuild::TestCases as core::ops::drop::Drop>::drop
  2421. 42.60 s > 5: <trybuild::documentation_attributes_compile_and_diagnose::{closure#0} as core::ops::function::FnOnce<()>>::call_once
  2422. 42.60 s > note: Some details are omitted, run with `RUST_BACKTRACE=full` for a verbose backtrace.
  2423. 42.60 s >
  2424. 42.60 s > error: test run failed
  2425. 42.60 s >
  2426. 42.60 s > ========== nextest test summary ==========
  2427. 42.60 s > report: target/nextest/ci_gammaloop/junit.xml
  2428. 42.60 s > tests: 10, failures: 1, errors: 0
  2429. 42.60 s >
  2430. 42.60 s > 1. alphal00p-docs-macros::trybuild::documentation_attributes_compile_and_diagnose
  2431. 42.60 s > failure: test failure with exit code 101
  2432. 42.60 s > thread 'documentation_attributes_compile_and_diagnose' (757) panicked at /nix/store/xdy1vvhll2bijdplvl9fcc2b9plkxhaa-vendor-cargo-deps/c19b7c6f923b580ac259164a89f2577984ad5ab09ee9d583b888f934adbbe8d0/trybuild-1.0.120/src/run.rs:63:13:
  2433. 42.60 s > tests failed
  2434. 42.60 s > stack backtrace:
  2435. 42.60 s > 0: __rustc::rust_begin_unwind
  2436. 42.60 s > 1: core::panicking::panic_fmt
  2437. 42.60 s > 2: <trybuild::Runner>::run::{closure#1}
  2438. 42.60 s > 3: <trybuild::Runner>::run
  2439. 42.60 s > 4: <trybuild::TestCases as core::ops::drop::Drop>::drop
  2440. 42.60 s > 5: <trybuild::documentation_attributes_compile_and_diagnose::{closure#0} as core::ops::function::FnOnce<()>>::call_once
  2441. 42.60 s > note: Some details are omitted, run with `RUST_BACKTRACE=full` for a verbose backtrace.
  2442. 42.60 s > system-out
  2443. 42.60 s > running 1 test
  2444. 42.60 s > test documentation_attributes_compile_and_diagnose ... FAILED
  2445. 42.60 s >
  2446. 42.60 s > failures:
  2447. 42.60 s >
  2448. 42.60 s > failures:
  2449. 42.60 s > documentation_attributes_compile_and_diagnose
  2450. 42.60 s >
  2451. 42.60 s > test result: FAILED. 0 passed; 1 failed; 0 ignored; 0 measured; 0 filtered out; finished in 0.10s
  2452. 42.60 s > system-err
  2453. 42.60 s > error: failed to load source for dependency `graphica`
  2454. 42.60 s >
  2455. 42.60 s > Caused by:
  2456. 42.60 s > unable to update https://github.com/symbolica-dev/symbolica?branch=dev#0441bd7a
  2457. 42.60 s >
  2458. 42.60 s > Caused by:
  2459. 42.60 s > can't checkout from 'https://github.com/symbolica-dev/symbolica': you are in the offline mode (--offline)
  2460. 42.60 s >
  2461. 42.60 s > thread 'documentation_attributes_compile_and_diagnose' (757) panicked at /nix/store/xdy1vvhll2bijdplvl9fcc2b9plkxhaa-vendor-cargo-deps/c19b7c6f923b580ac259164a89f2577984ad5ab09ee9d583b888f934adbbe8d0/trybuild-1.0.120/src/run.rs:63:13:
  2462. 42.60 s > tests failed
  2463. 42.60 s > stack backtrace:
  2464. 42.60 s > 0: __rustc::rust_begin_unwind
  2465. 42.60 s > 1: core::panicking::panic_fmt
  2466. 42.60 s > 2: <trybuild::Runner>::run::{closure#1}
  2467. 42.60 s > 3: <trybuild::Runner>::run
  2468. 42.60 s > 4: <trybuild::TestCases as core::ops::drop::Drop>::drop
  2469. 42.60 s > 5: <trybuild::documentation_attributes_compile_and_diagnose::{closure#0} as core::ops::function::FnOnce<()>>::call_once
  2470. 42.60 s > note: Some details are omitted, run with `RUST_BACKTRACE=full` for a verbose backtrace.
  2471. 42.60 s > =========================================
  2472. 42.60 s > Extracting 1 binary to /build/nextest-archive-9ODtcx
  2473. 42.60 s > Extracted 4 files to /build/nextest-archive-9ODtcx in 0.04s
  2474. 42.60 s > ------------
  2475. 42.60 s > Nextest run ID 50ae3872-29b4-466d-ba33-6ca35cb4cf4e with nextest profile: ci_gammaloop
  2476. 42.60 s > Starting 0 tests across 1 binary
  2477. 42.60 s > ------------
  2478. 42.60 s > Summary [ 0.000s] 0 tests run: 0 passed, 0 skipped
  2479. 42.60 s >
  2480. 42.60 s > ========== nextest test summary ==========
  2481. 42.60 s > report: target/nextest/ci_gammaloop/junit.xml
  2482. 42.60 s > tests: 0, failures: 0, errors: 0
  2483. 42.60 s > No failing testcases found.
  2484. 42.60 s > =========================================
  2485. 42.60 s > Extracting 1 binary to /build/nextest-archive-neEkXa
  2486. 42.60 s > Extracted 4 files to /build/nextest-archive-neEkXa in 0.04s
  2487. 42.60 s > ------------
  2488. 42.60 s > Nextest run ID 7aec2270-60e9-422c-91dc-f4f244db31f8 with nextest profile: ci_gammaloop
  2489. 42.60 s > Starting 5 tests across 1 binary
  2490. 42.60 s > ------------
  2491. 42.60 s > Summary [ 0.026s] 5 tests run: 5 passed, 0 skipped
  2492. 42.60 s >
  2493. 42.60 s > ========== nextest test summary ==========
  2494. 42.60 s > report: target/nextest/ci_gammaloop/junit.xml
  2495. 42.60 s > tests: 5, failures: 0, errors: 0
  2496. 42.60 s > No failing testcases found.
  2497. 42.60 s > =========================================
  2498. 42.60 s For full logs, run:
  2499. 42.60 s nix log /nix/store/6r13pbqsnmyyicpdrz1zkw00g0gdh9dy-gammaloop-nextest-docs.drv
  2500. 42.71 s [2 built (1 failed), 12 Run failed.