test packages.x86_64-linux.nix-ci-check-gammaloop-nextest-python-api
- 1.48 s
$ /nix/store/9ypz3flqsrl5xl495mm8h645gadjsxi1-coreutils-9.11/bin/timeout --kill-after=15s 7200s /nix/store/23zk8sgzamrbmj1fday15szf7f2279s8-nix-2.34.7/bin/nix --extra-experimental-features nix-command --extra-experimental-features flakes flake clone git+https://github.com/alphal00p/gammaloop --dest /tmp/nix-ci-worker/stable-pwd/repo/
- 2.50 s
Cloning into '/tmp/nix-ci-worker/stable-pwd/repo'...
- 2.50 s
remote: Enumerating objects: 65431, done.
- 2.50 s
remote: Counting objects: 0% (1/8082)
remote: Counting objects: 1% (81/8082)
remote: Counting objects: 2% (162/8082)
remote: Counting objects: 3% (243/8082)
remote: Counting objects: 4% (324/8082)
remote: Counting objects: 5% (405/8082)
remote: Counting objects: 6% (485/8082)
remote: Counting objects: 7% (566/8082)
remote: Counting objects: 8% (647/8082)
remote: Counting objects: 9% (728/8082)
remote: Counting objects: 10% (809/8082)
remote: Counting objects: 11% (890/8082)
remote: Counting objects: 12% (970/8082)
remote: Counting objects: 13% (1051/8082)
remote: Counting objects: 14% (1132/8082)
remote: Counting objects: 15% (1213/8082)
remote: Counting objects: 16% (1294/8082)
remote: Counting objects: 17% (1374/8082)
remote: Counting objects: 18% (1455/8082)
remote: Counting objects: 19% (1536/8082)
remote: Counting objects: 20% (1617/8082)
remote: Counting objects: 21% (1698/8082)
remote: Counting objects: 22% (1779/8082)
remote: Counting objects: 23% (1859/8082)
remote: Counting objects: 24% (1940/8082)
remote: Counting objects: 25% (2021/8082)
remote: Counting objects: 26% (2102/8082)
remote: Counting objects: 27% (2183/8082)
remote: Counting objects: 28% (2263/8082)
remote: Counting objects: 29% (2344/8082)
remote: Counting objects: 30% (2425/8082)
remote: Counting objects: 31% (2506/8082)
remote: Counting objects: 32% (2587/8082)
remote: Counting objects: 33% (2668/8082)
remote: Counting objects: 34% (2748/8082)
remote: Counting objects: 35% (2829/8082)
remote: Counting objects: 36% (2910/8082)
remote: Counting objects: 37% (2991/8082)
remote: Counting objects: 38% (3072/8082)
remote: Counting objects: 39% (3152/8082)
remote: Counting objects: 40% (3233/8082)
remote: Counting objects: 41% (3314/8082)
remote: Counting objects: 42% (3395/8082)
remote: Counting objects: 43% (3476/8082)
remote: Counting objects: 44% (3557/8082)
remote: Counting objects: 45% (3637/8082)
remote: Counting objects: 46% (3718/8082)
remote: Counting objects: 47% (3799/8082)
remote: Counting objects: 48% (3880/8082)
remote: Counting objects: 49% (3961/8082)
remote: Counting objects: 50% (4041/8082)
remote: Counting objects: 51% (4122/8082)
remote: Counting objects: 52% (4203/8082)
remote: Counting objects: 53% (4284/8082)
remote: Counting objects: 54% (4365/8082)
remote: Counting objects: 55% (4446/8082)
remote: Counting objects: 56% (4526/8082)
remote: Counting objects: 57% (4607/8082)
remote: Counting objects: 58% (4688/8082)
remote: Counting objects: 59% (4769/8082)
remote: Counting objects: 60% (4850/8082)
remote: Counting objects: 61% (4931/8082)
remote: Counting objects: 62% (5011/8082)
remote: Counting objects: 63% (5092/8082)
remote: Counting objects: 64% (5173/8082)
remote: Counting objects: 65% (5254/8082)
remote: Counting objects: 66% (5335/8082)
remote: Counting objects: 67% (5415/8082)
remote: Counting objects: 68% (5496/8082)
remote: Counting objects: 69% (5577/8082)
remote: Counting objects: 70% (5658/8082)
remote: Counting objects: 71% (5739/8082)
remote: Counting objects: 72% (5820/8082)
remote: Counting objects: 73% (5900/8082)
remote: Counting objects: 74% (5981/8082)
remote: Counting objects: 75% (6062/8082)
remote: Counting objects: 76% (6143/8082)
remote: Counting objects: 77% (6224/8082)
remote: Counting objects: 78% (6304/8082)
remote: Counting objects: 79% (6385/8082)
remote: Counting objects: 80% (6466/8082)
remote: Counting objects: 81% (6547/8082)
remote: Counting objects: 82% (6628/8082)
remote: Counting objects: 83% (6709/8082)
remote: Counting objects: 84% (6789/8082)
remote: Counting objects: 85% (6870/8082)
remote: Counting objects: 86% (6951/8082)
remote: Counting objects: 87% (7032/8082)
remote: Counting objects: 88% (7113/8082)
remote: Counting objects: 89% (7193/8082)
remote: Counting objects: 90% (7274/8082)
remote: Counting objects: 91% (7355/8082)
remote: Counting objects: 92% (7436/8082)
remote: Counting objects: 93% (7517/8082)
remote: Counting objects: 94% (7598/8082)
remote: Counting objects: 95% (7678/8082)
remote: Counting objects: 96% (7759/8082)
remote: Counting objects: 97% (7840/8082)
remote: Counting objects: 98% (7921/8082)
remote: Counting objects: 99% (8002/8082)
remote: Counting objects: 100% (8082/8082)
remote: Counting objects: 100% (8082/8082), done.
- 2.50 s
remote: Compressing objects: 0% (1/1721)
remote: Compressing objects: 1% (18/1721)
remote: Compressing objects: 2% (35/1721)
remote: Compressing objects: 3% (52/1721)
remote: Compressing objects: 4% (69/1721)
remote: Compressing objects: 5% (87/1721)
remote: Compressing objects: 6% (104/1721)
remote: Compressing objects: 7% (121/1721)
remote: Compressing objects: 8% (138/1721)
remote: Compressing objects: 9% (155/1721)
remote: Compressing objects: 10% (173/1721)
remote: Compressing objects: 11% (190/1721)
remote: Compressing objects: 12% (207/1721)
remote: Compressing objects: 13% (224/1721)
remote: Compressing objects: 14% (241/1721)
remote: Compressing objects: 15% (259/1721)
remote: Compressing objects: 16% (276/1721)
remote: Compressing objects: 17% (293/1721)
remote: Compressing objects: 18% (310/1721)
remote: Compressing objects: 18% (311/1721)
remote: Compressing objects: 19% (327/1721)
remote: Compressing objects: 20% (345/1721)
remote: Compressing objects: 21% (362/1721)
remote: Compressing objects: 22% (379/1721)
remote: Compressing objects: 23% (396/1721)
remote: Compressing objects: 24% (414/1721)
remote: Compressing objects: 25% (431/1721)
remote: Compressing objects: 26% (448/1721)
remote: Compressing objects: 27% (465/1721)
remote: Compressing objects: 28% (482/1721)
remote: Compressing objects: 29% (500/1721)
remote: Compressing objects: 30% (517/1721)
remote: Compressing objects: 31% (534/1721)
remote: Compressing objects: 32% (551/1721)
remote: Compressing objects: 33% (568/1721)
remote: Compressing objects: 34% (586/1721)
remote: Compressing objects: 35% (603/1721)
remote: Compressing objects: 36% (620/1721)
remote: Compressing objects: 37% (637/1721)
remote: Compressing objects: 38% (654/1721)
remote: Compressing objects: 39% (672/1721)
remote: Compressing objects: 40% (689/1721)
remote: Compressing objects: 41% (706/1721)
remote: Compressing objects: 42% (723/1721)
remote: Compressing objects: 43% (741/1721)
remote: Compressing objects: 44% (758/1721)
remote: Compressing objects: 45% (775/1721)
remote: Compressing objects: 46% (792/1721)
remote: Compressing objects: 47% (809/1721)
remote: Compressing objects: 48% (827/1721)
remote: Compressing objects: 49% (844/1721)
remote: Compressing objects: 50% (861/1721)
remote: Compressing objects: 51% (878/1721)
remote: Compressing objects: 52% (895/1721)
remote: Compressing objects: 53% (913/1721)
remote: Compressing objects: 54% (930/1721)
remote: Compressing objects: 55% (947/1721)
remote: Compressing objects: 56% (964/1721)
remote: Compressing objects: 57% (981/1721)
remote: Compressing objects: 58% (999/1721)
remote: Compressing objects: 59% (1016/1721)
remote: Compressing objects: 60% (1033/1721)
remote: Compressing objects: 61% (1050/1721)
remote: Compressing objects: 62% (1068/1721)
remote: Compressing objects: 63% (1085/1721)
remote: Compressing objects: 64% (1102/1721)
remote: Compressing objects: 65% (1119/1721)
remote: Compressing objects: 66% (1136/1721)
remote: Compressing objects: 67% (1154/1721)
remote: Compressing objects: 68% (1171/1721)
remote: Compressing objects: 69% (1188/1721)
remote: Compressing objects: 70% (1205/1721)
remote: Compressing objects: 71% (1222/1721)
remote: Compressing objects: 72% (1240/1721)
remote: Compressing objects: 73% (1257/1721)
remote: Compressing objects: 74% (1274/1721)
remote: Compressing objects: 75% (1291/1721)
remote: Compressing objects: 76% (1308/1721)
remote: Compressing objects: 77% (1326/1721)
remote: Compressing objects: 78% (1343/1721)
remote: Compressing objects: 79% (1360/1721)
remote: Compressing objects: 80% (1377/1721)
remote: Compressing objects: 81% (1395/1721)
remote: Compressing objects: 82% (1412/1721)
remote: Compressing objects: 83% (1429/1721)
remote: Compressing objects: 84% (1446/1721)
remote: Compressing objects: 85% (1463/1721)
remote: Compressing objects: 86% (1481/1721)
remote: Compressing objects: 87% (1498/1721)
remote: Compressing objects: 88% (1515/1721)
remote: Compressing objects: 89% (1532/1721)
remote: Compressing objects: 90% (1549/1721)
remote: Compressing objects: 91% (1567/1721)
remote: Compressing objects: 92% (1584/1721)
remote: Compressing objects: 93% (1601/1721)
remote: Compressing objects: 94% (1618/1721)
remote: Compressing objects: 95% (1635/1721)
remote: Compressing objects: 96% (1653/1721)
remote: Compressing objects: 97% (1670/1721)
remote: Compressing objects: 98% (1687/1721)
remote: Compressing objects: 99% (1704/1721)
remote: Compressing objects: 100% (1721/1721)
remote: Compressing objects: 100% (1721/1721), done.
- 5.09 s
Receiving objects: 0% (1/65431)
Receiving objects: 1% (655/65431)
Receiving objects: 2% (1309/65431)
Receiving objects: 3% (1963/65431)
Receiving objects: 4% (2618/65431)
Receiving objects: 5% (3272/65431)
Receiving objects: 6% (3926/65431)
Receiving objects: 7% (4581/65431)
Receiving objects: 8% (5235/65431)
Receiving objects: 9% (5889/65431)
Receiving objects: 10% (6544/65431)
Receiving objects: 11% (7198/65431)
Receiving objects: 12% (7852/65431), 17.12 MiB | 34.22 MiB/s
Receiving objects: 13% (8507/65431), 17.12 MiB | 34.22 MiB/s
Receiving objects: 14% (9161/65431), 17.12 MiB | 34.22 MiB/s
Receiving objects: 15% (9815/65431), 17.12 MiB | 34.22 MiB/s
Receiving objects: 16% (10469/65431), 17.12 MiB | 34.22 MiB/s
Receiving objects: 17% (11124/65431), 17.12 MiB | 34.22 MiB/s
Receiving objects: 18% (11778/65431), 17.12 MiB | 34.22 MiB/s
Receiving objects: 19% (12432/65431), 17.12 MiB | 34.22 MiB/s
Receiving objects: 20% (13087/65431), 17.12 MiB | 34.22 MiB/s
Receiving objects: 21% (13741/65431), 17.12 MiB | 34.22 MiB/s
Receiving objects: 22% (14395/65431), 17.12 MiB | 34.22 MiB/s
Receiving objects: 23% (15050/65431), 17.12 MiB | 34.22 MiB/s
Receiving objects: 24% (15704/65431), 17.12 MiB | 34.22 MiB/s
Receiving objects: 25% (16358/65431), 17.12 MiB | 34.22 MiB/s
Receiving objects: 26% (17013/65431), 17.12 MiB | 34.22 MiB/s
Receiving objects: 27% (17667/65431), 17.12 MiB | 34.22 MiB/s
Receiving objects: 28% (18321/65431), 17.12 MiB | 34.22 MiB/s
Receiving objects: 29% (18975/65431), 17.12 MiB | 34.22 MiB/s
Receiving objects: 30% (19630/65431), 17.12 MiB | 34.22 MiB/s
Receiving objects: 31% (20284/65431), 17.12 MiB | 34.22 MiB/s
Receiving objects: 32% (20938/65431), 17.12 MiB | 34.22 MiB/s
Receiving objects: 33% (21593/65431), 17.12 MiB | 34.22 MiB/s
Receiving objects: 34% (22247/65431), 17.12 MiB | 34.22 MiB/s
Receiving objects: 35% (22901/65431), 17.12 MiB | 34.22 MiB/s
Receiving objects: 36% (23556/65431), 17.12 MiB | 34.22 MiB/s
Receiving objects: 37% (24210/65431), 17.12 MiB | 34.22 MiB/s
Receiving objects: 38% (24864/65431), 17.12 MiB | 34.22 MiB/s
Receiving objects: 39% (25519/65431), 17.12 MiB | 34.22 MiB/s
Receiving objects: 40% (26173/65431), 17.12 MiB | 34.22 MiB/s
Receiving objects: 41% (26827/65431), 17.12 MiB | 34.22 MiB/s
Receiving objects: 42% (27482/65431), 17.12 MiB | 34.22 MiB/s
Receiving objects: 43% (28136/65431), 17.12 MiB | 34.22 MiB/s
Receiving objects: 44% (28790/65431), 17.12 MiB | 34.22 MiB/s
Receiving objects: 45% (29444/65431), 17.12 MiB | 34.22 MiB/s
Receiving objects: 46% (30099/65431), 17.12 MiB | 34.22 MiB/s
Receiving objects: 47% (30753/65431), 17.12 MiB | 34.22 MiB/s
Receiving objects: 48% (31407/65431), 17.12 MiB | 34.22 MiB/s
Receiving objects: 49% (32062/65431), 17.12 MiB | 34.22 MiB/s
Receiving objects: 50% (32716/65431), 17.12 MiB | 34.22 MiB/s
Receiving objects: 51% (33370/65431), 17.12 MiB | 34.22 MiB/s
Receiving objects: 52% (34025/65431), 17.12 MiB | 34.22 MiB/s
Receiving objects: 53% (34679/65431), 17.12 MiB | 34.22 MiB/s
Receiving objects: 53% (35027/65431), 17.12 MiB | 34.22 MiB/s
Receiving objects: 54% (35333/65431), 34.82 MiB | 34.81 MiB/s
Receiving objects: 55% (35988/65431), 34.82 MiB | 34.81 MiB/s
Receiving objects: 56% (36642/65431), 34.82 MiB | 34.81 MiB/s
Receiving objects: 57% (37296/65431), 34.82 MiB | 34.81 MiB/s
Receiving objects: 58% (37950/65431), 34.82 MiB | 34.81 MiB/s
Receiving objects: 59% (38605/65431), 34.82 MiB | 34.81 MiB/s
Receiving objects: 60% (39259/65431), 34.82 MiB | 34.81 MiB/s
Receiving objects: 61% (39913/65431), 34.82 MiB | 34.81 MiB/s
Receiving objects: 62% (40568/65431), 34.82 MiB | 34.81 MiB/s
Receiving objects: 63% (41222/65431), 34.82 MiB | 34.81 MiB/s
Receiving objects: 64% (41876/65431), 34.82 MiB | 34.81 MiB/s
Receiving objects: 65% (42531/65431), 34.82 MiB | 34.81 MiB/s
Receiving objects: 66% (43185/65431), 34.82 MiB | 34.81 MiB/s
Receiving objects: 67% (43839/65431), 34.82 MiB | 34.81 MiB/s
Receiving objects: 68% (44494/65431), 52.96 MiB | 35.30 MiB/s
Receiving objects: 69% (45148/65431), 52.96 MiB | 35.30 MiB/s
Receiving objects: 70% (45802/65431), 52.96 MiB | 35.30 MiB/s
Receiving objects: 71% (46457/65431), 52.96 MiB | 35.30 MiB/s
Receiving objects: 72% (47111/65431), 52.96 MiB | 35.30 MiB/s
Receiving objects: 73% (47765/65431), 52.96 MiB | 35.30 MiB/s
Receiving objects: 74% (48419/65431), 52.96 MiB | 35.30 MiB/s
Receiving objects: 75% (49074/65431), 52.96 MiB | 35.30 MiB/s
Receiving objects: 76% (49728/65431), 52.96 MiB | 35.30 MiB/s
Receiving objects: 77% (50382/65431), 52.96 MiB | 35.30 MiB/s
Receiving objects: 77% (50427/65431), 70.07 MiB | 35.03 MiB/s
Receiving objects: 78% (51037/65431), 70.07 MiB | 35.03 MiB/s
Receiving objects: 79% (51691/65431), 70.07 MiB | 35.03 MiB/s
Receiving objects: 80% (52345/65431), 70.07 MiB | 35.03 MiB/s
Receiving objects: 81% (53000/65431), 70.07 MiB | 35.03 MiB/s
Receiving objects: 82% (53654/65431), 70.07 MiB | 35.03 MiB/s
Receiving objects: 83% (54308/65431), 70.07 MiB | 35.03 MiB/s
Receiving objects: 84% (54963/65431), 70.07 MiB | 35.03 MiB/s
Receiving objects: 85% (55617/65431), 70.07 MiB | 35.03 MiB/s
Receiving objects: 86% (56271/65431), 70.07 MiB | 35.03 MiB/s
Receiving objects: 87% (56925/65431), 70.07 MiB | 35.03 MiB/s
Receiving objects: 88% (57580/65431), 70.07 MiB | 35.03 MiB/s
Receiving objects: 89% (58234/65431), 70.07 MiB | 35.03 MiB/s
Receiving objects: 90% (58888/65431), 70.07 MiB | 35.03 MiB/s
Receiving objects: 91% (59543/65431), 70.07 MiB | 35.03 MiB/s
Receiving objects: 92% (60197/65431), 70.07 MiB | 35.03 MiB/s
Receiving objects: 93% (60851/65431), 70.07 MiB | 35.03 MiB/s
Receiving objects: 94% (61506/65431), 70.07 MiB | 35.03 MiB/s
Receiving objects: 95% (62160/65431), 70.07 MiB | 35.03 MiB/s
Receiving objects: 96% (62814/65431), 70.07 MiB | 35.03 MiB/s
Receiving objects: 97% (63469/65431), 85.46 MiB | 33.94 MiB/s
Receiving objects: 98% (64123/65431), 85.46 MiB | 33.94 MiB/s
Receiving objects: 99% (64777/65431), 85.46 MiB | 33.94 MiB/s
remote: Total 65431 (delta 6911), reused 6518 (delta 6342), pack-reused 57349 (from 1)
- 5.10 s
Receiving objects: 100% (65431/65431), 85.46 MiB | 33.94 MiB/s
Receiving objects: 100% (65431/65431), 88.67 MiB | 33.78 MiB/s, done.
- 5.75 s
Resolving deltas: 0% (0/46029)
Resolving deltas: 1% (461/46029)
Resolving deltas: 2% (921/46029)
Resolving deltas: 3% (1381/46029)
Resolving deltas: 4% (1843/46029)
Resolving deltas: 5% (2302/46029)
Resolving deltas: 6% (2762/46029)
Resolving deltas: 7% (3223/46029)
Resolving deltas: 8% (3683/46029)
Resolving deltas: 9% (4143/46029)
Resolving deltas: 10% (4603/46029)
Resolving deltas: 11% (5064/46029)
Resolving deltas: 12% (5525/46029)
Resolving deltas: 13% (5985/46029)
Resolving deltas: 14% (6445/46029)
Resolving deltas: 15% (6910/46029)
Resolving deltas: 16% (7365/46029)
Resolving deltas: 17% (7826/46029)
Resolving deltas: 18% (8286/46029)
Resolving deltas: 19% (8746/46029)
Resolving deltas: 20% (9207/46029)
Resolving deltas: 21% (9667/46029)
Resolving deltas: 22% (10127/46029)
Resolving deltas: 23% (10587/46029)
Resolving deltas: 24% (11047/46029)
Resolving deltas: 25% (11508/46029)
Resolving deltas: 26% (11968/46029)
Resolving deltas: 27% (12428/46029)
Resolving deltas: 28% (12889/46029)
Resolving deltas: 29% (13349/46029)
Resolving deltas: 30% (13809/46029)
Resolving deltas: 31% (14269/46029)
Resolving deltas: 32% (14730/46029)
Resolving deltas: 33% (15190/46029)
Resolving deltas: 34% (15650/46029)
Resolving deltas: 35% (16111/46029)
Resolving deltas: 36% (16571/46029)
Resolving deltas: 37% (17031/46029)
Resolving deltas: 38% (17492/46029)
Resolving deltas: 39% (17952/46029)
Resolving deltas: 40% (18412/46029)
Resolving deltas: 41% (18872/46029)
Resolving deltas: 42% (19333/46029)
Resolving deltas: 43% (19793/46029)
Resolving deltas: 44% (20253/46029)
Resolving deltas: 45% (20714/46029)
Resolving deltas: 46% (21176/46029)
Resolving deltas: 47% (21634/46029)
Resolving deltas: 48% (22094/46029)
Resolving deltas: 49% (22555/46029)
Resolving deltas: 50% (23016/46029)
Resolving deltas: 51% (23475/46029)
Resolving deltas: 52% (23936/46029)
Resolving deltas: 53% (24396/46029)
Resolving deltas: 54% (24856/46029)
Resolving deltas: 55% (25316/46029)
Resolving deltas: 56% (25777/46029)
Resolving deltas: 57% (26237/46029)
Resolving deltas: 58% (26697/46029)
Resolving deltas: 59% (27158/46029)
Resolving deltas: 60% (27619/46029)
Resolving deltas: 61% (28078/46029)
Resolving deltas: 62% (28540/46029)
Resolving deltas: 63% (29002/46029)
Resolving deltas: 64% (29459/46029)
Resolving deltas: 65% (29919/46029)
Resolving deltas: 66% (30380/46029)
Resolving deltas: 67% (30840/46029)
Resolving deltas: 68% (31300/46029)
Resolving deltas: 69% (31761/46029)
Resolving deltas: 70% (32221/46029)
Resolving deltas: 71% (32681/46029)
Resolving deltas: 72% (33141/46029)
Resolving deltas: 73% (33602/46029)
Resolving deltas: 74% (34062/46029)
Resolving deltas: 75% (34523/46029)
Resolving deltas: 76% (34983/46029)
Resolving deltas: 77% (35443/46029)
Resolving deltas: 78% (35903/46029)
Resolving deltas: 79% (36363/46029)
Resolving deltas: 80% (36824/46029)
Resolving deltas: 81% (37284/46029)
Resolving deltas: 82% (37744/46029)
Resolving deltas: 83% (38205/46029)
Resolving deltas: 84% (38667/46029)
Resolving deltas: 85% (39125/46029)
Resolving deltas: 86% (39585/46029)
Resolving deltas: 87% (40046/46029)
Resolving deltas: 88% (40506/46029)
Resolving deltas: 89% (40966/46029)
Resolving deltas: 90% (41427/46029)
Resolving deltas: 91% (41887/46029)
Resolving deltas: 92% (42347/46029)
Resolving deltas: 93% (42807/46029)
Resolving deltas: 94% (43268/46029)
Resolving deltas: 95% (43729/46029)
Resolving deltas: 96% (44188/46029)
Resolving deltas: 97% (44650/46029)
Resolving deltas: 98% (45109/46029)
Resolving deltas: 99% (45569/46029)
Resolving deltas: 100% (46029/46029)
Resolving deltas: 100% (46029/46029), done.
- 6.05 s
Fetching commit 300fe4656edc32971c94203965703aa5d19e5b73 for push-vrpyqyylypmw ...
- 6.05 s
$ /nix/store/bcnisk3ydfgv26v2gw3zlky24g00yww2-git-2.54.0/bin/git fetch origin 300fe4656edc32971c94203965703aa5d19e5b73
- 6.45 s
From https://github.com/alphal00p/gammaloop
- 6.45 s
* branch 300fe4656edc32971c94203965703aa5d19e5b73 -> FETCH_HEAD
- 6.46 s
$ /nix/store/9ypz3flqsrl5xl495mm8h645gadjsxi1-coreutils-9.11/bin/timeout --kill-after=15s 7200s /nix/store/bcnisk3ydfgv26v2gw3zlky24g00yww2-git-2.54.0/bin/git -c advice.detachedHead=false checkout 300fe4656edc32971c94203965703aa5d19e5b73
- 6.67 s
HEAD is now at 300fe465 bundle standalone Linnest rendering in linnet-py
- 6.68 s
$ /nix/store/9ypz3flqsrl5xl495mm8h645gadjsxi1-coreutils-9.11/bin/timeout --kill-after=15s 7200s /nix/store/23zk8sgzamrbmj1fday15szf7f2279s8-nix-2.34.7/bin/nix --extra-experimental-features nix-command --extra-experimental-features flakes --log-format internal-json run .#packages.x86_64-linux.nix-ci-check-gammaloop-nextest-python-api --print-build-logs
- 14.36 s
- 14.46 s
Downloading cached gammaloop-nextest-binaries-python-api-gammaloop-integration-tests from https://cache.nix-ci.com
- 15.33 s
Downloading cached gammaloop-python-module from https://cache.nix-ci.com
- 15.35 s
Downloaded cached gammaloop-nextest-binaries-python-api-gammaloop-integration-tests (8.5 MiB) in 898ms
- 15.35 s
Progress: 0 of 1 built, 1 of 4 downloaded from cache (1 downloading)
- 15.35 s
Downloading cached gammaloop-nextest-binaries-python-api from https://cache.nix-ci.com
- 15.36 s
Downloaded cached gammaloop-nextest-binaries-python-api (520 B) in 2ms
- 15.36 s
Progress: 0 of 1 built, 2 of 4 downloaded from cache (1 downloading)
- 15.43 s
Downloaded cached gammaloop-python-module (133.9 MiB) in 97ms
- 15.43 s
Progress: 0 of 1 built, 3 of 4 downloaded from cache
- 15.43 s
Downloading cached nix-ci-check-gammaloop-nextest-python-api from https://cache.nix-ci.com
- 15.43 s
Downloaded cached nix-ci-check-gammaloop-nextest-python-api (1104 B) in 3ms
- 15.43 s
Progress: 0 of 1 built, 4 of 4 downloaded from cache
- 23.05 s
evaluating derivation 'g
copying '/nix/store/gi4f
evaluating derivation 'g
copying '/nix/store/gi4f
evaluating derivation 'g
copying '/nix/store/gi4f
evaluating derivation 'g
copying '/nix/store/gi4f
evaluating derivation 'g
copying '/nix/store/gi4f
evaluating derivation 'g
copying '/nix/store/gi4f
evaluating derivation 'g
copying '/nix/store/gi4f
evaluating derivation 'g
copying '/nix/store/gi4f
evaluating derivation 'g
copying '/nix/store/gi4f
evaluating derivation 'g
copying '/nix/store/gi4f
evaluating derivation 'g
copying '/nix/store/gi4f
evaluating derivation 'g
copying '/nix/store/gi4f
evaluating derivation 'g
copying '/nix/store/gi4f
evaluating derivation 'g
querying gammaloop-nexte
querying info about miss
querying gammaloop-nexte
[1.1 KiB DL] querying in
[0/7 built, 5/0/12 copie
[1/0/5 built, 2/5/12 copbuilder.pl> Running phase: patchPhase
- 25.07 s
builder.pl> Running phase: updateAutotoolsGnuConfigScriptsPhase
- 25.07 s
builder.pl> Running phase: configurePhase
- 25.07 s
builder.pl> no configure script, doing nothing
- 25.07 s
builder.pl> Running phase: buildPhase
- 25.07 s
builder.pl> Running phase: checkPhase
- 25.07 s
builder.pl> Running phase: installPhase
- 25.07 s
builder.pl> no Makefile or custom installPhase, doing nothing
- 25.07 s
builder.pl> Running phase: fixupPhase
- 25.07 s
builder.pl> shrinking RPATHs of ELF executables and libraries in /nix/store/n17p4y03iknmyjpnfk30rj7i0klr448n-builder.pl
- 25.07 s
builder.pl> checking for references to /build/ in /nix/store/n17p4y03iknmyjpnfk30rj7i0klr448n-builder.pl...
- 25.07 s
builder.pl> patching script interpreter paths in /nix/store/n17p4y03iknmyjpnfk30rj7i0klr448n-builder.pl
- 25.07 s
builder.pl (post)> Uploading to the NixCI cache: /nix/store/n17p4y03iknmyjpnfk30rj7i0klr448n-builder.pl
- 25.07 s
builder.pl (post)> warning: 'warn-short-path-literals' is deprecated, use 'lint-short-path-literals = ignore' instead
- 25.07 s
builder.pl (post)> copying 0 paths...
- 25.07 s
builder.pl (post)> warning: 'warn-short-path-literals' is deprecated, use 'lint-short-path-literals = ignore' instead
- 25.07 s
builder.pl (post)> copying 0 paths...
- 25.07 s
[1/4 built, 2/7/12 copie
[1/4 built, 2/8/12 copie
[1/4 built, 1/9/12 copie
[1/4 built, 1/11/12 copi
[1/1/3 built, 12 copied python3> structuredAttrs is enabled
- 25.07 s
python3> created 227 symlinks in user environment
- 25.07 s
python3 (post)> Uploading to the NixCI cache: /nix/store/3gi2x25n327sf3xma8b08jd57aqv69x5-python3-3.13.14-env
- 25.07 s
python3 (post)> warning: 'warn-short-path-literals' is deprecated, use 'lint-short-path-literals = ignore' instead
- 25.07 s
python3 (post)> copying 0 paths...
- 25.07 s
python3 (post)> warning: 'warn-short-path-literals' is deprecated, use 'lint-short-path-literals = ignore' instead
- 25.07 s
python3 (post)> copying 0 paths...
- 25.29 s
[2/4 built, 12 copied (2
[1/2/3 built, 12 copied gammaloop-nextest-python-api> Extracting 1 binary, 1 build script output directory, and 3 linked paths to /build/source
- 25.35 s
gammaloop-nextest-python-api> Extracted 18 files to /build/source in 0.06s
- 25.36 s
gammaloop-nextest-python-api> ------------
- 25.36 s
gammaloop-nextest-python-api> Nextest run ID c5d6ee22-b173-4e37-8fef-e81ba10b532a with nextest profile: ci_gammaloop
- 25.36 s
gammaloop-nextest-python-api> Starting 5 tests across 1 binary
- 25.47 s
gammaloop-nextest-python-api> FAIL [ 0.112s] (1/5) gammaloop-integration-tests::test_python_api python_evaluate_sample_honors_generate_events_and_observable_snapshots
- 25.47 s
gammaloop-nextest-python-api> stdout ---
- 25.47 s
gammaloop-nextest-python-api>
- 25.47 s
gammaloop-nextest-python-api> running 1 test
- 25.47 s
gammaloop-nextest-python-api> test python_evaluate_sample_honors_generate_events_and_observable_snapshots ... FAILED
- 25.47 s
gammaloop-nextest-python-api>
- 25.47 s
gammaloop-nextest-python-api> failures:
- 25.47 s
gammaloop-nextest-python-api>
- 25.47 s
gammaloop-nextest-python-api> failures:
- 25.47 s
gammaloop-nextest-python-api> python_evaluate_sample_honors_generate_events_and_observable_snapshots
- 25.47 s
gammaloop-nextest-python-api>
- 25.47 s
gammaloop-nextest-python-api> test result: FAILED. 0 passed; 1 failed; 0 ignored; 0 measured; 4 filtered out; finished in 0.11s
- 25.47 s
gammaloop-nextest-python-api>
- 25.47 s
gammaloop-nextest-python-api> stderr ---
- 25.47 s
gammaloop-nextest-python-api> Error: Python API test subprocess failed.
- 25.47 s
gammaloop-nextest-python-api> stdout:
- 25.47 s
gammaloop-nextest-python-api> ┌────────────────────────────────────────────────────────┐
- 25.47 s
gammaloop-nextest-python-api> │ You are running a restricted Symbolica instance. │
- 25.47 s
gammaloop-nextest-python-api> │ │
- 25.47 s
gammaloop-nextest-python-api> │ This mode is only permitted for non-commercial use and │
- 25.47 s
gammaloop-nextest-python-api> │ is limited to one instance and core per machine. │
- 25.47 s
gammaloop-nextest-python-api> │ │
- 25.47 s
gammaloop-nextest-python-api> │ Hobbyists can easily acquire a free license key │
- 25.47 s
gammaloop-nextest-python-api> │ that unlocks all cores and removes this banner: │
- 25.47 s
gammaloop-nextest-python-api> │ │
- 25.47 s
gammaloop-nextest-python-api> │ from symbolica import * │
- 25.47 s
gammaloop-nextest-python-api> │ request_hobbyist_license('YOUR_NAME', 'YOUR_EMAIL') │
- 25.47 s
gammaloop-nextest-python-api> │ │
- 25.47 s
gammaloop-nextest-python-api> │ All other users can obtain a free 30-day trial key: │
- 25.47 s
gammaloop-nextest-python-api> │ │
- 25.47 s
gammaloop-nextest-python-api> │ from symbolica import * │
- 25.47 s
gammaloop-nextest-python-api> │ request_trial_license('NAME', 'EMAIL', 'EMPLOYER') │
- 25.47 s
gammaloop-nextest-python-api> │ │
- 25.47 s
gammaloop-nextest-python-api> │ See https://symbolica.io/docs/get_started.html#license │
- 25.47 s
gammaloop-nextest-python-api> └────────────────────────────────────────────────────────┘
- 25.47 s
gammaloop-nextest-python-api> ┌───────────────────────────────────────────────────────────────────────────────────────────────────────────┐
- 25.47 s
gammaloop-nextest-python-api> │ Cannot start new unlicensed Symbolica instance since there is already another one running on the machine. │
- 25.47 s
gammaloop-nextest-python-api> └───────────────────────────────────────────────────────────────────────────────────────────────────────────┘
- 25.47 s
gammaloop-nextest-python-api>
- 25.47 s
gammaloop-nextest-python-api> stderr:
- 25.47 s
gammaloop-nextest-python-api> ┌───────────────────────────────────┐
- 25.47 s
gammaloop-nextest-python-api> │ The Symbolica license has expired │
- 25.47 s
gammaloop-nextest-python-api> └───────────────────────────────────┘
- 25.47 s
gammaloop-nextest-python-api>
- 25.47 s
gammaloop-nextest-python-api>
- 25.47 s
gammaloop-nextest-python-api> Location:
- 25.47 s
gammaloop-nextest-python-api> tests/tests/test_python_api.rs:156:20
- 25.47 s
gammaloop-nextest-python-api>
- 25.47 s
gammaloop-nextest-python-api> FAIL [ 0.112s] (2/5) gammaloop-integration-tests::test_python_api python_session_getters_return_live_toml_and_command_blocks
- 25.47 s
gammaloop-nextest-python-api> stdout ---
- 25.47 s
gammaloop-nextest-python-api>
- 25.47 s
gammaloop-nextest-python-api> running 1 test
- 25.47 s
gammaloop-nextest-python-api> test python_session_getters_return_live_toml_and_command_blocks ... FAILED
- 25.47 s
gammaloop-nextest-python-api>
- 25.47 s
gammaloop-nextest-python-api> failures:
- 25.47 s
gammaloop-nextest-python-api>
- 25.47 s
gammaloop-nextest-python-api> failures:
- 25.47 s
gammaloop-nextest-python-api> python_session_getters_return_live_toml_and_command_blocks
- 25.47 s
gammaloop-nextest-python-api>
- 25.47 s
gammaloop-nextest-python-api> test result: FAILED. 0 passed; 1 failed; 0 ignored; 0 measured; 4 filtered out; finished in 0.11s
- 25.47 s
gammaloop-nextest-python-api>
- 25.47 s
gammaloop-nextest-python-api> stderr ---
- 25.47 s
gammaloop-nextest-python-api> Error: Python API test subprocess failed.
- 25.47 s
gammaloop-nextest-python-api> stdout:
- 25.47 s
gammaloop-nextest-python-api> ┌────────────────────────────────────────────────────────┐
- 25.47 s
gammaloop-nextest-python-api> │ You are running a restricted Symbolica instance. │
- 25.47 s
gammaloop-nextest-python-api> │ │
- 25.47 s
gammaloop-nextest-python-api> │ This mode is only permitted for non-commercial use and │
- 25.47 s
gammaloop-nextest-python-api> │ is limited to one instance and core per machine. │
- 25.47 s
gammaloop-nextest-python-api> │ │
- 25.47 s
gammaloop-nextest-python-api> │ Hobbyists can easily acquire a free license key │
- 25.47 s
gammaloop-nextest-python-api> │ that unlocks all cores and removes this banner: │
- 25.47 s
gammaloop-nextest-python-api> │ │
- 25.47 s
gammaloop-nextest-python-api> │ from symbolica import * │
- 25.47 s
gammaloop-nextest-python-api> │ request_hobbyist_license('YOUR_NAME', 'YOUR_EMAIL') │
- 25.47 s
gammaloop-nextest-python-api> │ │
- 25.47 s
gammaloop-nextest-python-api> │ All other users can obtain a free 30-day trial key: │
- 25.47 s
gammaloop-nextest-python-api> │ │
- 25.47 s
gammaloop-nextest-python-api> │ from symbolica import * │
- 25.47 s
gammaloop-nextest-python-api> │ request_trial_license('NAME', 'EMAIL', 'EMPLOYER') │
- 25.47 s
gammaloop-nextest-python-api> │ │
- 25.47 s
gammaloop-nextest-python-api> │ See https://symbolica.io/docs/get_started.html#license │
- 25.47 s
gammaloop-nextest-python-api> └────────────────────────────────────────────────────────┘
- 25.47 s
gammaloop-nextest-python-api> ┌───────────────────────────────────────────────────────────────────────────────────────────────────────────┐
- 25.47 s
gammaloop-nextest-python-api> │ Cannot start new unlicensed Symbolica instance since there is already another one running on the machine. │
- 25.47 s
gammaloop-nextest-python-api> └───────────────────────────────────────────────────────────────────────────────────────────────────────────┘
- 25.47 s
gammaloop-nextest-python-api>
- 25.47 s
gammaloop-nextest-python-api> stderr:
- 25.47 s
gammaloop-nextest-python-api> ┌───────────────────────────────────┐
- 25.47 s
gammaloop-nextest-python-api> │ The Symbolica license has expired │
- 25.47 s
gammaloop-nextest-python-api> └───────────────────────────────────┘
- 25.47 s
gammaloop-nextest-python-api>
- 25.47 s
gammaloop-nextest-python-api>
- 25.47 s
gammaloop-nextest-python-api> Location:
- 25.47 s
gammaloop-nextest-python-api> tests/tests/test_python_api.rs:156:20
- 25.47 s
gammaloop-nextest-python-api>
- 25.47 s
gammaloop-nextest-python-api> FAIL [ 0.112s] (3/5) gammaloop-integration-tests::test_python_api python_evaluate_samples_batch_and_momentum_space_have_expected_shape
- 25.47 s
gammaloop-nextest-python-api> stdout ---
- 25.47 s
gammaloop-nextest-python-api>
- 25.47 s
gammaloop-nextest-python-api> running 1 test
- 25.47 s
gammaloop-nextest-python-api> test python_evaluate_samples_batch_and_momentum_space_have_expected_shape ... FAILED
- 25.47 s
gammaloop-nextest-python-api>
- 25.47 s
gammaloop-nextest-python-api> failures:
- 25.47 s
gammaloop-nextest-python-api>
- 25.47 s
gammaloop-nextest-python-api> failures:
- 25.47 s
gammaloop-nextest-python-api> python_evaluate_samples_batch_and_momentum_space_have_expected_shape
- 25.47 s
gammaloop-nextest-python-api>
- 25.47 s
gammaloop-nextest-python-api> test result: FAILED. 0 passed; 1 failed; 0 ignored; 0 measured; 4 filtered out; finished in 0.11s
- 25.47 s
gammaloop-nextest-python-api>
- 25.47 s
gammaloop-nextest-python-api> stderr ---
- 25.47 s
gammaloop-nextest-python-api> Error: Python API test subprocess failed.
- 25.47 s
gammaloop-nextest-python-api> stdout:
- 25.47 s
gammaloop-nextest-python-api> ┌────────────────────────────────────────────────────────┐
- 25.47 s
gammaloop-nextest-python-api> │ You are running a restricted Symbolica instance. │
- 25.47 s
gammaloop-nextest-python-api> │ │
- 25.47 s
gammaloop-nextest-python-api> │ This mode is only permitted for non-commercial use and │
- 25.47 s
gammaloop-nextest-python-api> │ is limited to one instance and core per machine. │
- 25.47 s
gammaloop-nextest-python-api> │ │
- 25.47 s
gammaloop-nextest-python-api> │ Hobbyists can easily acquire a free license key │
- 25.47 s
gammaloop-nextest-python-api> │ that unlocks all cores and removes this banner: │
- 25.47 s
gammaloop-nextest-python-api> │ │
- 25.47 s
gammaloop-nextest-python-api> │ from symbolica import * │
- 25.47 s
gammaloop-nextest-python-api> │ request_hobbyist_license('YOUR_NAME', 'YOUR_EMAIL') │
- 25.47 s
gammaloop-nextest-python-api> │ │
- 25.47 s
gammaloop-nextest-python-api> │ All other users can obtain a free 30-day trial key: │
- 25.47 s
gammaloop-nextest-python-api> │ │
- 25.47 s
gammaloop-nextest-python-api> │ from symbolica import * │
- 25.47 s
gammaloop-nextest-python-api> │ request_trial_license('NAME', 'EMAIL', 'EMPLOYER') │
- 25.47 s
gammaloop-nextest-python-api> │ │
- 25.47 s
gammaloop-nextest-python-api> │ See https://symbolica.io/docs/get_started.html#license │
- 25.47 s
gammaloop-nextest-python-api> └────────────────────────────────────────────────────────┘
- 25.47 s
gammaloop-nextest-python-api> ┌───────────────────────────────────────────────────────────────────────────────────────────────────────────┐
- 25.47 s
gammaloop-nextest-python-api> │ Cannot start new unlicensed Symbolica instance since there is already another one running on the machine. │
- 25.47 s
gammaloop-nextest-python-api> └───────────────────────────────────────────────────────────────────────────────────────────────────────────┘
- 25.47 s
gammaloop-nextest-python-api>
- 25.47 s
gammaloop-nextest-python-api> stderr:
- 25.47 s
gammaloop-nextest-python-api> ┌───────────────────────────────────┐
- 25.47 s
gammaloop-nextest-python-api> │ The Symbolica license has expired │
- 25.47 s
gammaloop-nextest-python-api> └───────────────────────────────────┘
- 25.47 s
gammaloop-nextest-python-api>
- 25.47 s
gammaloop-nextest-python-api>
- 25.47 s
gammaloop-nextest-python-api> Location:
- 25.47 s
gammaloop-nextest-python-api> tests/tests/test_python_api.rs:156:20
- 25.47 s
gammaloop-nextest-python-api>
- 25.48 s
gammaloop-nextest-python-api> FAIL [ 0.120s] (4/5) gammaloop-integration-tests::test_python_api python_evaluate_sample_preserves_graph_grouping_and_incoming_pdgs
- 25.48 s
gammaloop-nextest-python-api> stdout ---
- 25.48 s
gammaloop-nextest-python-api>
- 25.48 s
gammaloop-nextest-python-api> running 1 test
- 25.48 s
gammaloop-nextest-python-api> test python_evaluate_sample_preserves_graph_grouping_and_incoming_pdgs ... FAILED
- 25.48 s
gammaloop-nextest-python-api>
- 25.48 s
gammaloop-nextest-python-api> failures:
- 25.48 s
gammaloop-nextest-python-api>
- 25.48 s
gammaloop-nextest-python-api> failures:
- 25.48 s
gammaloop-nextest-python-api> python_evaluate_sample_preserves_graph_grouping_and_incoming_pdgs
- 25.48 s
gammaloop-nextest-python-api>
- 25.48 s
gammaloop-nextest-python-api> test result: FAILED. 0 passed; 1 failed; 0 ignored; 0 measured; 4 filtered out; finished in 0.12s
- 25.48 s
gammaloop-nextest-python-api>
- 25.48 s
gammaloop-nextest-python-api> stderr ---
- 25.48 s
gammaloop-nextest-python-api> Error: Python API test subprocess failed.
- 25.48 s
gammaloop-nextest-python-api> stdout:
- 25.48 s
gammaloop-nextest-python-api> ┌────────────────────────────────────────────────────────┐
- 25.48 s
gammaloop-nextest-python-api> │ You are running a restricted Symbolica instance. │
- 25.48 s
gammaloop-nextest-python-api> │ │
- 25.48 s
gammaloop-nextest-python-api> │ This mode is only permitted for non-commercial use and │
- 25.48 s
gammaloop-nextest-python-api> │ is limited to one instance and core per machine. │
- 25.48 s
gammaloop-nextest-python-api> │ │
- 25.48 s
gammaloop-nextest-python-api> │ Hobbyists can easily acquire a free license key │
- 25.48 s
gammaloop-nextest-python-api> │ that unlocks all cores and removes this banner: │
- 25.48 s
gammaloop-nextest-python-api> │ │
- 25.48 s
gammaloop-nextest-python-api> │ from symbolica import * │
- 25.48 s
gammaloop-nextest-python-api> │ request_hobbyist_license('YOUR_NAME', 'YOUR_EMAIL') │
- 25.48 s
gammaloop-nextest-python-api> │ │
- 25.48 s
gammaloop-nextest-python-api> │ All other users can obtain a free 30-day trial key: │
- 25.48 s
gammaloop-nextest-python-api> │ │
- 25.48 s
gammaloop-nextest-python-api> │ from symbolica import * │
- 25.48 s
gammaloop-nextest-python-api> │ request_trial_license('NAME', 'EMAIL', 'EMPLOYER') │
- 25.48 s
gammaloop-nextest-python-api> │ │
- 25.48 s
gammaloop-nextest-python-api> │ See https://symbolica.io/docs/get_started.html#license │
- 25.48 s
gammaloop-nextest-python-api> └────────────────────────────────────────────────────────┘
- 25.48 s
gammaloop-nextest-python-api> ┌───────────────────────────────────────────────────────────────────────────────────────────────────────────┐
- 25.48 s
gammaloop-nextest-python-api> │ Cannot start new unlicensed Symbolica instance since there is already another one running on the machine. │
- 25.48 s
gammaloop-nextest-python-api> └───────────────────────────────────────────────────────────────────────────────────────────────────────────┘
- 25.48 s
gammaloop-nextest-python-api>
- 25.48 s
gammaloop-nextest-python-api> stderr:
- 25.48 s
gammaloop-nextest-python-api> ┌───────────────────────────────────┐
- 25.48 s
gammaloop-nextest-python-api> │ The Symbolica license has expired │
- 25.48 s
gammaloop-nextest-python-api> └───────────────────────────────────┘
- 25.48 s
gammaloop-nextest-python-api>
- 25.48 s
gammaloop-nextest-python-api>
- 25.48 s
gammaloop-nextest-python-api> Location:
- 25.48 s
gammaloop-nextest-python-api> tests/tests/test_python_api.rs:156:20
- 25.48 s
gammaloop-nextest-python-api>
- 25.64 s
gammaloop-nextest-python-api> ------------
- 25.64 s
gammaloop-nextest-python-api> Summary [ 0.282s] 5 tests run: 1 passed, 4 failed, 0 skipped
- 25.64 s
gammaloop-nextest-python-api> FAIL [ 0.112s] (1/5) gammaloop-integration-tests::test_python_api python_evaluate_sample_honors_generate_events_and_observable_snapshots
- 25.64 s
gammaloop-nextest-python-api> stdout ---
- 25.64 s
gammaloop-nextest-python-api>
- 25.64 s
gammaloop-nextest-python-api> running 1 test
- 25.64 s
gammaloop-nextest-python-api> test python_evaluate_sample_honors_generate_events_and_observable_snapshots ... FAILED
- 25.64 s
gammaloop-nextest-python-api>
- 25.64 s
gammaloop-nextest-python-api> failures:
- 25.64 s
gammaloop-nextest-python-api>
- 25.64 s
gammaloop-nextest-python-api> failures:
- 25.64 s
gammaloop-nextest-python-api> python_evaluate_sample_honors_generate_events_and_observable_snapshots
- 25.64 s
gammaloop-nextest-python-api>
- 25.64 s
gammaloop-nextest-python-api> test result: FAILED. 0 passed; 1 failed; 0 ignored; 0 measured; 4 filtered out; finished in 0.11s
- 25.64 s
gammaloop-nextest-python-api>
- 25.64 s
gammaloop-nextest-python-api> stderr ---
- 25.64 s
gammaloop-nextest-python-api> Error: Python API test subprocess failed.
- 25.64 s
gammaloop-nextest-python-api> stdout:
- 25.64 s
gammaloop-nextest-python-api> ┌────────────────────────────────────────────────────────┐
- 25.64 s
gammaloop-nextest-python-api> │ You are running a restricted Symbolica instance. │
- 25.64 s
gammaloop-nextest-python-api> │ │
- 25.64 s
gammaloop-nextest-python-api> │ This mode is only permitted for non-commercial use and │
- 25.64 s
gammaloop-nextest-python-api> │ is limited to one instance and core per machine. │
- 25.64 s
gammaloop-nextest-python-api> │ │
- 25.64 s
gammaloop-nextest-python-api> │ Hobbyists can easily acquire a free license key │
- 25.64 s
gammaloop-nextest-python-api> │ that unlocks all cores and removes this banner: │
- 25.64 s
gammaloop-nextest-python-api> │ │
- 25.64 s
gammaloop-nextest-python-api> │ from symbolica import * │
- 25.64 s
gammaloop-nextest-python-api> │ request_hobbyist_license('YOUR_NAME', 'YOUR_EMAIL') │
- 25.64 s
gammaloop-nextest-python-api> │ │
- 25.64 s
gammaloop-nextest-python-api> │ All other users can obtain a free 30-day trial key: │
- 25.64 s
gammaloop-nextest-python-api> │ │
- 25.64 s
gammaloop-nextest-python-api> │ from symbolica import * │
- 25.64 s
gammaloop-nextest-python-api> │ request_trial_license('NAME', 'EMAIL', 'EMPLOYER') │
- 25.64 s
gammaloop-nextest-python-api> │ │
- 25.64 s
gammaloop-nextest-python-api> │ See https://symbolica.io/docs/get_started.html#license │
- 25.64 s
gammaloop-nextest-python-api> └────────────────────────────────────────────────────────┘
- 25.64 s
gammaloop-nextest-python-api> ┌───────────────────────────────────────────────────────────────────────────────────────────────────────────┐
- 25.64 s
gammaloop-nextest-python-api> │ Cannot start new unlicensed Symbolica instance since there is already another one running on the machine. │
- 25.64 s
gammaloop-nextest-python-api> └───────────────────────────────────────────────────────────────────────────────────────────────────────────┘
- 25.64 s
gammaloop-nextest-python-api>
- 25.64 s
gammaloop-nextest-python-api> stderr:
- 25.64 s
gammaloop-nextest-python-api> ┌───────────────────────────────────┐
- 25.64 s
gammaloop-nextest-python-api> │ The Symbolica license has expired │
- 25.64 s
gammaloop-nextest-python-api> └───────────────────────────────────┘
- 25.64 s
gammaloop-nextest-python-api>
- 25.64 s
gammaloop-nextest-python-api>
- 25.64 s
gammaloop-nextest-python-api> Location:
- 25.64 s
gammaloop-nextest-python-api> tests/tests/test_python_api.rs:156:20
- 25.64 s
gammaloop-nextest-python-api>
- 25.64 s
gammaloop-nextest-python-api> FAIL [ 0.112s] (2/5) gammaloop-integration-tests::test_python_api python_session_getters_return_live_toml_and_command_blocks
- 25.64 s
gammaloop-nextest-python-api> stdout ---
- 25.64 s
gammaloop-nextest-python-api>
- 25.64 s
gammaloop-nextest-python-api> running 1 test
- 25.64 s
gammaloop-nextest-python-api> test python_session_getters_return_live_toml_and_command_blocks ... FAILED
- 25.64 s
gammaloop-nextest-python-api>
- 25.64 s
gammaloop-nextest-python-api> failures:
- 25.64 s
gammaloop-nextest-python-api>
- 25.64 s
gammaloop-nextest-python-api> failures:
- 25.64 s
gammaloop-nextest-python-api> python_session_getters_return_live_toml_and_command_blocks
- 25.64 s
gammaloop-nextest-python-api>
- 25.64 s
gammaloop-nextest-python-api> test result: FAILED. 0 passed; 1 failed; 0 ignored; 0 measured; 4 filtered out; finished in 0.11s
- 25.64 s
gammaloop-nextest-python-api>
- 25.64 s
gammaloop-nextest-python-api> stderr ---
- 25.64 s
gammaloop-nextest-python-api> Error: Python API test subprocess failed.
- 25.64 s
gammaloop-nextest-python-api> stdout:
- 25.64 s
gammaloop-nextest-python-api> ┌────────────────────────────────────────────────────────┐
- 25.64 s
gammaloop-nextest-python-api> │ You are running a restricted Symbolica instance. │
- 25.64 s
gammaloop-nextest-python-api> │ │
- 25.64 s
gammaloop-nextest-python-api> │ This mode is only permitted for non-commercial use and │
- 25.64 s
gammaloop-nextest-python-api> │ is limited to one instance and core per machine. │
- 25.64 s
gammaloop-nextest-python-api> │ │
- 25.64 s
gammaloop-nextest-python-api> │ Hobbyists can easily acquire a free license key │
- 25.64 s
gammaloop-nextest-python-api> │ that unlocks all cores and removes this banner: │
- 25.64 s
gammaloop-nextest-python-api> │ │
- 25.64 s
gammaloop-nextest-python-api> │ from symbolica import * │
- 25.64 s
gammaloop-nextest-python-api> │ request_hobbyist_license('YOUR_NAME', 'YOUR_EMAIL') │
- 25.64 s
gammaloop-nextest-python-api> │ │
- 25.64 s
gammaloop-nextest-python-api> │ All other users can obtain a free 30-day trial key: │
- 25.64 s
gammaloop-nextest-python-api> │ │
- 25.64 s
gammaloop-nextest-python-api> │ from symbolica import * │
- 25.64 s
gammaloop-nextest-python-api> │ request_trial_license('NAME', 'EMAIL', 'EMPLOYER') │
- 25.64 s
gammaloop-nextest-python-api> │ │
- 25.64 s
gammaloop-nextest-python-api> │ See https://symbolica.io/docs/get_started.html#license │
- 25.64 s
gammaloop-nextest-python-api> └────────────────────────────────────────────────────────┘
- 25.64 s
gammaloop-nextest-python-api> ┌───────────────────────────────────────────────────────────────────────────────────────────────────────────┐
- 25.64 s
gammaloop-nextest-python-api> │ Cannot start new unlicensed Symbolica instance since there is already another one running on the machine. │
- 25.64 s
gammaloop-nextest-python-api> └───────────────────────────────────────────────────────────────────────────────────────────────────────────┘
- 25.64 s
gammaloop-nextest-python-api>
- 25.64 s
gammaloop-nextest-python-api> stderr:
- 25.64 s
gammaloop-nextest-python-api> ┌───────────────────────────────────┐
- 25.64 s
gammaloop-nextest-python-api> │ The Symbolica license has expired │
- 25.64 s
gammaloop-nextest-python-api> └───────────────────────────────────┘
- 25.64 s
gammaloop-nextest-python-api>
- 25.64 s
gammaloop-nextest-python-api>
- 25.64 s
gammaloop-nextest-python-api> Location:
- 25.64 s
gammaloop-nextest-python-api> tests/tests/test_python_api.rs:156:20
- 25.64 s
gammaloop-nextest-python-api>
- 25.64 s
gammaloop-nextest-python-api> FAIL [ 0.112s] (3/5) gammaloop-integration-tests::test_python_api python_evaluate_samples_batch_and_momentum_space_have_expected_shape
- 25.64 s
gammaloop-nextest-python-api> stdout ---
- 25.64 s
gammaloop-nextest-python-api>
- 25.64 s
gammaloop-nextest-python-api> running 1 test
- 25.64 s
gammaloop-nextest-python-api> test python_evaluate_samples_batch_and_momentum_space_have_expected_shape ... FAILED
- 25.64 s
gammaloop-nextest-python-api>
- 25.64 s
gammaloop-nextest-python-api> failures:
- 25.64 s
gammaloop-nextest-python-api>
- 25.64 s
gammaloop-nextest-python-api> failures:
- 25.64 s
gammaloop-nextest-python-api> python_evaluate_samples_batch_and_momentum_space_have_expected_shape
- 25.64 s
gammaloop-nextest-python-api>
- 25.64 s
gammaloop-nextest-python-api> test result: FAILED. 0 passed; 1 failed; 0 ignored; 0 measured; 4 filtered out; finished in 0.11s
- 25.64 s
gammaloop-nextest-python-api>
- 25.64 s
gammaloop-nextest-python-api> stderr ---
- 25.64 s
gammaloop-nextest-python-api> Error: Python API test subprocess failed.
- 25.64 s
gammaloop-nextest-python-api> stdout:
- 25.64 s
gammaloop-nextest-python-api> ┌────────────────────────────────────────────────────────┐
- 25.64 s
gammaloop-nextest-python-api> │ You are running a restricted Symbolica instance. │
- 25.64 s
gammaloop-nextest-python-api> │ │
- 25.64 s
gammaloop-nextest-python-api> │ This mode is only permitted for non-commercial use and │
- 25.64 s
gammaloop-nextest-python-api> │ is limited to one instance and core per machine. │
- 25.64 s
gammaloop-nextest-python-api> │ │
- 25.64 s
gammaloop-nextest-python-api> │ Hobbyists can easily acquire a free license key │
- 25.64 s
gammaloop-nextest-python-api> │ that unlocks all cores and removes this banner: │
- 25.64 s
gammaloop-nextest-python-api> │ │
- 25.64 s
gammaloop-nextest-python-api> │ from symbolica import * │
- 25.64 s
gammaloop-nextest-python-api> │ request_hobbyist_license('YOUR_NAME', 'YOUR_EMAIL') │
- 25.64 s
gammaloop-nextest-python-api> │ │
- 25.64 s
gammaloop-nextest-python-api> │ All other users can obtain a free 30-day trial key: │
- 25.64 s
gammaloop-nextest-python-api> │ │
- 25.64 s
gammaloop-nextest-python-api> │ from symbolica import * │
- 25.64 s
gammaloop-nextest-python-api> │ request_trial_license('NAME', 'EMAIL', 'EMPLOYER') │
- 25.64 s
gammaloop-nextest-python-api> │ │
- 25.64 s
gammaloop-nextest-python-api> │ See https://symbolica.io/docs/get_started.html#license │
- 25.64 s
gammaloop-nextest-python-api> └────────────────────────────────────────────────────────┘
- 25.64 s
gammaloop-nextest-python-api> ┌───────────────────────────────────────────────────────────────────────────────────────────────────────────┐
- 25.64 s
gammaloop-nextest-python-api> │ Cannot start new unlicensed Symbolica instance since there is already another one running on the machine. │
- 25.64 s
gammaloop-nextest-python-api> └───────────────────────────────────────────────────────────────────────────────────────────────────────────┘
- 25.64 s
gammaloop-nextest-python-api>
- 25.64 s
gammaloop-nextest-python-api> stderr:
- 25.64 s
gammaloop-nextest-python-api> ┌───────────────────────────────────┐
- 25.64 s
gammaloop-nextest-python-api> │ The Symbolica license has expired │
- 25.64 s
gammaloop-nextest-python-api> └───────────────────────────────────┘
- 25.64 s
gammaloop-nextest-python-api>
- 25.64 s
gammaloop-nextest-python-api>
- 25.64 s
gammaloop-nextest-python-api> Location:
- 25.64 s
gammaloop-nextest-python-api> tests/tests/test_python_api.rs:156:20
- 25.64 s
gammaloop-nextest-python-api>
- 25.64 s
gammaloop-nextest-python-api> FAIL [ 0.120s] (4/5) gammaloop-integration-tests::test_python_api python_evaluate_sample_preserves_graph_grouping_and_incoming_pdgs
- 25.64 s
gammaloop-nextest-python-api> stdout ---
- 25.64 s
gammaloop-nextest-python-api>
- 25.64 s
gammaloop-nextest-python-api> running 1 test
- 25.64 s
gammaloop-nextest-python-api> test python_evaluate_sample_preserves_graph_grouping_and_incoming_pdgs ... FAILED
- 25.64 s
gammaloop-nextest-python-api>
- 25.64 s
gammaloop-nextest-python-api> failures:
- 25.64 s
gammaloop-nextest-python-api>
- 25.64 s
gammaloop-nextest-python-api> failures:
- 25.64 s
gammaloop-nextest-python-api> python_evaluate_sample_preserves_graph_grouping_and_incoming_pdgs
- 25.64 s
gammaloop-nextest-python-api>
- 25.64 s
gammaloop-nextest-python-api> test result: FAILED. 0 passed; 1 failed; 0 ignored; 0 measured; 4 filtered out; finished in 0.12s
- 25.64 s
gammaloop-nextest-python-api>
- 25.64 s
gammaloop-nextest-python-api> stderr ---
- 25.64 s
gammaloop-nextest-python-api> Error: Python API test subprocess failed.
- 25.64 s
gammaloop-nextest-python-api> stdout:
- 25.64 s
gammaloop-nextest-python-api> ┌────────────────────────────────────────────────────────┐
- 25.64 s
gammaloop-nextest-python-api> │ You are running a restricted Symbolica instance. │
- 25.64 s
gammaloop-nextest-python-api> │ │
- 25.64 s
gammaloop-nextest-python-api> │ This mode is only permitted for non-commercial use and │
- 25.64 s
gammaloop-nextest-python-api> │ is limited to one instance and core per machine. │
- 25.64 s
gammaloop-nextest-python-api> │ │
- 25.64 s
gammaloop-nextest-python-api> │ Hobbyists can easily acquire a free license key │
- 25.64 s
gammaloop-nextest-python-api> │ that unlocks all cores and removes this banner: │
- 25.64 s
gammaloop-nextest-python-api> │ │
- 25.64 s
gammaloop-nextest-python-api> │ from symbolica import * │
- 25.64 s
gammaloop-nextest-python-api> │ request_hobbyist_license('YOUR_NAME', 'YOUR_EMAIL') │
- 25.64 s
gammaloop-nextest-python-api> │ │
- 25.64 s
gammaloop-nextest-python-api> │ All other users can obtain a free 30-day trial key: │
- 25.64 s
gammaloop-nextest-python-api> │ │
- 25.64 s
gammaloop-nextest-python-api> │ from symbolica import * │
- 25.64 s
gammaloop-nextest-python-api> │ request_trial_license('NAME', 'EMAIL', 'EMPLOYER') │
- 25.64 s
gammaloop-nextest-python-api> │ │
- 25.64 s
gammaloop-nextest-python-api> │ See https://symbolica.io/docs/get_started.html#license │
- 25.64 s
gammaloop-nextest-python-api> └────────────────────────────────────────────────────────┘
- 25.64 s
gammaloop-nextest-python-api> ┌───────────────────────────────────────────────────────────────────────────────────────────────────────────┐
- 25.64 s
gammaloop-nextest-python-api> │ Cannot start new unlicensed Symbolica instance since there is already another one running on the machine. │
- 25.64 s
gammaloop-nextest-python-api> └───────────────────────────────────────────────────────────────────────────────────────────────────────────┘
- 25.64 s
gammaloop-nextest-python-api>
- 25.64 s
gammaloop-nextest-python-api> stderr:
- 25.64 s
gammaloop-nextest-python-api> ┌───────────────────────────────────┐
- 25.64 s
gammaloop-nextest-python-api> │ The Symbolica license has expired │
- 25.64 s
gammaloop-nextest-python-api> └───────────────────────────────────┘
- 25.64 s
gammaloop-nextest-python-api>
- 25.64 s
gammaloop-nextest-python-api>
- 25.64 s
gammaloop-nextest-python-api> Location:
- 25.64 s
gammaloop-nextest-python-api> tests/tests/test_python_api.rs:156:20
- 25.64 s
gammaloop-nextest-python-api>
- 25.64 s
gammaloop-nextest-python-api> error: test run failed
- 25.67 s
gammaloop-nextest-python-api>
- 25.67 s
gammaloop-nextest-python-api> ========== nextest test summary ==========
- 25.67 s
gammaloop-nextest-python-api> report: target/nextest/ci_gammaloop/junit.xml
- 25.67 s
gammaloop-nextest-python-api> tests: 5, failures: 4, errors: 0
- 25.67 s
gammaloop-nextest-python-api>
- 25.67 s
gammaloop-nextest-python-api> 1. gammaloop-integration-tests::test_python_api::python_evaluate_sample_honors_generate_events_and_observable_snapshots
- 25.67 s
gammaloop-nextest-python-api> failure: test failure with exit code 101
- 25.67 s
gammaloop-nextest-python-api> Error: Python API test subprocess failed.
- 25.67 s
gammaloop-nextest-python-api> stdout:
- 25.67 s
gammaloop-nextest-python-api> ┌────────────────────────────────────────────────────────┐
- 25.67 s
gammaloop-nextest-python-api> │ You are running a restricted Symbolica instance. │
- 25.67 s
gammaloop-nextest-python-api> │ │
- 25.67 s
gammaloop-nextest-python-api> │ This mode is only permitted for non-commercial use and │
- 25.67 s
gammaloop-nextest-python-api> │ is limited to one instance and core per machine. │
- 25.67 s
gammaloop-nextest-python-api> │ │
- 25.67 s
gammaloop-nextest-python-api> │ Hobbyists can easily acquire a free license key │
- 25.67 s
gammaloop-nextest-python-api> │ that unlocks all cores and removes this banner: │
- 25.67 s
gammaloop-nextest-python-api> │ │
- 25.67 s
gammaloop-nextest-python-api> │ from symbolica import * │
- 25.67 s
gammaloop-nextest-python-api> │ request_hobbyist_license('YOUR_NAME', 'YOUR_EMAIL') │
- 25.67 s
gammaloop-nextest-python-api> │ │
- 25.67 s
gammaloop-nextest-python-api> │ All other users can obtain a free 30-day trial key: │
- 25.67 s
gammaloop-nextest-python-api> │ │
- 25.67 s
gammaloop-nextest-python-api> │ from symbolica import * │
- 25.67 s
gammaloop-nextest-python-api> │ request_trial_license('NAME', 'EMAIL', 'EMPLOYER') │
- 25.67 s
gammaloop-nextest-python-api> │ │
- 25.67 s
gammaloop-nextest-python-api> │ See https://symbolica.io/docs/get_started.html#license │
- 25.67 s
gammaloop-nextest-python-api> └────────────────────────────────────────────────────────┘
- 25.67 s
gammaloop-nextest-python-api> ┌───────────────────────────────────────────────────────────────────────────────────────────────────────────┐
- 25.67 s
gammaloop-nextest-python-api> │ Cannot start new unlicensed Symbolica instance since there is already another one running on the machine. │
- 25.67 s
gammaloop-nextest-python-api> └───────────────────────────────────────────────────────────────────────────────────────────────────────────┘
- 25.67 s
gammaloop-nextest-python-api>
- 25.67 s
gammaloop-nextest-python-api> stderr:
- 25.67 s
gammaloop-nextest-python-api> ┌───────────────────────────────────┐
- 25.67 s
gammaloop-nextest-python-api> │ The Symbolica license has expired │
- 25.67 s
gammaloop-nextest-python-api> └───────────────────────────────────┘
- 25.67 s
gammaloop-nextest-python-api>
- 25.67 s
gammaloop-nextest-python-api>
- 25.67 s
gammaloop-nextest-python-api> Location:
- 25.67 s
gammaloop-nextest-python-api> tests/tests/test_python_api.rs:156:20
- 25.67 s
gammaloop-nextest-python-api> system-out
- 25.67 s
gammaloop-nextest-python-api> running 1 test
- 25.67 s
gammaloop-nextest-python-api> test python_evaluate_sample_honors_generate_events_and_observable_snapshots ... FAILED
- 25.67 s
gammaloop-nextest-python-api>
- 25.67 s
gammaloop-nextest-python-api> failures:
- 25.67 s
gammaloop-nextest-python-api>
- 25.67 s
gammaloop-nextest-python-api> failures:
- 25.67 s
gammaloop-nextest-python-api> python_evaluate_sample_honors_generate_events_and_observable_snapshots
- 25.67 s
gammaloop-nextest-python-api>
- 25.67 s
gammaloop-nextest-python-api> test result: FAILED. 0 passed; 1 failed; 0 ignored; 0 measured; 4 filtered out; finished in 0.11s
- 25.67 s
gammaloop-nextest-python-api> system-err
- 25.67 s
gammaloop-nextest-python-api> Error: Python API test subprocess failed.
- 25.67 s
gammaloop-nextest-python-api> stdout:
- 25.67 s
gammaloop-nextest-python-api> ┌────────────────────────────────────────────────────────┐
- 25.67 s
gammaloop-nextest-python-api> │ You are running a restricted Symbolica instance. │
- 25.67 s
gammaloop-nextest-python-api> │ │
- 25.67 s
gammaloop-nextest-python-api> │ This mode is only permitted for non-commercial use and │
- 25.67 s
gammaloop-nextest-python-api> │ is limited to one instance and core per machine. │
- 25.67 s
gammaloop-nextest-python-api> │ │
- 25.67 s
gammaloop-nextest-python-api> │ Hobbyists can easily acquire a free license key │
- 25.67 s
gammaloop-nextest-python-api> │ that unlocks all cores and removes this banner: │
- 25.67 s
gammaloop-nextest-python-api> │ │
- 25.67 s
gammaloop-nextest-python-api> │ from symbolica import * │
- 25.67 s
gammaloop-nextest-python-api> │ request_hobbyist_license('YOUR_NAME', 'YOUR_EMAIL') │
- 25.67 s
gammaloop-nextest-python-api> │ │
- 25.67 s
gammaloop-nextest-python-api> │ All other users can obtain a free 30-day trial key: │
- 25.67 s
gammaloop-nextest-python-api> │ │
- 25.67 s
gammaloop-nextest-python-api> │ from symbolica import * │
- 25.67 s
gammaloop-nextest-python-api> │ request_trial_license('NAME', 'EMAIL', 'EMPLOYER') │
- 25.67 s
gammaloop-nextest-python-api> │ │
- 25.67 s
gammaloop-nextest-python-api> │ See https://symbolica.io/docs/get_started.html#license │
- 25.67 s
gammaloop-nextest-python-api> └────────────────────────────────────────────────────────┘
- 25.67 s
gammaloop-nextest-python-api> ┌───────────────────────────────────────────────────────────────────────────────────────────────────────────┐
- 25.67 s
gammaloop-nextest-python-api> │ Cannot start new unlicensed Symbolica instance since there is already another one running on the machine. │
- 25.67 s
gammaloop-nextest-python-api> └───────────────────────────────────────────────────────────────────────────────────────────────────────────┘
- 25.67 s
gammaloop-nextest-python-api>
- 25.67 s
gammaloop-nextest-python-api> stderr:
- 25.67 s
gammaloop-nextest-python-api> ┌───────────────────────────────────┐
- 25.67 s
gammaloop-nextest-python-api> │ The Symbolica license has expired │
- 25.67 s
gammaloop-nextest-python-api> └───────────────────────────────────┘
- 25.67 s
gammaloop-nextest-python-api>
- 25.67 s
gammaloop-nextest-python-api>
- 25.67 s
gammaloop-nextest-python-api> Location:
- 25.67 s
gammaloop-nextest-python-api> tests/tests/test_python_api.rs:156:20
- 25.67 s
gammaloop-nextest-python-api>
- 25.67 s
gammaloop-nextest-python-api> 2. gammaloop-integration-tests::test_python_api::python_session_getters_return_live_toml_and_command_blocks
- 25.67 s
gammaloop-nextest-python-api> failure: test failure with exit code 101
- 25.67 s
gammaloop-nextest-python-api> Error: Python API test subprocess failed.
- 25.67 s
gammaloop-nextest-python-api> stdout:
- 25.67 s
gammaloop-nextest-python-api> ┌────────────────────────────────────────────────────────┐
- 25.67 s
gammaloop-nextest-python-api> │ You are running a restricted Symbolica instance. │
- 25.67 s
gammaloop-nextest-python-api> │ │
- 25.67 s
gammaloop-nextest-python-api> │ This mode is only permitted for non-commercial use and │
- 25.67 s
gammaloop-nextest-python-api> │ is limited to one instance and core per machine. │
- 25.67 s
gammaloop-nextest-python-api> │ │
- 25.67 s
gammaloop-nextest-python-api> │ Hobbyists can easily acquire a free license key │
- 25.67 s
gammaloop-nextest-python-api> │ that unlocks all cores and removes this banner: │
- 25.67 s
gammaloop-nextest-python-api> │ │
- 25.67 s
gammaloop-nextest-python-api> │ from symbolica import * │
- 25.67 s
gammaloop-nextest-python-api> │ request_hobbyist_license('YOUR_NAME', 'YOUR_EMAIL') │
- 25.67 s
gammaloop-nextest-python-api> │ │
- 25.67 s
gammaloop-nextest-python-api> │ All other users can obtain a free 30-day trial key: │
- 25.67 s
gammaloop-nextest-python-api> │ │
- 25.67 s
gammaloop-nextest-python-api> │ from symbolica import * │
- 25.67 s
gammaloop-nextest-python-api> │ request_trial_license('NAME', 'EMAIL', 'EMPLOYER') │
- 25.67 s
gammaloop-nextest-python-api> │ │
- 25.67 s
gammaloop-nextest-python-api> │ See https://symbolica.io/docs/get_started.html#license │
- 25.67 s
gammaloop-nextest-python-api> └────────────────────────────────────────────────────────┘
- 25.67 s
gammaloop-nextest-python-api> ┌───────────────────────────────────────────────────────────────────────────────────────────────────────────┐
- 25.67 s
gammaloop-nextest-python-api> │ Cannot start new unlicensed Symbolica instance since there is already another one running on the machine. │
- 25.67 s
gammaloop-nextest-python-api> └───────────────────────────────────────────────────────────────────────────────────────────────────────────┘
- 25.67 s
gammaloop-nextest-python-api>
- 25.67 s
gammaloop-nextest-python-api> stderr:
- 25.67 s
gammaloop-nextest-python-api> ┌───────────────────────────────────┐
- 25.67 s
gammaloop-nextest-python-api> │ The Symbolica license has expired │
- 25.67 s
gammaloop-nextest-python-api> └───────────────────────────────────┘
- 25.67 s
gammaloop-nextest-python-api>
- 25.67 s
gammaloop-nextest-python-api>
- 25.67 s
gammaloop-nextest-python-api> Location:
- 25.67 s
gammaloop-nextest-python-api> tests/tests/test_python_api.rs:156:20
- 25.67 s
gammaloop-nextest-python-api> system-out
- 25.67 s
gammaloop-nextest-python-api> running 1 test
- 25.67 s
gammaloop-nextest-python-api> test python_session_getters_return_live_toml_and_command_blocks ... FAILED
- 25.67 s
gammaloop-nextest-python-api>
- 25.67 s
gammaloop-nextest-python-api> failures:
- 25.67 s
gammaloop-nextest-python-api>
- 25.67 s
gammaloop-nextest-python-api> failures:
- 25.67 s
gammaloop-nextest-python-api> python_session_getters_return_live_toml_and_command_blocks
- 25.67 s
gammaloop-nextest-python-api>
- 25.67 s
gammaloop-nextest-python-api> test result: FAILED. 0 passed; 1 failed; 0 ignored; 0 measured; 4 filtered out; finished in 0.11s
- 25.67 s
gammaloop-nextest-python-api> system-err
- 25.67 s
gammaloop-nextest-python-api> Error: Python API test subprocess failed.
- 25.67 s
gammaloop-nextest-python-api> stdout:
- 25.67 s
gammaloop-nextest-python-api> ┌────────────────────────────────────────────────────────┐
- 25.67 s
gammaloop-nextest-python-api> │ You are running a restricted Symbolica instance. │
- 25.67 s
gammaloop-nextest-python-api> │ │
- 25.67 s
gammaloop-nextest-python-api> │ This mode is only permitted for non-commercial use and │
- 25.67 s
gammaloop-nextest-python-api> │ is limited to one instance and core per machine. │
- 25.67 s
gammaloop-nextest-python-api> │ │
- 25.67 s
gammaloop-nextest-python-api> │ Hobbyists can easily acquire a free license key │
- 25.67 s
gammaloop-nextest-python-api> │ that unlocks all cores and removes this banner: │
- 25.67 s
gammaloop-nextest-python-api> │ │
- 25.67 s
gammaloop-nextest-python-api> │ from symbolica import * │
- 25.67 s
gammaloop-nextest-python-api> │ request_hobbyist_license('YOUR_NAME', 'YOUR_EMAIL') │
- 25.67 s
gammaloop-nextest-python-api> │ │
- 25.67 s
gammaloop-nextest-python-api> │ All other users can obtain a free 30-day trial key: │
- 25.67 s
gammaloop-nextest-python-api> │ │
- 25.67 s
gammaloop-nextest-python-api> │ from symbolica import * │
- 25.67 s
gammaloop-nextest-python-api> │ request_trial_license('NAME', 'EMAIL', 'EMPLOYER') │
- 25.67 s
gammaloop-nextest-python-api> │ │
- 25.67 s
gammaloop-nextest-python-api> │ See https://symbolica.io/docs/get_started.html#license │
- 25.67 s
gammaloop-nextest-python-api> └────────────────────────────────────────────────────────┘
- 25.67 s
gammaloop-nextest-python-api> ┌───────────────────────────────────────────────────────────────────────────────────────────────────────────┐
- 25.67 s
gammaloop-nextest-python-api> │ Cannot start new unlicensed Symbolica instance since there is already another one running on the machine. │
- 25.67 s
gammaloop-nextest-python-api> └───────────────────────────────────────────────────────────────────────────────────────────────────────────┘
- 25.67 s
gammaloop-nextest-python-api>
- 25.67 s
gammaloop-nextest-python-api> stderr:
- 25.67 s
gammaloop-nextest-python-api> ┌───────────────────────────────────┐
- 25.67 s
gammaloop-nextest-python-api> │ The Symbolica license has expired │
- 25.67 s
gammaloop-nextest-python-api> └───────────────────────────────────┘
- 25.67 s
gammaloop-nextest-python-api>
- 25.67 s
gammaloop-nextest-python-api>
- 25.67 s
gammaloop-nextest-python-api> Location:
- 25.67 s
gammaloop-nextest-python-api> tests/tests/test_python_api.rs:156:20
- 25.67 s
gammaloop-nextest-python-api>
- 25.67 s
gammaloop-nextest-python-api> 3. gammaloop-integration-tests::test_python_api::python_evaluate_samples_batch_and_momentum_space_have_expected_shape
- 25.67 s
gammaloop-nextest-python-api> failure: test failure with exit code 101
- 25.67 s
gammaloop-nextest-python-api> Error: Python API test subprocess failed.
- 25.67 s
gammaloop-nextest-python-api> stdout:
- 25.67 s
gammaloop-nextest-python-api> ┌────────────────────────────────────────────────────────┐
- 25.67 s
gammaloop-nextest-python-api> │ You are running a restricted Symbolica instance. │
- 25.67 s
gammaloop-nextest-python-api> │ │
- 25.67 s
gammaloop-nextest-python-api> │ This mode is only permitted for non-commercial use and │
- 25.67 s
gammaloop-nextest-python-api> │ is limited to one instance and core per machine. │
- 25.67 s
gammaloop-nextest-python-api> │ │
- 25.67 s
gammaloop-nextest-python-api> │ Hobbyists can easily acquire a free license key │
- 25.67 s
gammaloop-nextest-python-api> │ that unlocks all cores and removes this banner: │
- 25.67 s
gammaloop-nextest-python-api> │ │
- 25.67 s
gammaloop-nextest-python-api> │ from symbolica import * │
- 25.67 s
gammaloop-nextest-python-api> │ request_hobbyist_license('YOUR_NAME', 'YOUR_EMAIL') │
- 25.67 s
gammaloop-nextest-python-api> │ │
- 25.67 s
gammaloop-nextest-python-api> │ All other users can obtain a free 30-day trial key: │
- 25.67 s
gammaloop-nextest-python-api> │ │
- 25.67 s
gammaloop-nextest-python-api> │ from symbolica import * │
- 25.67 s
gammaloop-nextest-python-api> │ request_trial_license('NAME', 'EMAIL', 'EMPLOYER') │
- 25.67 s
gammaloop-nextest-python-api> │ │
- 25.67 s
gammaloop-nextest-python-api> │ See https://symbolica.io/docs/get_started.html#license │
- 25.67 s
gammaloop-nextest-python-api> └────────────────────────────────────────────────────────┘
- 25.67 s
gammaloop-nextest-python-api> ┌───────────────────────────────────────────────────────────────────────────────────────────────────────────┐
- 25.68 s
gammaloop-nextest-python-api> │ Cannot start new unlicensed Symbolica instance since there is already another one running on the machine. │
- 25.68 s
gammaloop-nextest-python-api> └───────────────────────────────────────────────────────────────────────────────────────────────────────────┘
- 25.68 s
gammaloop-nextest-python-api>
- 25.68 s
gammaloop-nextest-python-api> stderr:
- 25.68 s
gammaloop-nextest-python-api> ┌───────────────────────────────────┐
- 25.68 s
gammaloop-nextest-python-api> │ The Symbolica license has expired │
- 25.68 s
gammaloop-nextest-python-api> └───────────────────────────────────┘
- 25.68 s
gammaloop-nextest-python-api>
- 25.68 s
gammaloop-nextest-python-api>
- 25.68 s
gammaloop-nextest-python-api> Location:
- 25.68 s
gammaloop-nextest-python-api> tests/tests/test_python_api.rs:156:20
- 25.68 s
gammaloop-nextest-python-api> system-out
- 25.68 s
gammaloop-nextest-python-api> running 1 test
- 25.68 s
gammaloop-nextest-python-api> test python_evaluate_samples_batch_and_momentum_space_have_expected_shape ... FAILED
- 25.68 s
gammaloop-nextest-python-api>
- 25.68 s
gammaloop-nextest-python-api> failures:
- 25.68 s
gammaloop-nextest-python-api>
- 25.68 s
gammaloop-nextest-python-api> failures:
- 25.68 s
gammaloop-nextest-python-api> python_evaluate_samples_batch_and_momentum_space_have_expected_shape
- 25.68 s
gammaloop-nextest-python-api>
- 25.68 s
gammaloop-nextest-python-api> test result: FAILED. 0 passed; 1 failed; 0 ignored; 0 measured; 4 filtered out; finished in 0.11s
- 25.68 s
gammaloop-nextest-python-api> system-err
- 25.68 s
gammaloop-nextest-python-api> Error: Python API test subprocess failed.
- 25.68 s
gammaloop-nextest-python-api> stdout:
- 25.68 s
gammaloop-nextest-python-api> ┌────────────────────────────────────────────────────────┐
- 25.68 s
gammaloop-nextest-python-api> │ You are running a restricted Symbolica instance. │
- 25.68 s
gammaloop-nextest-python-api> │ │
- 25.68 s
gammaloop-nextest-python-api> │ This mode is only permitted for non-commercial use and │
- 25.68 s
gammaloop-nextest-python-api> │ is limited to one instance and core per machine. │
- 25.68 s
gammaloop-nextest-python-api> │ │
- 25.68 s
gammaloop-nextest-python-api> │ Hobbyists can easily acquire a free license key │
- 25.68 s
gammaloop-nextest-python-api> │ that unlocks all cores and removes this banner: │
- 25.68 s
gammaloop-nextest-python-api> │ │
- 25.68 s
gammaloop-nextest-python-api> │ from symbolica import * │
- 25.68 s
gammaloop-nextest-python-api> │ request_hobbyist_license('YOUR_NAME', 'YOUR_EMAIL') │
- 25.68 s
gammaloop-nextest-python-api> │ │
- 25.68 s
gammaloop-nextest-python-api> │ All other users can obtain a free 30-day trial key: │
- 25.68 s
gammaloop-nextest-python-api> │ │
- 25.68 s
gammaloop-nextest-python-api> │ from symbolica import * │
- 25.68 s
gammaloop-nextest-python-api> │ request_trial_license('NAME', 'EMAIL', 'EMPLOYER') │
- 25.68 s
gammaloop-nextest-python-api> │ │
- 25.68 s
gammaloop-nextest-python-api> │ See https://symbolica.io/docs/get_started.html#license │
- 25.68 s
gammaloop-nextest-python-api> └────────────────────────────────────────────────────────┘
- 25.68 s
gammaloop-nextest-python-api> ┌───────────────────────────────────────────────────────────────────────────────────────────────────────────┐
- 25.68 s
gammaloop-nextest-python-api> │ Cannot start new unlicensed Symbolica instance since there is already another one running on the machine. │
- 25.68 s
gammaloop-nextest-python-api> └───────────────────────────────────────────────────────────────────────────────────────────────────────────┘
- 25.68 s
gammaloop-nextest-python-api>
- 25.68 s
gammaloop-nextest-python-api> stderr:
- 25.68 s
gammaloop-nextest-python-api> ┌───────────────────────────────────┐
- 25.68 s
gammaloop-nextest-python-api> │ The Symbolica license has expired │
- 25.68 s
gammaloop-nextest-python-api> └───────────────────────────────────┘
- 25.68 s
gammaloop-nextest-python-api>
- 25.68 s
gammaloop-nextest-python-api>
- 25.68 s
gammaloop-nextest-python-api> Location:
- 25.68 s
gammaloop-nextest-python-api> tests/tests/test_python_api.rs:156:20
- 25.68 s
gammaloop-nextest-python-api>
- 25.68 s
gammaloop-nextest-python-api> 4. gammaloop-integration-tests::test_python_api::python_evaluate_sample_preserves_graph_grouping_and_incoming_pdgs
- 25.68 s
gammaloop-nextest-python-api> failure: test failure with exit code 101
- 25.68 s
gammaloop-nextest-python-api> Error: Python API test subprocess failed.
- 25.68 s
gammaloop-nextest-python-api> stdout:
- 25.68 s
gammaloop-nextest-python-api> ┌────────────────────────────────────────────────────────┐
- 25.68 s
gammaloop-nextest-python-api> │ You are running a restricted Symbolica instance. │
- 25.68 s
gammaloop-nextest-python-api> │ │
- 25.68 s
gammaloop-nextest-python-api> │ This mode is only permitted for non-commercial use and │
- 25.68 s
gammaloop-nextest-python-api> │ is limited to one instance and core per machine. │
- 25.68 s
gammaloop-nextest-python-api> │ │
- 25.68 s
gammaloop-nextest-python-api> │ Hobbyists can easily acquire a free license key │
- 25.68 s
gammaloop-nextest-python-api> │ that unlocks all cores and removes this banner: │
- 25.68 s
gammaloop-nextest-python-api> │ │
- 25.68 s
gammaloop-nextest-python-api> │ from symbolica import * │
- 25.68 s
gammaloop-nextest-python-api> │ request_hobbyist_license('YOUR_NAME', 'YOUR_EMAIL') │
- 25.68 s
gammaloop-nextest-python-api> │ │
- 25.68 s
gammaloop-nextest-python-api> │ All other users can obtain a free 30-day trial key: │
- 25.68 s
gammaloop-nextest-python-api> │ │
- 25.68 s
gammaloop-nextest-python-api> │ from symbolica import * │
- 25.68 s
gammaloop-nextest-python-api> │ request_trial_license('NAME', 'EMAIL', 'EMPLOYER') │
- 25.68 s
gammaloop-nextest-python-api> │ │
- 25.68 s
gammaloop-nextest-python-api> │ See https://symbolica.io/docs/get_started.html#license │
- 25.68 s
gammaloop-nextest-python-api> └────────────────────────────────────────────────────────┘
- 25.68 s
gammaloop-nextest-python-api> ┌───────────────────────────────────────────────────────────────────────────────────────────────────────────┐
- 25.68 s
gammaloop-nextest-python-api> │ Cannot start new unlicensed Symbolica instance since there is already another one running on the machine. │
- 25.68 s
gammaloop-nextest-python-api> └───────────────────────────────────────────────────────────────────────────────────────────────────────────┘
- 25.68 s
gammaloop-nextest-python-api>
- 25.68 s
gammaloop-nextest-python-api> stderr:
- 25.68 s
gammaloop-nextest-python-api> ┌───────────────────────────────────┐
- 25.68 s
gammaloop-nextest-python-api> │ The Symbolica license has expired │
- 25.68 s
gammaloop-nextest-python-api> └───────────────────────────────────┘
- 25.68 s
gammaloop-nextest-python-api>
- 25.68 s
gammaloop-nextest-python-api>
- 25.68 s
gammaloop-nextest-python-api> Location:
- 25.68 s
gammaloop-nextest-python-api> tests/tests/test_python_api.rs:156:20
- 25.68 s
gammaloop-nextest-python-api> system-out
- 25.68 s
gammaloop-nextest-python-api> running 1 test
- 25.68 s
gammaloop-nextest-python-api> test python_evaluate_sample_preserves_graph_grouping_and_incoming_pdgs ... FAILED
- 25.68 s
gammaloop-nextest-python-api>
- 25.68 s
gammaloop-nextest-python-api> failures:
- 25.68 s
gammaloop-nextest-python-api>
- 25.68 s
gammaloop-nextest-python-api> failures:
- 25.68 s
gammaloop-nextest-python-api> python_evaluate_sample_preserves_graph_grouping_and_incoming_pdgs
- 25.68 s
gammaloop-nextest-python-api>
- 25.68 s
gammaloop-nextest-python-api> test result: FAILED. 0 passed; 1 failed; 0 ignored; 0 measured; 4 filtered out; finished in 0.12s
- 25.68 s
gammaloop-nextest-python-api> system-err
- 25.68 s
gammaloop-nextest-python-api> Error: Python API test subprocess failed.
- 25.68 s
gammaloop-nextest-python-api> stdout:
- 25.68 s
gammaloop-nextest-python-api> ┌────────────────────────────────────────────────────────┐
- 25.68 s
gammaloop-nextest-python-api> │ You are running a restricted Symbolica instance. │
- 25.68 s
gammaloop-nextest-python-api> │ │
- 25.68 s
gammaloop-nextest-python-api> │ This mode is only permitted for non-commercial use and │
- 25.68 s
gammaloop-nextest-python-api> │ is limited to one instance and core per machine. │
- 25.68 s
gammaloop-nextest-python-api> │ │
- 25.68 s
gammaloop-nextest-python-api> │ Hobbyists can easily acquire a free license key │
- 25.68 s
gammaloop-nextest-python-api> │ that unlocks all cores and removes this banner: │
- 25.68 s
gammaloop-nextest-python-api> │ │
- 25.68 s
gammaloop-nextest-python-api> │ from symbolica import * │
- 25.68 s
gammaloop-nextest-python-api> │ request_hobbyist_license('YOUR_NAME', 'YOUR_EMAIL') │
- 25.68 s
gammaloop-nextest-python-api> │ │
- 25.68 s
gammaloop-nextest-python-api> │ All other users can obtain a free 30-day trial key: │
- 25.68 s
gammaloop-nextest-python-api> │ │
- 25.68 s
gammaloop-nextest-python-api> │ from symbolica import * │
- 25.68 s
gammaloop-nextest-python-api> │ request_trial_license('NAME', 'EMAIL', 'EMPLOYER') │
- 25.68 s
gammaloop-nextest-python-api> │ │
- 25.68 s
gammaloop-nextest-python-api> │ See https://symbolica.io/docs/get_started.html#license │
- 25.68 s
gammaloop-nextest-python-api> └────────────────────────────────────────────────────────┘
- 25.68 s
gammaloop-nextest-python-api> ┌───────────────────────────────────────────────────────────────────────────────────────────────────────────┐
- 25.68 s
gammaloop-nextest-python-api> │ Cannot start new unlicensed Symbolica instance since there is already another one running on the machine. │
- 25.68 s
gammaloop-nextest-python-api> └───────────────────────────────────────────────────────────────────────────────────────────────────────────┘
- 25.68 s
gammaloop-nextest-python-api>
- 25.68 s
gammaloop-nextest-python-api> stderr:
- 25.68 s
gammaloop-nextest-python-api> ┌───────────────────────────────────┐
- 25.68 s
gammaloop-nextest-python-api> │ The Symbolica license has expired │
- 25.68 s
gammaloop-nextest-python-api> └───────────────────────────────────┘
- 25.68 s
gammaloop-nextest-python-api>
- 25.68 s
gammaloop-nextest-python-api>
- 25.68 s
gammaloop-nextest-python-api> Location:
- 25.68 s
gammaloop-nextest-python-api> tests/tests/test_python_api.rs:156:20
- 25.68 s
gammaloop-nextest-python-api> =========================================
- 25.74 s
error: Cannot build '/nix/store/4kzj98b1f7qqfwnhzqhxbvk8wv98rki0-gammaloop-nextest-python-api.drv'.
- 25.74 s
Reason: builder failed with exit code 100.
- 25.74 s
Output paths:
- 25.74 s
/nix/store/zfhrsd28wys0w08nx237s3nizrjwhwhz-gammaloop-nextest-python-api
- 25.74 s
Last 717 log lines:
- 25.74 s
> Extracting 1 binary, 1 build script output directory, and 3 linked paths to /build/source
- 25.74 s
> Extracted 18 files to /build/source in 0.06s
- 25.74 s
> ------------
- 25.74 s
> Nextest run ID c5d6ee22-b173-4e37-8fef-e81ba10b532a with nextest profile: ci_gammaloop
- 25.74 s
> Starting 5 tests across 1 binary
- 25.74 s
> FAIL [ 0.112s] (1/5) gammaloop-integration-tests::test_python_api python_evaluate_sample_honors_generate_events_and_observable_snapshots
- 25.74 s
> stdout ---
- 25.74 s
>
- 25.74 s
> running 1 test
- 25.74 s
> test python_evaluate_sample_honors_generate_events_and_observable_snapshots ... FAILED
- 25.74 s
>
- 25.74 s
> failures:
- 25.74 s
>
- 25.74 s
> failures:
- 25.74 s
> python_evaluate_sample_honors_generate_events_and_observable_snapshots
- 25.74 s
>
- 25.74 s
> test result: FAILED. 0 passed; 1 failed; 0 ignored; 0 measured; 4 filtered out; finished in 0.11s
- 25.74 s
>
- 25.74 s
> stderr ---
- 25.74 s
> Error: Python API test subprocess failed.
- 25.74 s
> stdout:
- 25.74 s
> ┌────────────────────────────────────────────────────────┐
- 25.74 s
> │ You are running a restricted Symbolica instance. │
- 25.74 s
> │ │
- 25.74 s
> │ This mode is only permitted for non-commercial use and │
- 25.74 s
> │ is limited to one instance and core per machine. │
- 25.74 s
> │ │
- 25.74 s
> │ Hobbyists can easily acquire a free license key │
- 25.74 s
> │ that unlocks all cores and removes this banner: │
- 25.74 s
> │ │
- 25.74 s
> │ from symbolica import * │
- 25.74 s
> │ request_hobbyist_license('YOUR_NAME', 'YOUR_EMAIL') │
- 25.74 s
> │ │
- 25.74 s
> │ All other users can obtain a free 30-day trial key: │
- 25.74 s
> │ │
- 25.74 s
> │ from symbolica import * │
- 25.74 s
> │ request_trial_license('NAME', 'EMAIL', 'EMPLOYER') │
- 25.74 s
> │ │
- 25.74 s
> │ See https://symbolica.io/docs/get_started.html#license │
- 25.74 s
> └────────────────────────────────────────────────────────┘
- 25.74 s
> ┌───────────────────────────────────────────────────────────────────────────────────────────────────────────┐
- 25.74 s
> │ Cannot start new unlicensed Symbolica instance since there is already another one running on the machine. │
- 25.74 s
> └───────────────────────────────────────────────────────────────────────────────────────────────────────────┘
- 25.74 s
>
- 25.74 s
> stderr:
- 25.74 s
> ┌───────────────────────────────────┐
- 25.74 s
> │ The Symbolica license has expired │
- 25.74 s
> └───────────────────────────────────┘
- 25.74 s
>
- 25.74 s
>
- 25.74 s
> Location:
- 25.74 s
> tests/tests/test_python_api.rs:156:20
- 25.74 s
>
- 25.74 s
> FAIL [ 0.112s] (2/5) gammaloop-integration-tests::test_python_api python_session_getters_return_live_toml_and_command_blocks
- 25.74 s
> stdout ---
- 25.74 s
>
- 25.74 s
> running 1 test
- 25.74 s
> test python_session_getters_return_live_toml_and_command_blocks ... FAILED
- 25.74 s
>
- 25.74 s
> failures:
- 25.74 s
>
- 25.74 s
> failures:
- 25.74 s
> python_session_getters_return_live_toml_and_command_blocks
- 25.74 s
>
- 25.74 s
> test result: FAILED. 0 passed; 1 failed; 0 ignored; 0 measured; 4 filtered out; finished in 0.11s
- 25.74 s
>
- 25.74 s
> stderr ---
- 25.74 s
> Error: Python API test subprocess failed.
- 25.74 s
> stdout:
- 25.74 s
> ┌────────────────────────────────────────────────────────┐
- 25.74 s
> │ You are running a restricted Symbolica instance. │
- 25.74 s
> │ │
- 25.74 s
> │ This mode is only permitted for non-commercial use and │
- 25.74 s
> │ is limited to one instance and core per machine. │
- 25.74 s
> │ │
- 25.74 s
> │ Hobbyists can easily acquire a free license key │
- 25.74 s
> │ that unlocks all cores and removes this banner: │
- 25.74 s
> │ │
- 25.74 s
> │ from symbolica import * │
- 25.74 s
> │ request_hobbyist_license('YOUR_NAME', 'YOUR_EMAIL') │
- 25.74 s
> │ │
- 25.74 s
> │ All other users can obtain a free 30-day trial key: │
- 25.74 s
> │ │
- 25.74 s
> │ from symbolica import * │
- 25.74 s
> │ request_trial_license('NAME', 'EMAIL', 'EMPLOYER') │
- 25.74 s
> │ │
- 25.74 s
> │ See https://symbolica.io/docs/get_started.html#license │
- 25.74 s
> └────────────────────────────────────────────────────────┘
- 25.74 s
> ┌───────────────────────────────────────────────────────────────────────────────────────────────────────────┐
- 25.74 s
> │ Cannot start new unlicensed Symbolica instance since there is already another one running on the machine. │
- 25.74 s
> └───────────────────────────────────────────────────────────────────────────────────────────────────────────┘
- 25.74 s
>
- 25.74 s
> stderr:
- 25.74 s
> ┌───────────────────────────────────┐
- 25.74 s
> │ The Symbolica license has expired │
- 25.74 s
> └───────────────────────────────────┘
- 25.74 s
>
- 25.74 s
>
- 25.74 s
> Location:
- 25.74 s
> tests/tests/test_python_api.rs:156:20
- 25.74 s
>
- 25.74 s
> FAIL [ 0.112s] (3/5) gammaloop-integration-tests::test_python_api python_evaluate_samples_batch_and_momentum_space_have_expected_shape
- 25.74 s
> stdout ---
- 25.74 s
>
- 25.74 s
> running 1 test
- 25.74 s
> test python_evaluate_samples_batch_and_momentum_space_have_expected_shape ... FAILED
- 25.74 s
>
- 25.74 s
> failures:
- 25.74 s
>
- 25.74 s
> failures:
- 25.74 s
> python_evaluate_samples_batch_and_momentum_space_have_expected_shape
- 25.74 s
>
- 25.74 s
> test result: FAILED. 0 passed; 1 failed; 0 ignored; 0 measured; 4 filtered out; finished in 0.11s
- 25.74 s
>
- 25.74 s
> stderr ---
- 25.74 s
> Error: Python API test subprocess failed.
- 25.74 s
> stdout:
- 25.74 s
> ┌────────────────────────────────────────────────────────┐
- 25.74 s
> │ You are running a restricted Symbolica instance. │
- 25.74 s
> │ │
- 25.74 s
> │ This mode is only permitted for non-commercial use and │
- 25.74 s
> │ is limited to one instance and core per machine. │
- 25.74 s
> │ │
- 25.74 s
> │ Hobbyists can easily acquire a free license key │
- 25.74 s
> │ that unlocks all cores and removes this banner: │
- 25.74 s
> │ │
- 25.74 s
> │ from symbolica import * │
- 25.74 s
> │ request_hobbyist_license('YOUR_NAME', 'YOUR_EMAIL') │
- 25.74 s
> │ │
- 25.74 s
> │ All other users can obtain a free 30-day trial key: │
- 25.74 s
> │ │
- 25.74 s
> │ from symbolica import * │
- 25.74 s
> │ request_trial_license('NAME', 'EMAIL', 'EMPLOYER') │
- 25.74 s
> │ │
- 25.74 s
> │ See https://symbolica.io/docs/get_started.html#license │
- 25.74 s
> └────────────────────────────────────────────────────────┘
- 25.74 s
> ┌───────────────────────────────────────────────────────────────────────────────────────────────────────────┐
- 25.74 s
> │ Cannot start new unlicensed Symbolica instance since there is already another one running on the machine. │
- 25.74 s
> └───────────────────────────────────────────────────────────────────────────────────────────────────────────┘
- 25.74 s
>
- 25.74 s
> stderr:
- 25.74 s
> ┌───────────────────────────────────┐
- 25.74 s
> │ The Symbolica license has expired │
- 25.74 s
> └───────────────────────────────────┘
- 25.74 s
>
- 25.74 s
>
- 25.74 s
> Location:
- 25.74 s
> tests/tests/test_python_api.rs:156:20
- 25.74 s
>
- 25.74 s
> FAIL [ 0.120s] (4/5) gammaloop-integration-tests::test_python_api python_evaluate_sample_preserves_graph_grouping_and_incoming_pdgs
- 25.74 s
> stdout ---
- 25.74 s
>
- 25.74 s
> running 1 test
- 25.74 s
> test python_evaluate_sample_preserves_graph_grouping_and_incoming_pdgs ... FAILED
- 25.74 s
>
- 25.74 s
> failures:
- 25.74 s
>
- 25.74 s
> failures:
- 25.74 s
> python_evaluate_sample_preserves_graph_grouping_and_incoming_pdgs
- 25.74 s
>
- 25.74 s
> test result: FAILED. 0 passed; 1 failed; 0 ignored; 0 measured; 4 filtered out; finished in 0.12s
- 25.74 s
>
- 25.74 s
> stderr ---
- 25.74 s
> Error: Python API test subprocess failed.
- 25.74 s
> stdout:
- 25.74 s
> ┌────────────────────────────────────────────────────────┐
- 25.74 s
> │ You are running a restricted Symbolica instance. │
- 25.74 s
> │ │
- 25.74 s
> │ This mode is only permitted for non-commercial use and │
- 25.74 s
> │ is limited to one instance and core per machine. │
- 25.74 s
> │ │
- 25.74 s
> │ Hobbyists can easily acquire a free license key │
- 25.74 s
> │ that unlocks all cores and removes this banner: │
- 25.74 s
> │ │
- 25.74 s
> │ from symbolica import * │
- 25.74 s
> │ request_hobbyist_license('YOUR_NAME', 'YOUR_EMAIL') │
- 25.74 s
> │ │
- 25.74 s
> │ All other users can obtain a free 30-day trial key: │
- 25.74 s
> │ │
- 25.74 s
> │ from symbolica import * │
- 25.74 s
> │ request_trial_license('NAME', 'EMAIL', 'EMPLOYER') │
- 25.74 s
> │ │
- 25.74 s
> │ See https://symbolica.io/docs/get_started.html#license │
- 25.74 s
> └────────────────────────────────────────────────────────┘
- 25.74 s
> ┌───────────────────────────────────────────────────────────────────────────────────────────────────────────┐
- 25.74 s
> │ Cannot start new unlicensed Symbolica instance since there is already another one running on the machine. │
- 25.74 s
> └───────────────────────────────────────────────────────────────────────────────────────────────────────────┘
- 25.74 s
>
- 25.74 s
> stderr:
- 25.74 s
> ┌───────────────────────────────────┐
- 25.74 s
> │ The Symbolica license has expired │
- 25.74 s
> └───────────────────────────────────┘
- 25.74 s
>
- 25.74 s
>
- 25.74 s
> Location:
- 25.74 s
> tests/tests/test_python_api.rs:156:20
- 25.74 s
>
- 25.74 s
> ------------
- 25.74 s
> Summary [ 0.282s] 5 tests run: 1 passed, 4 failed, 0 skipped
- 25.74 s
> FAIL [ 0.112s] (1/5) gammaloop-integration-tests::test_python_api python_evaluate_sample_honors_generate_events_and_observable_snapshots
- 25.74 s
> stdout ---
- 25.74 s
>
- 25.74 s
> running 1 test
- 25.74 s
> test python_evaluate_sample_honors_generate_events_and_observable_snapshots ... FAILED
- 25.74 s
>
- 25.74 s
> failures:
- 25.74 s
>
- 25.74 s
> failures:
- 25.74 s
> python_evaluate_sample_honors_generate_events_and_observable_snapshots
- 25.74 s
>
- 25.74 s
> test result: FAILED. 0 passed; 1 failed; 0 ignored; 0 measured; 4 filtered out; finished in 0.11s
- 25.74 s
>
- 25.74 s
> stderr ---
- 25.74 s
> Error: Python API test subprocess failed.
- 25.74 s
> stdout:
- 25.74 s
> ┌────────────────────────────────────────────────────────┐
- 25.74 s
> │ You are running a restricted Symbolica instance. │
- 25.74 s
> │ │
- 25.74 s
> │ This mode is only permitted for non-commercial use and │
- 25.74 s
> │ is limited to one instance and core per machine. │
- 25.74 s
> │ │
- 25.74 s
> │ Hobbyists can easily acquire a free license key │
- 25.74 s
> │ that unlocks all cores and removes this banner: │
- 25.74 s
> │ │
- 25.74 s
> │ from symbolica import * │
- 25.74 s
> │ request_hobbyist_license('YOUR_NAME', 'YOUR_EMAIL') │
- 25.74 s
> │ │
- 25.74 s
> │ All other users can obtain a free 30-day trial key: │
- 25.74 s
> │ │
- 25.74 s
> │ from symbolica import * │
- 25.74 s
> │ request_trial_license('NAME', 'EMAIL', 'EMPLOYER') │
- 25.74 s
> │ │
- 25.74 s
> │ See https://symbolica.io/docs/get_started.html#license │
- 25.74 s
> └────────────────────────────────────────────────────────┘
- 25.74 s
> ┌───────────────────────────────────────────────────────────────────────────────────────────────────────────┐
- 25.74 s
> │ Cannot start new unlicensed Symbolica instance since there is already another one running on the machine. │
- 25.74 s
> └───────────────────────────────────────────────────────────────────────────────────────────────────────────┘
- 25.74 s
>
- 25.74 s
> stderr:
- 25.74 s
> ┌───────────────────────────────────┐
- 25.74 s
> │ The Symbolica license has expired │
- 25.74 s
> └───────────────────────────────────┘
- 25.74 s
>
- 25.74 s
>
- 25.74 s
> Location:
- 25.74 s
> tests/tests/test_python_api.rs:156:20
- 25.74 s
>
- 25.74 s
> FAIL [ 0.112s] (2/5) gammaloop-integration-tests::test_python_api python_session_getters_return_live_toml_and_command_blocks
- 25.74 s
> stdout ---
- 25.74 s
>
- 25.74 s
> running 1 test
- 25.74 s
> test python_session_getters_return_live_toml_and_command_blocks ... FAILED
- 25.74 s
>
- 25.74 s
> failures:
- 25.74 s
>
- 25.74 s
> failures:
- 25.74 s
> python_session_getters_return_live_toml_and_command_blocks
- 25.74 s
>
- 25.74 s
> test result: FAILED. 0 passed; 1 failed; 0 ignored; 0 measured; 4 filtered out; finished in 0.11s
- 25.74 s
>
- 25.74 s
> stderr ---
- 25.74 s
> Error: Python API test subprocess failed.
- 25.74 s
> stdout:
- 25.74 s
> ┌────────────────────────────────────────────────────────┐
- 25.74 s
> │ You are running a restricted Symbolica instance. │
- 25.74 s
> │ │
- 25.74 s
> │ This mode is only permitted for non-commercial use and │
- 25.74 s
> │ is limited to one instance and core per machine. │
- 25.74 s
> │ │
- 25.74 s
> │ Hobbyists can easily acquire a free license key │
- 25.74 s
> │ that unlocks all cores and removes this banner: │
- 25.74 s
> │ │
- 25.74 s
> │ from symbolica import * │
- 25.74 s
> │ request_hobbyist_license('YOUR_NAME', 'YOUR_EMAIL') │
- 25.74 s
> │ │
- 25.74 s
> │ All other users can obtain a free 30-day trial key: │
- 25.74 s
> │ │
- 25.74 s
> │ from symbolica import * │
- 25.74 s
> │ request_trial_license('NAME', 'EMAIL', 'EMPLOYER') │
- 25.74 s
> │ │
- 25.74 s
> │ See https://symbolica.io/docs/get_started.html#license │
- 25.74 s
> └────────────────────────────────────────────────────────┘
- 25.74 s
> ┌───────────────────────────────────────────────────────────────────────────────────────────────────────────┐
- 25.74 s
> │ Cannot start new unlicensed Symbolica instance since there is already another one running on the machine. │
- 25.74 s
> └───────────────────────────────────────────────────────────────────────────────────────────────────────────┘
- 25.74 s
>
- 25.74 s
> stderr:
- 25.74 s
> ┌───────────────────────────────────┐
- 25.74 s
> │ The Symbolica license has expired │
- 25.74 s
> └───────────────────────────────────┘
- 25.74 s
>
- 25.74 s
>
- 25.74 s
> Location:
- 25.74 s
> tests/tests/test_python_api.rs:156:20
- 25.74 s
>
- 25.74 s
> FAIL [ 0.112s] (3/5) gammaloop-integration-tests::test_python_api python_evaluate_samples_batch_and_momentum_space_have_expected_shape
- 25.74 s
> stdout ---
- 25.74 s
>
- 25.74 s
> running 1 test
- 25.74 s
> test python_evaluate_samples_batch_and_momentum_space_have_expected_shape ... FAILED
- 25.74 s
>
- 25.74 s
> failures:
- 25.74 s
>
- 25.74 s
> failures:
- 25.74 s
> python_evaluate_samples_batch_and_momentum_space_have_expected_shape
- 25.74 s
>
- 25.74 s
> test result: FAILED. 0 passed; 1 failed; 0 ignored; 0 measured; 4 filtered out; finished in 0.11s
- 25.74 s
>
- 25.74 s
> stderr ---
- 25.74 s
> Error: Python API test subprocess failed.
- 25.74 s
> stdout:
- 25.74 s
> ┌────────────────────────────────────────────────────────┐
- 25.74 s
> │ You are running a restricted Symbolica instance. │
- 25.74 s
> │ │
- 25.74 s
> │ This mode is only permitted for non-commercial use and │
- 25.74 s
> │ is limited to one instance and core per machine. │
- 25.74 s
> │ │
- 25.74 s
> │ Hobbyists can easily acquire a free license key │
- 25.74 s
> │ that unlocks all cores and removes this banner: │
- 25.74 s
> │ │
- 25.74 s
> │ from symbolica import * │
- 25.74 s
> │ request_hobbyist_license('YOUR_NAME', 'YOUR_EMAIL') │
- 25.74 s
> │ │
- 25.74 s
> │ All other users can obtain a free 30-day trial key: │
- 25.74 s
> │ │
- 25.74 s
> │ from symbolica import * │
- 25.74 s
> │ request_trial_license('NAME', 'EMAIL', 'EMPLOYER') │
- 25.74 s
> │ │
- 25.74 s
> │ See https://symbolica.io/docs/get_started.html#license │
- 25.74 s
> └────────────────────────────────────────────────────────┘
- 25.74 s
> ┌───────────────────────────────────────────────────────────────────────────────────────────────────────────┐
- 25.74 s
> │ Cannot start new unlicensed Symbolica instance since there is already another one running on the machine. │
- 25.74 s
> └───────────────────────────────────────────────────────────────────────────────────────────────────────────┘
- 25.74 s
>
- 25.74 s
> stderr:
- 25.74 s
> ┌───────────────────────────────────┐
- 25.74 s
> │ The Symbolica license has expired │
- 25.74 s
> └───────────────────────────────────┘
- 25.74 s
>
- 25.74 s
>
- 25.74 s
> Location:
- 25.74 s
> tests/tests/test_python_api.rs:156:20
- 25.74 s
>
- 25.74 s
> FAIL [ 0.120s] (4/5) gammaloop-integration-tests::test_python_api python_evaluate_sample_preserves_graph_grouping_and_incoming_pdgs
- 25.74 s
> stdout ---
- 25.74 s
>
- 25.74 s
> running 1 test
- 25.74 s
> test python_evaluate_sample_preserves_graph_grouping_and_incoming_pdgs ... FAILED
- 25.74 s
>
- 25.74 s
> failures:
- 25.74 s
>
- 25.74 s
> failures:
- 25.74 s
> python_evaluate_sample_preserves_graph_grouping_and_incoming_pdgs
- 25.74 s
>
- 25.74 s
> test result: FAILED. 0 passed; 1 failed; 0 ignored; 0 measured; 4 filtered out; finished in 0.12s
- 25.74 s
>
- 25.74 s
> stderr ---
- 25.74 s
> Error: Python API test subprocess failed.
- 25.74 s
> stdout:
- 25.74 s
> ┌────────────────────────────────────────────────────────┐
- 25.74 s
> │ You are running a restricted Symbolica instance. │
- 25.74 s
> │ │
- 25.74 s
> │ This mode is only permitted for non-commercial use and │
- 25.74 s
> │ is limited to one instance and core per machine. │
- 25.74 s
> │ │
- 25.74 s
> │ Hobbyists can easily acquire a free license key │
- 25.74 s
> │ that unlocks all cores and removes this banner: │
- 25.74 s
> │ │
- 25.74 s
> │ from symbolica import * │
- 25.74 s
> │ request_hobbyist_license('YOUR_NAME', 'YOUR_EMAIL') │
- 25.74 s
> │ │
- 25.74 s
> │ All other users can obtain a free 30-day trial key: │
- 25.74 s
> │ │
- 25.74 s
> │ from symbolica import * │
- 25.74 s
> │ request_trial_license('NAME', 'EMAIL', 'EMPLOYER') │
- 25.74 s
> │ │
- 25.74 s
> │ See https://symbolica.io/docs/get_started.html#license │
- 25.74 s
> └────────────────────────────────────────────────────────┘
- 25.74 s
> ┌───────────────────────────────────────────────────────────────────────────────────────────────────────────┐
- 25.74 s
> │ Cannot start new unlicensed Symbolica instance since there is already another one running on the machine. │
- 25.74 s
> └───────────────────────────────────────────────────────────────────────────────────────────────────────────┘
- 25.74 s
>
- 25.74 s
> stderr:
- 25.74 s
> ┌───────────────────────────────────┐
- 25.74 s
> │ The Symbolica license has expired │
- 25.74 s
> └───────────────────────────────────┘
- 25.74 s
>
- 25.74 s
>
- 25.74 s
> Location:
- 25.74 s
> tests/tests/test_python_api.rs:156:20
- 25.74 s
>
- 25.74 s
> error: test run failed
- 25.74 s
>
- 25.74 s
> ========== nextest test summary ==========
- 25.74 s
> report: target/nextest/ci_gammaloop/junit.xml
- 25.74 s
> tests: 5, failures: 4, errors: 0
- 25.74 s
>
- 25.74 s
> 1. gammaloop-integration-tests::test_python_api::python_evaluate_sample_honors_generate_events_and_observable_snapshots
- 25.74 s
> failure: test failure with exit code 101
- 25.74 s
> Error: Python API test subprocess failed.
- 25.74 s
> stdout:
- 25.74 s
> ┌────────────────────────────────────────────────────────┐
- 25.74 s
> │ You are running a restricted Symbolica instance. │
- 25.74 s
> │ │
- 25.74 s
> │ This mode is only permitted for non-commercial use and │
- 25.74 s
> │ is limited to one instance and core per machine. │
- 25.74 s
> │ │
- 25.74 s
> │ Hobbyists can easily acquire a free license key │
- 25.74 s
> │ that unlocks all cores and removes this banner: │
- 25.74 s
> │ │
- 25.74 s
> │ from symbolica import * │
- 25.74 s
> │ request_hobbyist_license('YOUR_NAME', 'YOUR_EMAIL') │
- 25.74 s
> │ │
- 25.74 s
> │ All other users can obtain a free 30-day trial key: │
- 25.74 s
> │ │
- 25.74 s
> │ from symbolica import * │
- 25.74 s
> │ request_trial_license('NAME', 'EMAIL', 'EMPLOYER') │
- 25.74 s
> │ │
- 25.74 s
> │ See https://symbolica.io/docs/get_started.html#license │
- 25.74 s
> └────────────────────────────────────────────────────────┘
- 25.74 s
> ┌───────────────────────────────────────────────────────────────────────────────────────────────────────────┐
- 25.74 s
> │ Cannot start new unlicensed Symbolica instance since there is already another one running on the machine. │
- 25.74 s
> └───────────────────────────────────────────────────────────────────────────────────────────────────────────┘
- 25.74 s
>
- 25.74 s
> stderr:
- 25.74 s
> ┌───────────────────────────────────┐
- 25.74 s
> │ The Symbolica license has expired │
- 25.74 s
> └───────────────────────────────────┘
- 25.74 s
>
- 25.74 s
>
- 25.74 s
> Location:
- 25.74 s
> tests/tests/test_python_api.rs:156:20
- 25.74 s
> system-out
- 25.74 s
> running 1 test
- 25.74 s
> test python_evaluate_sample_honors_generate_events_and_observable_snapshots ... FAILED
- 25.74 s
>
- 25.74 s
> failures:
- 25.74 s
>
- 25.74 s
> failures:
- 25.74 s
> python_evaluate_sample_honors_generate_events_and_observable_snapshots
- 25.74 s
>
- 25.74 s
> test result: FAILED. 0 passed; 1 failed; 0 ignored; 0 measured; 4 filtered out; finished in 0.11s
- 25.74 s
> system-err
- 25.74 s
> Error: Python API test subprocess failed.
- 25.74 s
> stdout:
- 25.74 s
> ┌────────────────────────────────────────────────────────┐
- 25.74 s
> │ You are running a restricted Symbolica instance. │
- 25.74 s
> │ │
- 25.74 s
> │ This mode is only permitted for non-commercial use and │
- 25.74 s
> │ is limited to one instance and core per machine. │
- 25.74 s
> │ │
- 25.74 s
> │ Hobbyists can easily acquire a free license key │
- 25.74 s
> │ that unlocks all cores and removes this banner: │
- 25.74 s
> │ │
- 25.74 s
> │ from symbolica import * │
- 25.74 s
> │ request_hobbyist_license('YOUR_NAME', 'YOUR_EMAIL') │
- 25.74 s
> │ │
- 25.74 s
> │ All other users can obtain a free 30-day trial key: │
- 25.74 s
> │ │
- 25.74 s
> │ from symbolica import * │
- 25.74 s
> │ request_trial_license('NAME', 'EMAIL', 'EMPLOYER') │
- 25.74 s
> │ │
- 25.74 s
> │ See https://symbolica.io/docs/get_started.html#license │
- 25.74 s
> └────────────────────────────────────────────────────────┘
- 25.74 s
> ┌───────────────────────────────────────────────────────────────────────────────────────────────────────────┐
- 25.74 s
> │ Cannot start new unlicensed Symbolica instance since there is already another one running on the machine. │
- 25.74 s
> └───────────────────────────────────────────────────────────────────────────────────────────────────────────┘
- 25.74 s
>
- 25.74 s
> stderr:
- 25.74 s
> ┌───────────────────────────────────┐
- 25.74 s
> │ The Symbolica license has expired │
- 25.74 s
> └───────────────────────────────────┘
- 25.74 s
>
- 25.74 s
>
- 25.74 s
> Location:
- 25.74 s
> tests/tests/test_python_api.rs:156:20
- 25.74 s
>
- 25.74 s
> 2. gammaloop-integration-tests::test_python_api::python_session_getters_return_live_toml_and_command_blocks
- 25.74 s
> failure: test failure with exit code 101
- 25.74 s
> Error: Python API test subprocess failed.
- 25.74 s
> stdout:
- 25.74 s
> ┌────────────────────────────────────────────────────────┐
- 25.74 s
> │ You are running a restricted Symbolica instance. │
- 25.74 s
> │ │
- 25.74 s
> │ This mode is only permitted for non-commercial use and │
- 25.74 s
> │ is limited to one instance and core per machine. │
- 25.74 s
> │ │
- 25.74 s
> │ Hobbyists can easily acquire a free license key │
- 25.74 s
> │ that unlocks all cores and removes this banner: │
- 25.74 s
> │ │
- 25.74 s
> │ from symbolica import * │
- 25.74 s
> │ request_hobbyist_license('YOUR_NAME', 'YOUR_EMAIL') │
- 25.74 s
> │ │
- 25.74 s
> │ All other users can obtain a free 30-day trial key: │
- 25.74 s
> │ │
- 25.74 s
> │ from symbolica import * │
- 25.74 s
> │ request_trial_license('NAME', 'EMAIL', 'EMPLOYER') │
- 25.74 s
> │ │
- 25.74 s
> │ See https://symbolica.io/docs/get_started.html#license │
- 25.74 s
> └────────────────────────────────────────────────────────┘
- 25.74 s
> ┌───────────────────────────────────────────────────────────────────────────────────────────────────────────┐
- 25.74 s
> │ Cannot start new unlicensed Symbolica instance since there is already another one running on the machine. │
- 25.74 s
> └───────────────────────────────────────────────────────────────────────────────────────────────────────────┘
- 25.74 s
>
- 25.74 s
> stderr:
- 25.74 s
> ┌───────────────────────────────────┐
- 25.74 s
> │ The Symbolica license has expired │
- 25.74 s
> └───────────────────────────────────┘
- 25.74 s
>
- 25.74 s
>
- 25.74 s
> Location:
- 25.74 s
> tests/tests/test_python_api.rs:156:20
- 25.74 s
> system-out
- 25.74 s
> running 1 test
- 25.74 s
> test python_session_getters_return_live_toml_and_command_blocks ... FAILED
- 25.74 s
>
- 25.74 s
> failures:
- 25.74 s
>
- 25.74 s
> failures:
- 25.74 s
> python_session_getters_return_live_toml_and_command_blocks
- 25.74 s
>
- 25.74 s
> test result: FAILED. 0 passed; 1 failed; 0 ignored; 0 measured; 4 filtered out; finished in 0.11s
- 25.74 s
> system-err
- 25.74 s
> Error: Python API test subprocess failed.
- 25.74 s
> stdout:
- 25.74 s
> ┌────────────────────────────────────────────────────────┐
- 25.74 s
> │ You are running a restricted Symbolica instance. │
- 25.74 s
> │ │
- 25.74 s
> │ This mode is only permitted for non-commercial use and │
- 25.74 s
> │ is limited to one instance and core per machine. │
- 25.74 s
> │ │
- 25.74 s
> │ Hobbyists can easily acquire a free license key │
- 25.74 s
> │ that unlocks all cores and removes this banner: │
- 25.74 s
> │ │
- 25.74 s
> │ from symbolica import * │
- 25.74 s
> │ request_hobbyist_license('YOUR_NAME', 'YOUR_EMAIL') │
- 25.74 s
> │ │
- 25.74 s
> │ All other users can obtain a free 30-day trial key: │
- 25.74 s
> │ │
- 25.74 s
> │ from symbolica import * │
- 25.74 s
> │ request_trial_license('NAME', 'EMAIL', 'EMPLOYER') │
- 25.74 s
> │ │
- 25.74 s
> │ See https://symbolica.io/docs/get_started.html#license │
- 25.74 s
> └────────────────────────────────────────────────────────┘
- 25.74 s
> ┌───────────────────────────────────────────────────────────────────────────────────────────────────────────┐
- 25.74 s
> │ Cannot start new unlicensed Symbolica instance since there is already another one running on the machine. │
- 25.74 s
> └───────────────────────────────────────────────────────────────────────────────────────────────────────────┘
- 25.74 s
>
- 25.74 s
> stderr:
- 25.74 s
> ┌───────────────────────────────────┐
- 25.74 s
> │ The Symbolica license has expired │
- 25.74 s
> └───────────────────────────────────┘
- 25.74 s
>
- 25.74 s
>
- 25.74 s
> Location:
- 25.74 s
> tests/tests/test_python_api.rs:156:20
- 25.74 s
>
- 25.74 s
> 3. gammaloop-integration-tests::test_python_api::python_evaluate_samples_batch_and_momentum_space_have_expected_shape
- 25.74 s
> failure: test failure with exit code 101
- 25.74 s
> Error: Python API test subprocess failed.
- 25.74 s
> stdout:
- 25.74 s
> ┌────────────────────────────────────────────────────────┐
- 25.74 s
> │ You are running a restricted Symbolica instance. │
- 25.74 s
> │ │
- 25.74 s
> │ This mode is only permitted for non-commercial use and │
- 25.74 s
> │ is limited to one instance and core per machine. │
- 25.74 s
> │ │
- 25.74 s
> │ Hobbyists can easily acquire a free license key │
- 25.74 s
> │ that unlocks all cores and removes this banner: │
- 25.74 s
> │ │
- 25.74 s
> │ from symbolica import * │
- 25.74 s
> │ request_hobbyist_license('YOUR_NAME', 'YOUR_EMAIL') │
- 25.74 s
> │ │
- 25.74 s
> │ All other users can obtain a free 30-day trial key: │
- 25.74 s
> │ │
- 25.74 s
> │ from symbolica import * │
- 25.74 s
> │ request_trial_license('NAME', 'EMAIL', 'EMPLOYER') │
- 25.74 s
> │ │
- 25.74 s
> │ See https://symbolica.io/docs/get_started.html#license │
- 25.74 s
> └────────────────────────────────────────────────────────┘
- 25.74 s
> ┌───────────────────────────────────────────────────────────────────────────────────────────────────────────┐
- 25.74 s
> │ Cannot start new unlicensed Symbolica instance since there is already another one running on the machine. │
- 25.74 s
> └───────────────────────────────────────────────────────────────────────────────────────────────────────────┘
- 25.74 s
>
- 25.74 s
> stderr:
- 25.74 s
> ┌───────────────────────────────────┐
- 25.74 s
> │ The Symbolica license has expired │
- 25.74 s
> └───────────────────────────────────┘
- 25.74 s
>
- 25.74 s
>
- 25.74 s
> Location:
- 25.74 s
> tests/tests/test_python_api.rs:156:20
- 25.74 s
> system-out
- 25.74 s
> running 1 test
- 25.74 s
> test python_evaluate_samples_batch_and_momentum_space_have_expected_shape ... FAILED
- 25.74 s
>
- 25.74 s
> failures:
- 25.74 s
>
- 25.74 s
> failures:
- 25.74 s
> python_evaluate_samples_batch_and_momentum_space_have_expected_shape
- 25.74 s
>
- 25.74 s
> test result: FAILED. 0 passed; 1 failed; 0 ignored; 0 measured; 4 filtered out; finished in 0.11s
- 25.74 s
> system-err
- 25.74 s
> Error: Python API test subprocess failed.
- 25.74 s
> stdout:
- 25.74 s
> ┌────────────────────────────────────────────────────────┐
- 25.74 s
> │ You are running a restricted Symbolica instance. │
- 25.74 s
> │ │
- 25.74 s
> │ This mode is only permitted for non-commercial use and │
- 25.74 s
> │ is limited to one instance and core per machine. │
- 25.74 s
> │ │
- 25.74 s
> │ Hobbyists can easily acquire a free license key │
- 25.74 s
> │ that unlocks all cores and removes this banner: │
- 25.74 s
> │ │
- 25.74 s
> │ from symbolica import * │
- 25.74 s
> │ request_hobbyist_license('YOUR_NAME', 'YOUR_EMAIL') │
- 25.74 s
> │ │
- 25.74 s
> │ All other users can obtain a free 30-day trial key: │
- 25.74 s
> │ │
- 25.74 s
> │ from symbolica import * │
- 25.74 s
> │ request_trial_license('NAME', 'EMAIL', 'EMPLOYER') │
- 25.74 s
> │ │
- 25.74 s
> │ See https://symbolica.io/docs/get_started.html#license │
- 25.74 s
> └────────────────────────────────────────────────────────┘
- 25.74 s
> ┌───────────────────────────────────────────────────────────────────────────────────────────────────────────┐
- 25.74 s
> │ Cannot start new unlicensed Symbolica instance since there is already another one running on the machine. │
- 25.74 s
> └───────────────────────────────────────────────────────────────────────────────────────────────────────────┘
- 25.74 s
>
- 25.74 s
> stderr:
- 25.74 s
> ┌───────────────────────────────────┐
- 25.74 s
> │ The Symbolica license has expired │
- 25.74 s
> └───────────────────────────────────┘
- 25.74 s
>
- 25.74 s
>
- 25.74 s
> Location:
- 25.74 s
> tests/tests/test_python_api.rs:156:20
- 25.74 s
>
- 25.74 s
> 4. gammaloop-integration-tests::test_python_api::python_evaluate_sample_preserves_graph_grouping_and_incoming_pdgs
- 25.74 s
> failure: test failure with exit code 101
- 25.74 s
> Error: Python API test subprocess failed.
- 25.74 s
> stdout:
- 25.74 s
> ┌────────────────────────────────────────────────────────┐
- 25.74 s
> │ You are running a restricted Symbolica instance. │
- 25.74 s
> │ │
- 25.74 s
> │ This mode is only permitted for non-commercial use and │
- 25.74 s
> │ is limited to one instance and core per machine. │
- 25.74 s
> │ │
- 25.74 s
> │ Hobbyists can easily acquire a free license key │
- 25.74 s
> │ that unlocks all cores and removes this banner: │
- 25.74 s
> │ │
- 25.74 s
> │ from symbolica import * │
- 25.74 s
> │ request_hobbyist_license('YOUR_NAME', 'YOUR_EMAIL') │
- 25.74 s
> │ │
- 25.74 s
> │ All other users can obtain a free 30-day trial key: │
- 25.74 s
> │ │
- 25.74 s
> │ from symbolica import * │
- 25.74 s
> │ request_trial_license('NAME', 'EMAIL', 'EMPLOYER') │
- 25.74 s
> │ │
- 25.74 s
> │ See https://symbolica.io/docs/get_started.html#license │
- 25.74 s
> └────────────────────────────────────────────────────────┘
- 25.74 s
> ┌───────────────────────────────────────────────────────────────────────────────────────────────────────────┐
- 25.74 s
> │ Cannot start new unlicensed Symbolica instance since there is already another one running on the machine. │
- 25.74 s
> └───────────────────────────────────────────────────────────────────────────────────────────────────────────┘
- 25.74 s
>
- 25.74 s
> stderr:
- 25.74 s
> ┌───────────────────────────────────┐
- 25.74 s
> │ The Symbolica license has expired │
- 25.74 s
> └───────────────────────────────────┘
- 25.74 s
>
- 25.74 s
>
- 25.74 s
> Location:
- 25.74 s
> tests/tests/test_python_api.rs:156:20
- 25.74 s
> system-out
- 25.74 s
> running 1 test
- 25.74 s
> test python_evaluate_sample_preserves_graph_grouping_and_incoming_pdgs ... FAILED
- 25.74 s
>
- 25.74 s
> failures:
- 25.74 s
>
- 25.74 s
> failures:
- 25.74 s
> python_evaluate_sample_preserves_graph_grouping_and_incoming_pdgs
- 25.74 s
>
- 25.74 s
> test result: FAILED. 0 passed; 1 failed; 0 ignored; 0 measured; 4 filtered out; finished in 0.12s
- 25.74 s
> system-err
- 25.74 s
> Error: Python API test subprocess failed.
- 25.74 s
> stdout:
- 25.74 s
> ┌────────────────────────────────────────────────────────┐
- 25.74 s
> │ You are running a restricted Symbolica instance. │
- 25.74 s
> │ │
- 25.74 s
> │ This mode is only permitted for non-commercial use and │
- 25.74 s
> │ is limited to one instance and core per machine. │
- 25.74 s
> │ │
- 25.74 s
> │ Hobbyists can easily acquire a free license key │
- 25.74 s
> │ that unlocks all cores and removes this banner: │
- 25.74 s
> │ │
- 25.74 s
> │ from symbolica import * │
- 25.74 s
> │ request_hobbyist_license('YOUR_NAME', 'YOUR_EMAIL') │
- 25.74 s
> │ │
- 25.74 s
> │ All other users can obtain a free 30-day trial key: │
- 25.74 s
> │ │
- 25.74 s
> │ from symbolica import * │
- 25.74 s
> │ request_trial_license('NAME', 'EMAIL', 'EMPLOYER') │
- 25.74 s
> │ │
- 25.74 s
> │ See https://symbolica.io/docs/get_started.html#license │
- 25.74 s
> └────────────────────────────────────────────────────────┘
- 25.74 s
> ┌───────────────────────────────────────────────────────────────────────────────────────────────────────────┐
- 25.74 s
> │ Cannot start new unlicensed Symbolica instance since there is already another one running on the machine. │
- 25.74 s
> └───────────────────────────────────────────────────────────────────────────────────────────────────────────┘
- 25.74 s
>
- 25.74 s
> stderr:
- 25.74 s
> ┌───────────────────────────────────┐
- 25.74 s
> │ The Symbolica license has expired │
- 25.74 s
> └───────────────────────────────────┘
- 25.74 s
>
- 25.74 s
>
- 25.74 s
> Location:
- 25.74 s
> tests/tests/test_python_api.rs:156:20
- 25.74 s
> =========================================
- 25.74 s
For full logs, run:
- 25.74 s
nix log /nix/store/4kzj98b1f7qqfwnhzqhxbvk8wv98rki0-gammaloop-nextest-python-api.drv
- 25.85 s
[2 built (1 failed), 12 Run failed.